FailedConsole Output

Skipping 7,445 KB.. Full Log
Sanitizer-x86_64 :: libdispatch/suspend.c (3306 of 4241)
PASS: ThreadSanitizer-x86_64 :: libdispatch/source-serial.c (3307 of 4241)
PASS: ThreadSanitizer-x86_64 :: libdispatch/sync-block-copy.cc (3308 of 4241)
PASS: ThreadSanitizer-x86_64 :: libdispatch/sync-norace.c (3309 of 4241)
PASS: ThreadSanitizer-x86_64 :: libdispatch/target-queue-norace.c (3310 of 4241)
PASS: ThreadSanitizer-x86_64 :: libdispatch/sync-race.c (3311 of 4241)
PASS: ThreadSanitizer-x86_64 :: longjmp.cc (3312 of 4241)
PASS: ThreadSanitizer-x86_64 :: longjmp2.cc (3313 of 4241)
PASS: ThreadSanitizer-x86_64 :: longjmp3.cc (3314 of 4241)
PASS: ThreadSanitizer-x86_64 :: load_shared_lib.cc (3315 of 4241)
PASS: ThreadSanitizer-x86_64 :: longjmp4.cc (3316 of 4241)
PASS: ThreadSanitizer-x86_64 :: malloc_overflow.cc (3317 of 4241)
UNSUPPORTED: ThreadSanitizer-x86_64 :: map32bit.cc (3318 of 4241)
PASS: ThreadSanitizer-x86_64 :: lots_of_threads.c (3319 of 4241)
PASS: ThreadSanitizer-x86_64 :: malloc_stack.cc (3320 of 4241)
PASS: ThreadSanitizer-x86_64 :: mmap_large.cc (3321 of 4241)
PASS: ThreadSanitizer-x86_64 :: memcmp_race.cc (3322 of 4241)
PASS: ThreadSanitizer-x86_64 :: memcpy_race.cc (3323 of 4241)
PASS: ThreadSanitizer-x86_64 :: mmap_stress.cc (3324 of 4241)
PASS: ThreadSanitizer-x86_64 :: mop1.c (3325 of 4241)
XFAIL: ThreadSanitizer-x86_64 :: must_deadlock.cc (3326 of 4241)
PASS: ThreadSanitizer-x86_64 :: mop_with_offset.cc (3327 of 4241)
PASS: ThreadSanitizer-x86_64 :: mop_with_offset2.cc (3328 of 4241)
PASS: ThreadSanitizer-x86_64 :: mutex_annotations.cc (3329 of 4241)
PASS: ThreadSanitizer-x86_64 :: mutex_bad_read_lock.cc (3330 of 4241)
PASS: ThreadSanitizer-x86_64 :: mutex_bad_read_unlock.cc (3331 of 4241)
PASS: ThreadSanitizer-x86_64 :: mutex_bad_unlock.cc (3332 of 4241)
PASS: ThreadSanitizer-x86_64 :: mutex_destroy_locked.cc (3333 of 4241)
PASS: ThreadSanitizer-x86_64 :: mutex_destroy_locked2.cc (3334 of 4241)
PASS: ThreadSanitizer-x86_64 :: mutex_double_lock.cc (3335 of 4241)
PASS: ThreadSanitizer-x86_64 :: mutex_cycle2.c (3336 of 4241)
PASS: ThreadSanitizer-x86_64 :: mutex_cycle_long.c (3337 of 4241)
PASS: ThreadSanitizer-x86_64 :: mutexset1.cc (3338 of 4241)
PASS: ThreadSanitizer-x86_64 :: mutex_lock_destroyed.cc (3339 of 4241)
PASS: ThreadSanitizer-x86_64 :: mutexset2.cc (3340 of 4241)
PASS: ThreadSanitizer-x86_64 :: mutexset3.cc (3341 of 4241)
PASS: ThreadSanitizer-x86_64 :: mutexset4.cc (3342 of 4241)
PASS: ThreadSanitizer-x86_64 :: mutexset5.cc (3343 of 4241)
PASS: ThreadSanitizer-x86_64 :: mutexset6.cc (3344 of 4241)
PASS: ThreadSanitizer-x86_64 :: mutexset7.cc (3345 of 4241)
PASS: ThreadSanitizer-x86_64 :: pie_test.cc (3346 of 4241)
PASS: ThreadSanitizer-x86_64 :: mutexset8.cc (3347 of 4241)
PASS: ThreadSanitizer-x86_64 :: printf-1.c (3348 of 4241)
UNSUPPORTED: ThreadSanitizer-x86_64 :: race_on_barrier.c (3349 of 4241)
UNSUPPORTED: ThreadSanitizer-x86_64 :: race_on_barrier2.c (3350 of 4241)
PASS: ThreadSanitizer-x86_64 :: pthread_atfork_deadlock.c (3351 of 4241)
PASS: ThreadSanitizer-x86_64 :: pthread_key.cc (3352 of 4241)
PASS: ThreadSanitizer-x86_64 :: race_on_fputs.cc (3353 of 4241)
PASS: ThreadSanitizer-x86_64 :: race_on_heap.cc (3354 of 4241)
PASS: ThreadSanitizer-x86_64 :: race_on_mutex.c (3355 of 4241)
PASS: ThreadSanitizer-x86_64 :: race_on_mutex2.c (3356 of 4241)
PASS: ThreadSanitizer-x86_64 :: race_on_puts.cc (3357 of 4241)
PASS: ThreadSanitizer-x86_64 :: race_on_read.cc (3358 of 4241)
PASS: ThreadSanitizer-x86_64 :: race_on_speculative_load.cc (3359 of 4241)
PASS: ThreadSanitizer-x86_64 :: race_on_write.cc (3360 of 4241)
PASS: ThreadSanitizer-x86_64 :: race_stress.cc (3361 of 4241)
PASS: ThreadSanitizer-x86_64 :: race_top_suppression.cc (3362 of 4241)
PASS: ThreadSanitizer-x86_64 :: race_top_suppression1.cc (3363 of 4241)
PASS: ThreadSanitizer-x86_64 :: race_with_finished_thread.cc (3364 of 4241)
PASS: ThreadSanitizer-x86_64 :: setuid.c (3365 of 4241)
PASS: ThreadSanitizer-x86_64 :: real_deadlock_detector_stress_test.cc (3366 of 4241)
PASS: ThreadSanitizer-x86_64 :: signal_block.cc (3367 of 4241)
PASS: ThreadSanitizer-x86_64 :: setuid2.c (3368 of 4241)
PASS: ThreadSanitizer-x86_64 :: restore_stack.cc (3369 of 4241)
PASS: ThreadSanitizer-x86_64 :: signal_cond.cc (3370 of 4241)
PASS: ThreadSanitizer-x86_64 :: signal_longjmp.cc (3371 of 4241)
PASS: ThreadSanitizer-x86_64 :: signal_errno.cc (3372 of 4241)
UNSUPPORTED: ThreadSanitizer-x86_64 :: signal_recursive.cc (3373 of 4241)
UNSUPPORTED: ThreadSanitizer-x86_64 :: signal_reset.cc (3374 of 4241)
UNSUPPORTED: ThreadSanitizer-x86_64 :: signal_sync.cc (3375 of 4241)
UNSUPPORTED: ThreadSanitizer-x86_64 :: signal_sync2.cc (3376 of 4241)
UNSUPPORTED: ThreadSanitizer-x86_64 :: signal_thread.cc (3377 of 4241)
PASS: ThreadSanitizer-x86_64 :: signal_write.cc (3378 of 4241)
PASS: ThreadSanitizer-x86_64 :: signal_pause.cc (3379 of 4241)
PASS: ThreadSanitizer-x86_64 :: signal_malloc.cc (3380 of 4241)
PASS: ThreadSanitizer-x86_64 :: sigsuspend.cc (3381 of 4241)
PASS: ThreadSanitizer-x86_64 :: simple_race.c (3382 of 4241)
PASS: ThreadSanitizer-x86_64 :: simple_race.cc (3383 of 4241)
PASS: ThreadSanitizer-x86_64 :: simple_stack2.cc (3384 of 4241)
PASS: ThreadSanitizer-x86_64 :: sleep_sync.cc (3385 of 4241)
PASS: ThreadSanitizer-x86_64 :: sleep_sync2.cc (3386 of 4241)
PASS: ThreadSanitizer-x86_64 :: simple_stack.c (3387 of 4241)
PASS: ThreadSanitizer-x86_64 :: stack_race.cc (3388 of 4241)
PASS: ThreadSanitizer-x86_64 :: static_init1.cc (3389 of 4241)
PASS: ThreadSanitizer-x86_64 :: stack_sync_reuse.cc (3390 of 4241)
PASS: ThreadSanitizer-x86_64 :: stack_race2.cc (3391 of 4241)
PASS: ThreadSanitizer-x86_64 :: static_init2.cc (3392 of 4241)
PASS: ThreadSanitizer-x86_64 :: static_init4.cc (3393 of 4241)
PASS: ThreadSanitizer-x86_64 :: static_init5.cc (3394 of 4241)
UNSUPPORTED: ThreadSanitizer-x86_64 :: strerror_r.cc (3395 of 4241)
UNSUPPORTED: ThreadSanitizer-x86_64 :: sunrpc.cc (3396 of 4241)
PASS: ThreadSanitizer-x86_64 :: static_init3.cc (3397 of 4241)
PASS: ThreadSanitizer-x86_64 :: static_init6.cc (3398 of 4241)
PASS: ThreadSanitizer-x86_64 :: suppress_same_stacks.cc (3399 of 4241)
PASS: ThreadSanitizer-x86_64 :: suppress_same_address.cc (3400 of 4241)
PASS: ThreadSanitizer-x86_64 :: suppressions_global.cc (3401 of 4241)
PASS: ThreadSanitizer-x86_64 :: suppressions_mutex.cc (3402 of 4241)
PASS: ThreadSanitizer-x86_64 :: suppressions_race.cc (3403 of 4241)
PASS: ThreadSanitizer-x86_64 :: thread_detach.c (3404 of 4241)
PASS: ThreadSanitizer-x86_64 :: suppressions_race2.cc (3405 of 4241)
PASS: ThreadSanitizer-x86_64 :: thread_detach2.c (3406 of 4241)
PASS: ThreadSanitizer-x86_64 :: thread_end_with_ignore2.cc (3407 of 4241)
PASS: ThreadSanitizer-x86_64 :: thread_end_with_ignore.cc (3408 of 4241)
PASS: ThreadSanitizer-x86_64 :: thread_end_with_ignore3.cc (3409 of 4241)
PASS: ThreadSanitizer-x86_64 :: thread_leak.c (3410 of 4241)
PASS: ThreadSanitizer-x86_64 :: thread_exit.c (3411 of 4241)
PASS: ThreadSanitizer-x86_64 :: thread_leak2.c (3412 of 4241)
PASS: ThreadSanitizer-x86_64 :: thread_leak4.c (3413 of 4241)
PASS: ThreadSanitizer-x86_64 :: thread_leak3.c (3414 of 4241)
UNSUPPORTED: ThreadSanitizer-x86_64 :: thread_name2.cc (3415 of 4241)
PASS: ThreadSanitizer-x86_64 :: thread_leak5.c (3416 of 4241)
PASS: ThreadSanitizer-x86_64 :: thread_name.cc (3417 of 4241)
PASS: ThreadSanitizer-x86_64 :: tiny_race.c (3418 of 4241)
PASS: ThreadSanitizer-x86_64 :: tls_race.cc (3419 of 4241)
PASS: ThreadSanitizer-x86_64 :: tls_race2.cc (3420 of 4241)
PASS: ThreadSanitizer-x86_64 :: unaligned_norace.cc (3421 of 4241)
PASS: ThreadSanitizer-x86_64 :: tsan-vs-gvn.cc (3422 of 4241)
PASS: ThreadSanitizer-x86_64 :: virtual_inheritance_compile_bug.cc (3423 of 4241)
PASS: ThreadSanitizer-x86_64 :: vfork.cc (3424 of 4241)
PASS: ThreadSanitizer-x86_64 :: vptr_benign_race.cc (3425 of 4241)
PASS: ThreadSanitizer-x86_64 :: unaligned_race.cc (3426 of 4241)
PASS: ThreadSanitizer-x86_64 :: vptr_harmful_race.cc (3427 of 4241)
PASS: ThreadSanitizer-x86_64 :: vptr_harmful_race2.cc (3428 of 4241)
PASS: ThreadSanitizer-x86_64 :: vptr_harmful_race3.cc (3429 of 4241)
PASS: ThreadSanitizer-x86_64 :: vptr_harmful_race4.cc (3430 of 4241)
PASS: UBSan-AddressSanitizer-i386 :: TestCases/Float/cast-overflow.cpp (3431 of 4241)
PASS: ThreadSanitizer-x86_64 :: write_in_reader_lock.cc (3432 of 4241)
PASS: UBSan-AddressSanitizer-i386 :: TestCases/ImplicitConversion/integer-sign-change-blacklist.c (3433 of 4241)
PASS: UBSan-AddressSanitizer-i386 :: TestCases/ImplicitConversion/integer-sign-change-summary.cpp (3434 of 4241)
PASS: UBSan-AddressSanitizer-i386 :: TestCases/ImplicitConversion/integer-arithmetic-value-change.c (3435 of 4241)
PASS: UBSan-AddressSanitizer-i386 :: TestCases/ImplicitConversion/integer-conversion.c (3436 of 4241)
PASS: UBSan-AddressSanitizer-i386 :: TestCases/ImplicitConversion/integer-sign-change.c (3437 of 4241)
PASS: UBSan-AddressSanitizer-i386 :: TestCases/ImplicitConversion/integer-truncation.c (3438 of 4241)
PASS: UBSan-AddressSanitizer-i386 :: TestCases/ImplicitConversion/signed-integer-truncation-or-sign-change-summary.cpp (3439 of 4241)
PASS: UBSan-AddressSanitizer-i386 :: TestCases/ImplicitConversion/signed-integer-truncation-summary.cpp (3440 of 4241)
PASS: UBSan-AddressSanitizer-i386 :: TestCases/ImplicitConversion/signed-integer-truncation-blacklist.c (3441 of 4241)
PASS: UBSan-AddressSanitizer-i386 :: TestCases/ImplicitConversion/signed-integer-truncation-or-sign-change-blacklist.c (3442 of 4241)
PASS: UBSan-AddressSanitizer-i386 :: TestCases/ImplicitConversion/unsigned-integer-truncation-summary.cpp (3443 of 4241)
PASS: UBSan-AddressSanitizer-i386 :: TestCases/ImplicitConversion/signed-integer-truncation.c (3444 of 4241)
PASS: UBSan-AddressSanitizer-i386 :: TestCases/Integer/add-overflow.cpp (3445 of 4241)
PASS: UBSan-AddressSanitizer-i386 :: TestCases/Integer/div-overflow.cpp (3446 of 4241)
FAIL: UBSan-AddressSanitizer-i386 :: TestCases/Integer/div-zero.cpp (3447 of 4241)
******************** TEST 'UBSan-AddressSanitizer-i386 :: TestCases/Integer/div-zero.cpp' FAILED ********************
Script:
--
: 'RUN: at line 1';      /Users/buildslave/jenkins/workspace/clang-stage1-cmake-RA-expensive/clang-build/./bin/clang  --driver-mode=g++ -fsanitize=address  -arch i386 -stdlib=libc++ -mmacosx-version-min=10.9 -isysroot /Applications/Xcode.app/Contents/Developer/Platforms/MacOSX.platform/Developer/SDKs/MacOSX10.13.sdk  -fsanitize=integer-divide-by-zero -DDIVIDEND=0 /Users/buildslave/jenkins/workspace/clang-stage1-cmake-RA-expensive/llvm/projects/compiler-rt/test/ubsan/TestCases/Integer/div-zero.cpp -o /Users/buildslave/jenkins/workspace/clang-stage1-cmake-RA-expensive/clang-build/tools/clang/runtime/compiler-rt-bins/test/ubsan/AddressSanitizer-i386/TestCases/Integer/Output/div-zero.cpp.tmp &&  /Users/buildslave/jenkins/workspace/clang-stage1-cmake-RA-expensive/clang-build/tools/clang/runtime/compiler-rt-bins/test/ubsan/AddressSanitizer-i386/TestCases/Integer/Output/div-zero.cpp.tmp 2>&1 | FileCheck /Users/buildslave/jenkins/workspace/clang-stage1-cmake-RA-expensive/llvm/projects/compiler-rt/test/ubsan/TestCases/Integer/div-zero.cpp
: 'RUN: at line 2';      /Users/buildslave/jenkins/workspace/clang-stage1-cmake-RA-expensive/clang-build/./bin/clang  --driver-mode=g++ -fsanitize=address  -arch i386 -stdlib=libc++ -mmacosx-version-min=10.9 -isysroot /Applications/Xcode.app/Contents/Developer/Platforms/MacOSX.platform/Developer/SDKs/MacOSX10.13.sdk  -fsanitize=integer-divide-by-zero -DDIVIDEND=1U /Users/buildslave/jenkins/workspace/clang-stage1-cmake-RA-expensive/llvm/projects/compiler-rt/test/ubsan/TestCases/Integer/div-zero.cpp -o /Users/buildslave/jenkins/workspace/clang-stage1-cmake-RA-expensive/clang-build/tools/clang/runtime/compiler-rt-bins/test/ubsan/AddressSanitizer-i386/TestCases/Integer/Output/div-zero.cpp.tmp &&  /Users/buildslave/jenkins/workspace/clang-stage1-cmake-RA-expensive/clang-build/tools/clang/runtime/compiler-rt-bins/test/ubsan/AddressSanitizer-i386/TestCases/Integer/Output/div-zero.cpp.tmp 2>&1 | FileCheck /Users/buildslave/jenkins/workspace/clang-stage1-cmake-RA-expensive/llvm/projects/compiler-rt/test/ubsan/TestCases/Integer/div-zero.cpp
: 'RUN: at line 3';      /Users/buildslave/jenkins/workspace/clang-stage1-cmake-RA-expensive/clang-build/./bin/clang  --driver-mode=g++ -fsanitize=address  -arch i386 -stdlib=libc++ -mmacosx-version-min=10.9 -isysroot /Applications/Xcode.app/Contents/Developer/Platforms/MacOSX.platform/Developer/SDKs/MacOSX10.13.sdk  -fsanitize=float-divide-by-zero -DDIVIDEND=1.5 /Users/buildslave/jenkins/workspace/clang-stage1-cmake-RA-expensive/llvm/projects/compiler-rt/test/ubsan/TestCases/Integer/div-zero.cpp -o /Users/buildslave/jenkins/workspace/clang-stage1-cmake-RA-expensive/clang-build/tools/clang/runtime/compiler-rt-bins/test/ubsan/AddressSanitizer-i386/TestCases/Integer/Output/div-zero.cpp.tmp &&  /Users/buildslave/jenkins/workspace/clang-stage1-cmake-RA-expensive/clang-build/tools/clang/runtime/compiler-rt-bins/test/ubsan/AddressSanitizer-i386/TestCases/Integer/Output/div-zero.cpp.tmp 2>&1 | FileCheck /Users/buildslave/jenkins/workspace/clang-stage1-cmake-RA-expensive/llvm/projects/compiler-rt/test/ubsan/TestCases/Integer/div-zero.cpp
: 'RUN: at line 4';      /Users/buildslave/jenkins/workspace/clang-stage1-cmake-RA-expensive/clang-build/./bin/clang  --driver-mode=g++ -fsanitize=address  -arch i386 -stdlib=libc++ -mmacosx-version-min=10.9 -isysroot /Applications/Xcode.app/Contents/Developer/Platforms/MacOSX.platform/Developer/SDKs/MacOSX10.13.sdk  -fsanitize=integer-divide-by-zero -DDIVIDEND='intmax(123)' /Users/buildslave/jenkins/workspace/clang-stage1-cmake-RA-expensive/llvm/projects/compiler-rt/test/ubsan/TestCases/Integer/div-zero.cpp -o /Users/buildslave/jenkins/workspace/clang-stage1-cmake-RA-expensive/clang-build/tools/clang/runtime/compiler-rt-bins/test/ubsan/AddressSanitizer-i386/TestCases/Integer/Output/div-zero.cpp.tmp &&  /Users/buildslave/jenkins/workspace/clang-stage1-cmake-RA-expensive/clang-build/tools/clang/runtime/compiler-rt-bins/test/ubsan/AddressSanitizer-i386/TestCases/Integer/Output/div-zero.cpp.tmp 2>&1 | FileCheck /Users/buildslave/jenkins/workspace/clang-stage1-cmake-RA-expensive/llvm/projects/compiler-rt/test/ubsan/TestCases/Integer/div-zero.cpp
--
Exit Code: 1

Hide Details

Command Output (stderr): -- /Users/buildslave/jenkins/workspace/clang-stage1-cmake-RA-expensive/llvm/projects/compiler-rt/test/ubsan/TestCases/Integer/div-zero.cpp:14:12: warning: expression result unused [-Wunused-value] DIVIDEND / 0; ~~~~~~~~ ^ ~ /Users/buildslave/jenkins/workspace/clang-stage1-cmake-RA-expensive/llvm/projects/compiler-rt/test/ubsan/TestCases/Integer/div-zero.cpp:14:12: warning: division by zero is undefined [-Wdivision-by-zero] DIVIDEND / 0; ^ ~ 2 warnings generated. /Users/buildslave/jenkins/workspace/clang-stage1-cmake-RA-expensive/llvm/projects/compiler-rt/test/ubsan/TestCases/Integer/div-zero.cpp:14:12: warning: expression result unused [-Wunused-value] DIVIDEND / 0; ~~~~~~~~ ^ ~ /Users/buildslave/jenkins/workspace/clang-stage1-cmake-RA-expensive/llvm/projects/compiler-rt/test/ubsan/TestCases/Integer/div-zero.cpp:14:12: warning: division by zero is undefined [-Wdivision-by-zero] DIVIDEND / 0; ^ ~ 2 warnings generated. clang-9: error: unsupported option '-fsanitize=float-divide-by-zero' for target 'i386-apple-darwin17.6.0'

Hide Details

--

Hide Details

******************** PASS: UBSan-AddressSanitizer-i386 :: TestCases/ImplicitConversion/unsigned-integer-truncation-blacklist.c (3448 of 4241) PASS: UBSan-AddressSanitizer-i386 :: TestCases/Integer/mul-overflow.cpp (3449 of 4241) PASS: UBSan-AddressSanitizer-i386 :: TestCases/Integer/incdec-overflow.cpp (3450 of 4241) PASS: UBSan-AddressSanitizer-i386 :: TestCases/Integer/negate-overflow.cpp (3451 of 4241) PASS: UBSan-AddressSanitizer-i386 :: TestCases/ImplicitConversion/unsigned-integer-truncation.c (3452 of 4241) PASS: UBSan-AddressSanitizer-i386 :: TestCases/Integer/no-recover.cpp (3453 of 4241) PASS: UBSan-AddressSanitizer-i386 :: TestCases/Integer/summary.cpp (3454 of 4241) PASS: UBSan-AddressSanitizer-i386 :: TestCases/Integer/sub-overflow.cpp (3455 of 4241) PASS: UBSan-AddressSanitizer-i386 :: TestCases/Integer/uadd-overflow.cpp (3456 of 4241) PASS: UBSan-AddressSanitizer-i386 :: TestCases/Integer/suppressions.cpp (3457 of 4241) PASS: UBSan-AddressSanitizer-i386 :: TestCases/Integer/umul-overflow.cpp (3458 of 4241) PASS: UBSan-AddressSanitizer-i386 :: TestCases/Integer/uincdec-overflow.cpp (3459 of 4241) UNSUPPORTED: UBSan-AddressSanitizer-i386 :: TestCases/Misc/Linux/print_stack_trace.cc (3460 of 4241) UNSUPPORTED: UBSan-AddressSanitizer-i386 :: TestCases/Misc/Linux/ubsan_options.cc (3461 of 4241) PASS: UBSan-AddressSanitizer-i386 :: TestCases/Misc/bool.cpp (3462 of 4241) PASS: UBSan-AddressSanitizer-i386 :: TestCases/Integer/usub-overflow.cpp (3463 of 4241) UNSUPPORTED: UBSan-AddressSanitizer-i386 :: TestCases/Misc/builtins.cpp (3464 of 4241) PASS: UBSan-AddressSanitizer-i386 :: TestCases/Integer/shift.cpp (3465 of 4241) PASS: UBSan-AddressSanitizer-i386 :: TestCases/Misc/bounds.cpp (3466 of 4241) PASS: UBSan-AddressSanitizer-i386 :: TestCases/Misc/deduplication.cpp (3467 of 4241) PASS: UBSan-AddressSanitizer-i386 :: TestCases/Misc/enum.cpp (3468 of 4241) PASS: UBSan-AddressSanitizer-i386 :: TestCases/Misc/log-path_test.cc (3469 of 4241) PASS: UBSan-AddressSanitizer-i386 :: TestCases/Misc/coverage-levels.cc (3470 of 4241) UNSUPPORTED: UBSan-AddressSanitizer-i386 :: TestCases/Misc/no-interception.cpp (3471 of 4241) PASS: UBSan-AddressSanitizer-i386 :: TestCases/Misc/monitor.cpp (3472 of 4241) PASS: UBSan-AddressSanitizer-i386 :: TestCases/Misc/nonnull.cpp (3473 of 4241) PASS: UBSan-AddressSanitizer-i386 :: TestCases/Misc/nonnull-arg.cpp (3474 of 4241) PASS: UBSan-AddressSanitizer-i386 :: TestCases/Misc/missing_return.cpp (3475 of 4241) PASS: UBSan-AddressSanitizer-i386 :: TestCases/Misc/vla.c (3476 of 4241) PASS: UBSan-AddressSanitizer-i386 :: TestCases/Misc/nullability.c (3477 of 4241) PASS: UBSan-AddressSanitizer-i386 :: TestCases/Misc/unreachable.cpp (3478 of 4241) PASS: UBSan-AddressSanitizer-i386 :: TestCases/Pointer/alignment-assumption-attribute-align_value-on-paramvar.cpp (3479 of 4241) PASS: UBSan-AddressSanitizer-i386 :: TestCases/Pointer/alignment-assumption-attribute-alloc_align-on-function-variable.cpp (3480 of 4241) PASS: UBSan-AddressSanitizer-i386 :: TestCases/Pointer/alignment-assumption-attribute-align_value-on-lvalue.cpp (3481 of 4241) PASS: UBSan-AddressSanitizer-i386 :: TestCases/Pointer/alignment-assumption-attribute-alloc_align-on-function.cpp (3482 of 4241) PASS: UBSan-AddressSanitizer-i386 :: TestCases/Pointer/alignment-assumption-attribute-assume_aligned-on-function.cpp (3483 of 4241) PASS: UBSan-AddressSanitizer-i386 :: TestCases/Pointer/alignment-assumption-attribute-assume_aligned-on-function-two-params.cpp (3484 of 4241) PASS: UBSan-AddressSanitizer-i386 :: TestCases/Pointer/alignment-assumption-blacklist.cpp (3485 of 4241) PASS: UBSan-AddressSanitizer-i386 :: TestCases/Pointer/alignment-assumption-builtin_assume_aligned-three-params.cpp (3486 of 4241) PASS: UBSan-AddressSanitizer-i386 :: TestCases/Pointer/alignment-assumption-builtin_assume_aligned-three-params-variable.cpp (3487 of 4241) PASS: UBSan-AddressSanitizer-i386 :: TestCases/Pointer/alignment-assumption-summary.cpp (3488 of 4241) PASS: UBSan-AddressSanitizer-i386 :: TestCases/Pointer/alignment-assumption-builtin_assume_aligned-two-params.cpp (3489 of 4241) PASS: UBSan-AddressSanitizer-i386 :: TestCases/Pointer/unsigned-index-expression.cpp (3490 of 4241) UNSUPPORTED: UBSan-AddressSanitizer-i386 :: TestCases/TypeCheck/Function/function.cpp (3491 of 4241) UNSUPPORTED: UBSan-AddressSanitizer-i386 :: TestCases/TypeCheck/Linux/PR33221.cpp (3492 of 4241) PASS: UBSan-AddressSanitizer-i386 :: TestCases/Pointer/index-overflow.cpp (3493 of 4241) PASS: UBSan-AddressSanitizer-i386 :: TestCases/TypeCheck/PR33221.cpp (3494 of 4241) PASS: UBSan-AddressSanitizer-i386 :: TestCases/TypeCheck/null.cpp (3495 of 4241) PASS: UBSan-AddressSanitizer-i386 :: TestCases/TypeCheck/vptr-corrupted-vtable-itanium.cpp (3496 of 4241) PASS: UBSan-AddressSanitizer-i386 :: TestCases/TypeCheck/vptr-non-unique-typeinfo.cpp (3497 of 4241) PASS: UBSan-AddressSanitizer-i386 :: TestCases/TypeCheck/vptr-virtual-base-construction.cpp (3498 of 4241) PASS: UBSan-AddressSanitizer-i386 :: TestCases/Pointer/alignment-assumption-openmp.cpp (3499 of 4241) PASS: UBSan-AddressSanitizer-i386 :: TestCases/TypeCheck/vptr-virtual-base.cpp (3500 of 4241) PASS: UBSan-AddressSanitizer-i386 :: TestCases/TypeCheck/misaligned.cpp (3501 of 4241) FAIL: UBSan-AddressSanitizer-x86_64 :: TestCases/Float/cast-overflow.cpp (3502 of 4241) ******************** TEST 'UBSan-AddressSanitizer-x86_64 :: TestCases/Float/cast-overflow.cpp' FAILED ******************** Script: -- : 'RUN: at line 1'; /Users/buildslave/jenkins/workspace/clang-stage1-cmake-RA-expensive/clang-build/./bin/clang --driver-mode=g++ -fsanitize=address -arch x86_64 -stdlib=libc++ -mmacosx-version-min=10.9 -isysroot /Applications/Xcode.app/Contents/Developer/Platforms/MacOSX.platform/Developer/SDKs/MacOSX10.13.sdk -fsanitize=float-cast-overflow /Users/buildslave/jenkins/workspace/clang-stage1-cmake-RA-expensive/llvm/projects/compiler-rt/test/ubsan/TestCases/Float/cast-overflow.cpp -o /Users/buildslave/jenkins/workspace/clang-stage1-cmake-RA-expensive/clang-build/tools/clang/runtime/compiler-rt-bins/test/ubsan/AddressSanitizer-x86_64/TestCases/Float/Output/cast-overflow.cpp.tmp : 'RUN: at line 2'; /Users/buildslave/jenkins/workspace/clang-stage1-cmake-RA-expensive/clang-build/tools/clang/runtime/compiler-rt-bins/test/ubsan/AddressSanitizer-x86_64/TestCases/Float/Output/cast-overflow.cpp.tmp _ : 'RUN: at line 3'; env UBSAN_OPTIONS=abort_on_error=0:log_to_syslog=0:detect_leaks=0:print_summary=1:report_error_type=1 /Users/buildslave/jenkins/workspace/clang-stage1-cmake-RA-expensive/clang-build/tools/clang/runtime/compiler-rt-bins/test/ubsan/AddressSanitizer-x86_64/TestCases/Float/Output/cast-overflow.cpp.tmp 0 2>&1 | FileCheck /Users/buildslave/jenkins/workspace/clang-stage1-cmake-RA-expensive/llvm/projects/compiler-rt/test/ubsan/TestCases/Float/cast-overflow.cpp --check-prefix=CHECK-0 : 'RUN: at line 4'; /Users/buildslave/jenkins/workspace/clang-stage1-cmake-RA-expensive/clang-build/tools/clang/runtime/compiler-rt-bins/test/ubsan/AddressSanitizer-x86_64/TestCases/Float/Output/cast-overflow.cpp.tmp 1 2>&1 | FileCheck /Users/buildslave/jenkins/workspace/clang-stage1-cmake-RA-expensive/llvm/projects/compiler-rt/test/ubsan/TestCases/Float/cast-overflow.cpp --check-prefix=CHECK-1 : 'RUN: at line 5'; /Users/buildslave/jenkins/workspace/clang-stage1-cmake-RA-expensive/clang-build/tools/clang/runtime/compiler-rt-bins/test/ubsan/AddressSanitizer-x86_64/TestCases/Float/Output/cast-overflow.cpp.tmp 2 2>&1 | FileCheck /Users/buildslave/jenkins/workspace/clang-stage1-cmake-RA-expensive/llvm/projects/compiler-rt/test/ubsan/TestCases/Float/cast-overflow.cpp --check-prefix=CHECK-2 : 'RUN: at line 6'; /Users/buildslave/jenkins/workspace/clang-stage1-cmake-RA-expensive/clang-build/tools/clang/runtime/compiler-rt-bins/test/ubsan/AddressSanitizer-x86_64/TestCases/Float/Output/cast-overflow.cpp.tmp 3 2>&1 | FileCheck /Users/buildslave/jenkins/workspace/clang-stage1-cmake-RA-expensive/llvm/projects/compiler-rt/test/ubsan/TestCases/Float/cast-overflow.cpp --check-prefix=CHECK-3 : 'RUN: at line 7'; /Users/buildslave/jenkins/workspace/clang-stage1-cmake-RA-expensive/clang-build/tools/clang/runtime/compiler-rt-bins/test/ubsan/AddressSanitizer-x86_64/TestCases/Float/Output/cast-overflow.cpp.tmp 4 2>&1 | FileCheck /Users/buildslave/jenkins/workspace/clang-stage1-cmake-RA-expensive/llvm/projects/compiler-rt/test/ubsan/TestCases/Float/cast-overflow.cpp --check-prefix=CHECK-4 : 'RUN: at line 8'; /Users/buildslave/jenkins/workspace/clang-stage1-cmake-RA-expensive/clang-build/tools/clang/runtime/compiler-rt-bins/test/ubsan/AddressSanitizer-x86_64/TestCases/Float/Output/cast-overflow.cpp.tmp 5 2>&1 | FileCheck /Users/buildslave/jenkins/workspace/clang-stage1-cmake-RA-expensive/llvm/projects/compiler-rt/test/ubsan/TestCases/Float/cast-overflow.cpp --check-prefix=CHECK-5 : 'RUN: at line 9'; /Users/buildslave/jenkins/workspace/clang-stage1-cmake-RA-expensive/clang-build/tools/clang/runtime/compiler-rt-bins/test/ubsan/AddressSanitizer-x86_64/TestCases/Float/Output/cast-overflow.cpp.tmp 6 2>&1 | FileCheck /Users/buildslave/jenkins/workspace/clang-stage1-cmake-RA-expensive/llvm/projects/compiler-rt/test/ubsan/TestCases/Float/cast-overflow.cpp --check-prefix=CHECK-6 : 'RUN: at line 12'; not /Users/buildslave/jenkins/workspace/clang-stage1-cmake-RA-expensive/clang-build/tools/clang/runtime/compiler-rt-bins/test/ubsan/AddressSanitizer-x86_64/TestCases/Float/Output/cast-overflow.cpp.tmp 9 2>&1 | FileCheck /Users/buildslave/jenkins/workspace/clang-stage1-cmake-RA-expensive/llvm/projects/compiler-rt/test/ubsan/TestCases/Float/cast-overflow.cpp --check-prefix=CHECK-9 -- Exit Code: 1

Hide Details

Command Output (stderr): -- /Users/buildslave/jenkins/workspace/clang-stage1-cmake-RA-expensive/llvm/projects/compiler-rt/test/ubsan/TestCases/Float/cast-overflow.cpp:61:3: warning: expression result unused [-Wunused-value] (int)MaxFloatRepresentableAsInt; // ok ^ ~~~~~~~~~~~~~~~~~~~~~~~~~~ /Users/buildslave/jenkins/workspace/clang-stage1-cmake-RA-expensive/llvm/projects/compiler-rt/test/ubsan/TestCases/Float/cast-overflow.cpp:62:3: warning: expression result unused [-Wunused-value] (int)-MaxFloatRepresentableAsInt; // ok ^ ~~~~~~~~~~~~~~~~~~~~~~~~~~~ /Users/buildslave/jenkins/workspace/clang-stage1-cmake-RA-expensive/llvm/projects/compiler-rt/test/ubsan/TestCases/Float/cast-overflow.cpp:65:3: warning: expression result unused [-Wunused-value] (int)MinFloatRepresentableAsInt; // ok ^ ~~~~~~~~~~~~~~~~~~~~~~~~~~ /Users/buildslave/jenkins/workspace/clang-stage1-cmake-RA-expensive/llvm/projects/compiler-rt/test/ubsan/TestCases/Float/cast-overflow.cpp:68:3: warning: expression result unused [-Wunused-value] (unsigned int)MaxFloatRepresentableAsUInt; // ok ^ ~~~~~~~~~~~~~~~~~~~~~~~~~~~ 4 warnings generated. /Users/buildslave/jenkins/workspace/clang-stage1-cmake-RA-expensive/llvm/projects/compiler-rt/test/ubsan/TestCases/Float/cast-overflow.cpp:140:14: error: CHECK-6: expected string not found in input // CHECK-6: cast-overflow.cpp:[[@LINE+2]]:{{34: runtime error: 0xffffff00000000000000000000000001 is outside the range of representable values of type 'float'| __int128 not supported}} ^ <stdin>:1:1: note: scanning from here /Users/buildslave/jenkins/workspace/clang-stage1-cmake-RA-expensive/llvm/projects/compiler-rt/test/ubsan/TestCases/Float/cast-overflow.cpp:142:27: runtime error: 3.40282e+38 is outside the range of representable values of type 'int' ^ <stdin>:1:1: note: uses undefined variable "@LINE" /Users/buildslave/jenkins/workspace/clang-stage1-cmake-RA-expensive/llvm/projects/compiler-rt/test/ubsan/TestCases/Float/cast-overflow.cpp:142:27: runtime error: 3.40282e+38 is outside the range of representable values of type 'int' ^

Hide Details

--

Hide Details

******************** PASS: UBSan-AddressSanitizer-x86_64 :: TestCases/ImplicitConversion/integer-arithmetic-value-change.c (3503 of 4241) PASS: UBSan-AddressSanitizer-x86_64 :: TestCases/ImplicitConversion/integer-conversion.c (3504 of 4241) PASS: UBSan-AddressSanitizer-x86_64 :: TestCases/ImplicitConversion/integer-sign-change-summary.cpp (3505 of 4241) PASS: UBSan-AddressSanitizer-x86_64 :: TestCases/ImplicitConversion/integer-sign-change-blacklist.c (3506 of 4241) PASS: UBSan-AddressSanitizer-i386 :: TestCases/TypeCheck/vptr.cpp (3507 of 4241) PASS: UBSan-AddressSanitizer-x86_64 :: TestCases/ImplicitConversion/integer-sign-change.c (3508 of 4241) PASS: UBSan-AddressSanitizer-x86_64 :: TestCases/ImplicitConversion/integer-truncation.c (3509 of 4241) PASS: UBSan-AddressSanitizer-x86_64 :: TestCases/ImplicitConversion/signed-integer-truncation-or-sign-change-summary.cpp (3510 of 4241) PASS: UBSan-AddressSanitizer-x86_64 :: TestCases/ImplicitConversion/signed-integer-truncation-summary.cpp (3511 of 4241) PASS: UBSan-AddressSanitizer-x86_64 :: TestCases/ImplicitConversion/signed-integer-truncation-blacklist.c (3512 of 4241) PASS: UBSan-AddressSanitizer-x86_64 :: TestCases/ImplicitConversion/signed-integer-truncation-or-sign-change-blacklist.c (3513 of 4241) PASS: UBSan-AddressSanitizer-x86_64 :: TestCases/ImplicitConversion/unsigned-integer-truncation-summary.cpp (3514 of 4241) PASS: UBSan-AddressSanitizer-x86_64 :: TestCases/ImplicitConversion/signed-integer-truncation.c (3515 of 4241) PASS: UBSan-AddressSanitizer-x86_64 :: TestCases/Integer/add-overflow.cpp (3516 of 4241) PASS: UBSan-AddressSanitizer-x86_64 :: TestCases/Integer/div-overflow.cpp (3517 of 4241) FAIL: UBSan-AddressSanitizer-x86_64 :: TestCases/Integer/div-zero.cpp (3518 of 4241) ******************** TEST 'UBSan-AddressSanitizer-x86_64 :: TestCases/Integer/div-zero.cpp' FAILED ******************** Script: -- : 'RUN: at line 1'; /Users/buildslave/jenkins/workspace/clang-stage1-cmake-RA-expensive/clang-build/./bin/clang --driver-mode=g++ -fsanitize=address -arch x86_64 -stdlib=libc++ -mmacosx-version-min=10.9 -isysroot /Applications/Xcode.app/Contents/Developer/Platforms/MacOSX.platform/Developer/SDKs/MacOSX10.13.sdk -fsanitize=integer-divide-by-zero -DDIVIDEND=0 /Users/buildslave/jenkins/workspace/clang-stage1-cmake-RA-expensive/llvm/projects/compiler-rt/test/ubsan/TestCases/Integer/div-zero.cpp -o /Users/buildslave/jenkins/workspace/clang-stage1-cmake-RA-expensive/clang-build/tools/clang/runtime/compiler-rt-bins/test/ubsan/AddressSanitizer-x86_64/TestCases/Integer/Output/div-zero.cpp.tmp && /Users/buildslave/jenkins/workspace/clang-stage1-cmake-RA-expensive/clang-build/tools/clang/runtime/compiler-rt-bins/test/ubsan/AddressSanitizer-x86_64/TestCases/Integer/Output/div-zero.cpp.tmp 2>&1 | FileCheck /Users/buildslave/jenkins/workspace/clang-stage1-cmake-RA-expensive/llvm/projects/compiler-rt/test/ubsan/TestCases/Integer/div-zero.cpp : 'RUN: at line 2'; /Users/buildslave/jenkins/workspace/clang-stage1-cmake-RA-expensive/clang-build/./bin/clang --driver-mode=g++ -fsanitize=address -arch x86_64 -stdlib=libc++ -mmacosx-version-min=10.9 -isysroot /Applications/Xcode.app/Contents/Developer/Platforms/MacOSX.platform/Developer/SDKs/MacOSX10.13.sdk -fsanitize=integer-divide-by-zero -DDIVIDEND=1U /Users/buildslave/jenkins/workspace/clang-stage1-cmake-RA-expensive/llvm/projects/compiler-rt/test/ubsan/TestCases/Integer/div-zero.cpp -o /Users/buildslave/jenkins/workspace/clang-stage1-cmake-RA-expensive/clang-build/tools/clang/runtime/compiler-rt-bins/test/ubsan/AddressSanitizer-x86_64/TestCases/Integer/Output/div-zero.cpp.tmp && /Users/buildslave/jenkins/workspace/clang-stage1-cmake-RA-expensive/clang-build/tools/clang/runtime/compiler-rt-bins/test/ubsan/AddressSanitizer-x86_64/TestCases/Integer/Output/div-zero.cpp.tmp 2>&1 | FileCheck /Users/buildslave/jenkins/workspace/clang-stage1-cmake-RA-expensive/llvm/projects/compiler-rt/test/ubsan/TestCases/Integer/div-zero.cpp : 'RUN: at line 3'; /Users/buildslave/jenkins/workspace/clang-stage1-cmake-RA-expensive/clang-build/./bin/clang --driver-mode=g++ -fsanitize=address -arch x86_64 -stdlib=libc++ -mmacosx-version-min=10.9 -isysroot /Applications/Xcode.app/Contents/Developer/Platforms/MacOSX.platform/Developer/SDKs/MacOSX10.13.sdk -fsanitize=float-divide-by-zero -DDIVIDEND=1.5 /Users/buildslave/jenkins/workspace/clang-stage1-cmake-RA-expensive/llvm/projects/compiler-rt/test/ubsan/TestCases/Integer/div-zero.cpp -o /Users/buildslave/jenkins/workspace/clang-stage1-cmake-RA-expensive/clang-build/tools/clang/runtime/compiler-rt-bins/test/ubsan/AddressSanitizer-x86_64/TestCases/Integer/Output/div-zero.cpp.tmp && /Users/buildslave/jenkins/workspace/clang-stage1-cmake-RA-expensive/clang-build/tools/clang/runtime/compiler-rt-bins/test/ubsan/AddressSanitizer-x86_64/TestCases/Integer/Output/div-zero.cpp.tmp 2>&1 | FileCheck /Users/buildslave/jenkins/workspace/clang-stage1-cmake-RA-expensive/llvm/projects/compiler-rt/test/ubsan/TestCases/Integer/div-zero.cpp : 'RUN: at line 4'; /Users/buildslave/jenkins/workspace/clang-stage1-cmake-RA-expensive/clang-build/./bin/clang --driver-mode=g++ -fsanitize=address -arch x86_64 -stdlib=libc++ -mmacosx-version-min=10.9 -isysroot /Applications/Xcode.app/Contents/Developer/Platforms/MacOSX.platform/Developer/SDKs/MacOSX10.13.sdk -fsanitize=integer-divide-by-zero -DDIVIDEND='intmax(123)' /Users/buildslave/jenkins/workspace/clang-stage1-cmake-RA-expensive/llvm/projects/compiler-rt/test/ubsan/TestCases/Integer/div-zero.cpp -o /Users/buildslave/jenkins/workspace/clang-stage1-cmake-RA-expensive/clang-build/tools/clang/runtime/compiler-rt-bins/test/ubsan/AddressSanitizer-x86_64/TestCases/Integer/Output/div-zero.cpp.tmp && /Users/buildslave/jenkins/workspace/clang-stage1-cmake-RA-expensive/clang-build/tools/clang/runtime/compiler-rt-bins/test/ubsan/AddressSanitizer-x86_64/TestCases/Integer/Output/div-zero.cpp.tmp 2>&1 | FileCheck /Users/buildslave/jenkins/workspace/clang-stage1-cmake-RA-expensive/llvm/projects/compiler-rt/test/ubsan/TestCases/Integer/div-zero.cpp -- Exit Code: 1

Hide Details

Command Output (stderr): -- /Users/buildslave/jenkins/workspace/clang-stage1-cmake-RA-expensive/llvm/projects/compiler-rt/test/ubsan/TestCases/Integer/div-zero.cpp:14:12: warning: expression result unused [-Wunused-value] DIVIDEND / 0; ~~~~~~~~ ^ ~ /Users/buildslave/jenkins/workspace/clang-stage1-cmake-RA-expensive/llvm/projects/compiler-rt/test/ubsan/TestCases/Integer/div-zero.cpp:14:12: warning: division by zero is undefined [-Wdivision-by-zero] DIVIDEND / 0; ^ ~ 2 warnings generated. /Users/buildslave/jenkins/workspace/clang-stage1-cmake-RA-expensive/llvm/projects/compiler-rt/test/ubsan/TestCases/Integer/div-zero.cpp:14:12: warning: expression result unused [-Wunused-value] DIVIDEND / 0; ~~~~~~~~ ^ ~ /Users/buildslave/jenkins/workspace/clang-stage1-cmake-RA-expensive/llvm/projects/compiler-rt/test/ubsan/TestCases/Integer/div-zero.cpp:14:12: warning: division by zero is undefined [-Wdivision-by-zero] DIVIDEND / 0; ^ ~ 2 warnings generated. clang-9: error: unsupported option '-fsanitize=float-divide-by-zero' for target 'x86_64-apple-darwin17.6.0'

Hide Details

--

Hide Details

******************** PASS: UBSan-AddressSanitizer-x86_64 :: TestCases/Integer/incdec-overflow.cpp (3519 of 4241) PASS: UBSan-AddressSanitizer-x86_64 :: TestCases/Integer/mul-overflow.cpp (3520 of 4241) PASS: UBSan-AddressSanitizer-x86_64 :: TestCases/Integer/negate-overflow.cpp (3521 of 4241) PASS: UBSan-AddressSanitizer-x86_64 :: TestCases/ImplicitConversion/unsigned-integer-truncation.c (3522 of 4241) PASS: UBSan-AddressSanitizer-x86_64 :: TestCases/ImplicitConversion/unsigned-integer-truncation-blacklist.c (3523 of 4241) PASS: UBSan-AddressSanitizer-x86_64 :: TestCases/Integer/no-recover.cpp (3524 of 4241) PASS: UBSan-AddressSanitizer-x86_64 :: TestCases/Integer/summary.cpp (3525 of 4241) PASS: UBSan-AddressSanitizer-x86_64 :: TestCases/Integer/sub-overflow.cpp (3526 of 4241) PASS: UBSan-AddressSanitizer-x86_64 :: TestCases/Integer/uadd-overflow.cpp (3527 of 4241) PASS: UBSan-AddressSanitizer-x86_64 :: TestCases/Integer/suppressions.cpp (3528 of 4241) PASS: UBSan-AddressSanitizer-x86_64 :: TestCases/Integer/umul-overflow.cpp (3529 of 4241) PASS: UBSan-AddressSanitizer-x86_64 :: TestCases/Integer/uincdec-overflow.cpp (3530 of 4241) UNSUPPORTED: UBSan-AddressSanitizer-x86_64 :: TestCases/Misc/Linux/print_stack_trace.cc (3531 of 4241) UNSUPPORTED: UBSan-AddressSanitizer-x86_64 :: TestCases/Misc/Linux/ubsan_options.cc (3532 of 4241) PASS: UBSan-AddressSanitizer-x86_64 :: TestCases/Misc/bool.cpp (3533 of 4241) PASS: UBSan-AddressSanitizer-x86_64 :: TestCases/Integer/usub-overflow.cpp (3534 of 4241) PASS: UBSan-AddressSanitizer-x86_64 :: TestCases/Integer/shift.cpp (3535 of 4241) PASS: UBSan-AddressSanitizer-x86_64 :: TestCases/Misc/builtins.cpp (3536 of 4241) PASS: UBSan-AddressSanitizer-x86_64 :: TestCases/Misc/bounds.cpp (3537 of 4241) PASS: UBSan-AddressSanitizer-x86_64 :: TestCases/Misc/deduplication.cpp (3538 of 4241) PASS: UBSan-AddressSanitizer-x86_64 :: TestCases/Misc/enum.cpp (3539 of 4241) PASS: UBSan-AddressSanitizer-x86_64 :: TestCases/Misc/coverage-levels.cc (3540 of 4241) PASS: UBSan-AddressSanitizer-x86_64 :: TestCases/Misc/log-path_test.cc (3541 of 4241) UNSUPPORTED: UBSan-AddressSanitizer-x86_64 :: TestCases/Misc/no-interception.cpp (3542 of 4241) PASS: UBSan-AddressSanitizer-x86_64 :: TestCases/Misc/monitor.cpp (3543 of 4241) PASS: UBSan-AddressSanitizer-x86_64 :: TestCases/Misc/missing_return.cpp (3544 of 4241) PASS: UBSan-AddressSanitizer-x86_64 :: TestCases/Misc/nonnull.cpp (3545 of 4241) PASS: UBSan-AddressSanitizer-x86_64 :: TestCases/Misc/nullability.c (3546 of 4241) PASS: UBSan-AddressSanitizer-x86_64 :: TestCases/Misc/nonnull-arg.cpp (3547 of 4241) PASS: UBSan-AddressSanitizer-x86_64 :: TestCases/Misc/unreachable.cpp (3548 of 4241) PASS: UBSan-AddressSanitizer-x86_64 :: TestCases/Misc/vla.c (3549 of 4241) PASS: UBSan-AddressSanitizer-x86_64 :: TestCases/Pointer/alignment-assumption-attribute-align_value-on-paramvar.cpp (3550 of 4241) PASS: UBSan-AddressSanitizer-x86_64 :: TestCases/Pointer/alignment-assumption-attribute-align_value-on-lvalue.cpp (3551 of 4241) PASS: UBSan-AddressSanitizer-x86_64 :: TestCases/Pointer/alignment-assumption-attribute-alloc_align-on-function-variable.cpp (3552 of 4241) PASS: UBSan-AddressSanitizer-x86_64 :: TestCases/Pointer/alignment-assumption-attribute-assume_aligned-on-function-two-params.cpp (3553 of 4241) PASS: UBSan-AddressSanitizer-x86_64 :: TestCases/Pointer/alignment-assumption-attribute-alloc_align-on-function.cpp (3554 of 4241) PASS: UBSan-AddressSanitizer-x86_64 :: TestCases/Pointer/alignment-assumption-attribute-assume_aligned-on-function.cpp (3555 of 4241) PASS: UBSan-AddressSanitizer-x86_64 :: TestCases/Pointer/alignment-assumption-blacklist.cpp (3556 of 4241) PASS: UBSan-AddressSanitizer-x86_64 :: TestCases/Pointer/alignment-assumption-builtin_assume_aligned-three-params.cpp (3557 of 4241) PASS: UBSan-AddressSanitizer-x86_64 :: TestCases/Pointer/alignment-assumption-builtin_assume_aligned-three-params-variable.cpp (3558 of 4241) PASS: UBSan-AddressSanitizer-x86_64 :: TestCases/Pointer/alignment-assumption-summary.cpp (3559 of 4241) PASS: UBSan-AddressSanitizer-x86_64 :: TestCases/Pointer/alignment-assumption-builtin_assume_aligned-two-params.cpp (3560 of 4241) PASS: UBSan-AddressSanitizer-x86_64 :: TestCases/Pointer/unsigned-index-expression.cpp (3561 of 4241) PASS: UBSan-AddressSanitizer-x86_64 :: TestCases/Pointer/index-overflow.cpp (3562 of 4241) UNSUPPORTED: UBSan-AddressSanitizer-x86_64 :: TestCases/TypeCheck/Linux/PR33221.cpp (3563 of 4241) PASS: UBSan-AddressSanitizer-x86_64 :: TestCases/TypeCheck/PR33221.cpp (3564 of 4241) PASS: UBSan-AddressSanitizer-x86_64 :: TestCases/TypeCheck/Function/function.cpp (3565 of 4241) PASS: UBSan-AddressSanitizer-x86_64 :: TestCases/Pointer/alignment-assumption-openmp.cpp (3566 of 4241) PASS: UBSan-AddressSanitizer-x86_64 :: TestCases/TypeCheck/null.cpp (3567 of 4241) PASS: UBSan-Minimal-x86_64 :: TestCases/alignment-assumption.c (3568 of 4241) PASS: UBSan-Minimal-x86_64 :: TestCases/implicit-integer-sign-change.c (3569 of 4241) PASS: UBSan-Minimal-x86_64 :: TestCases/alignment-assumption.c (3570 of 4241) PASS: UBSan-Minimal-x86_64 :: TestCases/implicit-integer-sign-change.c (3571 of 4241) PASS: UBSan-Minimal-x86_64 :: TestCases/implicit-signed-integer-truncation-or-sign-change.c (3572 of 4241) PASS: UBSan-Minimal-x86_64 :: TestCases/implicit-signed-integer-truncation-or-sign-change.c (3573 of 4241) PASS: UBSan-Minimal-x86_64 :: TestCases/implicit-signed-integer-truncation.c (3574 of 4241) PASS: UBSan-AddressSanitizer-x86_64 :: TestCases/TypeCheck/vptr-non-unique-typeinfo.cpp (3575 of 4241) PASS: UBSan-Minimal-x86_64 :: TestCases/implicit-signed-integer-truncation.c (3576 of 4241) PASS: UBSan-Minimal-x86_64 :: TestCases/implicit-unsigned-integer-truncation.c (3577 of 4241) PASS: UBSan-AddressSanitizer-x86_64 :: TestCases/TypeCheck/vptr-corrupted-vtable-itanium.cpp (3578 of 4241) PASS: UBSan-Minimal-x86_64 :: TestCases/implicit-unsigned-integer-truncation.c (3579 of 4241) PASS: UBSan-Minimal-x86_64 :: TestCases/recover-dedup-limit.cpp (3580 of 4241) PASS: UBSan-Minimal-x86_64 :: TestCases/recover-dedup-limit.cpp (3581 of 4241) PASS: UBSan-AddressSanitizer-x86_64 :: TestCases/TypeCheck/vptr-virtual-base-construction.cpp (3582 of 4241) PASS: UBSan-Minimal-x86_64 :: TestCases/recover-dedup.cpp (3583 of 4241) PASS: UBSan-Minimal-x86_64 :: TestCases/recover-dedup.cpp (3584 of 4241) PASS: UBSan-Minimal-x86_64 :: TestCases/test-darwin-interface.c (3585 of 4241) PASS: UBSan-Minimal-x86_64 :: TestCases/test-darwin-interface.c (3586 of 4241) PASS: UBSan-AddressSanitizer-x86_64 :: TestCases/TypeCheck/vptr-virtual-base.cpp (3587 of 4241) PASS: UBSan-Minimal-x86_64 :: TestCases/uadd-overflow.cpp (3588 of 4241) UNSUPPORTED: UBSan-Standalone-i386 :: TestCases/ImplicitConversion/integer-sign-change-summary.cpp (3589 of 4241) PASS: UBSan-Minimal-x86_64 :: TestCases/uadd-overflow.cpp (3590 of 4241) PASS: UBSan-Standalone-i386 :: TestCases/Float/cast-overflow.cpp (3591 of 4241) PASS: UBSan-Standalone-i386 :: TestCases/ImplicitConversion/integer-sign-change-blacklist.c (3592 of 4241) PASS: UBSan-AddressSanitizer-x86_64 :: TestCases/TypeCheck/misaligned.cpp (3593 of 4241) UNSUPPORTED: UBSan-Standalone-i386 :: TestCases/ImplicitConversion/signed-integer-truncation-or-sign-change-summary.cpp (3594 of 4241) UNSUPPORTED: UBSan-Standalone-i386 :: TestCases/ImplicitConversion/signed-integer-truncation-summary.cpp (3595 of 4241) PASS: UBSan-Standalone-i386 :: TestCases/ImplicitConversion/integer-truncation.c (3596 of 4241) PASS: UBSan-Standalone-i386 :: TestCases/ImplicitConversion/integer-sign-change.c (3597 of 4241) UNSUPPORTED: UBSan-Standalone-i386 :: TestCases/ImplicitConversion/unsigned-integer-truncation-summary.cpp (3598 of 4241) PASS: UBSan-Standalone-i386 :: TestCases/ImplicitConversion/integer-arithmetic-value-change.c (3599 of 4241) PASS: UBSan-Standalone-i386 :: TestCases/ImplicitConversion/integer-conversion.c (3600 of 4241) PASS: UBSan-Standalone-i386 :: TestCases/ImplicitConversion/signed-integer-truncation-blacklist.c (3601 of 4241) PASS: UBSan-Standalone-i386 :: TestCases/Integer/div-overflow.cpp (3602 of 4241) FAIL: UBSan-Standalone-i386 :: TestCases/Integer/div-zero.cpp (3603 of 4241) ******************** TEST 'UBSan-Standalone-i386 :: TestCases/Integer/div-zero.cpp' FAILED ******************** Script: -- : 'RUN: at line 1'; /Users/buildslave/jenkins/workspace/clang-stage1-cmake-RA-expensive/clang-build/./bin/clang --driver-mode=g++ -arch i386 -stdlib=libc++ -mmacosx-version-min=10.9 -isysroot /Applications/Xcode.app/Contents/Developer/Platforms/MacOSX.platform/Developer/SDKs/MacOSX10.13.sdk -fsanitize=integer-divide-by-zero -DDIVIDEND=0 /Users/buildslave/jenkins/workspace/clang-stage1-cmake-RA-expensive/llvm/projects/compiler-rt/test/ubsan/TestCases/Integer/div-zero.cpp -o /Users/buildslave/jenkins/workspace/clang-stage1-cmake-RA-expensive/clang-build/tools/clang/runtime/compiler-rt-bins/test/ubsan/Standalone-i386/TestCases/Integer/Output/div-zero.cpp.tmp && /Users/buildslave/jenkins/workspace/clang-stage1-cmake-RA-expensive/clang-build/tools/clang/runtime/compiler-rt-bins/test/ubsan/Standalone-i386/TestCases/Integer/Output/div-zero.cpp.tmp 2>&1 | FileCheck /Users/buildslave/jenkins/workspace/clang-stage1-cmake-RA-expensive/llvm/projects/compiler-rt/test/ubsan/TestCases/Integer/div-zero.cpp : 'RUN: at line 2'; /Users/buildslave/jenkins/workspace/clang-stage1-cmake-RA-expensive/clang-build/./bin/clang --driver-mode=g++ -arch i386 -stdlib=libc++ -mmacosx-version-min=10.9 -isysroot /Applications/Xcode.app/Contents/Developer/Platforms/MacOSX.platform/Developer/SDKs/MacOSX10.13.sdk -fsanitize=integer-divide-by-zero -DDIVIDEND=1U /Users/buildslave/jenkins/workspace/clang-stage1-cmake-RA-expensive/llvm/projects/compiler-rt/test/ubsan/TestCases/Integer/div-zero.cpp -o /Users/buildslave/jenkins/workspace/clang-stage1-cmake-RA-expensive/clang-build/tools/clang/runtime/compiler-rt-bins/test/ubsan/Standalone-i386/TestCases/Integer/Output/div-zero.cpp.tmp && /Users/buildslave/jenkins/workspace/clang-stage1-cmake-RA-expensive/clang-build/tools/clang/runtime/compiler-rt-bins/test/ubsan/Standalone-i386/TestCases/Integer/Output/div-zero.cpp.tmp 2>&1 | FileCheck /Users/buildslave/jenkins/workspace/clang-stage1-cmake-RA-expensive/llvm/projects/compiler-rt/test/ubsan/TestCases/Integer/div-zero.cpp : 'RUN: at line 3'; /Users/buildslave/jenkins/workspace/clang-stage1-cmake-RA-expensive/clang-build/./bin/clang --driver-mode=g++ -arch i386 -stdlib=libc++ -mmacosx-version-min=10.9 -isysroot /Applications/Xcode.app/Contents/Developer/Platforms/MacOSX.platform/Developer/SDKs/MacOSX10.13.sdk -fsanitize=float-divide-by-zero -DDIVIDEND=1.5 /Users/buildslave/jenkins/workspace/clang-stage1-cmake-RA-expensive/llvm/projects/compiler-rt/test/ubsan/TestCases/Integer/div-zero.cpp -o /Users/buildslave/jenkins/workspace/clang-stage1-cmake-RA-expensive/clang-build/tools/clang/runtime/compiler-rt-bins/test/ubsan/Standalone-i386/TestCases/Integer/Output/div-zero.cpp.tmp && /Users/buildslave/jenkins/workspace/clang-stage1-cmake-RA-expensive/clang-build/tools/clang/runtime/compiler-rt-bins/test/ubsan/Standalone-i386/TestCases/Integer/Output/div-zero.cpp.tmp 2>&1 | FileCheck /Users/buildslave/jenkins/workspace/clang-stage1-cmake-RA-expensive/llvm/projects/compiler-rt/test/ubsan/TestCases/Integer/div-zero.cpp : 'RUN: at line 4'; /Users/buildslave/jenkins/workspace/clang-stage1-cmake-RA-expensive/clang-build/./bin/clang --driver-mode=g++ -arch i386 -stdlib=libc++ -mmacosx-version-min=10.9 -isysroot /Applications/Xcode.app/Contents/Developer/Platforms/MacOSX.platform/Developer/SDKs/MacOSX10.13.sdk -fsanitize=integer-divide-by-zero -DDIVIDEND='intmax(123)' /Users/buildslave/jenkins/workspace/clang-stage1-cmake-RA-expensive/llvm/projects/compiler-rt/test/ubsan/TestCases/Integer/div-zero.cpp -o /Users/buildslave/jenkins/workspace/clang-stage1-cmake-RA-expensive/clang-build/tools/clang/runtime/compiler-rt-bins/test/ubsan/Standalone-i386/TestCases/Integer/Output/div-zero.cpp.tmp && /Users/buildslave/jenkins/workspace/clang-stage1-cmake-RA-expensive/clang-build/tools/clang/runtime/compiler-rt-bins/test/ubsan/Standalone-i386/TestCases/Integer/Output/div-zero.cpp.tmp 2>&1 | FileCheck /Users/buildslave/jenkins/workspace/clang-stage1-cmake-RA-expensive/llvm/projects/compiler-rt/test/ubsan/TestCases/Integer/div-zero.cpp -- Exit Code: 1

Hide Details

Command Output (stderr): -- /Users/buildslave/jenkins/workspace/clang-stage1-cmake-RA-expensive/llvm/projects/compiler-rt/test/ubsan/TestCases/Integer/div-zero.cpp:14:12: warning: expression result unused [-Wunused-value] DIVIDEND / 0; ~~~~~~~~ ^ ~ /Users/buildslave/jenkins/workspace/clang-stage1-cmake-RA-expensive/llvm/projects/compiler-rt/test/ubsan/TestCases/Integer/div-zero.cpp:14:12: warning: division by zero is undefined [-Wdivision-by-zero] DIVIDEND / 0; ^ ~ 2 warnings generated. /Users/buildslave/jenkins/workspace/clang-stage1-cmake-RA-expensive/llvm/projects/compiler-rt/test/ubsan/TestCases/Integer/div-zero.cpp:14:12: warning: expression result unused [-Wunused-value] DIVIDEND / 0; ~~~~~~~~ ^ ~ /Users/buildslave/jenkins/workspace/clang-stage1-cmake-RA-expensive/llvm/projects/compiler-rt/test/ubsan/TestCases/Integer/div-zero.cpp:14:12: warning: division by zero is undefined [-Wdivision-by-zero] DIVIDEND / 0; ^ ~ 2 warnings generated. clang-9: error: unsupported option '-fsanitize=float-divide-by-zero' for target 'i386-apple-darwin17.6.0'

Hide Details

--

Hide Details

******************** PASS: UBSan-Standalone-i386 :: TestCases/Integer/add-overflow.cpp (3604 of 4241) PASS: UBSan-Standalone-i386 :: TestCases/Integer/mul-overflow.cpp (3605 of 4241) PASS: UBSan-Standalone-i386 :: TestCases/Integer/incdec-overflow.cpp (3606 of 4241) PASS: UBSan-Standalone-i386 :: TestCases/ImplicitConversion/signed-integer-truncation-or-sign-change-blacklist.c (3607 of 4241) PASS: UBSan-Standalone-i386 :: TestCases/Integer/negate-overflow.cpp (3608 of 4241) UNSUPPORTED: UBSan-Standalone-i386 :: TestCases/Integer/summary.cpp (3609 of 4241) PASS: UBSan-Standalone-i386 :: TestCases/Integer/no-recover.cpp (3610 of 4241) PASS: UBSan-Standalone-i386 :: TestCases/ImplicitConversion/signed-integer-truncation.c (3611 of 4241) PASS: UBSan-Standalone-i386 :: TestCases/Integer/sub-overflow.cpp (3612 of 4241) PASS: UBSan-Standalone-i386 :: TestCases/Integer/umul-overflow.cpp (3613 of 4241) PASS: UBSan-Standalone-i386 :: TestCases/Integer/uadd-overflow.cpp (3614 of 4241) UNSUPPORTED: UBSan-Standalone-i386 :: TestCases/Misc/Linux/print_stack_trace.cc (3615 of 4241) UNSUPPORTED: UBSan-Standalone-i386 :: TestCases/Misc/Linux/ubsan_options.cc (3616 of 4241) PASS: UBSan-Standalone-i386 :: TestCases/Integer/uincdec-overflow.cpp (3617 of 4241) PASS: UBSan-Standalone-i386 :: TestCases/Misc/bool.cpp (3618 of 4241) UNSUPPORTED: UBSan-Standalone-i386 :: TestCases/Misc/builtins.cpp (3619 of 4241) PASS: UBSan-Standalone-i386 :: TestCases/Misc/bounds.cpp (3620 of 4241) PASS: UBSan-Standalone-i386 :: TestCases/Integer/usub-overflow.cpp (3621 of 4241) PASS: UBSan-Standalone-i386 :: TestCases/Integer/suppressions.cpp (3622 of 4241) PASS: UBSan-Standalone-i386 :: TestCases/Misc/deduplication.cpp (3623 of 4241) PASS: UBSan-Standalone-i386 :: TestCases/ImplicitConversion/unsigned-integer-truncation.c (3624 of 4241) PASS: UBSan-Standalone-i386 :: TestCases/Misc/enum.cpp (3625 of 4241) UNSUPPORTED: UBSan-Standalone-i386 :: TestCases/Misc/no-interception.cpp (3626 of 4241) PASS: UBSan-Standalone-i386 :: TestCases/Misc/monitor.cpp (3627 of 4241) PASS: UBSan-Standalone-i386 :: TestCases/Misc/coverage-levels.cc (3628 of 4241) PASS: UBSan-Standalone-i386 :: TestCases/Misc/log-path_test.cc (3629 of 4241) PASS: UBSan-Standalone-i386 :: TestCases/Misc/nonnull-arg.cpp (3630 of 4241) PASS: UBSan-Standalone-i386 :: TestCases/Integer/shift.cpp (3631 of 4241) PASS: UBSan-Standalone-i386 :: TestCases/Misc/nonnull.cpp (3632 of 4241) PASS: UBSan-Standalone-i386 :: TestCases/Misc/vla.c (3633 of 4241) PASS: UBSan-Standalone-i386 :: TestCases/Misc/nullability.c (3634 of 4241) PASS: UBSan-Standalone-i386 :: TestCases/ImplicitConversion/unsigned-integer-truncation-blacklist.c (3635 of 4241) PASS: UBSan-Standalone-i386 :: TestCases/Misc/unreachable.cpp (3636 of 4241) PASS: UBSan-Standalone-i386 :: TestCases/Misc/missing_return.cpp (3637 of 4241) PASS: UBSan-Standalone-i386 :: TestCases/Pointer/alignment-assumption-blacklist.cpp (3638 of 4241) PASS: UBSan-Standalone-i386 :: TestCases/Pointer/alignment-assumption-attribute-align_value-on-paramvar.cpp (3639 of 4241) PASS: UBSan-Standalone-i386 :: TestCases/Pointer/alignment-assumption-attribute-assume_aligned-on-function.cpp (3640 of 4241) PASS: UBSan-Standalone-i386 :: TestCases/Pointer/alignment-assumption-attribute-align_value-on-lvalue.cpp (3641 of 4241) PASS: UBSan-Standalone-i386 :: TestCases/Pointer/alignment-assumption-attribute-assume_aligned-on-function-two-params.cpp (3642 of 4241) PASS: UBSan-Standalone-i386 :: TestCases/Pointer/alignment-assumption-attribute-alloc_align-on-function.cpp (3643 of 4241) UNSUPPORTED: UBSan-Standalone-i386 :: TestCases/Pointer/alignment-assumption-summary.cpp (3644 of 4241) PASS: UBSan-Standalone-i386 :: TestCases/Pointer/alignment-assumption-attribute-alloc_align-on-function-variable.cpp (3645 of 4241) UNSUPPORTED: UBSan-Standalone-i386 :: TestCases/TypeCheck/Function/function.cpp (3646 of 4241) UNSUPPORTED: UBSan-Standalone-i386 :: TestCases/TypeCheck/Linux/PR33221.cpp (3647 of 4241) PASS: UBSan-Standalone-i386 :: TestCases/Pointer/unsigned-index-expression.cpp (3648 of 4241) PASS: UBSan-Standalone-i386 :: TestCases/TypeCheck/PR33221.cpp (3649 of 4241) PASS: UBSan-Standalone-i386 :: TestCases/Pointer/index-overflow.cpp (3650 of 4241) PASS: UBSan-Standalone-i386 :: TestCases/TypeCheck/null.cpp (3651 of 4241) PASS: UBSan-Standalone-i386 :: TestCases/TypeCheck/vptr-non-unique-typeinfo.cpp (3652 of 4241) PASS: UBSan-Standalone-i386 :: TestCases/Pointer/alignment-assumption-builtin_assume_aligned-three-params-variable.cpp (3653 of 4241) PASS: UBSan-Standalone-i386 :: TestCases/TypeCheck/vptr-virtual-base-construction.cpp (3654 of 4241) PASS: UBSan-Standalone-i386 :: TestCases/TypeCheck/vptr-corrupted-vtable-itanium.cpp (3655 of 4241) PASS: UBSan-Standalone-i386 :: TestCases/TypeCheck/vptr-virtual-base.cpp (3656 of 4241) FAIL: UBSan-Standalone-x86_64 :: TestCases/Float/cast-overflow.cpp (3657 of 4241) ******************** TEST 'UBSan-Standalone-x86_64 :: TestCases/Float/cast-overflow.cpp' FAILED ******************** Script: -- : 'RUN: at line 1'; /Users/buildslave/jenkins/workspace/clang-stage1-cmake-RA-expensive/clang-build/./bin/clang --driver-mode=g++ -arch x86_64 -stdlib=libc++ -mmacosx-version-min=10.9 -isysroot /Applications/Xcode.app/Contents/Developer/Platforms/MacOSX.platform/Developer/SDKs/MacOSX10.13.sdk -fsanitize=float-cast-overflow /Users/buildslave/jenkins/workspace/clang-stage1-cmake-RA-expensive/llvm/projects/compiler-rt/test/ubsan/TestCases/Float/cast-overflow.cpp -o /Users/buildslave/jenkins/workspace/clang-stage1-cmake-RA-expensive/clang-build/tools/clang/runtime/compiler-rt-bins/test/ubsan/Standalone-x86_64/TestCases/Float/Output/cast-overflow.cpp.tmp : 'RUN: at line 2'; /Users/buildslave/jenkins/workspace/clang-stage1-cmake-RA-expensive/clang-build/tools/clang/runtime/compiler-rt-bins/test/ubsan/Standalone-x86_64/TestCases/Float/Output/cast-overflow.cpp.tmp _ : 'RUN: at line 3'; env UBSAN_OPTIONS=abort_on_error=0:log_to_syslog=0:print_summary=1:report_error_type=1 /Users/buildslave/jenkins/workspace/clang-stage1-cmake-RA-expensive/clang-build/tools/clang/runtime/compiler-rt-bins/test/ubsan/Standalone-x86_64/TestCases/Float/Output/cast-overflow.cpp.tmp 0 2>&1 | FileCheck /Users/buildslave/jenkins/workspace/clang-stage1-cmake-RA-expensive/llvm/projects/compiler-rt/test/ubsan/TestCases/Float/cast-overflow.cpp --check-prefix=CHECK-0 : 'RUN: at line 4'; /Users/buildslave/jenkins/workspace/clang-stage1-cmake-RA-expensive/clang-build/tools/clang/runtime/compiler-rt-bins/test/ubsan/Standalone-x86_64/TestCases/Float/Output/cast-overflow.cpp.tmp 1 2>&1 | FileCheck /Users/buildslave/jenkins/workspace/clang-stage1-cmake-RA-expensive/llvm/projects/compiler-rt/test/ubsan/TestCases/Float/cast-overflow.cpp --check-prefix=CHECK-1 : 'RUN: at line 5'; /Users/buildslave/jenkins/workspace/clang-stage1-cmake-RA-expensive/clang-build/tools/clang/runtime/compiler-rt-bins/test/ubsan/Standalone-x86_64/TestCases/Float/Output/cast-overflow.cpp.tmp 2 2>&1 | FileCheck /Users/buildslave/jenkins/workspace/clang-stage1-cmake-RA-expensive/llvm/projects/compiler-rt/test/ubsan/TestCases/Float/cast-overflow.cpp --check-prefix=CHECK-2 : 'RUN: at line 6'; /Users/buildslave/jenkins/workspace/clang-stage1-cmake-RA-expensive/clang-build/tools/clang/runtime/compiler-rt-bins/test/ubsan/Standalone-x86_64/TestCases/Float/Output/cast-overflow.cpp.tmp 3 2>&1 | FileCheck /Users/buildslave/jenkins/workspace/clang-stage1-cmake-RA-expensive/llvm/projects/compiler-rt/test/ubsan/TestCases/Float/cast-overflow.cpp --check-prefix=CHECK-3 : 'RUN: at line 7'; /Users/buildslave/jenkins/workspace/clang-stage1-cmake-RA-expensive/clang-build/tools/clang/runtime/compiler-rt-bins/test/ubsan/Standalone-x86_64/TestCases/Float/Output/cast-overflow.cpp.tmp 4 2>&1 | FileCheck /Users/buildslave/jenkins/workspace/clang-stage1-cmake-RA-expensive/llvm/projects/compiler-rt/test/ubsan/TestCases/Float/cast-overflow.cpp --check-prefix=CHECK-4 : 'RUN: at line 8'; /Users/buildslave/jenkins/workspace/clang-stage1-cmake-RA-expensive/clang-build/tools/clang/runtime/compiler-rt-bins/test/ubsan/Standalone-x86_64/TestCases/Float/Output/cast-overflow.cpp.tmp 5 2>&1 | FileCheck /Users/buildslave/jenkins/workspace/clang-stage1-cmake-RA-expensive/llvm/projects/compiler-rt/test/ubsan/TestCases/Float/cast-overflow.cpp --check-prefix=CHECK-5 : 'RUN: at line 9'; /Users/buildslave/jenkins/workspace/clang-stage1-cmake-RA-expensive/clang-build/tools/clang/runtime/compiler-rt-bins/test/ubsan/Standalone-x86_64/TestCases/Float/Output/cast-overflow.cpp.tmp 6 2>&1 | FileCheck /Users/buildslave/jenkins/workspace/clang-stage1-cmake-RA-expensive/llvm/projects/compiler-rt/test/ubsan/TestCases/Float/cast-overflow.cpp --check-prefix=CHECK-6 : 'RUN: at line 12'; not /Users/buildslave/jenkins/workspace/clang-stage1-cmake-RA-expensive/clang-build/tools/clang/runtime/compiler-rt-bins/test/ubsan/Standalone-x86_64/TestCases/Float/Output/cast-overflow.cpp.tmp 9 2>&1 | FileCheck /Users/buildslave/jenkins/workspace/clang-stage1-cmake-RA-expensive/llvm/projects/compiler-rt/test/ubsan/TestCases/Float/cast-overflow.cpp --check-prefix=CHECK-9 -- Exit Code: 1

Hide Details

Command Output (stderr): -- /Users/buildslave/jenkins/workspace/clang-stage1-cmake-RA-expensive/llvm/projects/compiler-rt/test/ubsan/TestCases/Float/cast-overflow.cpp:61:3: warning: expression result unused [-Wunused-value] (int)MaxFloatRepresentableAsInt; // ok ^ ~~~~~~~~~~~~~~~~~~~~~~~~~~ /Users/buildslave/jenkins/workspace/clang-stage1-cmake-RA-expensive/llvm/projects/compiler-rt/test/ubsan/TestCases/Float/cast-overflow.cpp:62:3: warning: expression result unused [-Wunused-value] (int)-MaxFloatRepresentableAsInt; // ok ^ ~~~~~~~~~~~~~~~~~~~~~~~~~~~ /Users/buildslave/jenkins/workspace/clang-stage1-cmake-RA-expensive/llvm/projects/compiler-rt/test/ubsan/TestCases/Float/cast-overflow.cpp:65:3: warning: expression result unused [-Wunused-value] (int)MinFloatRepresentableAsInt; // ok ^ ~~~~~~~~~~~~~~~~~~~~~~~~~~ /Users/buildslave/jenkins/workspace/clang-stage1-cmake-RA-expensive/llvm/projects/compiler-rt/test/ubsan/TestCases/Float/cast-overflow.cpp:68:3: warning: expression result unused [-Wunused-value] (unsigned int)MaxFloatRepresentableAsUInt; // ok ^ ~~~~~~~~~~~~~~~~~~~~~~~~~~~ 4 warnings generated. /Users/buildslave/jenkins/workspace/clang-stage1-cmake-RA-expensive/llvm/projects/compiler-rt/test/ubsan/TestCases/Float/cast-overflow.cpp:140:14: error: CHECK-6: expected string not found in input // CHECK-6: cast-overflow.cpp:[[@LINE+2]]:{{34: runtime error: 0xffffff00000000000000000000000001 is outside the range of representable values of type 'float'| __int128 not supported}} ^ <stdin>:1:1: note: scanning from here /Users/buildslave/jenkins/workspace/clang-stage1-cmake-RA-expensive/llvm/projects/compiler-rt/test/ubsan/TestCases/Float/cast-overflow.cpp:142:27: runtime error: 3.40282e+38 is outside the range of representable values of type 'int' ^ <stdin>:1:1: note: uses undefined variable "@LINE" /Users/buildslave/jenkins/workspace/clang-stage1-cmake-RA-expensive/llvm/projects/compiler-rt/test/ubsan/TestCases/Float/cast-overflow.cpp:142:27: runtime error: 3.40282e+38 is outside the range of representable values of type 'int' ^

Hide Details

--

Hide Details

******************** PASS: UBSan-Standalone-i386 :: TestCases/TypeCheck/misaligned.cpp (3658 of 4241) PASS: UBSan-Standalone-i386 :: TestCases/Pointer/alignment-assumption-builtin_assume_aligned-three-params.cpp (3659 of 4241) UNSUPPORTED: UBSan-Standalone-x86_64 :: TestCases/ImplicitConversion/integer-sign-change-summary.cpp (3660 of 4241) PASS: UBSan-Standalone-i386 :: TestCases/Pointer/alignment-assumption-builtin_assume_aligned-two-params.cpp (3661 of 4241) PASS: UBSan-Standalone-i386 :: TestCases/Pointer/alignment-assumption-openmp.cpp (3662 of 4241) PASS: UBSan-Standalone-x86_64 :: TestCases/ImplicitConversion/integer-sign-change-blacklist.c (3663 of 4241) PASS: UBSan-Standalone-x86_64 :: TestCases/ImplicitConversion/integer-arithmetic-value-change.c (3664 of 4241) UNSUPPORTED: UBSan-Standalone-x86_64 :: TestCases/ImplicitConversion/signed-integer-truncation-or-sign-change-summary.cpp (3665 of 4241) UNSUPPORTED: UBSan-Standalone-x86_64 :: TestCases/ImplicitConversion/signed-integer-truncation-summary.cpp (3666 of 4241) PASS: UBSan-Standalone-x86_64 :: TestCases/ImplicitConversion/integer-conversion.c (3667 of 4241) PASS: UBSan-Standalone-x86_64 :: TestCases/ImplicitConversion/integer-truncation.c (3668 of 4241) UNSUPPORTED: UBSan-Standalone-x86_64 :: TestCases/ImplicitConversion/unsigned-integer-truncation-summary.cpp (3669 of 4241) PASS: UBSan-AddressSanitizer-x86_64 :: TestCases/TypeCheck/vptr.cpp (3670 of 4241) PASS: UBSan-Standalone-x86_64 :: TestCases/ImplicitConversion/integer-sign-change.c (3671 of 4241) PASS: UBSan-Standalone-x86_64 :: TestCases/Integer/div-overflow.cpp (3672 of 4241) FAIL: UBSan-Standalone-x86_64 :: TestCases/Integer/div-zero.cpp (3673 of 4241) ******************** TEST 'UBSan-Standalone-x86_64 :: TestCases/Integer/div-zero.cpp' FAILED ******************** Script: -- : 'RUN: at line 1'; /Users/buildslave/jenkins/workspace/clang-stage1-cmake-RA-expensive/clang-build/./bin/clang --driver-mode=g++ -arch x86_64 -stdlib=libc++ -mmacosx-version-min=10.9 -isysroot /Applications/Xcode.app/Contents/Developer/Platforms/MacOSX.platform/Developer/SDKs/MacOSX10.13.sdk -fsanitize=integer-divide-by-zero -DDIVIDEND=0 /Users/buildslave/jenkins/workspace/clang-stage1-cmake-RA-expensive/llvm/projects/compiler-rt/test/ubsan/TestCases/Integer/div-zero.cpp -o /Users/buildslave/jenkins/workspace/clang-stage1-cmake-RA-expensive/clang-build/tools/clang/runtime/compiler-rt-bins/test/ubsan/Standalone-x86_64/TestCases/Integer/Output/div-zero.cpp.tmp && /Users/buildslave/jenkins/workspace/clang-stage1-cmake-RA-expensive/clang-build/tools/clang/runtime/compiler-rt-bins/test/ubsan/Standalone-x86_64/TestCases/Integer/Output/div-zero.cpp.tmp 2>&1 | FileCheck /Users/buildslave/jenkins/workspace/clang-stage1-cmake-RA-expensive/llvm/projects/compiler-rt/test/ubsan/TestCases/Integer/div-zero.cpp : 'RUN: at line 2'; /Users/buildslave/jenkins/workspace/clang-stage1-cmake-RA-expensive/clang-build/./bin/clang --driver-mode=g++ -arch x86_64 -stdlib=libc++ -mmacosx-version-min=10.9 -isysroot /Applications/Xcode.app/Contents/Developer/Platforms/MacOSX.platform/Developer/SDKs/MacOSX10.13.sdk -fsanitize=integer-divide-by-zero -DDIVIDEND=1U /Users/buildslave/jenkins/workspace/clang-stage1-cmake-RA-expensive/llvm/projects/compiler-rt/test/ubsan/TestCases/Integer/div-zero.cpp -o /Users/buildslave/jenkins/workspace/clang-stage1-cmake-RA-expensive/clang-build/tools/clang/runtime/compiler-rt-bins/test/ubsan/Standalone-x86_64/TestCases/Integer/Output/div-zero.cpp.tmp && /Users/buildslave/jenkins/workspace/clang-stage1-cmake-RA-expensive/clang-build/tools/clang/runtime/compiler-rt-bins/test/ubsan/Standalone-x86_64/TestCases/Integer/Output/div-zero.cpp.tmp 2>&1 | FileCheck /Users/buildslave/jenkins/workspace/clang-stage1-cmake-RA-expensive/llvm/projects/compiler-rt/test/ubsan/TestCases/Integer/div-zero.cpp : 'RUN: at line 3'; /Users/buildslave/jenkins/workspace/clang-stage1-cmake-RA-expensive/clang-build/./bin/clang --driver-mode=g++ -arch x86_64 -stdlib=libc++ -mmacosx-version-min=10.9 -isysroot /Applications/Xcode.app/Contents/Developer/Platforms/MacOSX.platform/Developer/SDKs/MacOSX10.13.sdk -fsanitize=float-divide-by-zero -DDIVIDEND=1.5 /Users/buildslave/jenkins/workspace/clang-stage1-cmake-RA-expensive/llvm/projects/compiler-rt/test/ubsan/TestCases/Integer/div-zero.cpp -o /Users/buildslave/jenkins/workspace/clang-stage1-cmake-RA-expensive/clang-build/tools/clang/runtime/compiler-rt-bins/test/ubsan/Standalone-x86_64/TestCases/Integer/Output/div-zero.cpp.tmp && /Users/buildslave/jenkins/workspace/clang-stage1-cmake-RA-expensive/clang-build/tools/clang/runtime/compiler-rt-bins/test/ubsan/Standalone-x86_64/TestCases/Integer/Output/div-zero.cpp.tmp 2>&1 | FileCheck /Users/buildslave/jenkins/workspace/clang-stage1-cmake-RA-expensive/llvm/projects/compiler-rt/test/ubsan/TestCases/Integer/div-zero.cpp : 'RUN: at line 4'; /Users/buildslave/jenkins/workspace/clang-stage1-cmake-RA-expensive/clang-build/./bin/clang --driver-mode=g++ -arch x86_64 -stdlib=libc++ -mmacosx-version-min=10.9 -isysroot /Applications/Xcode.app/Contents/Developer/Platforms/MacOSX.platform/Developer/SDKs/MacOSX10.13.sdk -fsanitize=integer-divide-by-zero -DDIVIDEND='intmax(123)' /Users/buildslave/jenkins/workspace/clang-stage1-cmake-RA-expensive/llvm/projects/compiler-rt/test/ubsan/TestCases/Integer/div-zero.cpp -o /Users/buildslave/jenkins/workspace/clang-stage1-cmake-RA-expensive/clang-build/tools/clang/runtime/compiler-rt-bins/test/ubsan/Standalone-x86_64/TestCases/Integer/Output/div-zero.cpp.tmp && /Users/buildslave/jenkins/workspace/clang-stage1-cmake-RA-expensive/clang-build/tools/clang/runtime/compiler-rt-bins/test/ubsan/Standalone-x86_64/TestCases/Integer/Output/div-zero.cpp.tmp 2>&1 | FileCheck /Users/buildslave/jenkins/workspace/clang-stage1-cmake-RA-expensive/llvm/projects/compiler-rt/test/ubsan/TestCases/Integer/div-zero.cpp -- Exit Code: 1

Hide Details

Command Output (stderr): -- /Users/buildslave/jenkins/workspace/clang-stage1-cmake-RA-expensive/llvm/projects/compiler-rt/test/ubsan/TestCases/Integer/div-zero.cpp:14:12: warning: expression result unused [-Wunused-value] DIVIDEND / 0; ~~~~~~~~ ^ ~ /Users/buildslave/jenkins/workspace/clang-stage1-cmake-RA-expensive/llvm/projects/compiler-rt/test/ubsan/TestCases/Integer/div-zero.cpp:14:12: warning: division by zero is undefined [-Wdivision-by-zero] DIVIDEND / 0; ^ ~ 2 warnings generated. /Users/buildslave/jenkins/workspace/clang-stage1-cmake-RA-expensive/llvm/projects/compiler-rt/test/ubsan/TestCases/Integer/div-zero.cpp:14:12: warning: expression result unused [-Wunused-value] DIVIDEND / 0; ~~~~~~~~ ^ ~ /Users/buildslave/jenkins/workspace/clang-stage1-cmake-RA-expensive/llvm/projects/compiler-rt/test/ubsan/TestCases/Integer/div-zero.cpp:14:12: warning: division by zero is undefined [-Wdivision-by-zero] DIVIDEND / 0; ^ ~ 2 warnings generated. clang-9: error: unsupported option '-fsanitize=float-divide-by-zero' for target 'x86_64-apple-darwin17.6.0'

Hide Details

--

Hide Details

******************** PASS: UBSan-Standalone-x86_64 :: TestCases/ImplicitConversion/signed-integer-truncation-blacklist.c (3674 of 4241) PASS: UBSan-Standalone-x86_64 :: TestCases/Integer/add-overflow.cpp (3675 of 4241) PASS: UBSan-Standalone-x86_64 :: TestCases/Integer/mul-overflow.cpp (3676 of 4241) PASS: UBSan-Standalone-x86_64 :: TestCases/Integer/negate-overflow.cpp (3677 of 4241) PASS: UBSan-Standalone-x86_64 :: TestCases/ImplicitConversion/signed-integer-truncation-or-sign-change-blacklist.c (3678 of 4241) PASS: UBSan-Standalone-x86_64 :: TestCases/Integer/incdec-overflow.cpp (3679 of 4241) UNSUPPORTED: UBSan-Standalone-x86_64 :: TestCases/Integer/summary.cpp (3680 of 4241) PASS: UBSan-Standalone-x86_64 :: TestCases/Integer/no-recover.cpp (3681 of 4241) PASS: UBSan-Standalone-x86_64 :: TestCases/Integer/sub-overflow.cpp (3682 of 4241) PASS: UBSan-Standalone-x86_64 :: TestCases/Integer/uadd-overflow.cpp (3683 of 4241) PASS: UBSan-Standalone-x86_64 :: TestCases/Integer/umul-overflow.cpp (3684 of 4241) PASS: UBSan-Standalone-x86_64 :: TestCases/ImplicitConversion/signed-integer-truncation.c (3685 of 4241) UNSUPPORTED: UBSan-Standalone-x86_64 :: TestCases/Misc/Linux/print_stack_trace.cc (3686 of 4241) UNSUPPORTED: UBSan-Standalone-x86_64 :: TestCases/Misc/Linux/ubsan_options.cc (3687 of 4241) PASS: UBSan-Standalone-x86_64 :: TestCases/Integer/uincdec-overflow.cpp (3688 of 4241) PASS: UBSan-Standalone-x86_64 :: TestCases/Misc/bool.cpp (3689 of 4241) PASS: UBSan-Standalone-x86_64 :: TestCases/Integer/suppressions.cpp (3690 of 4241) PASS: UBSan-Standalone-x86_64 :: TestCases/Integer/usub-overflow.cpp (3691 of 4241) PASS: UBSan-Standalone-x86_64 :: TestCases/Misc/bounds.cpp (3692 of 4241) PASS: UBSan-Standalone-x86_64 :: TestCases/Misc/deduplication.cpp (3693 of 4241) PASS: UBSan-Standalone-x86_64 :: TestCases/ImplicitConversion/unsigned-integer-truncation.c (3694 of 4241) PASS: UBSan-Standalone-x86_64 :: TestCases/Misc/builtins.cpp (3695 of 4241) PASS: UBSan-Standalone-x86_64 :: TestCases/Misc/monitor.cpp (3696 of 4241) UNSUPPORTED: UBSan-Standalone-x86_64 :: TestCases/Misc/no-interception.cpp (3697 of 4241) PASS: UBSan-Standalone-x86_64 :: TestCases/Misc/enum.cpp (3698 of 4241) PASS: UBSan-Standalone-x86_64 :: TestCases/ImplicitConversion/unsigned-integer-truncation-blacklist.c (3699 of 4241) PASS: UBSan-Standalone-x86_64 :: TestCases/Integer/shift.cpp (3700 of 4241) PASS: UBSan-Standalone-x86_64 :: TestCases/Misc/nonnull-arg.cpp (3701 of 4241) PASS: UBSan-Standalone-x86_64 :: TestCases/Misc/log-path_test.cc (3702 of 4241) PASS: UBSan-Standalone-x86_64 :: TestCases/Misc/nullability.c (3703 of 4241) PASS: UBSan-Standalone-x86_64 :: TestCases/Misc/nonnull.cpp (3704 of 4241) PASS: UBSan-Standalone-x86_64 :: TestCases/Misc/coverage-levels.cc (3705 of 4241) PASS: UBSan-Standalone-x86_64 :: TestCases/Misc/vla.c (3706 of 4241) PASS: UBSan-Standalone-x86_64 :: TestCases/Misc/unreachable.cpp (3707 of 4241) PASS: UBSan-Standalone-x86_64 :: TestCases/Misc/missing_return.cpp (3708 of 4241) PASS: UBSan-Standalone-x86_64 :: TestCases/Pointer/alignment-assumption-blacklist.cpp (3709 of 4241) PASS: UBSan-Standalone-x86_64 :: TestCases/Pointer/alignment-assumption-attribute-align_value-on-paramvar.cpp (3710 of 4241) PASS: UBSan-Standalone-x86_64 :: TestCases/Pointer/alignment-assumption-attribute-assume_aligned-on-function-two-params.cpp (3711 of 4241) PASS: UBSan-Standalone-x86_64 :: TestCases/Pointer/alignment-assumption-attribute-alloc_align-on-function.cpp (3712 of 4241) PASS: UBSan-Standalone-x86_64 :: TestCases/Pointer/alignment-assumption-attribute-alloc_align-on-function-variable.cpp (3713 of 4241) UNSUPPORTED: UBSan-Standalone-x86_64 :: TestCases/Pointer/alignment-assumption-summary.cpp (3714 of 4241) PASS: UBSan-Standalone-x86_64 :: TestCases/Pointer/alignment-assumption-attribute-align_value-on-lvalue.cpp (3715 of 4241) PASS: UBSan-Standalone-i386 :: TestCases/TypeCheck/vptr.cpp (3716 of 4241) PASS: UBSan-Standalone-x86_64 :: TestCases/Pointer/unsigned-index-expression.cpp (3717 of 4241) UNSUPPORTED: UBSan-Standalone-x86_64 :: TestCases/TypeCheck/Linux/PR33221.cpp (3718 of 4241) PASS: UBSan-Standalone-x86_64 :: TestCases/Pointer/alignment-assumption-attribute-assume_aligned-on-function.cpp (3719 of 4241) PASS: UBSan-Standalone-x86_64 :: TestCases/TypeCheck/PR33221.cpp (3720 of 4241) PASS: UBSan-Standalone-x86_64 :: TestCases/Pointer/index-overflow.cpp (3721 of 4241) PASS: UBSan-Standalone-x86_64 :: TestCases/TypeCheck/null.cpp (3722 of 4241) PASS: UBSan-Standalone-x86_64 :: TestCases/TypeCheck/vptr-non-unique-typeinfo.cpp (3723 of 4241) PASS: UBSan-Standalone-x86_64 :: TestCases/TypeCheck/vptr-corrupted-vtable-itanium.cpp (3724 of 4241) PASS: UBSan-Standalone-x86_64 :: TestCases/TypeCheck/vptr-virtual-base-construction.cpp (3725 of 4241) PASS: UBSan-Standalone-x86_64 :: TestCases/Pointer/alignment-assumption-builtin_assume_aligned-three-params-variable.cpp (3726 of 4241) PASS: UBSan-Standalone-x86_64 :: TestCases/TypeCheck/Function/function.cpp (3727 of 4241) PASS: UBSan-Standalone-x86_64 :: TestCases/TypeCheck/vptr-virtual-base.cpp (3728 of 4241) PASS: UBSan-StandaloneStatic-i386 :: TestCases/Float/cast-overflow.cpp (3729 of 4241) PASS: UBSan-Standalone-x86_64 :: TestCases/TypeCheck/misaligned.cpp (3730 of 4241) UNSUPPORTED: UBSan-StandaloneStatic-i386 :: TestCases/ImplicitConversion/integer-sign-change-summary.cpp (3731 of 4241) PASS: UBSan-Standalone-x86_64 :: TestCases/Pointer/alignment-assumption-builtin_assume_aligned-three-params.cpp (3732 of 4241) PASS: UBSan-Standalone-x86_64 :: TestCases/Pointer/alignment-assumption-builtin_assume_aligned-two-params.cpp (3733 of 4241) PASS: UBSan-Standalone-x86_64 :: TestCases/Pointer/alignment-assumption-openmp.cpp (3734 of 4241) PASS: UBSan-StandaloneStatic-i386 :: TestCases/ImplicitConversion/integer-sign-change-blacklist.c (3735 of 4241) UNSUPPORTED: UBSan-StandaloneStatic-i386 :: TestCases/ImplicitConversion/signed-integer-truncation-or-sign-change-summary.cpp (3736 of 4241) UNSUPPORTED: UBSan-StandaloneStatic-i386 :: TestCases/ImplicitConversion/signed-integer-truncation-summary.cpp (3737 of 4241) PASS: UBSan-StandaloneStatic-i386 :: TestCases/ImplicitConversion/integer-arithmetic-value-change.c (3738 of 4241) PASS: UBSan-StandaloneStatic-i386 :: TestCases/ImplicitConversion/integer-conversion.c (3739 of 4241) UNSUPPORTED: UBSan-StandaloneStatic-i386 :: TestCases/ImplicitConversion/unsigned-integer-truncation-summary.cpp (3740 of 4241) PASS: UBSan-StandaloneStatic-i386 :: TestCases/ImplicitConversion/integer-sign-change.c (3741 of 4241) PASS: UBSan-StandaloneStatic-i386 :: TestCases/ImplicitConversion/integer-truncation.c (3742 of 4241) PASS: UBSan-StandaloneStatic-i386 :: TestCases/ImplicitConversion/signed-integer-truncation.c (3743 of 4241) PASS: UBSan-StandaloneStatic-i386 :: TestCases/ImplicitConversion/signed-integer-truncation-or-sign-change-blacklist.c (3744 of 4241) PASS: UBSan-StandaloneStatic-i386 :: TestCases/Integer/div-overflow.cpp (3745 of 4241) PASS: UBSan-StandaloneStatic-i386 :: TestCases/ImplicitConversion/signed-integer-truncation-blacklist.c (3746 of 4241) PASS: UBSan-StandaloneStatic-i386 :: TestCases/Integer/mul-overflow.cpp (3747 of 4241) FAIL: UBSan-StandaloneStatic-i386 :: TestCases/Integer/div-zero.cpp (3748 of 4241) ******************** TEST 'UBSan-StandaloneStatic-i386 :: TestCases/Integer/div-zero.cpp' FAILED ******************** Script: -- : 'RUN: at line 1'; /Users/buildslave/jenkins/workspace/clang-stage1-cmake-RA-expensive/clang-build/./bin/clang --driver-mode=g++ -static-libsan -arch i386 -stdlib=libc++ -mmacosx-version-min=10.9 -isysroot /Applications/Xcode.app/Contents/Developer/Platforms/MacOSX.platform/Developer/SDKs/MacOSX10.13.sdk -lc++abi -fsanitize=integer-divide-by-zero -DDIVIDEND=0 /Users/buildslave/jenkins/workspace/clang-stage1-cmake-RA-expensive/llvm/projects/compiler-rt/test/ubsan/TestCases/Integer/div-zero.cpp -o /Users/buildslave/jenkins/workspace/clang-stage1-cmake-RA-expensive/clang-build/tools/clang/runtime/compiler-rt-bins/test/ubsan/StandaloneStatic-i386/TestCases/Integer/Output/div-zero.cpp.tmp && /Users/buildslave/jenkins/workspace/clang-stage1-cmake-RA-expensive/clang-build/tools/clang/runtime/compiler-rt-bins/test/ubsan/StandaloneStatic-i386/TestCases/Integer/Output/div-zero.cpp.tmp 2>&1 | FileCheck /Users/buildslave/jenkins/workspace/clang-stage1-cmake-RA-expensive/llvm/projects/compiler-rt/test/ubsan/TestCases/Integer/div-zero.cpp : 'RUN: at line 2'; /Users/buildslave/jenkins/workspace/clang-stage1-cmake-RA-expensive/clang-build/./bin/clang --driver-mode=g++ -static-libsan -arch i386 -stdlib=libc++ -mmacosx-version-min=10.9 -isysroot /Applications/Xcode.app/Contents/Developer/Platforms/MacOSX.platform/Developer/SDKs/MacOSX10.13.sdk -lc++abi -fsanitize=integer-divide-by-zero -DDIVIDEND=1U /Users/buildslave/jenkins/workspace/clang-stage1-cmake-RA-expensive/llvm/projects/compiler-rt/test/ubsan/TestCases/Integer/div-zero.cpp -o /Users/buildslave/jenkins/workspace/clang-stage1-cmake-RA-expensive/clang-build/tools/clang/runtime/compiler-rt-bins/test/ubsan/StandaloneStatic-i386/TestCases/Integer/Output/div-zero.cpp.tmp && /Users/buildslave/jenkins/workspace/clang-stage1-cmake-RA-expensive/clang-build/tools/clang/runtime/compiler-rt-bins/test/ubsan/StandaloneStatic-i386/TestCases/Integer/Output/div-zero.cpp.tmp 2>&1 | FileCheck /Users/buildslave/jenkins/workspace/clang-stage1-cmake-RA-expensive/llvm/projects/compiler-rt/test/ubsan/TestCases/Integer/div-zero.cpp : 'RUN: at line 3'; /Users/buildslave/jenkins/workspace/clang-stage1-cmake-RA-expensive/clang-build/./bin/clang --driver-mode=g++ -static-libsan -arch i386 -stdlib=libc++ -mmacosx-version-min=10.9 -isysroot /Applications/Xcode.app/Contents/Developer/Platforms/MacOSX.platform/Developer/SDKs/MacOSX10.13.sdk -lc++abi -fsanitize=float-divide-by-zero -DDIVIDEND=1.5 /Users/buildslave/jenkins/workspace/clang-stage1-cmake-RA-expensive/llvm/projects/compiler-rt/test/ubsan/TestCases/Integer/div-zero.cpp -o /Users/buildslave/jenkins/workspace/clang-stage1-cmake-RA-expensive/clang-build/tools/clang/runtime/compiler-rt-bins/test/ubsan/StandaloneStatic-i386/TestCases/Integer/Output/div-zero.cpp.tmp && /Users/buildslave/jenkins/workspace/clang-stage1-cmake-RA-expensive/clang-build/tools/clang/runtime/compiler-rt-bins/test/ubsan/StandaloneStatic-i386/TestCases/Integer/Output/div-zero.cpp.tmp 2>&1 | FileCheck /Users/buildslave/jenkins/workspace/clang-stage1-cmake-RA-expensive/llvm/projects/compiler-rt/test/ubsan/TestCases/Integer/div-zero.cpp : 'RUN: at line 4'; /Users/buildslave/jenkins/workspace/clang-stage1-cmake-RA-expensive/clang-build/./bin/clang --driver-mode=g++ -static-libsan -arch i386 -stdlib=libc++ -mmacosx-version-min=10.9 -isysroot /Applications/Xcode.app/Contents/Developer/Platforms/MacOSX.platform/Developer/SDKs/MacOSX10.13.sdk -lc++abi -fsanitize=integer-divide-by-zero -DDIVIDEND='intmax(123)' /Users/buildslave/jenkins/workspace/clang-stage1-cmake-RA-expensive/llvm/projects/compiler-rt/test/ubsan/TestCases/Integer/div-zero.cpp -o /Users/buildslave/jenkins/workspace/clang-stage1-cmake-RA-expensive/clang-build/tools/clang/runtime/compiler-rt-bins/test/ubsan/StandaloneStatic-i386/TestCases/Integer/Output/div-zero.cpp.tmp && /Users/buildslave/jenkins/workspace/clang-stage1-cmake-RA-expensive/clang-build/tools/clang/runtime/compiler-rt-bins/test/ubsan/StandaloneStatic-i386/TestCases/Integer/Output/div-zero.cpp.tmp 2>&1 | FileCheck /Users/buildslave/jenkins/workspace/clang-stage1-cmake-RA-expensive/llvm/projects/compiler-rt/test/ubsan/TestCases/Integer/div-zero.cpp -- Exit Code: 1

Hide Details

Command Output (stderr): -- /Users/buildslave/jenkins/workspace/clang-stage1-cmake-RA-expensive/llvm/projects/compiler-rt/test/ubsan/TestCases/Integer/div-zero.cpp:14:12: warning: expression result unused [-Wunused-value] DIVIDEND / 0; ~~~~~~~~ ^ ~ /Users/buildslave/jenkins/workspace/clang-stage1-cmake-RA-expensive/llvm/projects/compiler-rt/test/ubsan/TestCases/Integer/div-zero.cpp:14:12: warning: division by zero is undefined [-Wdivision-by-zero] DIVIDEND / 0; ^ ~ 2 warnings generated. /Users/buildslave/jenkins/workspace/clang-stage1-cmake-RA-expensive/llvm/projects/compiler-rt/test/ubsan/TestCases/Integer/div-zero.cpp:14:12: warning: expression result unused [-Wunused-value] DIVIDEND / 0; ~~~~~~~~ ^ ~ /Users/buildslave/jenkins/workspace/clang-stage1-cmake-RA-expensive/llvm/projects/compiler-rt/test/ubsan/TestCases/Integer/div-zero.cpp:14:12: warning: division by zero is undefined [-Wdivision-by-zero] DIVIDEND / 0; ^ ~ 2 warnings generated. clang-9: error: unsupported option '-fsanitize=float-divide-by-zero' for target 'i386-apple-darwin17.6.0'

Hide Details

--

Hide Details

******************** PASS: UBSan-StandaloneStatic-i386 :: TestCases/Integer/add-overflow.cpp (3749 of 4241) PASS: UBSan-StandaloneStatic-i386 :: TestCases/Integer/negate-overflow.cpp (3750 of 4241) UNSUPPORTED: UBSan-StandaloneStatic-i386 :: TestCases/Integer/summary.cpp (3751 of 4241) PASS: UBSan-StandaloneStatic-i386 :: TestCases/Integer/incdec-overflow.cpp (3752 of 4241) PASS: UBSan-StandaloneStatic-i386 :: TestCases/Integer/no-recover.cpp (3753 of 4241) PASS: UBSan-StandaloneStatic-i386 :: TestCases/Integer/sub-overflow.cpp (3754 of 4241) PASS: UBSan-StandaloneStatic-i386 :: TestCases/Integer/umul-overflow.cpp (3755 of 4241) PASS: UBSan-StandaloneStatic-i386 :: TestCases/Integer/uadd-overflow.cpp (3756 of 4241) UNSUPPORTED: UBSan-StandaloneStatic-i386 :: TestCases/Misc/Linux/print_stack_trace.cc (3757 of 4241) UNSUPPORTED: UBSan-StandaloneStatic-i386 :: TestCases/Misc/Linux/ubsan_options.cc (3758 of 4241) PASS: UBSan-StandaloneStatic-i386 :: TestCases/Integer/uincdec-overflow.cpp (3759 of 4241) PASS: UBSan-StandaloneStatic-i386 :: TestCases/Misc/bool.cpp (3760 of 4241) UNSUPPORTED: UBSan-StandaloneStatic-i386 :: TestCases/Misc/builtins.cpp (3761 of 4241) UNSUPPORTED: UBSan-StandaloneStatic-i386 :: TestCases/Misc/coverage-levels.cc (3762 of 4241) PASS: UBSan-StandaloneStatic-i386 :: TestCases/Misc/bounds.cpp (3763 of 4241) PASS: UBSan-StandaloneStatic-i386 :: TestCases/Misc/deduplication.cpp (3764 of 4241) PASS: UBSan-StandaloneStatic-i386 :: TestCases/Integer/usub-overflow.cpp (3765 of 4241) PASS: UBSan-StandaloneStatic-i386 :: TestCases/Integer/suppressions.cpp (3766 of 4241) PASS: UBSan-StandaloneStatic-i386 :: TestCases/ImplicitConversion/unsigned-integer-truncation.c (3767 of 4241) UNSUPPORTED: UBSan-StandaloneStatic-i386 :: TestCases/Misc/no-interception.cpp (3768 of 4241) PASS: UBSan-StandaloneStatic-i386 :: TestCases/Misc/monitor.cpp (3769 of 4241) PASS: UBSan-StandaloneStatic-i386 :: TestCases/Misc/enum.cpp (3770 of 4241) PASS: UBSan-StandaloneStatic-i386 :: TestCases/Misc/log-path_test.cc (3771 of 4241) PASS: UBSan-StandaloneStatic-i386 :: TestCases/Misc/nonnull-arg.cpp (3772 of 4241) PASS: UBSan-StandaloneStatic-i386 :: TestCases/Misc/nullability.c (3773 of 4241) PASS: UBSan-StandaloneStatic-i386 :: TestCases/Misc/nonnull.cpp (3774 of 4241) PASS: UBSan-StandaloneStatic-i386 :: TestCases/Misc/vla.c (3775 of 4241) PASS: UBSan-StandaloneStatic-i386 :: TestCases/Misc/unreachable.cpp (3776 of 4241) PASS: UBSan-StandaloneStatic-i386 :: TestCases/ImplicitConversion/unsigned-integer-truncation-blacklist.c (3777 of 4241) PASS: UBSan-StandaloneStatic-i386 :: TestCases/Integer/shift.cpp (3778 of 4241) PASS: UBSan-StandaloneStatic-i386 :: TestCases/Misc/missing_return.cpp (3779 of 4241) PASS: UBSan-StandaloneStatic-i386 :: TestCases/Pointer/alignment-assumption-blacklist.cpp (3780 of 4241) PASS: UBSan-StandaloneStatic-i386 :: TestCases/Pointer/alignment-assumption-attribute-align_value-on-lvalue.cpp (3781 of 4241) PASS: UBSan-StandaloneStatic-i386 :: TestCases/Pointer/alignment-assumption-attribute-alloc_align-on-function-variable.cpp (3782 of 4241) PASS: UBSan-StandaloneStatic-i386 :: TestCases/Pointer/alignment-assumption-attribute-align_value-on-paramvar.cpp (3783 of 4241) PASS: UBSan-StandaloneStatic-i386 :: TestCases/Pointer/alignment-assumption-attribute-alloc_align-on-function.cpp (3784 of 4241) UNSUPPORTED: UBSan-StandaloneStatic-i386 :: TestCases/Pointer/alignment-assumption-summary.cpp (3785 of 4241) PASS: UBSan-StandaloneStatic-i386 :: TestCases/Pointer/alignment-assumption-attribute-assume_aligned-on-function-two-params.cpp (3786 of 4241) PASS: UBSan-StandaloneStatic-i386 :: TestCases/Pointer/alignment-assumption-attribute-assume_aligned-on-function.cpp (3787 of 4241) UNSUPPORTED: UBSan-StandaloneStatic-i386 :: TestCases/TypeCheck/Function/function.cpp (3788 of 4241) UNSUPPORTED: UBSan-StandaloneStatic-i386 :: TestCases/TypeCheck/Linux/PR33221.cpp (3789 of 4241) PASS: UBSan-StandaloneStatic-i386 :: TestCases/Pointer/unsigned-index-expression.cpp (3790 of 4241) PASS: UBSan-Standalone-x86_64 :: TestCases/TypeCheck/vptr.cpp (3791 of 4241) PASS: UBSan-StandaloneStatic-i386 :: TestCases/TypeCheck/PR33221.cpp (3792 of 4241) PASS: UBSan-StandaloneStatic-i386 :: TestCases/TypeCheck/null.cpp (3793 of 4241) PASS: UBSan-StandaloneStatic-i386 :: TestCases/Pointer/index-overflow.cpp (3794 of 4241) PASS: UBSan-StandaloneStatic-i386 :: TestCases/TypeCheck/vptr-virtual-base-construction.cpp (3795 of 4241) PASS: UBSan-StandaloneStatic-i386 :: TestCases/TypeCheck/vptr-non-unique-typeinfo.cpp (3796 of 4241) PASS: UBSan-StandaloneStatic-i386 :: TestCases/TypeCheck/vptr-corrupted-vtable-itanium.cpp (3797 of 4241) PASS: UBSan-StandaloneStatic-i386 :: TestCases/TypeCheck/vptr-virtual-base.cpp (3798 of 4241) PASS: UBSan-StandaloneStatic-i386 :: TestCases/Pointer/alignment-assumption-builtin_assume_aligned-three-params-variable.cpp (3799 of 4241) FAIL: UBSan-StandaloneStatic-x86_64 :: TestCases/Float/cast-overflow.cpp (3800 of 4241) ******************** TEST 'UBSan-StandaloneStatic-x86_64 :: TestCases/Float/cast-overflow.cpp' FAILED ******************** Script: -- : 'RUN: at line 1'; /Users/buildslave/jenkins/workspace/clang-stage1-cmake-RA-expensive/clang-build/./bin/clang --driver-mode=g++ -static-libsan -arch x86_64 -stdlib=libc++ -mmacosx-version-min=10.9 -isysroot /Applications/Xcode.app/Contents/Developer/Platforms/MacOSX.platform/Developer/SDKs/MacOSX10.13.sdk -lc++abi -fsanitize=float-cast-overflow /Users/buildslave/jenkins/workspace/clang-stage1-cmake-RA-expensive/llvm/projects/compiler-rt/test/ubsan/TestCases/Float/cast-overflow.cpp -o /Users/buildslave/jenkins/workspace/clang-stage1-cmake-RA-expensive/clang-build/tools/clang/runtime/compiler-rt-bins/test/ubsan/StandaloneStatic-x86_64/TestCases/Float/Output/cast-overflow.cpp.tmp : 'RUN: at line 2'; /Users/buildslave/jenkins/workspace/clang-stage1-cmake-RA-expensive/clang-build/tools/clang/runtime/compiler-rt-bins/test/ubsan/StandaloneStatic-x86_64/TestCases/Float/Output/cast-overflow.cpp.tmp _ : 'RUN: at line 3'; env UBSAN_OPTIONS=abort_on_error=0:log_to_syslog=0:print_summary=1:report_error_type=1 /Users/buildslave/jenkins/workspace/clang-stage1-cmake-RA-expensive/clang-build/tools/clang/runtime/compiler-rt-bins/test/ubsan/StandaloneStatic-x86_64/TestCases/Float/Output/cast-overflow.cpp.tmp 0 2>&1 | FileCheck /Users/buildslave/jenkins/workspace/clang-stage1-cmake-RA-expensive/llvm/projects/compiler-rt/test/ubsan/TestCases/Float/cast-overflow.cpp --check-prefix=CHECK-0 : 'RUN: at line 4'; /Users/buildslave/jenkins/workspace/clang-stage1-cmake-RA-expensive/clang-build/tools/clang/runtime/compiler-rt-bins/test/ubsan/StandaloneStatic-x86_64/TestCases/Float/Output/cast-overflow.cpp.tmp 1 2>&1 | FileCheck /Users/buildslave/jenkins/workspace/clang-stage1-cmake-RA-expensive/llvm/projects/compiler-rt/test/ubsan/TestCases/Float/cast-overflow.cpp --check-prefix=CHECK-1 : 'RUN: at line 5'; /Users/buildslave/jenkins/workspace/clang-stage1-cmake-RA-expensive/clang-build/tools/clang/runtime/compiler-rt-bins/test/ubsan/StandaloneStatic-x86_64/TestCases/Float/Output/cast-overflow.cpp.tmp 2 2>&1 | FileCheck /Users/buildslave/jenkins/workspace/clang-stage1-cmake-RA-expensive/llvm/projects/compiler-rt/test/ubsan/TestCases/Float/cast-overflow.cpp --check-prefix=CHECK-2 : 'RUN: at line 6'; /Users/buildslave/jenkins/workspace/clang-stage1-cmake-RA-expensive/clang-build/tools/clang/runtime/compiler-rt-bins/test/ubsan/StandaloneStatic-x86_64/TestCases/Float/Output/cast-overflow.cpp.tmp 3 2>&1 | FileCheck /Users/buildslave/jenkins/workspace/clang-stage1-cmake-RA-expensive/llvm/projects/compiler-rt/test/ubsan/TestCases/Float/cast-overflow.cpp --check-prefix=CHECK-3 : 'RUN: at line 7'; /Users/buildslave/jenkins/workspace/clang-stage1-cmake-RA-expensive/clang-build/tools/clang/runtime/compiler-rt-bins/test/ubsan/StandaloneStatic-x86_64/TestCases/Float/Output/cast-overflow.cpp.tmp 4 2>&1 | FileCheck /Users/buildslave/jenkins/workspace/clang-stage1-cmake-RA-expensive/llvm/projects/compiler-rt/test/ubsan/TestCases/Float/cast-overflow.cpp --check-prefix=CHECK-4 : 'RUN: at line 8'; /Users/buildslave/jenkins/workspace/clang-stage1-cmake-RA-expensive/clang-build/tools/clang/runtime/compiler-rt-bins/test/ubsan/StandaloneStatic-x86_64/TestCases/Float/Output/cast-overflow.cpp.tmp 5 2>&1 | FileCheck /Users/buildslave/jenkins/workspace/clang-stage1-cmake-RA-expensive/llvm/projects/compiler-rt/test/ubsan/TestCases/Float/cast-overflow.cpp --check-prefix=CHECK-5 : 'RUN: at line 9'; /Users/buildslave/jenkins/workspace/clang-stage1-cmake-RA-expensive/clang-build/tools/clang/runtime/compiler-rt-bins/test/ubsan/StandaloneStatic-x86_64/TestCases/Float/Output/cast-overflow.cpp.tmp 6 2>&1 | FileCheck /Users/buildslave/jenkins/workspace/clang-stage1-cmake-RA-expensive/llvm/projects/compiler-rt/test/ubsan/TestCases/Float/cast-overflow.cpp --check-prefix=CHECK-6 : 'RUN: at line 12'; not /Users/buildslave/jenkins/workspace/clang-stage1-cmake-RA-expensive/clang-build/tools/clang/runtime/compiler-rt-bins/test/ubsan/StandaloneStatic-x86_64/TestCases/Float/Output/cast-overflow.cpp.tmp 9 2>&1 | FileCheck /Users/buildslave/jenkins/workspace/clang-stage1-cmake-RA-expensive/llvm/projects/compiler-rt/test/ubsan/TestCases/Float/cast-overflow.cpp --check-prefix=CHECK-9 -- Exit Code: 1

Hide Details

Command Output (stderr): -- /Users/buildslave/jenkins/workspace/clang-stage1-cmake-RA-expensive/llvm/projects/compiler-rt/test/ubsan/TestCases/Float/cast-overflow.cpp:61:3: warning: expression result unused [-Wunused-value] (int)MaxFloatRepresentableAsInt; // ok ^ ~~~~~~~~~~~~~~~~~~~~~~~~~~ /Users/buildslave/jenkins/workspace/clang-stage1-cmake-RA-expensive/llvm/projects/compiler-rt/test/ubsan/TestCases/Float/cast-overflow.cpp:62:3: warning: expression result unused [-Wunused-value] (int)-MaxFloatRepresentableAsInt; // ok ^ ~~~~~~~~~~~~~~~~~~~~~~~~~~~ /Users/buildslave/jenkins/workspace/clang-stage1-cmake-RA-expensive/llvm/projects/compiler-rt/test/ubsan/TestCases/Float/cast-overflow.cpp:65:3: warning: expression result unused [-Wunused-value] (int)MinFloatRepresentableAsInt; // ok ^ ~~~~~~~~~~~~~~~~~~~~~~~~~~ /Users/buildslave/jenkins/workspace/clang-stage1-cmake-RA-expensive/llvm/projects/compiler-rt/test/ubsan/TestCases/Float/cast-overflow.cpp:68:3: warning: expression result unused [-Wunused-value] (unsigned int)MaxFloatRepresentableAsUInt; // ok ^ ~~~~~~~~~~~~~~~~~~~~~~~~~~~ 4 warnings generated. /Users/buildslave/jenkins/workspace/clang-stage1-cmake-RA-expensive/llvm/projects/compiler-rt/test/ubsan/TestCases/Float/cast-overflow.cpp:140:14: error: CHECK-6: expected string not found in input // CHECK-6: cast-overflow.cpp:[[@LINE+2]]:{{34: runtime error: 0xffffff00000000000000000000000001 is outside the range of representable values of type 'float'| __int128 not supported}} ^ <stdin>:1:1: note: scanning from here /Users/buildslave/jenkins/workspace/clang-stage1-cmake-RA-expensive/llvm/projects/compiler-rt/test/ubsan/TestCases/Float/cast-overflow.cpp:142:27: runtime error: 3.40282e+38 is outside the range of representable values of type 'int' ^ <stdin>:1:1: note: uses undefined variable "@LINE" /Users/buildslave/jenkins/workspace/clang-stage1-cmake-RA-expensive/llvm/projects/compiler-rt/test/ubsan/TestCases/Float/cast-overflow.cpp:142:27: runtime error: 3.40282e+38 is outside the range of representable values of type 'int' ^

Hide Details

--

Hide Details

******************** PASS: UBSan-StandaloneStatic-i386 :: TestCases/TypeCheck/misaligned.cpp (3801 of 4241) UNSUPPORTED: UBSan-StandaloneStatic-x86_64 :: TestCases/ImplicitConversion/integer-sign-change-summary.cpp (3802 of 4241) PASS: UBSan-StandaloneStatic-x86_64 :: TestCases/ImplicitConversion/integer-sign-change-blacklist.c (3803 of 4241) PASS: UBSan-StandaloneStatic-i386 :: TestCases/Pointer/alignment-assumption-builtin_assume_aligned-two-params.cpp (3804 of 4241) PASS: UBSan-StandaloneStatic-i386 :: TestCases/Pointer/alignment-assumption-openmp.cpp (3805 of 4241) PASS: UBSan-StandaloneStatic-i386 :: TestCases/Pointer/alignment-assumption-builtin_assume_aligned-three-params.cpp (3806 of 4241) UNSUPPORTED: UBSan-StandaloneStatic-x86_64 :: TestCases/ImplicitConversion/signed-integer-truncation-or-sign-change-summary.cpp (3807 of 4241) UNSUPPORTED: UBSan-StandaloneStatic-x86_64 :: TestCases/ImplicitConversion/signed-integer-truncation-summary.cpp (3808 of 4241) PASS: UBSan-StandaloneStatic-x86_64 :: TestCases/ImplicitConversion/integer-arithmetic-value-change.c (3809 of 4241) PASS: UBSan-StandaloneStatic-x86_64 :: TestCases/ImplicitConversion/integer-conversion.c (3810 of 4241) UNSUPPORTED: UBSan-StandaloneStatic-x86_64 :: TestCases/ImplicitConversion/unsigned-integer-truncation-summary.cpp (3811 of 4241) PASS: UBSan-StandaloneStatic-x86_64 :: TestCases/ImplicitConversion/integer-truncation.c (3812 of 4241) PASS: UBSan-StandaloneStatic-x86_64 :: TestCases/ImplicitConversion/signed-integer-truncation.c (3813 of 4241) PASS: UBSan-StandaloneStatic-x86_64 :: TestCases/ImplicitConversion/integer-sign-change.c (3814 of 4241) PASS: UBSan-StandaloneStatic-x86_64 :: TestCases/Integer/div-overflow.cpp (3815 of 4241) PASS: UBSan-StandaloneStatic-x86_64 :: TestCases/ImplicitConversion/signed-integer-truncation-or-sign-change-blacklist.c (3816 of 4241) FAIL: UBSan-StandaloneStatic-x86_64 :: TestCases/Integer/div-zero.cpp (3817 of 4241) ******************** TEST 'UBSan-StandaloneStatic-x86_64 :: TestCases/Integer/div-zero.cpp' FAILED ******************** Script: -- : 'RUN: at line 1'; /Users/buildslave/jenkins/workspace/clang-stage1-cmake-RA-expensive/clang-build/./bin/clang --driver-mode=g++ -static-libsan -arch x86_64 -stdlib=libc++ -mmacosx-version-min=10.9 -isysroot /Applications/Xcode.app/Contents/Developer/Platforms/MacOSX.platform/Developer/SDKs/MacOSX10.13.sdk -lc++abi -fsanitize=integer-divide-by-zero -DDIVIDEND=0 /Users/buildslave/jenkins/workspace/clang-stage1-cmake-RA-expensive/llvm/projects/compiler-rt/test/ubsan/TestCases/Integer/div-zero.cpp -o /Users/buildslave/jenkins/workspace/clang-stage1-cmake-RA-expensive/clang-build/tools/clang/runtime/compiler-rt-bins/test/ubsan/StandaloneStatic-x86_64/TestCases/Integer/Output/div-zero.cpp.tmp && /Users/buildslave/jenkins/workspace/clang-stage1-cmake-RA-expensive/clang-build/tools/clang/runtime/compiler-rt-bins/test/ubsan/StandaloneStatic-x86_64/TestCases/Integer/Output/div-zero.cpp.tmp 2>&1 | FileCheck /Users/buildslave/jenkins/workspace/clang-stage1-cmake-RA-expensive/llvm/projects/compiler-rt/test/ubsan/TestCases/Integer/div-zero.cpp : 'RUN: at line 2'; /Users/buildslave/jenkins/workspace/clang-stage1-cmake-RA-expensive/clang-build/./bin/clang --driver-mode=g++ -static-libsan -arch x86_64 -stdlib=libc++ -mmacosx-version-min=10.9 -isysroot /Applications/Xcode.app/Contents/Developer/Platforms/MacOSX.platform/Developer/SDKs/MacOSX10.13.sdk -lc++abi -fsanitize=integer-divide-by-zero -DDIVIDEND=1U /Users/buildslave/jenkins/workspace/clang-stage1-cmake-RA-expensive/llvm/projects/compiler-rt/test/ubsan/TestCases/Integer/div-zero.cpp -o /Users/buildslave/jenkins/workspace/clang-stage1-cmake-RA-expensive/clang-build/tools/clang/runtime/compiler-rt-bins/test/ubsan/StandaloneStatic-x86_64/TestCases/Integer/Output/div-zero.cpp.tmp && /Users/buildslave/jenkins/workspace/clang-stage1-cmake-RA-expensive/clang-build/tools/clang/runtime/compiler-rt-bins/test/ubsan/StandaloneStatic-x86_64/TestCases/Integer/Output/div-zero.cpp.tmp 2>&1 | FileCheck /Users/buildslave/jenkins/workspace/clang-stage1-cmake-RA-expensive/llvm/projects/compiler-rt/test/ubsan/TestCases/Integer/div-zero.cpp : 'RUN: at line 3'; /Users/buildslave/jenkins/workspace/clang-stage1-cmake-RA-expensive/clang-build/./bin/clang --driver-mode=g++ -static-libsan -arch x86_64 -stdlib=libc++ -mmacosx-version-min=10.9 -isysroot /Applications/Xcode.app/Contents/Developer/Platforms/MacOSX.platform/Developer/SDKs/MacOSX10.13.sdk -lc++abi -fsanitize=float-divide-by-zero -DDIVIDEND=1.5 /Users/buildslave/jenkins/workspace/clang-stage1-cmake-RA-expensive/llvm/projects/compiler-rt/test/ubsan/TestCases/Integer/div-zero.cpp -o /Users/buildslave/jenkins/workspace/clang-stage1-cmake-RA-expensive/clang-build/tools/clang/runtime/compiler-rt-bins/test/ubsan/StandaloneStatic-x86_64/TestCases/Integer/Output/div-zero.cpp.tmp && /Users/buildslave/jenkins/workspace/clang-stage1-cmake-RA-expensive/clang-build/tools/clang/runtime/compiler-rt-bins/test/ubsan/StandaloneStatic-x86_64/TestCases/Integer/Output/div-zero.cpp.tmp 2>&1 | FileCheck /Users/buildslave/jenkins/workspace/clang-stage1-cmake-RA-expensive/llvm/projects/compiler-rt/test/ubsan/TestCases/Integer/div-zero.cpp : 'RUN: at line 4'; /Users/buildslave/jenkins/workspace/clang-stage1-cmake-RA-expensive/clang-build/./bin/clang --driver-mode=g++ -static-libsan -arch x86_64 -stdlib=libc++ -mmacosx-version-min=10.9 -isysroot /Applications/Xcode.app/Contents/Developer/Platforms/MacOSX.platform/Developer/SDKs/MacOSX10.13.sdk -lc++abi -fsanitize=integer-divide-by-zero -DDIVIDEND='intmax(123)' /Users/buildslave/jenkins/workspace/clang-stage1-cmake-RA-expensive/llvm/projects/compiler-rt/test/ubsan/TestCases/Integer/div-zero.cpp -o /Users/buildslave/jenkins/workspace/clang-stage1-cmake-RA-expensive/clang-build/tools/clang/runtime/compiler-rt-bins/test/ubsan/StandaloneStatic-x86_64/TestCases/Integer/Output/div-zero.cpp.tmp && /Users/buildslave/jenkins/workspace/clang-stage1-cmake-RA-expensive/clang-build/tools/clang/runtime/compiler-rt-bins/test/ubsan/StandaloneStatic-x86_64/TestCases/Integer/Output/div-zero.cpp.tmp 2>&1 | FileCheck /Users/buildslave/jenkins/workspace/clang-stage1-cmake-RA-expensive/llvm/projects/compiler-rt/test/ubsan/TestCases/Integer/div-zero.cpp -- Exit Code: 1

Hide Details

Command Output (stderr): -- /Users/buildslave/jenkins/workspace/clang-stage1-cmake-RA-expensive/llvm/projects/compiler-rt/test/ubsan/TestCases/Integer/div-zero.cpp:14:12: warning: expression result unused [-Wunused-value] DIVIDEND / 0; ~~~~~~~~ ^ ~ /Users/buildslave/jenkins/workspace/clang-stage1-cmake-RA-expensive/llvm/projects/compiler-rt/test/ubsan/TestCases/Integer/div-zero.cpp:14:12: warning: division by zero is undefined [-Wdivision-by-zero] DIVIDEND / 0; ^ ~ 2 warnings generated. /Users/buildslave/jenkins/workspace/clang-stage1-cmake-RA-expensive/llvm/projects/compiler-rt/test/ubsan/TestCases/Integer/div-zero.cpp:14:12: warning: expression result unused [-Wunused-value] DIVIDEND / 0; ~~~~~~~~ ^ ~ /Users/buildslave/jenkins/workspace/clang-stage1-cmake-RA-expensive/llvm/projects/compiler-rt/test/ubsan/TestCases/Integer/div-zero.cpp:14:12: warning: division by zero is undefined [-Wdivision-by-zero] DIVIDEND / 0; ^ ~ 2 warnings generated. clang-9: error: unsupported option '-fsanitize=float-divide-by-zero' for target 'x86_64-apple-darwin17.6.0'

Hide Details

--

Hide Details

******************** PASS: UBSan-StandaloneStatic-x86_64 :: TestCases/Integer/mul-overflow.cpp (3818 of 4241) PASS: UBSan-StandaloneStatic-x86_64 :: TestCases/ImplicitConversion/signed-integer-truncation-blacklist.c (3819 of 4241) PASS: UBSan-StandaloneStatic-x86_64 :: TestCases/Integer/add-overflow.cpp (3820 of 4241) PASS: UBSan-StandaloneStatic-x86_64 :: TestCases/Integer/negate-overflow.cpp (3821 of 4241) UNSUPPORTED: UBSan-StandaloneStatic-x86_64 :: TestCases/Integer/summary.cpp (3822 of 4241) PASS: UBSan-StandaloneStatic-x86_64 :: TestCases/Integer/incdec-overflow.cpp (3823 of 4241) PASS: UBSan-StandaloneStatic-x86_64 :: TestCases/Integer/no-recover.cpp (3824 of 4241) PASS: UBSan-StandaloneStatic-x86_64 :: TestCases/Integer/sub-overflow.cpp (3825 of 4241) PASS: UBSan-StandaloneStatic-x86_64 :: TestCases/Integer/umul-overflow.cpp (3826 of 4241) PASS: UBSan-StandaloneStatic-x86_64 :: TestCases/Integer/uadd-overflow.cpp (3827 of 4241) UNSUPPORTED: UBSan-StandaloneStatic-x86_64 :: TestCases/Misc/Linux/print_stack_trace.cc (3828 of 4241) UNSUPPORTED: UBSan-StandaloneStatic-x86_64 :: TestCases/Misc/Linux/ubsan_options.cc (3829 of 4241) PASS: UBSan-StandaloneStatic-x86_64 :: TestCases/Integer/uincdec-overflow.cpp (3830 of 4241) PASS: UBSan-StandaloneStatic-x86_64 :: TestCases/Misc/bool.cpp (3831 of 4241) PASS: UBSan-StandaloneStatic-x86_64 :: TestCases/Misc/bounds.cpp (3832 of 4241) UNSUPPORTED: UBSan-StandaloneStatic-x86_64 :: TestCases/Misc/coverage-levels.cc (3833 of 4241) PASS: UBSan-StandaloneStatic-x86_64 :: TestCases/Integer/usub-overflow.cpp (3834 of 4241) PASS: UBSan-StandaloneStatic-x86_64 :: TestCases/ImplicitConversion/unsigned-integer-truncation.c (3835 of 4241) PASS: UBSan-StandaloneStatic-x86_64 :: TestCases/Misc/builtins.cpp (3836 of 4241) PASS: UBSan-StandaloneStatic-x86_64 :: TestCases/Misc/deduplication.cpp (3837 of 4241) PASS: UBSan-StandaloneStatic-x86_64 :: TestCases/Misc/monitor.cpp (3838 of 4241) UNSUPPORTED: UBSan-StandaloneStatic-x86_64 :: TestCases/Misc/no-interception.cpp (3839 of 4241) PASS: UBSan-StandaloneStatic-x86_64 :: TestCases/Integer/suppressions.cpp (3840 of 4241) PASS: UBSan-StandaloneStatic-x86_64 :: TestCases/Misc/enum.cpp (3841 of 4241) PASS: UBSan-StandaloneStatic-x86_64 :: TestCases/Misc/nonnull-arg.cpp (3842 of 4241) PASS: UBSan-StandaloneStatic-x86_64 :: TestCases/ImplicitConversion/unsigned-integer-truncation-blacklist.c (3843 of 4241) PASS: UBSan-StandaloneStatic-x86_64 :: TestCases/Misc/log-path_test.cc (3844 of 4241) PASS: UBSan-StandaloneStatic-x86_64 :: TestCases/Misc/nullability.c (3845 of 4241) PASS: UBSan-StandaloneStatic-x86_64 :: TestCases/Misc/nonnull.cpp (3846 of 4241) PASS: UBSan-StandaloneStatic-x86_64 :: TestCases/Misc/vla.c (3847 of 4241) PASS: UBSan-StandaloneStatic-x86_64 :: TestCases/Integer/shift.cpp (3848 of 4241) PASS: UBSan-StandaloneStatic-x86_64 :: TestCases/Misc/unreachable.cpp (3849 of 4241) PASS: UBSan-StandaloneStatic-x86_64 :: TestCases/Misc/missing_return.cpp (3850 of 4241) PASS: UBSan-StandaloneStatic-x86_64 :: TestCases/Pointer/alignment-assumption-blacklist.cpp (3851 of 4241) PASS: UBSan-StandaloneStatic-x86_64 :: TestCases/Pointer/alignment-assumption-attribute-align_value-on-paramvar.cpp (3852 of 4241) PASS: UBSan-StandaloneStatic-x86_64 :: TestCases/Pointer/alignment-assumption-attribute-align_value-on-lvalue.cpp (3853 of 4241) PASS: UBSan-StandaloneStatic-x86_64 :: TestCases/Pointer/alignment-assumption-attribute-alloc_align-on-function-variable.cpp (3854 of 4241) PASS: UBSan-StandaloneStatic-x86_64 :: TestCases/Pointer/alignment-assumption-attribute-alloc_align-on-function.cpp (3855 of 4241) UNSUPPORTED: UBSan-StandaloneStatic-x86_64 :: TestCases/Pointer/alignment-assumption-summary.cpp (3856 of 4241) PASS: UBSan-StandaloneStatic-x86_64 :: TestCases/Pointer/alignment-assumption-attribute-assume_aligned-on-function-two-params.cpp (3857 of 4241) PASS: UBSan-StandaloneStatic-x86_64 :: TestCases/Pointer/alignment-assumption-attribute-assume_aligned-on-function.cpp (3858 of 4241) PASS: UBSan-StandaloneStatic-i386 :: TestCases/TypeCheck/vptr.cpp (3859 of 4241) UNSUPPORTED: UBSan-StandaloneStatic-x86_64 :: TestCases/TypeCheck/Linux/PR33221.cpp (3860 of 4241) PASS: UBSan-StandaloneStatic-x86_64 :: TestCases/Pointer/unsigned-index-expression.cpp (3861 of 4241) PASS: UBSan-StandaloneStatic-x86_64 :: TestCases/TypeCheck/PR33221.cpp (3862 of 4241) PASS: UBSan-StandaloneStatic-x86_64 :: TestCases/Pointer/index-overflow.cpp (3863 of 4241) PASS: UBSan-StandaloneStatic-x86_64 :: TestCases/TypeCheck/null.cpp (3864 of 4241) PASS: UBSan-StandaloneStatic-x86_64 :: TestCases/TypeCheck/vptr-non-unique-typeinfo.cpp (3865 of 4241) PASS: UBSan-StandaloneStatic-x86_64 :: TestCases/TypeCheck/vptr-corrupted-vtable-itanium.cpp (3866 of 4241) PASS: UBSan-StandaloneStatic-x86_64 :: TestCases/Pointer/alignment-assumption-builtin_assume_aligned-three-params-variable.cpp (3867 of 4241) PASS: UBSan-StandaloneStatic-x86_64 :: TestCases/TypeCheck/vptr-virtual-base-construction.cpp (3868 of 4241) PASS: UBSan-StandaloneStatic-x86_64 :: TestCases/TypeCheck/Function/function.cpp (3869 of 4241) PASS: UBSan-StandaloneStatic-x86_64 :: TestCases/TypeCheck/vptr-virtual-base.cpp (3870 of 4241) PASS: UBSan-StandaloneStatic-x86_64 :: TestCases/TypeCheck/misaligned.cpp (3871 of 4241) PASS: UBSan-StandaloneStatic-x86_64 :: TestCases/Pointer/alignment-assumption-builtin_assume_aligned-three-params.cpp (3872 of 4241) PASS: UBSan-StandaloneStatic-x86_64 :: TestCases/Pointer/alignment-assumption-openmp.cpp (3873 of 4241) PASS: UBSan-StandaloneStatic-x86_64 :: TestCases/Pointer/alignment-assumption-builtin_assume_aligned-two-params.cpp (3874 of 4241) FAIL: UBSan-ThreadSanitizer-x86_64 :: TestCases/Float/cast-overflow.cpp (3875 of 4241) ******************** TEST 'UBSan-ThreadSanitizer-x86_64 :: TestCases/Float/cast-overflow.cpp' FAILED ******************** Script: -- : 'RUN: at line 1'; /Users/buildslave/jenkins/workspace/clang-stage1-cmake-RA-expensive/clang-build/./bin/clang --driver-mode=g++ -fsanitize=thread -arch x86_64 -stdlib=libc++ -mmacosx-version-min=10.9 -isysroot /Applications/Xcode.app/Contents/Developer/Platforms/MacOSX.platform/Developer/SDKs/MacOSX10.13.sdk -fsanitize=float-cast-overflow /Users/buildslave/jenkins/workspace/clang-stage1-cmake-RA-expensive/llvm/projects/compiler-rt/test/ubsan/TestCases/Float/cast-overflow.cpp -o /Users/buildslave/jenkins/workspace/clang-stage1-cmake-RA-expensive/clang-build/tools/clang/runtime/compiler-rt-bins/test/ubsan/ThreadSanitizer-x86_64/TestCases/Float/Output/cast-overflow.cpp.tmp : 'RUN: at line 2'; /Users/buildslave/jenkins/workspace/clang-stage1-cmake-RA-expensive/clang-build/tools/clang/runtime/compiler-rt-bins/test/ubsan/ThreadSanitizer-x86_64/TestCases/Float/Output/cast-overflow.cpp.tmp _ : 'RUN: at line 3'; env UBSAN_OPTIONS=abort_on_error=0:log_to_syslog=0:print_summary=1:report_error_type=1 /Users/buildslave/jenkins/workspace/clang-stage1-cmake-RA-expensive/clang-build/tools/clang/runtime/compiler-rt-bins/test/ubsan/ThreadSanitizer-x86_64/TestCases/Float/Output/cast-overflow.cpp.tmp 0 2>&1 | FileCheck /Users/buildslave/jenkins/workspace/clang-stage1-cmake-RA-expensive/llvm/projects/compiler-rt/test/ubsan/TestCases/Float/cast-overflow.cpp --check-prefix=CHECK-0 : 'RUN: at line 4'; /Users/buildslave/jenkins/workspace/clang-stage1-cmake-RA-expensive/clang-build/tools/clang/runtime/compiler-rt-bins/test/ubsan/ThreadSanitizer-x86_64/TestCases/Float/Output/cast-overflow.cpp.tmp 1 2>&1 | FileCheck /Users/buildslave/jenkins/workspace/clang-stage1-cmake-RA-expensive/llvm/projects/compiler-rt/test/ubsan/TestCases/Float/cast-overflow.cpp --check-prefix=CHECK-1 : 'RUN: at line 5'; /Users/buildslave/jenkins/workspace/clang-stage1-cmake-RA-expensive/clang-build/tools/clang/runtime/compiler-rt-bins/test/ubsan/ThreadSanitizer-x86_64/TestCases/Float/Output/cast-overflow.cpp.tmp 2 2>&1 | FileCheck /Users/buildslave/jenkins/workspace/clang-stage1-cmake-RA-expensive/llvm/projects/compiler-rt/test/ubsan/TestCases/Float/cast-overflow.cpp --check-prefix=CHECK-2 : 'RUN: at line 6'; /Users/buildslave/jenkins/workspace/clang-stage1-cmake-RA-expensive/clang-build/tools/clang/runtime/compiler-rt-bins/test/ubsan/ThreadSanitizer-x86_64/TestCases/Float/Output/cast-overflow.cpp.tmp 3 2>&1 | FileCheck /Users/buildslave/jenkins/workspace/clang-stage1-cmake-RA-expensive/llvm/projects/compiler-rt/test/ubsan/TestCases/Float/cast-overflow.cpp --check-prefix=CHECK-3 : 'RUN: at line 7'; /Users/buildslave/jenkins/workspace/clang-stage1-cmake-RA-expensive/clang-build/tools/clang/runtime/compiler-rt-bins/test/ubsan/ThreadSanitizer-x86_64/TestCases/Float/Output/cast-overflow.cpp.tmp 4 2>&1 | FileCheck /Users/buildslave/jenkins/workspace/clang-stage1-cmake-RA-expensive/llvm/projects/compiler-rt/test/ubsan/TestCases/Float/cast-overflow.cpp --check-prefix=CHECK-4 : 'RUN: at line 8'; /Users/buildslave/jenkins/workspace/clang-stage1-cmake-RA-expensive/clang-build/tools/clang/runtime/compiler-rt-bins/test/ubsan/ThreadSanitizer-x86_64/TestCases/Float/Output/cast-overflow.cpp.tmp 5 2>&1 | FileCheck /Users/buildslave/jenkins/workspace/clang-stage1-cmake-RA-expensive/llvm/projects/compiler-rt/test/ubsan/TestCases/Float/cast-overflow.cpp --check-prefix=CHECK-5 : 'RUN: at line 9'; /Users/buildslave/jenkins/workspace/clang-stage1-cmake-RA-expensive/clang-build/tools/clang/runtime/compiler-rt-bins/test/ubsan/ThreadSanitizer-x86_64/TestCases/Float/Output/cast-overflow.cpp.tmp 6 2>&1 | FileCheck /Users/buildslave/jenkins/workspace/clang-stage1-cmake-RA-expensive/llvm/projects/compiler-rt/test/ubsan/TestCases/Float/cast-overflow.cpp --check-prefix=CHECK-6 : 'RUN: at line 12'; not /Users/buildslave/jenkins/workspace/clang-stage1-cmake-RA-expensive/clang-build/tools/clang/runtime/compiler-rt-bins/test/ubsan/ThreadSanitizer-x86_64/TestCases/Float/Output/cast-overflow.cpp.tmp 9 2>&1 | FileCheck /Users/buildslave/jenkins/workspace/clang-stage1-cmake-RA-expensive/llvm/projects/compiler-rt/test/ubsan/TestCases/Float/cast-overflow.cpp --check-prefix=CHECK-9 -- Exit Code: 1

Hide Details

Command Output (stderr): -- /Users/buildslave/jenkins/workspace/clang-stage1-cmake-RA-expensive/llvm/projects/compiler-rt/test/ubsan/TestCases/Float/cast-overflow.cpp:61:3: warning: expression result unused [-Wunused-value] (int)MaxFloatRepresentableAsInt; // ok ^ ~~~~~~~~~~~~~~~~~~~~~~~~~~ /Users/buildslave/jenkins/workspace/clang-stage1-cmake-RA-expensive/llvm/projects/compiler-rt/test/ubsan/TestCases/Float/cast-overflow.cpp:62:3: warning: expression result unused [-Wunused-value] (int)-MaxFloatRepresentableAsInt; // ok ^ ~~~~~~~~~~~~~~~~~~~~~~~~~~~ /Users/buildslave/jenkins/workspace/clang-stage1-cmake-RA-expensive/llvm/projects/compiler-rt/test/ubsan/TestCases/Float/cast-overflow.cpp:65:3: warning: expression result unused [-Wunused-value] (int)MinFloatRepresentableAsInt; // ok ^ ~~~~~~~~~~~~~~~~~~~~~~~~~~ /Users/buildslave/jenkins/workspace/clang-stage1-cmake-RA-expensive/llvm/projects/compiler-rt/test/ubsan/TestCases/Float/cast-overflow.cpp:68:3: warning: expression result unused [-Wunused-value] (unsigned int)MaxFloatRepresentableAsUInt; // ok ^ ~~~~~~~~~~~~~~~~~~~~~~~~~~~ 4 warnings generated. /Users/buildslave/jenkins/workspace/clang-stage1-cmake-RA-expensive/llvm/projects/compiler-rt/test/ubsan/TestCases/Float/cast-overflow.cpp:140:14: error: CHECK-6: expected string not found in input // CHECK-6: cast-overflow.cpp:[[@LINE+2]]:{{34: runtime error: 0xffffff00000000000000000000000001 is outside the range of representable values of type 'float'| __int128 not supported}} ^ <stdin>:1:1: note: scanning from here /Users/buildslave/jenkins/workspace/clang-stage1-cmake-RA-expensive/llvm/projects/compiler-rt/test/ubsan/TestCases/Float/cast-overflow.cpp:142:27: runtime error: 3.40282e+38 is outside the range of representable values of type 'int' ^ <stdin>:1:1: note: uses undefined variable "@LINE" /Users/buildslave/jenkins/workspace/clang-stage1-cmake-RA-expensive/llvm/projects/compiler-rt/test/ubsan/TestCases/Float/cast-overflow.cpp:142:27: runtime error: 3.40282e+38 is outside the range of representable values of type 'int' ^

Hide Details

--

Hide Details

******************** PASS: UBSan-StandaloneStatic-x86_64 :: TestCases/TypeCheck/vptr.cpp (3876 of 4241) PASS: UBSan-ThreadSanitizer-x86_64 :: TestCases/ImplicitConversion/integer-sign-change-blacklist.c (3877 of 4241) PASS: UBSan-ThreadSanitizer-x86_64 :: TestCases/ImplicitConversion/integer-sign-change-summary.cpp (3878 of 4241) PASS: UBSan-ThreadSanitizer-x86_64 :: TestCases/ImplicitConversion/integer-arithmetic-value-change.c (3879 of 4241) PASS: UBSan-ThreadSanitizer-x86_64 :: TestCases/ImplicitConversion/integer-conversion.c (3880 of 4241) PASS: UBSan-ThreadSanitizer-x86_64 :: TestCases/ImplicitConversion/integer-sign-change.c (3881 of 4241) PASS: UBSan-ThreadSanitizer-x86_64 :: TestCases/ImplicitConversion/integer-truncation.c (3882 of 4241) PASS: UBSan-ThreadSanitizer-x86_64 :: TestCases/ImplicitConversion/signed-integer-truncation-or-sign-change-summary.cpp (3883 of 4241) PASS: UBSan-ThreadSanitizer-x86_64 :: TestCases/ImplicitConversion/signed-integer-truncation-summary.cpp (3884 of 4241) PASS: UBSan-ThreadSanitizer-x86_64 :: TestCases/ImplicitConversion/signed-integer-truncation-blacklist.c (3885 of 4241) PASS: UBSan-ThreadSanitizer-x86_64 :: TestCases/ImplicitConversion/signed-integer-truncation-or-sign-change-blacklist.c (3886 of 4241) PASS: UBSan-ThreadSanitizer-x86_64 :: TestCases/ImplicitConversion/unsigned-integer-truncation-summary.cpp (3887 of 4241) PASS: UBSan-ThreadSanitizer-x86_64 :: TestCases/ImplicitConversion/signed-integer-truncation.c (3888 of 4241) PASS: UBSan-ThreadSanitizer-x86_64 :: TestCases/Integer/add-overflow.cpp (3889 of 4241) PASS: UBSan-ThreadSanitizer-x86_64 :: TestCases/Integer/div-overflow.cpp (3890 of 4241) FAIL: UBSan-ThreadSanitizer-x86_64 :: TestCases/Integer/div-zero.cpp (3891 of 4241) ******************** TEST 'UBSan-ThreadSanitizer-x86_64 :: TestCases/Integer/div-zero.cpp' FAILED ******************** Script: -- : 'RUN: at line 1'; /Users/buildslave/jenkins/workspace/clang-stage1-cmake-RA-expensive/clang-build/./bin/clang --driver-mode=g++ -fsanitize=thread -arch x86_64 -stdlib=libc++ -mmacosx-version-min=10.9 -isysroot /Applications/Xcode.app/Contents/Developer/Platforms/MacOSX.platform/Developer/SDKs/MacOSX10.13.sdk -fsanitize=integer-divide-by-zero -DDIVIDEND=0 /Users/buildslave/jenkins/workspace/clang-stage1-cmake-RA-expensive/llvm/projects/compiler-rt/test/ubsan/TestCases/Integer/div-zero.cpp -o /Users/buildslave/jenkins/workspace/clang-stage1-cmake-RA-expensive/clang-build/tools/clang/runtime/compiler-rt-bins/test/ubsan/ThreadSanitizer-x86_64/TestCases/Integer/Output/div-zero.cpp.tmp && /Users/buildslave/jenkins/workspace/clang-stage1-cmake-RA-expensive/clang-build/tools/clang/runtime/compiler-rt-bins/test/ubsan/ThreadSanitizer-x86_64/TestCases/Integer/Output/div-zero.cpp.tmp 2>&1 | FileCheck /Users/buildslave/jenkins/workspace/clang-stage1-cmake-RA-expensive/llvm/projects/compiler-rt/test/ubsan/TestCases/Integer/div-zero.cpp : 'RUN: at line 2'; /Users/buildslave/jenkins/workspace/clang-stage1-cmake-RA-expensive/clang-build/./bin/clang --driver-mode=g++ -fsanitize=thread -arch x86_64 -stdlib=libc++ -mmacosx-version-min=10.9 -isysroot /Applications/Xcode.app/Contents/Developer/Platforms/MacOSX.platform/Developer/SDKs/MacOSX10.13.sdk -fsanitize=integer-divide-by-zero -DDIVIDEND=1U /Users/buildslave/jenkins/workspace/clang-stage1-cmake-RA-expensive/llvm/projects/compiler-rt/test/ubsan/TestCases/Integer/div-zero.cpp -o /Users/buildslave/jenkins/workspace/clang-stage1-cmake-RA-expensive/clang-build/tools/clang/runtime/compiler-rt-bins/test/ubsan/ThreadSanitizer-x86_64/TestCases/Integer/Output/div-zero.cpp.tmp && /Users/buildslave/jenkins/workspace/clang-stage1-cmake-RA-expensive/clang-build/tools/clang/runtime/compiler-rt-bins/test/ubsan/ThreadSanitizer-x86_64/TestCases/Integer/Output/div-zero.cpp.tmp 2>&1 | FileCheck /Users/buildslave/jenkins/workspace/clang-stage1-cmake-RA-expensive/llvm/projects/compiler-rt/test/ubsan/TestCases/Integer/div-zero.cpp : 'RUN: at line 3'; /Users/buildslave/jenkins/workspace/clang-stage1-cmake-RA-expensive/clang-build/./bin/clang --driver-mode=g++ -fsanitize=thread -arch x86_64 -stdlib=libc++ -mmacosx-version-min=10.9 -isysroot /Applications/Xcode.app/Contents/Developer/Platforms/MacOSX.platform/Developer/SDKs/MacOSX10.13.sdk -fsanitize=float-divide-by-zero -DDIVIDEND=1.5 /Users/buildslave/jenkins/workspace/clang-stage1-cmake-RA-expensive/llvm/projects/compiler-rt/test/ubsan/TestCases/Integer/div-zero.cpp -o /Users/buildslave/jenkins/workspace/clang-stage1-cmake-RA-expensive/clang-build/tools/clang/runtime/compiler-rt-bins/test/ubsan/ThreadSanitizer-x86_64/TestCases/Integer/Output/div-zero.cpp.tmp && /Users/buildslave/jenkins/workspace/clang-stage1-cmake-RA-expensive/clang-build/tools/clang/runtime/compiler-rt-bins/test/ubsan/ThreadSanitizer-x86_64/TestCases/Integer/Output/div-zero.cpp.tmp 2>&1 | FileCheck /Users/buildslave/jenkins/workspace/clang-stage1-cmake-RA-expensive/llvm/projects/compiler-rt/test/ubsan/TestCases/Integer/div-zero.cpp : 'RUN: at line 4'; /Users/buildslave/jenkins/workspace/clang-stage1-cmake-RA-expensive/clang-build/./bin/clang --driver-mode=g++ -fsanitize=thread -arch x86_64 -stdlib=libc++ -mmacosx-version-min=10.9 -isysroot /Applications/Xcode.app/Contents/Developer/Platforms/MacOSX.platform/Developer/SDKs/MacOSX10.13.sdk -fsanitize=integer-divide-by-zero -DDIVIDEND='intmax(123)' /Users/buildslave/jenkins/workspace/clang-stage1-cmake-RA-expensive/llvm/projects/compiler-rt/test/ubsan/TestCases/Integer/div-zero.cpp -o /Users/buildslave/jenkins/workspace/clang-stage1-cmake-RA-expensive/clang-build/tools/clang/runtime/compiler-rt-bins/test/ubsan/ThreadSanitizer-x86_64/TestCases/Integer/Output/div-zero.cpp.tmp && /Users/buildslave/jenkins/workspace/clang-stage1-cmake-RA-expensive/clang-build/tools/clang/runtime/compiler-rt-bins/test/ubsan/ThreadSanitizer-x86_64/TestCases/Integer/Output/div-zero.cpp.tmp 2>&1 | FileCheck /Users/buildslave/jenkins/workspace/clang-stage1-cmake-RA-expensive/llvm/projects/compiler-rt/test/ubsan/TestCases/Integer/div-zero.cpp -- Exit Code: 1

Hide Details

Command Output (stderr): -- /Users/buildslave/jenkins/workspace/clang-stage1-cmake-RA-expensive/llvm/projects/compiler-rt/test/ubsan/TestCases/Integer/div-zero.cpp:14:12: warning: expression result unused [-Wunused-value] DIVIDEND / 0; ~~~~~~~~ ^ ~ /Users/buildslave/jenkins/workspace/clang-stage1-cmake-RA-expensive/llvm/projects/compiler-rt/test/ubsan/TestCases/Integer/div-zero.cpp:14:12: warning: division by zero is undefined [-Wdivision-by-zero] DIVIDEND / 0; ^ ~ 2 warnings generated. /Users/buildslave/jenkins/workspace/clang-stage1-cmake-RA-expensive/llvm/projects/compiler-rt/test/ubsan/TestCases/Integer/div-zero.cpp:14:12: warning: expression result unused [-Wunused-value] DIVIDEND / 0; ~~~~~~~~ ^ ~ /Users/buildslave/jenkins/workspace/clang-stage1-cmake-RA-expensive/llvm/projects/compiler-rt/test/ubsan/TestCases/Integer/div-zero.cpp:14:12: warning: division by zero is undefined [-Wdivision-by-zero] DIVIDEND / 0; ^ ~ 2 warnings generated. clang-9: error: unsupported option '-fsanitize=float-divide-by-zero' for target 'x86_64-apple-darwin17.6.0'

Hide Details

--

Hide Details

******************** PASS: UBSan-ThreadSanitizer-x86_64 :: TestCases/Integer/incdec-overflow.cpp (3892 of 4241) PASS: UBSan-ThreadSanitizer-x86_64 :: TestCases/Integer/mul-overflow.cpp (3893 of 4241) PASS: UBSan-ThreadSanitizer-x86_64 :: TestCases/ImplicitConversion/unsigned-integer-truncation-blacklist.c (3894 of 4241) PASS: UBSan-ThreadSanitizer-x86_64 :: TestCases/Integer/negate-overflow.cpp (3895 of 4241) PASS: UBSan-ThreadSanitizer-x86_64 :: TestCases/ImplicitConversion/unsigned-integer-truncation.c (3896 of 4241) PASS: UBSan-ThreadSanitizer-x86_64 :: TestCases/Integer/no-recover.cpp (3897 of 4241) UNSUPPORTED: UBSan-ThreadSanitizer-x86_64 :: TestCases/Integer/summary.cpp (3898 of 4241) PASS: UBSan-ThreadSanitizer-x86_64 :: TestCases/Integer/sub-overflow.cpp (3899 of 4241) PASS: UBSan-ThreadSanitizer-x86_64 :: TestCases/Integer/uadd-overflow.cpp (3900 of 4241) PASS: UBSan-ThreadSanitizer-x86_64 :: TestCases/Integer/suppressions.cpp (3901 of 4241) PASS: UBSan-ThreadSanitizer-x86_64 :: TestCases/Integer/umul-overflow.cpp (3902 of 4241) PASS: UBSan-ThreadSanitizer-x86_64 :: TestCases/Integer/uincdec-overflow.cpp (3903 of 4241) UNSUPPORTED: UBSan-ThreadSanitizer-x86_64 :: TestCases/Misc/Linux/print_stack_trace.cc (3904 of 4241) UNSUPPORTED: UBSan-ThreadSanitizer-x86_64 :: TestCases/Misc/Linux/ubsan_options.cc (3905 of 4241) PASS: UBSan-ThreadSanitizer-x86_64 :: TestCases/Misc/bool.cpp (3906 of 4241) PASS: UBSan-ThreadSanitizer-x86_64 :: TestCases/Integer/usub-overflow.cpp (3907 of 4241) PASS: UBSan-ThreadSanitizer-x86_64 :: TestCases/Integer/shift.cpp (3908 of 4241) PASS: UBSan-ThreadSanitizer-x86_64 :: TestCases/Misc/builtins.cpp (3909 of 4241) PASS: UBSan-ThreadSanitizer-x86_64 :: TestCases/Misc/bounds.cpp (3910 of 4241) PASS: UBSan-ThreadSanitizer-x86_64 :: TestCases/Misc/deduplication.cpp (3911 of 4241) XFAIL: UBSan-ThreadSanitizer-x86_64 :: TestCases/Misc/coverage-levels.cc (3912 of 4241) PASS: UBSan-ThreadSanitizer-x86_64 :: TestCases/Misc/enum.cpp (3913 of 4241) PASS: UBSan-ThreadSanitizer-x86_64 :: TestCases/Misc/log-path_test.cc (3914 of 4241) UNSUPPORTED: UBSan-ThreadSanitizer-x86_64 :: TestCases/Misc/no-interception.cpp (3915 of 4241) PASS: UBSan-ThreadSanitizer-x86_64 :: TestCases/Misc/missing_return.cpp (3916 of 4241) PASS: UBSan-ThreadSanitizer-x86_64 :: TestCases/Misc/monitor.cpp (3917 of 4241) PASS: UBSan-ThreadSanitizer-x86_64 :: TestCases/Misc/nullability.c (3918 of 4241) PASS: UBSan-ThreadSanitizer-x86_64 :: TestCases/Misc/nonnull.cpp (3919 of 4241) PASS: UBSan-ThreadSanitizer-x86_64 :: TestCases/Misc/vla.c (3920 of 4241) PASS: UBSan-ThreadSanitizer-x86_64 :: TestCases/Misc/unreachable.cpp (3921 of 4241) PASS: UBSan-ThreadSanitizer-x86_64 :: TestCases/Misc/nonnull-arg.cpp (3922 of 4241) PASS: UBSan-ThreadSanitizer-x86_64 :: TestCases/Pointer/alignment-assumption-attribute-align_value-on-paramvar.cpp (3923 of 4241) PASS: UBSan-ThreadSanitizer-x86_64 :: TestCases/Pointer/alignment-assumption-attribute-align_value-on-lvalue.cpp (3924 of 4241) PASS: UBSan-ThreadSanitizer-x86_64 :: TestCases/Pointer/alignment-assumption-attribute-alloc_align-on-function-variable.cpp (3925 of 4241) PASS: UBSan-ThreadSanitizer-x86_64 :: TestCases/Pointer/alignment-assumption-attribute-alloc_align-on-function.cpp (3926 of 4241) PASS: UBSan-ThreadSanitizer-x86_64 :: TestCases/Pointer/alignment-assumption-attribute-assume_aligned-on-function-two-params.cpp (3927 of 4241) PASS: UBSan-ThreadSanitizer-x86_64 :: TestCases/Pointer/alignment-assumption-attribute-assume_aligned-on-function.cpp (3928 of 4241) PASS: UBSan-ThreadSanitizer-x86_64 :: TestCases/Pointer/alignment-assumption-blacklist.cpp (3929 of 4241) PASS: UBSan-ThreadSanitizer-x86_64 :: TestCases/Pointer/alignment-assumption-builtin_assume_aligned-three-params-variable.cpp (3930 of 4241) PASS: UBSan-ThreadSanitizer-x86_64 :: TestCases/Pointer/alignment-assumption-builtin_assume_aligned-three-params.cpp (3931 of 4241) PASS: UBSan-ThreadSanitizer-x86_64 :: TestCases/Pointer/alignment-assumption-summary.cpp (3932 of 4241) PASS: UBSan-ThreadSanitizer-x86_64 :: TestCases/Pointer/alignment-assumption-builtin_assume_aligned-two-params.cpp (3933 of 4241) PASS: UBSan-ThreadSanitizer-x86_64 :: TestCases/Pointer/unsigned-index-expression.cpp (3934 of 4241) PASS: UBSan-ThreadSanitizer-x86_64 :: TestCases/Pointer/index-overflow.cpp (3935 of 4241) UNSUPPORTED: UBSan-ThreadSanitizer-x86_64 :: TestCases/TypeCheck/Linux/PR33221.cpp (3936 of 4241) PASS: UBSan-ThreadSanitizer-x86_64 :: TestCases/TypeCheck/PR33221.cpp (3937 of 4241) PASS: UBSan-ThreadSanitizer-x86_64 :: TestCases/TypeCheck/Function/function.cpp (3938 of 4241) PASS: UBSan-ThreadSanitizer-x86_64 :: TestCases/Pointer/alignment-assumption-openmp.cpp (3939 of 4241) UNSUPPORTED: XRay-x86_64-darwin :: TestCases/Posix/always-never-instrument.cc (3940 of 4241) UNSUPPORTED: XRay-x86_64-darwin :: TestCases/Posix/arg1-arg0-logging.cc (3941 of 4241) UNSUPPORTED: XRay-x86_64-darwin :: TestCases/Posix/arg1-logger.cc (3942 of 4241) UNSUPPORTED: XRay-x86_64-darwin :: TestCases/Posix/arg1-logging-implicit-this.cc (3943 of 4241) UNSUPPORTED: XRay-x86_64-darwin :: TestCases/Posix/argv0-log-file-name.cc (3944 of 4241) UNSUPPORTED: XRay-x86_64-darwin :: TestCases/Posix/basic-filtering.cc (3945 of 4241) UNSUPPORTED: XRay-x86_64-darwin :: TestCases/Posix/c-test.cc (3946 of 4241) UNSUPPORTED: XRay-x86_64-darwin :: TestCases/Posix/clang-no-xray-instrument.cc (3947 of 4241) UNSUPPORTED: XRay-x86_64-darwin :: TestCases/Posix/common-trampoline-alignment.cc (3948 of 4241) UNSUPPORTED: XRay-x86_64-darwin :: TestCases/Posix/coverage-sample.cc (3949 of 4241) UNSUPPORTED: XRay-x86_64-darwin :: TestCases/Posix/custom-event-handler-alignment.cc (3950 of 4241) UNSUPPORTED: XRay-x86_64-darwin :: TestCases/Posix/custom-event-logging.cc (3951 of 4241) UNSUPPORTED: XRay-x86_64-darwin :: TestCases/Posix/fdr-mode-inmemory.cc (3952 of 4241) UNSUPPORTED: XRay-x86_64-darwin :: TestCases/Posix/fdr-mode-multiple.cc (3953 of 4241) UNSUPPORTED: XRay-x86_64-darwin :: TestCases/Posix/fdr-mode.cc (3954 of 4241) UNSUPPORTED: XRay-x86_64-darwin :: TestCases/Posix/fdr-reinit.cc (3955 of 4241) UNSUPPORTED: XRay-x86_64-darwin :: TestCases/Posix/fdr-single-thread.cc (3956 of 4241) UNSUPPORTED: XRay-x86_64-darwin :: TestCases/Posix/fdr-thread-order.cc (3957 of 4241) UNSUPPORTED: XRay-x86_64-darwin :: TestCases/Posix/fixedsize-logging.cc (3958 of 4241) UNSUPPORTED: XRay-x86_64-darwin :: TestCases/Posix/fork_basic_logging.cc (3959 of 4241) UNSUPPORTED: XRay-x86_64-darwin :: TestCases/Posix/func-id-utils.cc (3960 of 4241) UNSUPPORTED: XRay-x86_64-darwin :: TestCases/Posix/logging-modes.cc (3961 of 4241) UNSUPPORTED: XRay-x86_64-darwin :: TestCases/Posix/optional-inmemory-log.cc (3962 of 4241) UNSUPPORTED: XRay-x86_64-darwin :: TestCases/Posix/patching-unpatching.cc (3963 of 4241) UNSUPPORTED: XRay-x86_64-darwin :: TestCases/Posix/pic_test.cc (3964 of 4241) UNSUPPORTED: XRay-x86_64-darwin :: TestCases/Posix/profiling-multi-threaded.cc (3965 of 4241) UNSUPPORTED: XRay-x86_64-darwin :: TestCases/Posix/profiling-single-threaded.cc (3966 of 4241) UNSUPPORTED: XRay-x86_64-darwin :: TestCases/Posix/quiet-start.cc (3967 of 4241) UNSUPPORTED: XRay-x86_64h-darwin :: TestCases/Posix/always-never-instrument.cc (3968 of 4241) UNSUPPORTED: XRay-x86_64h-darwin :: TestCases/Posix/arg1-arg0-logging.cc (3969 of 4241) UNSUPPORTED: XRay-x86_64h-darwin :: TestCases/Posix/arg1-logger.cc (3970 of 4241) UNSUPPORTED: XRay-x86_64h-darwin :: TestCases/Posix/arg1-logging-implicit-this.cc (3971 of 4241) UNSUPPORTED: XRay-x86_64h-darwin :: TestCases/Posix/argv0-log-file-name.cc (3972 of 4241) UNSUPPORTED: XRay-x86_64h-darwin :: TestCases/Posix/basic-filtering.cc (3973 of 4241) UNSUPPORTED: XRay-x86_64h-darwin :: TestCases/Posix/c-test.cc (3974 of 4241) UNSUPPORTED: XRay-x86_64h-darwin :: TestCases/Posix/clang-no-xray-instrument.cc (3975 of 4241) UNSUPPORTED: XRay-x86_64h-darwin :: TestCases/Posix/common-trampoline-alignment.cc (3976 of 4241) UNSUPPORTED: XRay-x86_64h-darwin :: TestCases/Posix/coverage-sample.cc (3977 of 4241) UNSUPPORTED: XRay-x86_64h-darwin :: TestCases/Posix/custom-event-handler-alignment.cc (3978 of 4241) UNSUPPORTED: XRay-x86_64h-darwin :: TestCases/Posix/custom-event-logging.cc (3979 of 4241) UNSUPPORTED: XRay-x86_64h-darwin :: TestCases/Posix/fdr-mode-inmemory.cc (3980 of 4241) UNSUPPORTED: XRay-x86_64h-darwin :: TestCases/Posix/fdr-mode-multiple.cc (3981 of 4241) UNSUPPORTED: XRay-x86_64h-darwin :: TestCases/Posix/fdr-mode.cc (3982 of 4241) UNSUPPORTED: XRay-x86_64h-darwin :: TestCases/Posix/fdr-reinit.cc (3983 of 4241) UNSUPPORTED: XRay-x86_64h-darwin :: TestCases/Posix/fdr-single-thread.cc (3984 of 4241) UNSUPPORTED: XRay-x86_64h-darwin :: TestCases/Posix/fdr-thread-order.cc (3985 of 4241) UNSUPPORTED: XRay-x86_64h-darwin :: TestCases/Posix/fixedsize-logging.cc (3986 of 4241) UNSUPPORTED: XRay-x86_64h-darwin :: TestCases/Posix/fork_basic_logging.cc (3987 of 4241) UNSUPPORTED: XRay-x86_64h-darwin :: TestCases/Posix/func-id-utils.cc (3988 of 4241) UNSUPPORTED: XRay-x86_64h-darwin :: TestCases/Posix/logging-modes.cc (3989 of 4241) UNSUPPORTED: XRay-x86_64h-darwin :: TestCases/Posix/optional-inmemory-log.cc (3990 of 4241) UNSUPPORTED: XRay-x86_64h-darwin :: TestCases/Posix/patching-unpatching.cc (3991 of 4241) UNSUPPORTED: XRay-x86_64h-darwin :: TestCases/Posix/pic_test.cc (3992 of 4241) UNSUPPORTED: XRay-x86_64h-darwin :: TestCases/Posix/profiling-multi-threaded.cc (3993 of 4241) UNSUPPORTED: XRay-x86_64h-darwin :: TestCases/Posix/profiling-single-threaded.cc (3994 of 4241) UNSUPPORTED: XRay-x86_64h-darwin :: TestCases/Posix/quiet-start.cc (3995 of 4241) PASS: UBSan-ThreadSanitizer-x86_64 :: TestCases/TypeCheck/vptr-corrupted-vtable-itanium.cpp (3996 of 4241) PASS: UBSan-ThreadSanitizer-x86_64 :: TestCases/TypeCheck/vptr-non-unique-typeinfo.cpp (3997 of 4241) PASS: cfi-devirt-i386 :: bad-split.cpp (3998 of 4241) PASS: cfi-devirt-i386 :: anon-namespace.cpp (3999 of 4241) PASS: UBSan-ThreadSanitizer-x86_64 :: TestCases/TypeCheck/vptr-virtual-base-construction.cpp (4000 of 4241) PASS: UBSan-ThreadSanitizer-x86_64 :: TestCases/TypeCheck/null.cpp (4001 of 4241) UNSUPPORTED: cfi-devirt-i386 :: cross-dso/icall/diag.cpp (4002 of 4241) UNSUPPORTED: cfi-devirt-i386 :: cross-dso/icall/dlopen.cpp (4003 of 4241) UNSUPPORTED: cfi-devirt-i386 :: cross-dso/icall/icall-from-dso.cpp (4004 of 4241) UNSUPPORTED: cfi-devirt-i386 :: cross-dso/icall/icall.cpp (4005 of 4241) UNSUPPORTED: cfi-devirt-i386 :: cross-dso/shadow_is_read_only.cpp (4006 of 4241) UNSUPPORTED: cfi-devirt-i386 :: cross-dso/simple-fail.cpp (4007 of 4241) UNSUPPORTED: cfi-devirt-i386 :: cross-dso/simple-pass.cpp (4008 of 4241) UNSUPPORTED: cfi-devirt-i386 :: cross-dso/stats.cpp (4009 of 4241) UNSUPPORTED: cfi-devirt-i386 :: cross-dso/target_out_of_bounds.cpp (4010 of 4241) PASS: UBSan-ThreadSanitizer-x86_64 :: TestCases/TypeCheck/vptr-virtual-base.cpp (4011 of 4241) UNSUPPORTED: cfi-devirt-i386 :: icall/external-call.c (4012 of 4241) XFAIL: cfi-devirt-i386 :: icall/weak.c (4013 of 4241) UNSUPPORTED: cfi-devirt-i386 :: icall/wrong-signature-mixed-lto.c (4014 of 4241) PASS: cfi-devirt-i386 :: bad-cast.cpp (4015 of 4241) PASS: cfi-devirt-i386 :: cross-dso-diagnostic.cpp (4016 of 4241) PASS: cfi-devirt-i386 :: icall/bad-signature.c (4017 of 4241) PASS: cfi-devirt-i386 :: create-derivers.test (4018 of 4241) XFAIL: cfi-devirt-i386 :: sibling.cpp (4019 of 4241) PASS: cfi-devirt-i386 :: mfcall.cpp (4020 of 4241) PASS: cfi-devirt-i386 :: nvcall.cpp (4021 of 4241) UNSUPPORTED: cfi-devirt-i386 :: stats.cpp (4022 of 4241) PASS: cfi-devirt-i386 :: overwrite.cpp (4023 of 4241) XFAIL: cfi-devirt-i386 :: simple-pass.cpp (4024 of 4241) PASS: cfi-devirt-i386 :: base-derived-destructor.cpp (4025 of 4241) PASS: cfi-devirt-i386 :: vtable-may-alias.cpp (4026 of 4241) PASS: cfi-devirt-i386 :: target_uninstrumented.cpp (4027 of 4241) XFAIL: cfi-devirt-i386 :: two-vcalls.cpp (4028 of 4241) PASS: cfi-devirt-x86_64 :: bad-split.cpp (4029 of 4241) PASS: cfi-devirt-i386 :: multiple-inheritance.cpp (4030 of 4241) PASS: cfi-devirt-x86_64 :: create-derivers.test (4031 of 4241) PASS: UBSan-ThreadSanitizer-x86_64 :: TestCases/TypeCheck/misaligned.cpp (4032 of 4241) UNSUPPORTED: cfi-devirt-x86_64 :: cross-dso/icall/diag.cpp (4033 of 4241) UNSUPPORTED: cfi-devirt-x86_64 :: cross-dso/icall/dlopen.cpp (4034 of 4241) UNSUPPORTED: cfi-devirt-x86_64 :: cross-dso/icall/icall-from-dso.cpp (4035 of 4241) UNSUPPORTED: cfi-devirt-x86_64 :: cross-dso/icall/icall.cpp (4036 of 4241) UNSUPPORTED: cfi-devirt-x86_64 :: cross-dso/shadow_is_read_only.cpp (4037 of 4241) UNSUPPORTED: cfi-devirt-x86_64 :: cross-dso/simple-fail.cpp (4038 of 4241) UNSUPPORTED: cfi-devirt-x86_64 :: cross-dso/simple-pass.cpp (4039 of 4241) UNSUPPORTED: cfi-devirt-x86_64 :: cross-dso/stats.cpp (4040 of 4241) UNSUPPORTED: cfi-devirt-x86_64 :: cross-dso/target_out_of_bounds.cpp (4041 of 4241) PASS: cfi-devirt-x86_64 :: cross-dso-diagnostic.cpp (4042 of 4241) UNSUPPORTED: cfi-devirt-x86_64 :: icall/external-call.c (4043 of 4241) XFAIL: cfi-devirt-x86_64 :: icall/weak.c (4044 of 4241) UNSUPPORTED: cfi-devirt-x86_64 :: icall/wrong-signature-mixed-lto.c (4045 of 4241) PASS: cfi-devirt-i386 :: vdtor.cpp (4046 of 4241) PASS: cfi-devirt-x86_64 :: bad-cast.cpp (4047 of 4241) PASS: cfi-devirt-x86_64 :: anon-namespace.cpp (4048 of 4241) PASS: cfi-devirt-x86_64 :: icall/bad-signature.c (4049 of 4241) XFAIL: cfi-devirt-x86_64 :: sibling.cpp (4050 of 4241) PASS: cfi-devirt-x86_64 :: base-derived-destructor.cpp (4051 of 4241) PASS: cfi-devirt-x86_64 :: mfcall.cpp (4052 of 4241) UNSUPPORTED: cfi-devirt-x86_64 :: stats.cpp (4053 of 4241) PASS: cfi-devirt-x86_64 :: nvcall.cpp (4054 of 4241) PASS: cfi-devirt-x86_64 :: overwrite.cpp (4055 of 4241) PASS: cfi-devirt-x86_64 :: target_uninstrumented.cpp (4056 of 4241) XFAIL: cfi-devirt-x86_64 :: simple-pass.cpp (4057 of 4241) PASS: cfi-devirt-x86_64 :: vtable-may-alias.cpp (4058 of 4241) XFAIL: cfi-devirt-x86_64 :: two-vcalls.cpp (4059 of 4241) PASS: cfi-standalone-i386 :: bad-split.cpp (4060 of 4241) PASS: cfi-devirt-x86_64 :: multiple-inheritance.cpp (4061 of 4241) PASS: cfi-standalone-i386 :: create-derivers.test (4062 of 4241) PASS: cfi-standalone-i386 :: cross-dso-diagnostic.cpp (4063 of 4241) UNSUPPORTED: cfi-standalone-i386 :: cross-dso/icall/diag.cpp (4064 of 4241) UNSUPPORTED: cfi-standalone-i386 :: cross-dso/icall/dlopen.cpp (4065 of 4241) UNSUPPORTED: cfi-standalone-i386 :: cross-dso/icall/icall-from-dso.cpp (4066 of 4241) UNSUPPORTED: cfi-standalone-i386 :: cross-dso/icall/icall.cpp (4067 of 4241) UNSUPPORTED: cfi-standalone-i386 :: cross-dso/shadow_is_read_only.cpp (4068 of 4241) UNSUPPORTED: cfi-standalone-i386 :: cross-dso/simple-fail.cpp (4069 of 4241) UNSUPPORTED: cfi-standalone-i386 :: cross-dso/simple-pass.cpp (4070 of 4241) UNSUPPORTED: cfi-standalone-i386 :: cross-dso/stats.cpp (4071 of 4241) UNSUPPORTED: cfi-standalone-i386 :: cross-dso/target_out_of_bounds.cpp (4072 of 4241) PASS: cfi-devirt-x86_64 :: vdtor.cpp (4073 of 4241) UNSUPPORTED: cfi-standalone-i386 :: icall/external-call.c (4074 of 4241) PASS: cfi-standalone-i386 :: bad-cast.cpp (4075 of 4241) UNSUPPORTED: cfi-standalone-i386 :: icall/wrong-signature-mixed-lto.c (4076 of 4241) XFAIL: cfi-standalone-i386 :: icall/weak.c (4077 of 4241) PASS: cfi-standalone-i386 :: anon-namespace.cpp (4078 of 4241) PASS: cfi-standalone-i386 :: icall/bad-signature.c (4079 of 4241) PASS: cfi-devirt-i386 :: simple-fail.cpp (4080 of 4241) XFAIL: cfi-standalone-i386 :: sibling.cpp (4081 of 4241) PASS: cfi-standalone-i386 :: base-derived-destructor.cpp (4082 of 4241) PASS: cfi-standalone-i386 :: mfcall.cpp (4083 of 4241) PASS: cfi-standalone-i386 :: nvcall.cpp (4084 of 4241) PASS: cfi-standalone-i386 :: stats.cpp (4085 of 4241) XFAIL: cfi-standalone-i386 :: simple-pass.cpp (4086 of 4241) PASS: cfi-standalone-i386 :: target_uninstrumented.cpp (4087 of 4241) PASS: cfi-standalone-i386 :: vtable-may-alias.cpp (4088 of 4241) PASS: cfi-standalone-i386 :: overwrite.cpp (4089 of 4241) XFAIL: cfi-standalone-i386 :: two-vcalls.cpp (4090 of 4241) PASS: cfi-standalone-x86_64 :: bad-split.cpp (4091 of 4241) PASS: cfi-standalone-i386 :: multiple-inheritance.cpp (4092 of 4241) PASS: cfi-standalone-x86_64 :: create-derivers.test (4093 of 4241) PASS: cfi-standalone-x86_64 :: cross-dso-diagnostic.cpp (4094 of 4241) UNSUPPORTED: cfi-standalone-x86_64 :: cross-dso/icall/diag.cpp (4095 of 4241) UNSUPPORTED: cfi-standalone-x86_64 :: cross-dso/icall/dlopen.cpp (4096 of 4241) UNSUPPORTED: cfi-standalone-x86_64 :: cross-dso/icall/icall-from-dso.cpp (4097 of 4241) UNSUPPORTED: cfi-standalone-x86_64 :: cross-dso/icall/icall.cpp (4098 of 4241) UNSUPPORTED: cfi-standalone-x86_64 :: cross-dso/shadow_is_read_only.cpp (4099 of 4241) UNSUPPORTED: cfi-standalone-x86_64 :: cross-dso/simple-fail.cpp (4100 of 4241) UNSUPPORTED: cfi-standalone-x86_64 :: cross-dso/simple-pass.cpp (4101 of 4241) UNSUPPORTED: cfi-standalone-x86_64 :: cross-dso/stats.cpp (4102 of 4241) UNSUPPORTED: cfi-standalone-x86_64 :: cross-dso/target_out_of_bounds.cpp (4103 of 4241) PASS: cfi-standalone-i386 :: vdtor.cpp (4104 of 4241) UNSUPPORTED: cfi-standalone-x86_64 :: icall/external-call.c (4105 of 4241) XFAIL: cfi-standalone-x86_64 :: icall/weak.c (4106 of 4241) UNSUPPORTED: cfi-standalone-x86_64 :: icall/wrong-signature-mixed-lto.c (4107 of 4241) PASS: cfi-standalone-x86_64 :: bad-cast.cpp (4108 of 4241) PASS: cfi-standalone-x86_64 :: anon-namespace.cpp (4109 of 4241) PASS: cfi-standalone-x86_64 :: icall/bad-signature.c (4110 of 4241) PASS: cfi-devirt-x86_64 :: simple-fail.cpp (4111 of 4241) XFAIL: cfi-standalone-x86_64 :: sibling.cpp (4112 of 4241) PASS: cfi-standalone-x86_64 :: base-derived-destructor.cpp (4113 of 4241) PASS: cfi-standalone-x86_64 :: mfcall.cpp (4114 of 4241) PASS: cfi-standalone-x86_64 :: stats.cpp (4115 of 4241) XFAIL: cfi-standalone-x86_64 :: simple-pass.cpp (4116 of 4241) PASS: cfi-standalone-x86_64 :: nvcall.cpp (4117 of 4241) PASS: cfi-standalone-x86_64 :: target_uninstrumented.cpp (4118 of 4241) PASS: cfi-standalone-x86_64 :: overwrite.cpp (4119 of 4241) PASS: cfi-standalone-x86_64 :: vtable-may-alias.cpp (4120 of 4241) UNSUPPORTED: libFuzzer :: afl-driver-close-fd-mask.test (4121 of 4241) XFAIL: cfi-standalone-x86_64 :: two-vcalls.cpp (4122 of 4241) PASS: libFuzzer :: acquire-crash-state.test (4123 of 4241) UNSUPPORTED: libFuzzer :: afl-driver.test (4124 of 4241) PASS: cfi-standalone-x86_64 :: multiple-inheritance.cpp (4125 of 4241) PASS: libFuzzer :: bad-strcmp.test (4126 of 4241) PASS: libFuzzer :: bogus-initialize.test (4127 of 4241) PASS: cfi-standalone-x86_64 :: vdtor.cpp (4128 of 4241) PASS: cfi-standalone-i386 :: simple-fail.cpp (4129 of 4241) PASS: libFuzzer :: buffer-overflow-on-input.test (4130 of 4241) PASS: UBSan-ThreadSanitizer-x86_64 :: TestCases/TypeCheck/vptr.cpp (4131 of 4241) PASS: libFuzzer :: afl-driver-stderr.test (4132 of 4241) UNSUPPORTED: libFuzzer :: compressed.test (4133 of 4241) PASS: libFuzzer :: caller-callee.test (4134 of 4241) PASS: cfi-standalone-x86_64 :: simple-fail.cpp (4135 of 4241) PASS: libFuzzer :: counters.test (4136 of 4241) PASS: libFuzzer :: coverage.test (4137 of 4241) PASS: libFuzzer :: cxxstring.test (4138 of 4241) UNSUPPORTED: libFuzzer :: dataflow.test (4139 of 4241) PASS: libFuzzer :: dead-stripping.test (4140 of 4241) UNSUPPORTED: libFuzzer :: deep-recursion.test (4141 of 4241) PASS: libFuzzer :: cross_over.test (4142 of 4241) UNSUPPORTED: libFuzzer :: disable-leaks.test (4143 of 4241) PASS: libFuzzer :: deprecated-instrumentation.test (4144 of 4241) UNSUPPORTED: libFuzzer :: equivalence-signals.test (4145 of 4241) UNSUPPORTED: libFuzzer :: equivalence.test (4146 of 4241) PASS: libFuzzer :: dso.test (4147 of 4241) PASS: libFuzzer :: cleanse.test (4148 of 4241) UNSUPPORTED: libFuzzer :: extra-counters.test (4149 of 4241) UNSUPPORTED: libFuzzer :: features_dir.test (4150 of 4241) UNSUPPORTED: libFuzzer :: fork-sigusr.test (4151 of 4241) UNSUPPORTED: libFuzzer :: fork-ubsan.test (4152 of 4241) UNSUPPORTED: libFuzzer :: fork.test (4153 of 4241) PASS: libFuzzer :: exit-report.test (4154 of 4241) PASS: libFuzzer :: full-coverage-set.test (4155 of 4241) PASS: libFuzzer :: exit_on_src_pos.test (4156 of 4241) PASS: libFuzzer :: fuzzer-alignment-assumption.test (4157 of 4241) PASS: libFuzzer :: fuzzer-customcrossoverandmutate.test (4158 of 4241) PASS: libFuzzer :: fuzzer-custommutator.test (4159 of 4241) PASS: libFuzzer :: fuzzer-customcrossover.test (4160 of 4241) PASS: libFuzzer :: fuzzer-dirs.test (4161 of 4241) PASS: libFuzzer :: fuzzer-fdmask.test (4162 of 4241) PASS: libFuzzer :: fuzzer-finalstats.test (4163 of 4241) PASS: libFuzzer :: fuzzer-dict.test (4164 of 4241) PASS: libFuzzer :: fuzzer-implicit-integer-sign-change.test (4165 of 4241) PASS: libFuzzer :: fuzzer-flags.test (4166 of 4241) PASS: libFuzzer :: fuzzer-implicit-signed-integer-truncation-or-sign-change.test (4167 of 4241) UNSUPPORTED: libFuzzer :: fuzzer-leak.test (4168 of 4241) UNSUPPORTED: libFuzzer :: fuzzer-oom-with-profile.test (4169 of 4241) PASS: libFuzzer :: fuzzer-implicit-signed-integer-truncation.test (4170 of 4241) PASS: libFuzzer :: fuzzer-implicit-unsigned-integer-truncation.test (4171 of 4241) PASS: libFuzzer :: fuzzer-printcovpcs.test (4172 of 4241) PASS: libFuzzer :: fuzzer-runs.test (4173 of 4241) PASS: libFuzzer :: fuzzer-seed.test (4174 of 4241) PASS: libFuzzer :: fuzzer-segv.test (4175 of 4241) PASS: libFuzzer :: fuzzer-oom.test (4176 of 4241) PASS: libFuzzer :: fuzzer-singleinputs.test (4177 of 4241) PASS: libFuzzer :: fuzzer-ubsan.test (4178 of 4241) UNSUPPORTED: libFuzzer :: gc-sections.test (4179 of 4241) PASS: libFuzzer :: fuzzer-threaded.test (4180 of 4241) UNSUPPORTED: libFuzzer :: large.test (4181 of 4241) PASS: libFuzzer :: initialize.test (4182 of 4241) UNSUPPORTED: libFuzzer :: libcxx.test (4183 of 4241) UNSUPPORTED: libFuzzer :: magic-separator.test (4184 of 4241) PASS: libFuzzer :: max-number-of-runs.test (4185 of 4241) PASS: libFuzzer :: len_control.test (4186 of 4241) PASS: libFuzzer :: memcmp.test (4187 of 4241) PASS: libFuzzer :: memcmp64.test (4188 of 4241) PASS: libFuzzer :: fuzzer-timeout.test (4189 of 4241) UNSUPPORTED: libFuzzer :: merge-sigusr.test (4190 of 4241) PASS: libFuzzer :: merge-posix.test (4191 of 4241) PASS: libFuzzer :: merge-control-file.test (4192 of 4241) PASS: libFuzzer :: merge.test (4193 of 4241) UNSUPPORTED: libFuzzer :: msan-param-unpoison.test (4194 of 4241) UNSUPPORTED: libFuzzer :: msan.test (4195 of 4241) PASS: libFuzzer :: not-instrumented.test (4196 of 4241) PASS: libFuzzer :: null-deref-on-empty.test (4197 of 4241) PASS: libFuzzer :: minimize_two_crashes.test (4198 of 4241) UNSUPPORTED: libFuzzer :: only-some-bytes-fork.test (4199 of 4241) UNSUPPORTED: libFuzzer :: only-some-bytes.test (4200 of 4241) PASS: libFuzzer :: overwrite-input.test (4201 of 4241) UNSUPPORTED: libFuzzer :: print-func.test (4202 of 4241) PASS: libFuzzer :: null-deref.test (4203 of 4241) PASS: libFuzzer :: recommended-dictionary.test (4204 of 4241) PASS: libFuzzer :: read-binary.test (4205 of 4241) PASS: libFuzzer :: reduce_inputs.test (4206 of 4241) PASS: libFuzzer :: repeated-bytes.test (4207 of 4241) PASS: libFuzzer :: reload.test (4208 of 4241) PASS: libFuzzer :: seed_inputs.test (4209 of 4241) UNSUPPORTED: libFuzzer :: sigint.test (4210 of 4241) UNSUPPORTED: libFuzzer :: sigusr.test (4211 of 4241) UNSUPPORTED: libFuzzer :: simple-cmp.test (4212 of 4241) PASS: libFuzzer :: shrink.test (4213 of 4241) PASS: libFuzzer :: standalone.test (4214 of 4241) PASS: libFuzzer :: strcmp.test (4215 of 4241) PASS: libFuzzer :: simple.test (4216 of 4241) PASS: libFuzzer :: strncmp-oob.test (4217 of 4241) PASS: libFuzzer :: strncmp.test (4218 of 4241) PASS: libFuzzer :: strstr.test (4219 of 4241) PASS: libFuzzer :: swap-cmp.test (4220 of 4241) UNSUPPORTED: libFuzzer :: target-function.test (4221 of 4241) PASS: libFuzzer :: three-bytes.test (4222 of 4241) UNSUPPORTED: libFuzzer :: trace-malloc-2.test (4223 of 4241) UNSUPPORTED: libFuzzer :: trace-malloc-threaded.test (4224 of 4241) UNSUPPORTED: libFuzzer :: trace-malloc-unbalanced.test (4225 of 4241) PASS: libFuzzer :: symbolize-deadlock.test (4226 of 4241) PASS: libFuzzer :: minimize_crash.test (4227 of 4241) PASS: libFuzzer :: trace-malloc.test (4228 of 4241) PASS: libFuzzer :: ulimit.test (4229 of 4241) PASS: libFuzzer :: value-profile-cmp2.test (4230 of 4241) PASS: libFuzzer :: value-profile-cmp3.test (4231 of 4241) PASS: libFuzzer :: value-profile-div.test (4232 of 4241) PASS: libFuzzer :: value-profile-cmp4.test (4233 of 4241) PASS: libFuzzer :: value-profile-cmp.test (4234 of 4241) PASS: libFuzzer :: value-profile-mem.test (4235 of 4241) PASS: libFuzzer :: value-profile-strcmp.test (4236 of 4241) PASS: libFuzzer :: value-profile-strncmp.test (4237 of 4241) PASS: libFuzzer :: value-profile-set.test (4238 of 4241) UNSUPPORTED: libFuzzer :: windows-opt-ref.test (4239 of 4241) PASS: libFuzzer :: value-profile-load.test (4240 of 4241) PASS: libFuzzer :: value-profile-switch.test (4241 of 4241)

Hide Details

22 warning(s) in tests. Testing Time: 1977.61s ******************** Failing Tests (11): UBSan-AddressSanitizer-i386 :: TestCases/Integer/div-zero.cpp UBSan-AddressSanitizer-x86_64 :: TestCases/Float/cast-overflow.cpp UBSan-AddressSanitizer-x86_64 :: TestCases/Integer/div-zero.cpp UBSan-Standalone-i386 :: TestCases/Integer/div-zero.cpp UBSan-Standalone-x86_64 :: TestCases/Float/cast-overflow.cpp UBSan-Standalone-x86_64 :: TestCases/Integer/div-zero.cpp UBSan-StandaloneStatic-i386 :: TestCases/Integer/div-zero.cpp UBSan-StandaloneStatic-x86_64 :: TestCases/Float/cast-overflow.cpp UBSan-StandaloneStatic-x86_64 :: TestCases/Integer/div-zero.cpp UBSan-ThreadSanitizer-x86_64 :: TestCases/Float/cast-overflow.cpp UBSan-ThreadSanitizer-x86_64 :: TestCases/Integer/div-zero.cpp

Hide Details

Expected Passes : 2894 Expected Failures : 48 Unsupported Tests : 1288 Unexpected Failures: 11 FAILED: test/CMakeFiles/check-compiler-rt cd /Users/buildslave/jenkins/workspace/clang-stage1-cmake-RA-expensive/clang-build/tools/clang/runtime/compiler-rt-bins/test && /usr/local/bin/python2.7 /Users/buildslave/jenkins/workspace/clang-stage1-cmake-RA-expensive/clang-build/bin/llvm-lit --xunit-xml-output=testresults.xunit.xml -v --timeout=600 /Users/buildslave/jenkins/workspace/clang-stage1-cmake-RA-expensive/clang-build/tools/clang/runtime/compiler-rt-bins/test/builtins/TestCases /Users/buildslave/jenkins/workspace/clang-stage1-cmake-RA-expensive/clang-build/tools/clang/runtime/compiler-rt-bins/test/lsan/I386LsanConfig /Users/buildslave/jenkins/workspace/clang-stage1-cmake-RA-expensive/clang-build/tools/clang/runtime/compiler-rt-bins/test/lsan/I386AsanConfig /Users/buildslave/jenkins/workspace/clang-stage1-cmake-RA-expensive/clang-build/tools/clang/runtime/compiler-rt-bins/test/lsan/X86_64LsanConfig /Users/buildslave/jenkins/workspace/clang-stage1-cmake-RA-expensive/clang-build/tools/clang/runtime/compiler-rt-bins/test/lsan/X86_64AsanConfig /Users/buildslave/jenkins/workspace/clang-stage1-cmake-RA-expensive/clang-build/tools/clang/runtime/compiler-rt-bins/test/ubsan/Standalone-i386 /Users/buildslave/jenkins/workspace/clang-stage1-cmake-RA-expensive/clang-build/tools/clang/runtime/compiler-rt-bins/test/ubsan/AddressSanitizer-i386 /Users/buildslave/jenkins/workspace/clang-stage1-cmake-RA-expensive/clang-build/tools/clang/runtime/compiler-rt-bins/test/ubsan/Standalone-x86_64 /Users/buildslave/jenkins/workspace/clang-stage1-cmake-RA-expensive/clang-build/tools/clang/runtime/compiler-rt-bins/test/ubsan/AddressSanitizer-x86_64 /Users/buildslave/jenkins/workspace/clang-stage1-cmake-RA-expensive/clang-build/tools/clang/runtime/compiler-rt-bins/test/ubsan/ThreadSanitizer-x86_64 /Users/buildslave/jenkins/workspace/clang-stage1-cmake-RA-expensive/clang-build/tools/clang/runtime/compiler-rt-bins/test/ubsan/StandaloneStatic-i386 /Users/buildslave/jenkins/workspace/clang-stage1-cmake-RA-expensive/clang-build/tools/clang/runtime/compiler-rt-bins/test/ubsan/StandaloneStatic-x86_64 /Users/buildslave/jenkins/workspace/clang-stage1-cmake-RA-expensive/clang-build/tools/clang/runtime/compiler-rt-bins/test/cfi/Standalone-i386 /Users/buildslave/jenkins/workspace/clang-stage1-cmake-RA-expensive/clang-build/tools/clang/runtime/compiler-rt-bins/test/cfi/Devirt-i386 /Users/buildslave/jenkins/workspace/clang-stage1-cmake-RA-expensive/clang-build/tools/clang/runtime/compiler-rt-bins/test/cfi/Standalone-x86_64 /Users/buildslave/jenkins/workspace/clang-stage1-cmake-RA-expensive/clang-build/tools/clang/runtime/compiler-rt-bins/test/cfi/Devirt-x86_64 /Users/buildslave/jenkins/workspace/clang-stage1-cmake-RA-expensive/clang-build/tools/clang/runtime/compiler-rt-bins/test/sanitizer_common/asan-i386-Darwin /Users/buildslave/jenkins/workspace/clang-stage1-cmake-RA-expensive/clang-build/tools/clang/runtime/compiler-rt-bins/test/sanitizer_common/asan-x86_64-Darwin /Users/buildslave/jenkins/workspace/clang-stage1-cmake-RA-expensive/clang-build/tools/clang/runtime/compiler-rt-bins/test/sanitizer_common/lsan-x86_64-Darwin /Users/buildslave/jenkins/workspace/clang-stage1-cmake-RA-expensive/clang-build/tools/clang/runtime/compiler-rt-bins/test/sanitizer_common/tsan-x86_64-Darwin /Users/buildslave/jenkins/workspace/clang-stage1-cmake-RA-expensive/clang-build/tools/clang/runtime/compiler-rt-bins/test/sanitizer_common/ubsan-i386-Darwin /Users/buildslave/jenkins/workspace/clang-stage1-cmake-RA-expensive/clang-build/tools/clang/runtime/compiler-rt-bins/test/sanitizer_common/ubsan-x86_64-Darwin /Users/buildslave/jenkins/workspace/clang-stage1-cmake-RA-expensive/clang-build/tools/clang/runtime/compiler-rt-bins/test/sanitizer_common/Unit /Users/buildslave/jenkins/workspace/clang-stage1-cmake-RA-expensive/clang-build/tools/clang/runtime/compiler-rt-bins/test/fuzzer/unit /Users/buildslave/jenkins/workspace/clang-stage1-cmake-RA-expensive/clang-build/tools/clang/runtime/compiler-rt-bins/test/fuzzer/X86_64DefaultDarwinConfig/ /Users/buildslave/jenkins/workspace/clang-stage1-cmake-RA-expensive/clang-build/tools/clang/runtime/compiler-rt-bins/test/asan/I386DarwinConfig /Users/buildslave/jenkins/workspace/clang-stage1-cmake-RA-expensive/clang-build/tools/clang/runtime/compiler-rt-bins/test/asan/X86_64DarwinConfig /Users/buildslave/jenkins/workspace/clang-stage1-cmake-RA-expensive/clang-build/tools/clang/runtime/compiler-rt-bins/test/asan/Unit /Users/buildslave/jenkins/workspace/clang-stage1-cmake-RA-expensive/clang-build/tools/clang/runtime/compiler-rt-bins/test/tsan/X86_64Config /Users/buildslave/jenkins/workspace/clang-stage1-cmake-RA-expensive/clang-build/tools/clang/runtime/compiler-rt-bins/test/tsan/Unit /Users/buildslave/jenkins/workspace/clang-stage1-cmake-RA-expensive/clang-build/tools/clang/runtime/compiler-rt-bins/test/ubsan_minimal/i386 /Users/buildslave/jenkins/workspace/clang-stage1-cmake-RA-expensive/clang-build/tools/clang/runtime/compiler-rt-bins/test/ubsan_minimal/x86_64 /Users/buildslave/jenkins/workspace/clang-stage1-cmake-RA-expensive/clang-build/tools/clang/runtime/compiler-rt-bins/test/profile/Profile-i386 /Users/buildslave/jenkins/workspace/clang-stage1-cmake-RA-expensive/clang-build/tools/clang/runtime/compiler-rt-bins/test/profile/Profile-x86_64 /Users/buildslave/jenkins/workspace/clang-stage1-cmake-RA-expensive/clang-build/tools/clang/runtime/compiler-rt-bins/test/xray/X86_64DarwinConfig /Users/buildslave/jenkins/workspace/clang-stage1-cmake-RA-expensive/clang-build/tools/clang/runtime/compiler-rt-bins/test/xray/X86_64HDarwinConfig /Users/buildslave/jenkins/workspace/clang-stage1-cmake-RA-expensive/clang-build/tools/clang/runtime/compiler-rt-bins/test/shadowcallstack/arm64 ninja: build stopped: subcommand failed. [233/644] cd /Users/buildslave/jenkins/workspace/clang-stage1-cmake-RA-expensive/llvm/tools/clang/bindings/python && /usr/local/Cellar/cmake/3.13.1/bin/cmake -E env CLANG_LIBRARY_PATH=/Users/buildslave/jenkins/workspace/clang-stage1-cmake-RA-expensive/clang-build/lib /usr/local/bin/python2.7 -m unittest discover ..........s..s......................................................................s.s.......s...s........................... ---------------------------------------------------------------------- Ran 126 tests in 3.464s

Hide Details

OK (skipped=6) [642/644] : && /Applications/Xcode.app/Contents/Developer/Toolchains/XcodeDefault.xctoolchain/usr/bin/c++ -fPIC -fvisibility-inlines-hidden -Werror=date-time -Werror=unguarded-availability-new -std=c++11 -Wall -Wextra -Wno-unused-parameter -Wwrite-strings -Wcast-qual -Wmissing-field-initializers -pedantic -Wno-long-long -Wimplicit-fallthrough -Wcovered-switch-default -Wno-noexcept-type -Wnon-virtual-dtor -Wdelete-non-virtual-dtor -Wstring-conversion -fdiagnostics-color -O3 -isysroot /Applications/Xcode.app/Contents/Developer/Platforms/MacOSX.platform/Developer/SDKs/MacOSX10.13.sdk -mmacosx-version-min=10.9 -Wl,-search_paths_first -Wl,-headerpad_max_install_names -Wl,-dead_strip unittests/tools/llvm-exegesis/X86/CMakeFiles/LLVMExegesisX86Tests.dir/AssemblerTest.cpp.o unittests/tools/llvm-exegesis/X86/CMakeFiles/LLVMExegesisX86Tests.dir/BenchmarkResultTest.cpp.o unittests/tools/llvm-exegesis/X86/CMakeFiles/LLVMExegesisX86Tests.dir/RegisterAliasingTest.cpp.o unittests/tools/llvm-exegesis/X86/CMakeFiles/LLVMExegesisX86Tests.dir/SchedClassResolutionTest.cpp.o unittests/tools/llvm-exegesis/X86/CMakeFiles/LLVMExegesisX86Tests.dir/SnippetGeneratorTest.cpp.o unittests/tools/llvm-exegesis/X86/CMakeFiles/LLVMExegesisX86Tests.dir/TargetTest.cpp.o -o unittests/tools/llvm-exegesis/X86/LLVMExegesisX86Tests lib/libLLVMMC.a lib/libLLVMMCParser.a lib/libLLVMObject.a lib/libLLVMSupport.a lib/libLLVMSymbolize.a lib/libLLVMX86CodeGen.a lib/libLLVMX86AsmParser.a lib/libLLVMX86Desc.a lib/libLLVMX86Disassembler.a lib/libLLVMX86Info.a lib/libLLVMX86Utils.a lib/libLLVMSupport.a lib/libgtest_main.a lib/libgtest.a lib/libLLVMExegesis.a lib/libLLVMExegesisX86.a lib/libLLVMDebugInfoPDB.a -lpthread lib/libLLVMX86CodeGen.a lib/libLLVMAsmPrinter.a lib/libLLVMDebugInfoDWARF.a lib/libLLVMX86AsmParser.a lib/libLLVMX86Desc.a lib/libLLVMX86Disassembler.a lib/libLLVMX86Info.a lib/libLLVMX86Utils.a lib/libLLVMExegesis.a lib/libLLVMGlobalISel.a lib/libLLVMSelectionDAG.a lib/libLLVMCodeGen.a lib/libLLVMBitWriter.a lib/libLLVMScalarOpts.a lib/libLLVMAggressiveInstCombine.a lib/libLLVMInstCombine.a lib/libLLVMTransformUtils.a lib/libLLVMMCDisassembler.a lib/libLLVMMCJIT.a lib/libLLVMExecutionEngine.a lib/libLLVMTarget.a lib/libLLVMAnalysis.a lib/libLLVMProfileData.a lib/libLLVMRuntimeDyld.a lib/libLLVMObjectYAML.a lib/libLLVMObject.a lib/libLLVMMCParser.a lib/libLLVMMC.a lib/libLLVMBitReader.a lib/libLLVMBitstreamReader.a lib/libLLVMCore.a lib/libLLVMBinaryFormat.a lib/libLLVMRemarks.a lib/libLLVMDebugInfoCodeView.a lib/libLLVMDebugInfoMSF.a lib/libLLVMSupport.a -lz -lcurses -lm lib/libLLVMDemangle.a && : FAILED: tools/clang/runtime/CMakeFiles/check-compiler-rt cd /Users/buildslave/jenkins/workspace/clang-stage1-cmake-RA-expensive/clang-build/tools/clang/runtime/compiler-rt-bins && /usr/local/Cellar/cmake/3.13.1/bin/cmake --build . --target check-all --config Release ninja: build stopped: cannot make progress due to previous errors. Command failed Command: ['/usr/local/bin/ninja', '-v', '-k', '0', 'check-all'] Build step 'Execute shell' marked build as failure Recording test results ERROR: Step ‘Publish JUnit test result report’ failed: No test report files were found. Configuration error? [BFA] Scanning build for known causes... [BFA] Found failure cause(s): [BFA] Regression test failed from category Test [BFA] Ninja target failed from category Compile [BFA] Compile Error from category Compile [BFA] Missing test results from category Infrastructure [BFA] Done. 1s No emails were triggered. Finished: FAILURE