FailedConsole Output

Skipping 19,467 KB.. Full Log
 :: std/utilities/time/time.cal/time.cal.ymwd/time.cal.ymwd.nonmembers/comparisons.pass.cpp (54666 of 55026)
PASS: libc++ :: std/utilities/time/time.cal/time.cal.ymwd/types.pass.cpp (54667 of 55026)
PASS: libc++ :: std/utilities/time/time.cal/time.cal.ymwd/time.cal.ymwd.nonmembers/minus.pass.cpp (54668 of 55026)
PASS: libc++ :: std/utilities/time/time.cal/time.cal.ymwd/time.cal.ymwd.nonmembers/plus.pass.cpp (54669 of 55026)
PASS: libc++ :: std/utilities/time/time.cal/time.cal.ymwdlast/time.cal.ymwdlast.members/ctor.pass.cpp (54670 of 55026)
PASS: libc++ :: std/utilities/time/time.cal/time.cal.ymwdlast/time.cal.ymwdlast.members/month.pass.cpp (54671 of 55026)
PASS: libc++ :: std/utilities/time/time.cal/time.cal.ymwdlast/time.cal.ymwdlast.members/ok.pass.cpp (54672 of 55026)
PASS: libc++ :: std/utilities/time/time.cal/time.cal.ymwdlast/time.cal.ymwdlast.members/op_local_days.pass.cpp (54673 of 55026)
PASS: libc++ :: std/utilities/time/time.cal/time.cal.ymwdlast/time.cal.ymwdlast.members/op_sys_days.pass.cpp (54674 of 55026)
PASS: libc++ :: std/utilities/time/time.cal/time.cal.ymwdlast/time.cal.ymwdlast.members/plus_minus_equal_month.pass.cpp (54675 of 55026)
PASS: libc++ :: std/utilities/time/time.cal/time.cal.ymwdlast/time.cal.ymwdlast.members/plus_minus_equal_year.pass.cpp (54676 of 55026)
PASS: libc++ :: std/utilities/time/time.cal/time.cal.ymwdlast/time.cal.ymwdlast.members/year.pass.cpp (54677 of 55026)
PASS: libc++ :: std/utilities/time/time.cal/time.cal.ymwdlast/time.cal.ymwdlast.members/weekday.pass.cpp (54678 of 55026)
PASS: libc++ :: std/utilities/time/time.cal/time.cal.ymwdlast/time.cal.ymwdlast.nonmembers/comparisons.pass.cpp (54679 of 55026)
PASS: libc++ :: std/utilities/time/time.cal/time.cal.ymwdlast/time.cal.ymwdlast.nonmembers/minus.pass.cpp (54680 of 55026)
PASS: libc++ :: std/utilities/time/time.clock.req/nothing_to_do.pass.cpp (54681 of 55026)
PASS: libc++ :: std/utilities/time/time.clock/nothing_to_do.pass.cpp (54682 of 55026)
XFAIL: libc++ :: std/utilities/time/time.cal/time.cal.ymwd/time.cal.ymwd.nonmembers/streaming.pass.cpp (54683 of 55026)
PASS: libc++ :: std/utilities/time/time.cal/time.cal.ymwdlast/types.pass.cpp (54684 of 55026)
PASS: libc++ :: std/utilities/time/time.cal/time.cal.ymwdlast/time.cal.ymwdlast.nonmembers/plus.pass.cpp (54685 of 55026)
PASS: libc++ :: std/utilities/time/time.clock/time.clock.file/consistency.pass.cpp (54686 of 55026)
PASS: libc++ :: std/utilities/time/time.clock/time.clock.file/file_time.pass.cpp (54687 of 55026)
PASS: libc++ :: std/utilities/time/time.clock/time.clock.file/rep_signed.pass.cpp (54688 of 55026)
PASS: libc++ :: std/utilities/time/time.clock/time.clock.hires/consistency.pass.cpp (54689 of 55026)
PASS: libc++ :: std/utilities/time/time.clock/time.clock.file/now.pass.cpp (54690 of 55026)
PASS: libc++ :: std/utilities/time/time.clock/time.clock.steady/consistency.pass.cpp (54691 of 55026)
PASS: libc++ :: std/utilities/time/time.clock/time.clock.system/consistency.pass.cpp (54692 of 55026)
PASS: libc++ :: std/utilities/time/time.clock/time.clock.hires/now.pass.cpp (54693 of 55026)
PASS: libc++ :: std/utilities/time/time.clock/time.clock.steady/now.pass.cpp (54694 of 55026)
PASS: libc++ :: std/utilities/time/time.clock/time.clock.system/from_time_t.pass.cpp (54695 of 55026)
PASS: libc++ :: std/utilities/time/time.clock/time.clock.system/now.pass.cpp (54696 of 55026)
PASS: libc++ :: std/utilities/time/time.clock/time.clock.system/local_time.types.pass.cpp (54697 of 55026)
XFAIL: libc++ :: std/utilities/time/time.cal/time.cal.ymwdlast/time.cal.ymwdlast.nonmembers/streaming.pass.cpp (54698 of 55026)
PASS: libc++ :: std/utilities/time/time.duration/duration.fail.cpp (54699 of 55026)
PASS: libc++ :: std/utilities/time/time.clock/time.clock.system/rep_signed.pass.cpp (54700 of 55026)
PASS: libc++ :: std/utilities/time/time.duration/default_ratio.pass.cpp (54701 of 55026)
PASS: libc++ :: std/utilities/time/time.duration/positive_num.fail.cpp (54702 of 55026)
PASS: libc++ :: std/utilities/time/time.clock/time.clock.system/to_time_t.pass.cpp (54703 of 55026)
PASS: libc++ :: std/utilities/time/time.duration/ratio.fail.cpp (54704 of 55026)
PASS: libc++ :: std/utilities/time/time.clock/time.clock.system/sys.time.types.pass.cpp (54705 of 55026)
PASS: libc++ :: std/utilities/time/time.duration/time.duration.alg/abs.fail.cpp (54706 of 55026)
PASS: libc++ :: std/utilities/time/time.duration/time.duration.alg/abs.pass.cpp (54707 of 55026)
PASS: libc++ :: std/utilities/time/time.duration/time.duration.arithmetic/op_++.pass.cpp (54708 of 55026)
PASS: libc++ :: std/utilities/time/time.duration/time.duration.arithmetic/op_+=.pass.cpp (54709 of 55026)
PASS: libc++ :: std/utilities/time/time.duration/time.duration.arithmetic/op_++int.pass.cpp (54710 of 55026)
PASS: libc++ :: std/utilities/time/time.duration/time.duration.arithmetic/op_+.pass.cpp (54711 of 55026)
PASS: libc++ :: std/utilities/time/time.duration/time.duration.arithmetic/op_--.pass.cpp (54712 of 55026)
PASS: libc++ :: std/utilities/time/time.duration/time.duration.arithmetic/op_--int.pass.cpp (54713 of 55026)
PASS: libc++ :: std/utilities/time/time.duration/time.duration.arithmetic/op_-.pass.cpp (54714 of 55026)
PASS: libc++ :: std/utilities/time/time.duration/time.duration.cast/ceil.fail.cpp (54715 of 55026)
PASS: libc++ :: std/utilities/time/time.duration/time.duration.arithmetic/op_-=.pass.cpp (54716 of 55026)
PASS: libc++ :: std/utilities/time/time.duration/time.duration.arithmetic/op_mod=rep.pass.cpp (54717 of 55026)
PASS: libc++ :: std/utilities/time/time.duration/time.duration.arithmetic/op_divide=.pass.cpp (54718 of 55026)
PASS: libc++ :: std/utilities/time/time.duration/time.duration.arithmetic/op_mod=duration.pass.cpp (54719 of 55026)
PASS: libc++ :: std/utilities/time/time.duration/time.duration.arithmetic/op_times=.pass.cpp (54720 of 55026)
PASS: libc++ :: std/utilities/time/time.duration/time.duration.cast/ceil.pass.cpp (54721 of 55026)
PASS: libc++ :: std/utilities/time/time.duration/time.duration.cast/floor.fail.cpp (54722 of 55026)
PASS: libc++ :: std/utilities/time/time.duration/time.duration.cast/duration_cast.pass.cpp (54723 of 55026)
PASS: libc++ :: std/utilities/time/time.duration/time.duration.cast/round.fail.cpp (54724 of 55026)
PASS: libc++ :: std/utilities/time/time.duration/time.duration.cast/toduration.fail.cpp (54725 of 55026)
PASS: libc++ :: std/utilities/time/time.duration/time.duration.cast/floor.pass.cpp (54726 of 55026)
PASS: libc++ :: std/utilities/time/time.duration/time.duration.cast/round.pass.cpp (54727 of 55026)
PASS: libc++ :: std/utilities/time/time.duration/time.duration.cons/convert_float_to_int.fail.cpp (54728 of 55026)
PASS: libc++ :: std/utilities/time/time.duration/time.duration.comparisons/op_equal.pass.cpp (54729 of 55026)
PASS: libc++ :: std/utilities/time/time.duration/time.duration.cons/convert_inexact.fail.cpp (54730 of 55026)
PASS: libc++ :: std/utilities/time/time.duration/time.duration.cons/convert_exact.pass.cpp (54731 of 55026)
PASS: libc++ :: std/utilities/time/time.duration/time.duration.comparisons/op_less.pass.cpp (54732 of 55026)
PASS: libc++ :: std/utilities/time/time.duration/time.duration.cons/convert_inexact.pass.cpp (54733 of 55026)
PASS: libc++ :: std/utilities/time/time.duration/time.duration.cons/rep01.fail.cpp (54734 of 55026)
PASS: libc++ :: std/utilities/time/time.duration/time.duration.cons/rep02.fail.cpp (54735 of 55026)
PASS: libc++ :: std/utilities/time/time.duration/time.duration.cons/convert_int_to_float.pass.cpp (54736 of 55026)
PASS: libc++ :: std/utilities/time/time.duration/time.duration.cons/convert_overflow.pass.cpp (54737 of 55026)
PASS: libc++ :: std/utilities/time/time.duration/time.duration.cons/default.pass.cpp (54738 of 55026)
PASS: libc++ :: std/utilities/time/time.duration/time.duration.cons/rep.pass.cpp (54739 of 55026)
PASS: libc++ :: std/utilities/time/time.duration/time.duration.cons/rep03.fail.cpp (54740 of 55026)
PASS: libc++ :: std/utilities/time/time.duration/time.duration.cons/rep02.pass.cpp (54741 of 55026)
PASS: libc++ :: std/utilities/time/time.duration/time.duration.literals/literals1.fail.cpp (54742 of 55026)
PASS: libc++ :: std/utilities/time/time.duration/time.duration.literals/literals2.fail.cpp (54743 of 55026)
PASS: libc++ :: std/utilities/time/time.duration/time.duration.literals/literals.pass.cpp (54744 of 55026)
PASS: libc++ :: std/utilities/time/time.duration/time.duration.literals/literals1.pass.cpp (54745 of 55026)
PASS: libc++ :: std/utilities/time/time.duration/time.duration.nonmember/op_divide_rep.fail.cpp (54746 of 55026)
PASS: libc++ :: std/utilities/time/time.duration/time.duration.literals/literals2.pass.cpp (54747 of 55026)
PASS: libc++ :: std/utilities/time/time.duration/time.duration.nonmember/op_+.pass.cpp (54748 of 55026)
PASS: libc++ :: std/utilities/time/time.duration/time.duration.nonmember/op_-.pass.cpp (54749 of 55026)
PASS: libc++ :: std/utilities/time/time.duration/time.duration.nonmember/op_divide_duration.pass.cpp (54750 of 55026)
PASS: libc++ :: std/utilities/time/time.duration/time.duration.observer/tested_elsewhere.pass.cpp (54751 of 55026)
PASS: libc++ :: std/utilities/time/time.duration/time.duration.nonmember/op_mod_rep.fail.cpp (54752 of 55026)
PASS: libc++ :: std/utilities/time/time.duration/time.duration.nonmember/op_divide_rep.pass.cpp (54753 of 55026)
PASS: libc++ :: std/utilities/time/time.duration/time.duration.nonmember/op_times_rep1.fail.cpp (54754 of 55026)
PASS: libc++ :: std/utilities/time/time.duration/time.duration.nonmember/op_times_rep2.fail.cpp (54755 of 55026)
PASS: libc++ :: std/utilities/time/time.duration/time.duration.nonmember/op_mod_duration.pass.cpp (54756 of 55026)
PASS: libc++ :: std/utilities/time/time.duration/time.duration.nonmember/op_mod_rep.pass.cpp (54757 of 55026)
PASS: libc++ :: std/utilities/time/time.duration/time.duration.nonmember/op_times_rep.pass.cpp (54758 of 55026)
PASS: libc++ :: std/utilities/time/time.point/duration.fail.cpp (54759 of 55026)
PASS: libc++ :: std/utilities/time/time.point/default_duration.pass.cpp (54760 of 55026)
PASS: libc++ :: std/utilities/time/time.duration/types.pass.cpp (54761 of 55026)
PASS: libc++ :: std/utilities/time/time.duration/time.duration.special/max.pass.cpp (54762 of 55026)
PASS: libc++ :: std/utilities/time/time.duration/time.duration.special/min.pass.cpp (54763 of 55026)
PASS: libc++ :: std/utilities/time/time.duration/time.duration.special/zero.pass.cpp (54764 of 55026)
PASS: libc++ :: std/utilities/time/time.point/time.point.cast/ceil.fail.cpp (54765 of 55026)
PASS: libc++ :: std/utilities/time/time.point/time.point.arithmetic/op_+=.pass.cpp (54766 of 55026)
PASS: libc++ :: std/utilities/time/time.point/time.point.arithmetic/op_-=.pass.cpp (54767 of 55026)
PASS: libc++ :: std/utilities/time/time.point/time.point.cast/floor.fail.cpp (54768 of 55026)
PASS: libc++ :: std/utilities/time/time.point/time.point.cast/round.fail.cpp (54769 of 55026)
PASS: libc++ :: std/utilities/time/time.point/time.point.cast/toduration.fail.cpp (54770 of 55026)
PASS: libc++ :: std/utilities/time/time.point/time.point.comparisons/op_equal.fail.cpp (54771 of 55026)
PASS: libc++ :: std/utilities/time/time.point/time.point.cast/floor.pass.cpp (54772 of 55026)
PASS: libc++ :: std/utilities/time/time.point/time.point.cast/ceil.pass.cpp (54773 of 55026)
PASS: libc++ :: std/utilities/time/time.point/time.point.comparisons/op_less.fail.cpp (54774 of 55026)
PASS: libc++ :: std/utilities/time/time.point/time.point.cast/round.pass.cpp (54775 of 55026)
PASS: libc++ :: std/utilities/time/time.point/time.point.comparisons/op_equal.pass.cpp (54776 of 55026)
PASS: libc++ :: std/utilities/time/time.point/time.point.cast/time_point_cast.pass.cpp (54777 of 55026)
PASS: libc++ :: std/utilities/time/time.point/time.point.cons/convert.fail.cpp (54778 of 55026)
PASS: libc++ :: std/utilities/time/time.point/time.point.cons/duration.fail.cpp (54779 of 55026)
PASS: libc++ :: std/utilities/time/time.point/time.point.comparisons/op_less.pass.cpp (54780 of 55026)
PASS: libc++ :: std/utilities/time/time.point/time.point.cons/default.pass.cpp (54781 of 55026)
PASS: libc++ :: std/utilities/time/time.point/time.point.cons/convert.pass.cpp (54782 of 55026)
PASS: libc++ :: std/utilities/time/time.point/time.point.observer/tested_elsewhere.pass.cpp (54783 of 55026)
PASS: libc++ :: std/utilities/time/time.point/time.point.cons/duration.pass.cpp (54784 of 55026)
PASS: libc++ :: std/utilities/time/time.traits/nothing_to_do.pass.cpp (54785 of 55026)
PASS: libc++ :: std/utilities/time/time.point/time.point.nonmember/op_-duration.pass.cpp (54786 of 55026)
PASS: libc++ :: std/utilities/time/time.point/time.point.nonmember/op_-time_point.pass.cpp (54787 of 55026)
PASS: libc++ :: std/utilities/time/time.point/time.point.nonmember/op_+.pass.cpp (54788 of 55026)
PASS: libc++ :: std/utilities/time/time.point/time.point.special/max.pass.cpp (54789 of 55026)
PASS: libc++ :: std/utilities/time/time.point/time.point.special/min.pass.cpp (54790 of 55026)
PASS: libc++ :: std/utilities/time/time.traits/time.traits.duration_values/max.pass.cpp (54791 of 55026)
PASS: libc++ :: std/utilities/time/time.traits/time.traits.duration_values/min.pass.cpp (54792 of 55026)
PASS: libc++ :: std/utilities/time/time.traits/time.traits.duration_values/zero.pass.cpp (54793 of 55026)
PASS: libc++ :: std/utilities/time/time.traits/time.traits.is_fp/treat_as_floating_point.pass.cpp (54794 of 55026)
PASS: libc++ :: std/utilities/time/time.traits/time.traits.specializations/duration.pass.cpp (54795 of 55026)
PASS: libc++ :: std/utilities/time/time.traits/time.traits.specializations/time_point.pass.cpp (54796 of 55026)
PASS: libc++ :: std/utilities/time/weeks.pass.cpp (54797 of 55026)
PASS: libc++ :: std/utilities/time/years.pass.cpp (54798 of 55026)
PASS: libc++ :: std/utilities/tuple/tuple.general/ignore.pass.cpp (54799 of 55026)
PASS: libc++ :: std/utilities/tuple/tuple.general/tuple.smartptr.pass.cpp (54800 of 55026)
PASS: libc++ :: std/utilities/tuple/tuple.tuple/tuple.assign/const_pair.pass.cpp (54801 of 55026)
PASS: libc++ :: std/utilities/tuple/tuple.tuple/TupleFunction.pass.cpp (54802 of 55026)
PASS: libc++ :: std/utilities/tuple/tuple.tuple/tuple.assign/copy.fail.cpp (54803 of 55026)
PASS: libc++ :: std/utilities/tuple/tuple.tuple/tuple.assign/convert_copy.pass.cpp (54804 of 55026)
PASS: libc++ :: std/utilities/tuple/tuple.tuple/tuple.apply/make_from_tuple.pass.cpp (54805 of 55026)
PASS: libc++ :: std/utilities/tuple/tuple.tuple/tuple.apply/apply.pass.cpp (54806 of 55026)
PASS: libc++ :: std/utilities/tuple/tuple.tuple/tuple.assign/copy.pass.cpp (54807 of 55026)
PASS: libc++ :: std/utilities/tuple/tuple.tuple/tuple.assign/convert_move.pass.cpp (54808 of 55026)
PASS: libc++ :: std/utilities/tuple/tuple.tuple/tuple.assign/move.pass.cpp (54809 of 55026)
PASS: libc++ :: std/utilities/tuple/tuple.tuple/tuple.assign/move_pair.pass.cpp (54810 of 55026)
PASS: libc++ :: std/utilities/tuple/tuple.tuple/tuple.assign/tuple_array_template_depth.pass.cpp (54811 of 55026)
PASS: libc++ :: std/utilities/tuple/tuple.tuple/tuple.apply/apply_extended_types.pass.cpp (54812 of 55026)
PASS: libc++ :: std/utilities/tuple/tuple.tuple/tuple.cnstr/PR23256_constrain_UTypes_ctor.pass.cpp (54813 of 55026)
PASS: libc++ :: std/utilities/tuple/tuple.tuple/tuple.cnstr/PR27684_contains_ref_to_incomplete_type.pass.cpp (54814 of 55026)
PASS: libc++ :: std/utilities/tuple/tuple.tuple/tuple.cnstr/PR31384.pass.cpp (54815 of 55026)
PASS: libc++ :: std/utilities/tuple/tuple.tuple/tuple.cnstr/UTypes.fail.cpp (54816 of 55026)
PASS: libc++ :: std/utilities/tuple/tuple.tuple/tuple.cnstr/PR22806_constrain_tuple_like_ctor.pass.cpp (54817 of 55026)
PASS: libc++ :: std/utilities/tuple/tuple.tuple/tuple.cnstr/PR20855_tuple_ref_binding_diagnostics.pass.cpp (54818 of 55026)
PASS: libc++ :: std/utilities/tuple/tuple.tuple/tuple.cnstr/alloc.pass.cpp (54819 of 55026)
PASS: libc++ :: std/utilities/tuple/tuple.tuple/tuple.cnstr/alloc_const_Types.fail.cpp (54820 of 55026)
PASS: libc++ :: std/utilities/tuple/tuple.tuple/tuple.cnstr/UTypes.pass.cpp (54821 of 55026)
PASS: libc++ :: std/utilities/tuple/tuple.tuple/tuple.cnstr/alloc_const_pair.pass.cpp (54822 of 55026)
PASS: libc++ :: std/utilities/tuple/tuple.tuple/tuple.cnstr/alloc_convert_copy.fail.cpp (54823 of 55026)
PASS: libc++ :: std/utilities/tuple/tuple.tuple/tuple.cnstr/alloc_UTypes.pass.cpp (54824 of 55026)
PASS: libc++ :: std/utilities/tuple/tuple.tuple/tuple.cnstr/alloc_const_Types.pass.cpp (54825 of 55026)
PASS: libc++ :: std/utilities/tuple/tuple.tuple/tuple.cnstr/alloc_convert_move.fail.cpp (54826 of 55026)
PASS: libc++ :: std/utilities/tuple/tuple.tuple/tuple.cnstr/alloc_copy.pass.cpp (54827 of 55026)
PASS: libc++ :: std/utilities/tuple/tuple.tuple/tuple.apply/apply_large_arity.pass.cpp (54828 of 55026)
PASS: libc++ :: std/utilities/tuple/tuple.tuple/tuple.cnstr/alloc_convert_copy.pass.cpp (54829 of 55026)
PASS: libc++ :: std/utilities/tuple/tuple.tuple/tuple.cnstr/alloc_move_pair.pass.cpp (54830 of 55026)
PASS: libc++ :: std/utilities/tuple/tuple.tuple/tuple.cnstr/alloc_move.pass.cpp (54831 of 55026)
PASS: libc++ :: std/utilities/tuple/tuple.tuple/tuple.cnstr/const_Types.fail.cpp (54832 of 55026)
PASS: libc++ :: std/utilities/tuple/tuple.tuple/tuple.cnstr/const_pair.pass.cpp (54833 of 55026)
PASS: libc++ :: std/utilities/tuple/tuple.tuple/tuple.cnstr/alloc_convert_move.pass.cpp (54834 of 55026)
PASS: libc++ :: std/utilities/tuple/tuple.tuple/tuple.cnstr/const_Types2.fail.cpp (54835 of 55026)
PASS: libc++ :: std/utilities/tuple/tuple.tuple/tuple.cnstr/copy.fail.cpp (54836 of 55026)
PASS: libc++ :: std/utilities/tuple/tuple.tuple/tuple.cnstr/const_Types.pass.cpp (54837 of 55026)
PASS: libc++ :: std/utilities/tuple/tuple.tuple/tuple.cnstr/convert_copy.pass.cpp (54838 of 55026)
PASS: libc++ :: std/utilities/tuple/tuple.tuple/tuple.cnstr/copy.pass.cpp (54839 of 55026)
PASS: libc++ :: std/utilities/tuple/tuple.tuple/tuple.cnstr/dtor.pass.cpp (54840 of 55026)
PASS: libc++ :: std/utilities/tuple/tuple.tuple/tuple.cnstr/convert_move.pass.cpp (54841 of 55026)
PASS: libc++ :: std/utilities/tuple/tuple.tuple/tuple.cnstr/default.pass.cpp (54842 of 55026)
PASS: libc++ :: std/utilities/tuple/tuple.tuple/tuple.cnstr/move_pair.pass.cpp (54843 of 55026)
PASS: libc++ :: std/utilities/tuple/tuple.tuple/tuple.cnstr/move.pass.cpp (54844 of 55026)
PASS: libc++ :: std/utilities/tuple/tuple.tuple/tuple.cnstr/implicit_deduction_guides.pass.cpp (54845 of 55026)
PASS: libc++ :: std/utilities/tuple/tuple.tuple/tuple.cnstr/test_lazy_sfinae.pass.cpp (54846 of 55026)
PASS: libc++ :: std/utilities/tuple/tuple.tuple/tuple.creation/forward_as_tuple.pass.cpp (54847 of 55026)
PASS: libc++ :: std/utilities/tuple/tuple.tuple/tuple.cnstr/tuple_array_template_depth.pass.cpp (54848 of 55026)
PASS: libc++ :: std/utilities/tuple/tuple.tuple/tuple.elem/get_const_rv.fail.cpp (54849 of 55026)
PASS: libc++ :: std/utilities/tuple/tuple.tuple/tuple.creation/make_tuple.pass.cpp (54850 of 55026)
PASS: libc++ :: std/utilities/tuple/tuple.tuple/tuple.elem/get_const.fail.cpp (54851 of 55026)
PASS: libc++ :: std/utilities/tuple/tuple.tuple/tuple.creation/tie.pass.cpp (54852 of 55026)
PASS: libc++ :: std/utilities/tuple/tuple.tuple/tuple.elem/get_const.pass.cpp (54853 of 55026)
PASS: libc++ :: std/utilities/tuple/tuple.tuple/tuple.elem/get_rv.pass.cpp (54854 of 55026)
PASS: libc++ :: std/utilities/tuple/tuple.tuple/tuple.elem/get_const_rv.pass.cpp (54855 of 55026)
PASS: libc++ :: std/utilities/tuple/tuple.tuple/tuple.elem/tuple.by.type.fail.cpp (54856 of 55026)
PASS: libc++ :: std/utilities/tuple/tuple.tuple/tuple.helper/tuple.include.utility.pass.cpp (54857 of 55026)
PASS: libc++ :: std/utilities/tuple/tuple.tuple/tuple.elem/get_non_const.pass.cpp (54858 of 55026)
PASS: libc++ :: std/utilities/tuple/tuple.tuple/tuple.helper/tuple_element.fail.cpp (54859 of 55026)
PASS: libc++ :: std/utilities/tuple/tuple.tuple/tuple.helper/tuple_size.fail.cpp (54860 of 55026)
PASS: libc++ :: std/utilities/tuple/tuple.tuple/tuple.helper/tuple.include.array.pass.cpp (54861 of 55026)
PASS: libc++ :: std/utilities/tuple/tuple.tuple/tuple.helper/tuple_element.pass.cpp (54862 of 55026)
PASS: libc++ :: std/utilities/tuple/tuple.tuple/tuple.helper/tuple_size.pass.cpp (54863 of 55026)
PASS: libc++ :: std/utilities/tuple/tuple.tuple/tuple.helper/tuple_size_v.fail.cpp (54864 of 55026)
PASS: libc++ :: std/utilities/tuple/tuple.tuple/tuple.helper/tuple_size_incomplete.fail.cpp (54865 of 55026)
PASS: libc++ :: std/utilities/tuple/tuple.tuple/tuple.helper/tuple_size_incomplete.pass.cpp (54866 of 55026)
PASS: libc++ :: std/utilities/tuple/tuple.tuple/tuple.helper/tuple_size_value_sfinae.pass.cpp (54867 of 55026)
PASS: libc++ :: std/utilities/tuple/tuple.tuple/tuple.elem/tuple.by.type.pass.cpp (54868 of 55026)
PASS: libc++ :: std/utilities/tuple/tuple.tuple/tuple.creation/tuple_cat.pass.cpp (54869 of 55026)
PASS: libc++ :: std/utilities/tuple/tuple.tuple/tuple.helper/tuple_size_v.pass.cpp (54870 of 55026)
PASS: libc++ :: std/utilities/tuple/tuple.tuple/tuple.helper/tuple_size_structured_bindings.pass.cpp (54871 of 55026)
PASS: libc++ :: std/utilities/tuple/tuple.tuple/tuple.traits/uses_allocator.pass.cpp (54872 of 55026)
PASS: libc++ :: std/utilities/type.index/type.index.hash/hash.pass.cpp (54873 of 55026)
PASS: libc++ :: std/utilities/type.index/type.index.members/ctor.pass.cpp (54874 of 55026)
PASS: libc++ :: std/utilities/tuple/tuple.tuple/tuple.special/non_member_swap.pass.cpp (54875 of 55026)
PASS: libc++ :: std/utilities/tuple/tuple.tuple/tuple.swap/member_swap.pass.cpp (54876 of 55026)
PASS: libc++ :: std/utilities/tuple/tuple.tuple/tuple.rel/eq.pass.cpp (54877 of 55026)
PASS: libc++ :: std/utilities/tuple/tuple.tuple/tuple.rel/lt.pass.cpp (54878 of 55026)
PASS: libc++ :: std/utilities/type.index/type.index.members/eq.pass.cpp (54879 of 55026)
PASS: libc++ :: std/utilities/type.index/type.index.members/hash_code.pass.cpp (54880 of 55026)
PASS: libc++ :: std/utilities/type.index/type.index.members/lt.pass.cpp (54881 of 55026)
PASS: libc++ :: std/utilities/utilities.general/nothing_to_do.pass.cpp (54882 of 55026)
PASS: libc++ :: std/utilities/type.index/type.index.overview/copy_assign.pass.cpp (54883 of 55026)
PASS: libc++ :: std/utilities/utility.requirements/hash.requirements/nothing_to_do.pass.cpp (54884 of 55026)
PASS: libc++ :: std/utilities/utility.requirements/allocator.requirements/nothing_to_do.pass.cpp (54885 of 55026)
PASS: libc++ :: std/utilities/type.index/type.index.overview/copy_ctor.pass.cpp (54886 of 55026)
PASS: libc++ :: std/utilities/utility.requirements/nothing_to_do.pass.cpp (54887 of 55026)
PASS: libc++ :: std/utilities/utility.requirements/nullablepointer.requirements/nothing_to_do.pass.cpp (54888 of 55026)
PASS: libc++ :: std/utilities/utility.requirements/swappable.requirements/nothing_to_do.pass.cpp (54889 of 55026)
PASS: libc++ :: std/utilities/type.index/type.index.synopsis/hash_type_index.pass.cpp (54890 of 55026)
PASS: libc++ :: std/utilities/utility.requirements/utility.arg.requirements/nothing_to_do.pass.cpp (54891 of 55026)
PASS: libc++ :: std/utilities/utility/as_const/as_const.fail.cpp (54892 of 55026)
PASS: libc++ :: std/utilities/type.index/type.index.members/name.pass.cpp (54893 of 55026)
PASS: libc++ :: std/utilities/utility/forward/forward.fail.cpp (54894 of 55026)
PASS: libc++ :: std/utilities/type.index/type.index.hash/enabled_hash.pass.cpp (54895 of 55026)
PASS: libc++ :: std/utilities/utility/declval/declval.pass.cpp (54896 of 55026)
PASS: libc++ :: std/utilities/utility/as_const/as_const.pass.cpp (54897 of 55026)
PASS: libc++ :: std/utilities/utility/forward/forward.pass.cpp (54898 of 55026)
PASS: libc++ :: std/utilities/utility/forward/move.fail.cpp (54899 of 55026)
PASS: libc++ :: std/utilities/utility/pairs/nothing_to_do.pass.cpp (54900 of 55026)
PASS: libc++ :: std/utilities/utility/forward/move_if_noexcept.pass.cpp (54901 of 55026)
PASS: libc++ :: std/utilities/utility/forward/move.pass.cpp (54902 of 55026)
PASS: libc++ :: std/utilities/utility/operators/rel_ops.pass.cpp (54903 of 55026)
PASS: libc++ :: std/utilities/utility/pairs/pair.astuple/get_const.fail.cpp (54904 of 55026)
PASS: libc++ :: std/utilities/utility/pairs/pair.astuple/get_const.pass.cpp (54905 of 55026)
PASS: libc++ :: std/utilities/utility/pairs/pair.astuple/get_non_const.pass.cpp (54906 of 55026)
PASS: libc++ :: std/utilities/utility/exchange/exchange.pass.cpp (54907 of 55026)
PASS: libc++ :: std/utilities/utility/pairs/pair.astuple/get_const_rv.pass.cpp (54908 of 55026)
PASS: libc++ :: std/utilities/utility/pairs/pair.astuple/tuple_element.fail.cpp (54909 of 55026)
PASS: libc++ :: std/utilities/utility/pairs/pair.astuple/get_rv.pass.cpp (54910 of 55026)
PASS: libc++ :: std/utilities/utility/pairs/pair.astuple/tuple_element.pass.cpp (54911 of 55026)
PASS: libc++ :: std/utilities/utility/pairs/pairs.general/nothing_to_do.pass.cpp (54912 of 55026)
PASS: libc++ :: std/utilities/utility/pairs/pair.astuple/tuple_size.pass.cpp (54913 of 55026)
PASS: libc++ :: std/utilities/utility/pairs/pair.piecewise/piecewise_construct.pass.cpp (54914 of 55026)
UNSUPPORTED: libc++ :: std/utilities/utility/pairs/pairs.pair/assign_pair_cxx03.pass.cpp (54915 of 55026)
PASS: libc++ :: std/utilities/utility/pairs/pairs.pair/assign_const_pair_U_V.pass.cpp (54916 of 55026)
PASS: libc++ :: std/utilities/utility/pairs/pair.astuple/pairs.by.type1.fail.cpp (54917 of 55026)
PASS: libc++ :: std/utilities/utility/pairs/pair.astuple/pairs.by.type2.fail.cpp (54918 of 55026)
PASS: libc++ :: std/utilities/utility/pairs/pairs.pair/assign_pair.pass.cpp (54919 of 55026)
PASS: libc++ :: std/utilities/utility/pairs/pair.astuple/pairs.by.type3.fail.cpp (54920 of 55026)
PASS: libc++ :: std/utilities/utility/pairs/pair.astuple/pairs.by.type.pass.cpp (54921 of 55026)
PASS: libc++ :: std/utilities/utility/pairs/pairs.pair/U_V.pass.cpp (54922 of 55026)
PASS: libc++ :: std/utilities/utility/pairs/pairs.pair/const_first_const_second_cxx03.pass.cpp (54923 of 55026)
PASS: libc++ :: std/utilities/utility/pairs/pairs.pair/assign_rv_pair.pass.cpp (54924 of 55026)
PASS: libc++ :: std/utilities/utility/pairs/pairs.pair/const_first_const_second.pass.cpp (54925 of 55026)
PASS: libc++ :: std/utilities/utility/pairs/pairs.pair/const_pair_U_V_cxx03.pass.cpp (54926 of 55026)
PASS: libc++ :: std/utilities/utility/pairs/pairs.pair/copy_ctor.pass.cpp (54927 of 55026)
UNSUPPORTED: libc++ :: std/utilities/utility/pairs/pairs.pair/not_constexpr_cxx11.fail.cpp (54928 of 55026)
PASS: libc++ :: std/utilities/utility/pairs/pairs.pair/assign_rv_pair_U_V.pass.cpp (54929 of 55026)
PASS: libc++ :: std/utilities/utility/pairs/pairs.pair/default-sfinae.pass.cpp (54930 of 55026)
PASS: libc++ :: std/utilities/utility/pairs/pairs.pair/default.pass.cpp (54931 of 55026)
PASS: libc++ :: std/utilities/utility/pairs/pairs.pair/piecewise.pass.cpp (54932 of 55026)
PASS: libc++ :: std/utilities/utility/pairs/pairs.pair/move_ctor.pass.cpp (54933 of 55026)
PASS: libc++ :: std/utilities/utility/pairs/pairs.pair/swap.pass.cpp (54934 of 55026)
PASS: libc++ :: std/utilities/utility/pairs/pairs.pair/dtor.pass.cpp (54935 of 55026)
PASS: libc++ :: std/utilities/utility/pairs/pairs.pair/const_pair_U_V.pass.cpp (54936 of 55026)
PASS: libc++ :: std/utilities/utility/pairs/pairs.pair/types.pass.cpp (54937 of 55026)
PASS: libc++ :: std/utilities/utility/pairs/pairs.pair/trivial_copy_move.pass.cpp (54938 of 55026)
PASS: libc++ :: std/utilities/utility/pairs/pairs.pair/implicit_deduction_guides.pass.cpp (54939 of 55026)
PASS: libc++ :: std/utilities/utility/pairs/pairs.spec/comparison.pass.cpp (54940 of 55026)
PASS: libc++ :: std/utilities/utility/synopsis.pass.cpp (54941 of 55026)
PASS: libc++ :: std/utilities/utility/pairs/pairs.spec/non_member_swap.pass.cpp (54942 of 55026)
PASS: libc++ :: std/utilities/utility/pairs/pairs.spec/make_pair.pass.cpp (54943 of 55026)
PASS: libc++ :: std/utilities/variant/variant.general/nothing_to_do.pass.cpp (54944 of 55026)
PASS: libc++ :: std/utilities/utility/pairs/pairs.pair/special_member_generation_test.pass.cpp (54945 of 55026)
PASS: libc++ :: std/utilities/utility/utility.swap/swap.pass.cpp (54946 of 55026)
PASS: libc++ :: std/utilities/utility/pairs/pairs.pair/rv_pair_U_V.pass.cpp (54947 of 55026)
PASS: libc++ :: std/utilities/utility/utility.swap/swap_array.pass.cpp (54948 of 55026)
PASS: libc++ :: std/utilities/utility/utility.inplace/inplace.pass.cpp (54949 of 55026)
PASS: libc++ :: std/utilities/variant/variant.bad_variant_access/bad_variant_access.pass.cpp (54950 of 55026)
PASS: libc++ :: std/utilities/variant/variant.get/get_if_index.pass.cpp (54951 of 55026)
PASS: libc++ :: std/utilities/variant/variant.get/get_if_type.pass.cpp (54952 of 55026)
PASS: libc++ :: std/utilities/variant/variant.get/get_index.pass.cpp (54953 of 55026)
PASS: libc++ :: std/utilities/variant/variant.get/holds_alternative.pass.cpp (54954 of 55026)
PASS: libc++ :: std/utilities/variant/variant.get/get_type.pass.cpp (54955 of 55026)
PASS: libc++ :: std/utilities/variant/variant.helpers/variant_alternative.fail.cpp (54956 of 55026)
PASS: libc++ :: std/utilities/variant/variant.helpers/variant_alternative.pass.cpp (54957 of 55026)
PASS: libc++ :: std/utilities/variant/variant.helpers/variant_size.pass.cpp (54958 of 55026)
PASS: libc++ :: std/utilities/variant/variant.monostate.relops/relops.pass.cpp (54959 of 55026)
PASS: libc++ :: std/utilities/variant/variant.monostate/monostate.pass.cpp (54960 of 55026)
PASS: libc++ :: std/utilities/variant/variant.relops/relops_bool_conv.fail.cpp (54961 of 55026)
PASS: libc++ :: std/utilities/variant/variant.hash/enabled_hash.pass.cpp (54962 of 55026)
PASS: libc++ :: std/utilities/variant/variant.hash/hash.pass.cpp (54963 of 55026)
PASS: libc++ :: std/utilities/variant/variant.synopsis/variant_npos.pass.cpp (54964 of 55026)
PASS: libc++ :: std/utilities/variant/variant.variant/variant.assign/copy.fail.cpp (54965 of 55026)
PASS: libc++ :: std/utilities/variant/variant.relops/relops.pass.cpp (54966 of 55026)
PASS: libc++ :: std/utilities/variant/variant.variant/variant.assign/conv.fail.cpp (54967 of 55026)
PASS: libc++ :: std/utilities/variant/variant.variant/variant.ctor/conv.fail.cpp (54968 of 55026)
PASS: libc++ :: std/utilities/variant/variant.variant/variant.ctor/default.pass.cpp (54969 of 55026)
PASS: libc++ :: std/utilities/variant/variant.variant/variant.assign/T.pass.cpp (54970 of 55026)
PASS: libc++ :: std/utilities/variant/variant.variant/variant.ctor/T.pass.cpp (54971 of 55026)
PASS: libc++ :: std/utilities/variant/variant.variant/variant.ctor/copy.pass.cpp (54972 of 55026)
PASS: libc++ :: std/utilities/variant/variant.variant/variant.assign/move.pass.cpp (54973 of 55026)
PASS: libc++ :: std/utilities/variant/variant.variant/variant.ctor/in_place_index_args.pass.cpp (54974 of 55026)
PASS: libc++ :: std/utilities/variant/variant.variant/variant.ctor/in_place_index_init_list_args.pass.cpp (54975 of 55026)
PASS: libc++ :: std/utilities/variant/variant.variant/variant.ctor/in_place_type_args.pass.cpp (54976 of 55026)
PASS: libc++ :: std/utilities/variant/variant.variant/variant.assign/copy.pass.cpp (54977 of 55026)
PASS: libc++ :: std/utilities/variant/variant.variant/variant.ctor/in_place_type_init_list_args.pass.cpp (54978 of 55026)
PASS: libc++ :: std/utilities/variant/variant.variant/variant.dtor/dtor.pass.cpp (54979 of 55026)
PASS: libc++ :: std/utilities/variant/variant.variant/variant.ctor/move.pass.cpp (54980 of 55026)
PASS: libc++ :: std/utilities/variant/variant.variant/variant.mod/emplace_index_init_list_args.pass.cpp (54981 of 55026)
PASS: libc++ :: std/utilities/variant/variant.variant/variant.mod/emplace_index_args.pass.cpp (54982 of 55026)
PASS: libc++ :: std/utilities/variant/variant.variant/variant.mod/emplace_type_init_list_args.pass.cpp (54983 of 55026)
PASS: libc++ :: std/utilities/variant/variant.variant/variant.mod/emplace_type_args.pass.cpp (54984 of 55026)
PASS: libc++ :: std/utilities/variant/variant.variant/variant.status/index.pass.cpp (54985 of 55026)
PASS: libc++ :: std/utilities/variant/variant.variant/variant_empty.fail.cpp (54986 of 55026)
PASS: libc++ :: std/utilities/variant/variant.variant/variant.status/valueless_by_exception.pass.cpp (54987 of 55026)
PASS: libc++ :: support/nothing_to_do.pass.cpp (54988 of 55026)
PASS: libc++ :: std/utilities/variant/variant.variant/variant_reference.fail.cpp (54989 of 55026)
PASS: libc++ :: support/test.support/test_macros_header_exceptions.fail.cpp (54990 of 55026)
PASS: libc++ :: std/utilities/variant/variant.variant/variant_array.fail.cpp (54991 of 55026)
PASS: libc++ :: support/test.support/test_macros_header_rtti.fail.cpp (54992 of 55026)
PASS: libc++ :: support/test.support/test_convertible_header.pass.cpp (54993 of 55026)
PASS: libc++ :: support/test.support/test_macros_header_exceptions.pass.cpp (54994 of 55026)
PASS: libc++ :: support/test.support/test_macros_header_rtti.pass.cpp (54995 of 55026)
PASS: libc++ :: support/test.workarounds/c1xx_broken_is_trivially_copyable.pass.cpp (54996 of 55026)
PASS: libc++ :: support/test.workarounds/c1xx_broken_za_ctor_check.pass.cpp (54997 of 55026)
PASS: libc++ :: support/test.support/test_poisoned_hash_helper.pass.cpp (54998 of 55026)
PASS: libc++ :: std/utilities/variant/variant.variant/variant_void.fail.cpp (54999 of 55026)
PASS: libc++ :: support/test.support/test_demangle.pass.cpp (55000 of 55026)
PASS: lit :: boolean-parsing.py (55001 of 55026)
PASS: lit :: googletest-upstream-format.py (55002 of 55026)
PASS: lit :: parallelism-groups.py (55003 of 55026)
PASS: lit :: googletest-format.py (55004 of 55026)
PASS: libc++ :: std/utilities/variant/variant.variant/variant.swap/swap.pass.cpp (55005 of 55026)
PASS: lit :: shtest-encoding.py (55006 of 55026)
PASS: lit :: shell-parsing.py (55007 of 55026)
PASS: libc++ :: std/utilities/variant/variant.visit/visit.pass.cpp (55008 of 55026)
PASS: lit :: progress-bar.py (55009 of 55026)
PASS: lit :: shtest-output-printing.py (55010 of 55026)
PASS: lit :: shtest-run-at-line.py (55011 of 55026)
PASS: lit :: shtest-format.py (55012 of 55026)
PASS: lit :: test-data-micro.py (55013 of 55026)
PASS: lit :: test-data.py (55014 of 55026)
PASS: lit :: test-output-micro.py (55015 of 55026)
PASS: lit :: test-output.py (55016 of 55026)
PASS: lit :: unit/ShUtil.py (55017 of 55026)
PASS: lit :: unit/TestRunner.py (55018 of 55026)
PASS: lit :: discovery.py (55019 of 55026)
PASS: lit :: usage.py (55020 of 55026)
PASS: lit :: xunit-output.py (55021 of 55026)
PASS: lit :: max-failures.py (55022 of 55026)
PASS: lit :: shtest-shell.py (55023 of 55026)
PASS: lit :: selecting.py (55024 of 55026)
PASS: lit :: googletest-timeout.py (55025 of 55026)
PASS: lit :: shtest-timeout.py (55026 of 55026)
Testing Time: 3644.96s
  Expected Passes    : 53954
  Expected Failures  : 212
  Unsupported Tests  : 860
Completed at: 2019-07-08T08:33:34
@@@@@@
+ echo '@@@ IOSSIM @@@'
IOSSIM

Hide Details

@@@ IOSSIM @@@ + cd clang-build + export 'SANITIZER_IOSSIM_TEST_DEVICE_IDENTIFIER=iPhone 6' + SANITIZER_IOSSIM_TEST_DEVICE_IDENTIFIER='iPhone 6' + ./bin/llvm-lit -v --xunit-xml-output=asan-IOSSimX86_64Config.xunit.xml ./tools/clang/runtime/compiler-rt-bins/test/asan/IOSSimX86_64Config/ llvm-lit: /Users/buildslave/jenkins/workspace/clang-stage1-cmake-RA-expensive/llvm/utils/lit/lit/util.py:408: note: using SDKROOT: '/Applications/Xcode.app/Contents/Developer/Platforms/MacOSX.platform/Developer/SDKs/MacOSX10.13.sdk' llvm-lit: /Users/buildslave/jenkins/workspace/clang-stage1-cmake-RA-expensive/llvm/projects/compiler-rt/test/lit.common.cfg.py:427: warning: Throttling sanitizer tests that require shadow memory on Darwin 64bit {"env": {}} -- Testing: 459 tests, 8 threads -- UNSUPPORTED: AddressSanitizer-x86_64-iossim :: TestCases/Darwin/address-range-limit.mm (1 of 459) UNSUPPORTED: AddressSanitizer-x86_64-iossim :: TestCases/Darwin/abort_on_error.cc (2 of 459) UNSUPPORTED: AddressSanitizer-x86_64-iossim :: TestCases/Darwin/asan-symbolize-partial-report-no-external-symbolizer.cc (3 of 459) UNSUPPORTED: AddressSanitizer-x86_64-iossim :: TestCases/Darwin/asan-symbolize-with-module-map.cc (4 of 459) UNSUPPORTED: AddressSanitizer-x86_64-iossim :: TestCases/Darwin/asan-symbolize-partial-report-with-module-map.cc (5 of 459) UNSUPPORTED: AddressSanitizer-x86_64-iossim :: TestCases/Darwin/asan_gen_prefixes.cc (6 of 459) UNSUPPORTED: AddressSanitizer-x86_64-iossim :: TestCases/Darwin/atos-symbolizer-dyld-root-path.cc (7 of 459) UNSUPPORTED: AddressSanitizer-x86_64-iossim :: TestCases/Darwin/atos-symbolizer.cc (8 of 459) PASS: AddressSanitizer-x86_64-iossim :: TestCases/Darwin/cstring_section.c (9 of 459) UNSUPPORTED: AddressSanitizer-x86_64-iossim :: TestCases/Darwin/dead-strip.c (10 of 459) UNSUPPORTED: AddressSanitizer-x86_64-iossim :: TestCases/Darwin/dladdr-demangling.cc (11 of 459) PASS: AddressSanitizer-x86_64-iossim :: TestCases/Darwin/cstring_literals_regtest.mm (12 of 459) UNSUPPORTED: AddressSanitizer-x86_64-iossim :: TestCases/Darwin/dyld_insert_libraries_reexec.cc (13 of 459) UNSUPPORTED: AddressSanitizer-x86_64-iossim :: TestCases/Darwin/dyld_insert_libraries_remove.cc (14 of 459) PASS: AddressSanitizer-x86_64-iossim :: TestCases/Darwin/dump_registers.cc (15 of 459) PASS: AddressSanitizer-x86_64-iossim :: TestCases/Darwin/fclose.c (16 of 459) PASS: AddressSanitizer-x86_64-iossim :: TestCases/Darwin/empty-section.cc (17 of 459) UNSUPPORTED: AddressSanitizer-x86_64-iossim :: TestCases/Darwin/haswell-symbolication.cc (18 of 459) PASS: AddressSanitizer-x86_64-iossim :: TestCases/Darwin/crashlog-stacktraces.c (19 of 459) UNSUPPORTED: AddressSanitizer-x86_64-iossim :: TestCases/Darwin/interface_symbols_darwin.cc (20 of 459) PASS: AddressSanitizer-x86_64-iossim :: TestCases/Darwin/getpwnam.c (21 of 459) PASS: AddressSanitizer-x86_64-iossim :: TestCases/Darwin/init_for_dlopen.cc (22 of 459) PASS: AddressSanitizer-x86_64-iossim :: TestCases/Darwin/linked-only.cc (23 of 459) PASS: AddressSanitizer-x86_64-iossim :: TestCases/Darwin/malloc_destroy_zone.cc (24 of 459) PASS: AddressSanitizer-x86_64-iossim :: TestCases/Darwin/malloc_set_zone_name-mprotect.cc (25 of 459) PASS: AddressSanitizer-x86_64-iossim :: TestCases/Darwin/malloc_zone-protected.cc (26 of 459) PASS: AddressSanitizer-x86_64-iossim :: TestCases/Darwin/mixing-global-constructors.cc (27 of 459) PASS: AddressSanitizer-x86_64-iossim :: TestCases/Darwin/malloc_size_crash.mm (28 of 459) PASS: AddressSanitizer-x86_64-iossim :: TestCases/Darwin/nil-return-struct.mm (29 of 459) UNSUPPORTED: AddressSanitizer-x86_64-iossim :: TestCases/Darwin/reexec-insert-libraries-env.cc (30 of 459) UNSUPPORTED: AddressSanitizer-x86_64-iossim :: TestCases/Darwin/sandbox-symbolizer.cc (31 of 459) PASS: AddressSanitizer-x86_64-iossim :: TestCases/Darwin/objc-odr.mm (32 of 459) PASS: AddressSanitizer-x86_64-iossim :: TestCases/Darwin/odr-lto.cc (33 of 459) PASS: AddressSanitizer-x86_64-iossim :: TestCases/Darwin/scribble.cc (34 of 459) UNSUPPORTED: AddressSanitizer-x86_64-iossim :: TestCases/Darwin/suppressions-function.cc (35 of 459) UNSUPPORTED: AddressSanitizer-x86_64-iossim :: TestCases/Darwin/suppressions-sandbox.cc (36 of 459) UNSUPPORTED: AddressSanitizer-x86_64-iossim :: TestCases/Darwin/unset-insert-libraries-on-exec.cc (37 of 459) UNSUPPORTED: AddressSanitizer-x86_64-iossim :: TestCases/Darwin/uuid.cc (38 of 459) UNSUPPORTED: AddressSanitizer-x86_64-iossim :: TestCases/Linux/abort_on_error.cc (39 of 459) UNSUPPORTED: AddressSanitizer-x86_64-iossim :: TestCases/Linux/activation-options.cc (40 of 459) UNSUPPORTED: AddressSanitizer-x86_64-iossim :: TestCases/Linux/aligned_delete_test.cc (41 of 459) UNSUPPORTED: AddressSanitizer-x86_64-iossim :: TestCases/Linux/allocator_oom_test.cc (42 of 459) UNSUPPORTED: AddressSanitizer-x86_64-iossim :: TestCases/Linux/asan_default_suppressions.cc (43 of 459) UNSUPPORTED: AddressSanitizer-x86_64-iossim :: TestCases/Linux/asan_dlopen_test.cc (44 of 459) UNSUPPORTED: AddressSanitizer-x86_64-iossim :: TestCases/Linux/asan_prelink_test.cc (45 of 459) UNSUPPORTED: AddressSanitizer-x86_64-iossim :: TestCases/Linux/asan_preload_test-1.cc (46 of 459) UNSUPPORTED: AddressSanitizer-x86_64-iossim :: TestCases/Linux/asan_preload_test-2.cc (47 of 459) UNSUPPORTED: AddressSanitizer-x86_64-iossim :: TestCases/Linux/asan_preload_test-3.cc (48 of 459) UNSUPPORTED: AddressSanitizer-x86_64-iossim :: TestCases/Linux/asan_rt_confict_test-1.cc (49 of 459) UNSUPPORTED: AddressSanitizer-x86_64-iossim :: TestCases/Linux/asan_rt_confict_test-2.cc (50 of 459) UNSUPPORTED: AddressSanitizer-x86_64-iossim :: TestCases/Linux/auto_memory_profile_test.cc (51 of 459) UNSUPPORTED: AddressSanitizer-x86_64-iossim :: TestCases/Linux/bzero.cc (52 of 459) UNSUPPORTED: AddressSanitizer-x86_64-iossim :: TestCases/Linux/calloc-preload.c (53 of 459) UNSUPPORTED: AddressSanitizer-x86_64-iossim :: TestCases/Linux/clang_gcc_abi.cc (54 of 459) UNSUPPORTED: AddressSanitizer-x86_64-iossim :: TestCases/Linux/clone_test.cc (55 of 459) UNSUPPORTED: AddressSanitizer-x86_64-iossim :: TestCases/Linux/coverage-missing.cc (56 of 459) UNSUPPORTED: AddressSanitizer-x86_64-iossim :: TestCases/Linux/cuda_test.cc (57 of 459) UNSUPPORTED: AddressSanitizer-x86_64-iossim :: TestCases/Linux/function-sections-are-bad.cc (58 of 459) UNSUPPORTED: AddressSanitizer-x86_64-iossim :: TestCases/Linux/global-overflow-bfd.cc (59 of 459) UNSUPPORTED: AddressSanitizer-x86_64-iossim :: TestCases/Linux/global-overflow-lld.cc (60 of 459) UNSUPPORTED: AddressSanitizer-x86_64-iossim :: TestCases/Linux/globals-gc-sections-lld.cc (61 of 459) UNSUPPORTED: AddressSanitizer-x86_64-iossim :: TestCases/Linux/init-order-dlopen.cc (62 of 459) UNSUPPORTED: AddressSanitizer-x86_64-iossim :: TestCases/Linux/init_fini_sections.cc (63 of 459) UNSUPPORTED: AddressSanitizer-x86_64-iossim :: TestCases/Linux/initialization-bug-any-order.cc (64 of 459) UNSUPPORTED: AddressSanitizer-x86_64-iossim :: TestCases/Linux/interception_malloc_test.cc (65 of 459) UNSUPPORTED: AddressSanitizer-x86_64-iossim :: TestCases/Linux/interception_readdir_r_test.cc (66 of 459) UNSUPPORTED: AddressSanitizer-x86_64-iossim :: TestCases/Linux/interception_test.cc (67 of 459) UNSUPPORTED: AddressSanitizer-x86_64-iossim :: TestCases/Linux/interface_symbols_linux.cc (68 of 459) UNSUPPORTED: AddressSanitizer-x86_64-iossim :: TestCases/Linux/kernel-area.cc (69 of 459) UNSUPPORTED: AddressSanitizer-x86_64-iossim :: TestCases/Linux/leak.cc (70 of 459) UNSUPPORTED: AddressSanitizer-x86_64-iossim :: TestCases/Linux/leak_check_segv.cc (71 of 459) UNSUPPORTED: AddressSanitizer-x86_64-iossim :: TestCases/Linux/local_alias.cc (72 of 459) UNSUPPORTED: AddressSanitizer-x86_64-iossim :: TestCases/Linux/long-object-path.cc (73 of 459) UNSUPPORTED: AddressSanitizer-x86_64-iossim :: TestCases/Linux/longjmp_chk.c (74 of 459) UNSUPPORTED: AddressSanitizer-x86_64-iossim :: TestCases/Linux/malloc-in-qsort.cc (75 of 459) UNSUPPORTED: AddressSanitizer-x86_64-iossim :: TestCases/Linux/malloc_delete_mismatch.cc (76 of 459) UNSUPPORTED: AddressSanitizer-x86_64-iossim :: TestCases/Linux/memmem_test.cc (77 of 459) UNSUPPORTED: AddressSanitizer-x86_64-iossim :: TestCases/Linux/mincore.cc (78 of 459) UNSUPPORTED: AddressSanitizer-x86_64-iossim :: TestCases/Linux/new_delete_mismatch.cc (79 of 459) UNSUPPORTED: AddressSanitizer-x86_64-iossim :: TestCases/Linux/new_delete_mismatch_global.cc (80 of 459) UNSUPPORTED: AddressSanitizer-x86_64-iossim :: TestCases/Linux/new_delete_mismatch_stack.cc (81 of 459) UNSUPPORTED: AddressSanitizer-x86_64-iossim :: TestCases/Linux/nohugepage_test.cc (82 of 459) UNSUPPORTED: AddressSanitizer-x86_64-iossim :: TestCases/Linux/odr-violation.cc (83 of 459) UNSUPPORTED: AddressSanitizer-x86_64-iossim :: TestCases/Linux/odr-vtable.cc (84 of 459) UNSUPPORTED: AddressSanitizer-x86_64-iossim :: TestCases/Linux/odr_c_test.c (85 of 459) UNSUPPORTED: AddressSanitizer-x86_64-iossim :: TestCases/Linux/odr_indicators.cc (86 of 459) UNSUPPORTED: AddressSanitizer-x86_64-iossim :: TestCases/Linux/overflow-in-qsort.cc (87 of 459) UNSUPPORTED: AddressSanitizer-x86_64-iossim :: TestCases/Linux/preinit_test.cc (88 of 459) UNSUPPORTED: AddressSanitizer-x86_64-iossim :: TestCases/Linux/preinstalled_signal.cc (89 of 459) UNSUPPORTED: AddressSanitizer-x86_64-iossim :: TestCases/Linux/print_memory_profile_test.cc (90 of 459) UNSUPPORTED: AddressSanitizer-x86_64-iossim :: TestCases/Linux/printf-fortify-1.c (91 of 459) UNSUPPORTED: AddressSanitizer-x86_64-iossim :: TestCases/Linux/printf-fortify-2.c (92 of 459) UNSUPPORTED: AddressSanitizer-x86_64-iossim :: TestCases/Linux/printf-fortify-3.c (93 of 459) UNSUPPORTED: AddressSanitizer-x86_64-iossim :: TestCases/Linux/printf-fortify-4.c (94 of 459) UNSUPPORTED: AddressSanitizer-x86_64-iossim :: TestCases/Linux/printf-fortify-5.c (95 of 459) UNSUPPORTED: AddressSanitizer-x86_64-iossim :: TestCases/Linux/pthread_create_from_constructor.cc (96 of 459) UNSUPPORTED: AddressSanitizer-x86_64-iossim :: TestCases/Linux/pthread_create_version.cc (97 of 459) UNSUPPORTED: AddressSanitizer-x86_64-iossim :: TestCases/Linux/ptrace.cc (98 of 459) UNSUPPORTED: AddressSanitizer-x86_64-iossim :: TestCases/Linux/quarantine_size_mb.cc (99 of 459) UNSUPPORTED: AddressSanitizer-x86_64-iossim :: TestCases/Linux/read_binary_name_regtest.c (100 of 459) UNSUPPORTED: AddressSanitizer-x86_64-iossim :: TestCases/Linux/recoverable-lsan.cc (101 of 459) UNSUPPORTED: AddressSanitizer-x86_64-iossim :: TestCases/Linux/recvfrom.cc (102 of 459) UNSUPPORTED: AddressSanitizer-x86_64-iossim :: TestCases/Linux/release_to_os_test.cc (103 of 459) UNSUPPORTED: AddressSanitizer-x86_64-iossim :: TestCases/Linux/rlimit_mmap_test.cc (104 of 459) UNSUPPORTED: AddressSanitizer-x86_64-iossim :: TestCases/Linux/sanbox_read_proc_self_maps_test.cc (105 of 459) UNSUPPORTED: AddressSanitizer-x86_64-iossim :: TestCases/Linux/segv_read_write.c (106 of 459) UNSUPPORTED: AddressSanitizer-x86_64-iossim :: TestCases/Linux/shmctl.cc (107 of 459) UNSUPPORTED: AddressSanitizer-x86_64-iossim :: TestCases/Linux/signal_during_stop_the_world.cc (108 of 459) UNSUPPORTED: AddressSanitizer-x86_64-iossim :: TestCases/Linux/sized_delete_test.cc (109 of 459) UNSUPPORTED: AddressSanitizer-x86_64-iossim :: TestCases/Linux/stack-overflow-recovery-mode.cc (110 of 459) UNSUPPORTED: AddressSanitizer-x86_64-iossim :: TestCases/Linux/stack-overflow-sigbus.cc (111 of 459) UNSUPPORTED: AddressSanitizer-x86_64-iossim :: TestCases/Linux/stack-trace-dlclose.cc (112 of 459) UNSUPPORTED: AddressSanitizer-x86_64-iossim :: TestCases/Linux/static_tls.cc (113 of 459) UNSUPPORTED: AddressSanitizer-x86_64-iossim :: TestCases/Linux/stress_dtls.c (114 of 459) UNSUPPORTED: AddressSanitizer-x86_64-iossim :: TestCases/Linux/swapcontext_annotation.cc (115 of 459) UNSUPPORTED: AddressSanitizer-x86_64-iossim :: TestCases/Linux/swapcontext_test.cc (116 of 459) UNSUPPORTED: AddressSanitizer-x86_64-iossim :: TestCases/Linux/syscalls.cc (117 of 459) UNSUPPORTED: AddressSanitizer-x86_64-iossim :: TestCases/Linux/textdomain.c (118 of 459) UNSUPPORTED: AddressSanitizer-x86_64-iossim :: TestCases/Linux/thread_local_quarantine_pthread_join.cc (119 of 459) UNSUPPORTED: AddressSanitizer-x86_64-iossim :: TestCases/Linux/thread_local_quarantine_size_kb.cc (120 of 459) UNSUPPORTED: AddressSanitizer-x86_64-iossim :: TestCases/Linux/uar_signals.cc (121 of 459) UNSUPPORTED: AddressSanitizer-x86_64-iossim :: TestCases/Linux/unpoison_tls.cc (122 of 459) UNSUPPORTED: AddressSanitizer-x86_64-iossim :: TestCases/Linux/vfork.cc (123 of 459) UNSUPPORTED: AddressSanitizer-x86_64-iossim :: TestCases/Posix/asan-sigbus.cpp (124 of 459) PASS: AddressSanitizer-x86_64-iossim :: TestCases/Posix/asan-symbolize-bad-path.cc (125 of 459) UNSUPPORTED: AddressSanitizer-x86_64-iossim :: TestCases/Posix/asan-symbolize-sanity-test.cc (126 of 459) PASS: AddressSanitizer-x86_64-iossim :: TestCases/Posix/asan_symbolize_script/logging_options_in_help.cc (127 of 459) PASS: AddressSanitizer-x86_64-iossim :: TestCases/Darwin/segv_read_write.c (128 of 459) UNSUPPORTED: AddressSanitizer-x86_64-iossim :: TestCases/Posix/asan_symbolize_script/plugin_no_op_symbolicate.cc (129 of 459) PASS: AddressSanitizer-x86_64-iossim :: TestCases/Posix/asan_symbolize_script/plugin_no_op_help_output.cc (130 of 459) PASS: AddressSanitizer-x86_64-iossim :: TestCases/Posix/asan_symbolize_script/set_log_dest.cc (131 of 459) PASS: AddressSanitizer-x86_64-iossim :: TestCases/Posix/asan_symbolize_script/set_log_level.cc (132 of 459) PASS: AddressSanitizer-x86_64-iossim :: TestCases/Posix/assign_large_valloc_to_global.cc (133 of 459) UNSUPPORTED: AddressSanitizer-x86_64-iossim :: TestCases/Posix/bcmp_test.cc (134 of 459) UNSUPPORTED: AddressSanitizer-x86_64-iossim :: TestCases/Posix/closed-fds.cc (135 of 459) PASS: AddressSanitizer-x86_64-iossim :: TestCases/Posix/asprintf.cc (136 of 459) PASS: AddressSanitizer-x86_64-iossim :: TestCases/Posix/concurrent_overflow.cc (137 of 459) UNSUPPORTED: AddressSanitizer-x86_64-iossim :: TestCases/Posix/coverage-module-unloaded.cc (138 of 459) UNSUPPORTED: AddressSanitizer-x86_64-iossim :: TestCases/Posix/coverage-reset.cc (139 of 459) UNSUPPORTED: AddressSanitizer-x86_64-iossim :: TestCases/Posix/coverage.cc (140 of 459) PASS: AddressSanitizer-x86_64-iossim :: TestCases/Darwin/suppressions-darwin.cc (141 of 459) UNSUPPORTED: AddressSanitizer-x86_64-iossim :: TestCases/Posix/deep_call_stack.cc (142 of 459) PASS: AddressSanitizer-x86_64-iossim :: TestCases/Posix/coverage-fork.cc (143 of 459) PASS: AddressSanitizer-x86_64-iossim :: TestCases/Posix/current_allocated_bytes.cc (144 of 459) PASS: AddressSanitizer-x86_64-iossim :: TestCases/Posix/deep_thread_stack.cc (145 of 459) PASS: AddressSanitizer-x86_64-iossim :: TestCases/Posix/fgets_fputs.cc (146 of 459) PASS: AddressSanitizer-x86_64-iossim :: TestCases/Posix/fread_fwrite.cc (147 of 459) PASS: AddressSanitizer-x86_64-iossim :: TestCases/Posix/free_hook_realloc.cc (148 of 459) PASS: AddressSanitizer-x86_64-iossim :: TestCases/Posix/freopen.cc (149 of 459) UNSUPPORTED: AddressSanitizer-x86_64-iossim :: TestCases/Posix/glob.cc (150 of 459) PASS: AddressSanitizer-x86_64-iossim :: TestCases/Posix/global-registration.c (151 of 459) PASS: AddressSanitizer-x86_64-iossim :: TestCases/Posix/gc-test.cc (152 of 459) PASS: AddressSanitizer-x86_64-iossim :: TestCases/Posix/halt_on_error-signals.c (153 of 459) PASS: AddressSanitizer-x86_64-iossim :: TestCases/Posix/halt_on_error_suppress_equal_pcs.cc (154 of 459) UNSUPPORTED: AddressSanitizer-x86_64-iossim :: TestCases/Posix/handle_abort_on_error.cc (155 of 459) PASS: AddressSanitizer-x86_64-iossim :: TestCases/Posix/halt_on_error-torture.cc (156 of 459) PASS: AddressSanitizer-x86_64-iossim :: TestCases/Posix/interception-in-shared-lib-test.cc (157 of 459) UNSUPPORTED: AddressSanitizer-x86_64-iossim :: TestCases/Posix/invalid-pointer-pairs-threads.cc (158 of 459) PASS: AddressSanitizer-x86_64-iossim :: TestCases/Posix/dlclose-test.cc (159 of 459) PASS: AddressSanitizer-x86_64-iossim :: TestCases/Posix/init-order-pthread-create.cc (160 of 459) PASS: AddressSanitizer-x86_64-iossim :: TestCases/Posix/lto-constmerge-odr.cc (161 of 459) PASS: AddressSanitizer-x86_64-iossim :: TestCases/Posix/large_allocator_unpoisons_on_free.cc (162 of 459) UNSUPPORTED: AddressSanitizer-x86_64-iossim :: TestCases/Posix/new_array_cookie_test.cc (163 of 459) UNSUPPORTED: AddressSanitizer-x86_64-iossim :: TestCases/Posix/new_array_cookie_uaf_test.cc (164 of 459) UNSUPPORTED: AddressSanitizer-x86_64-iossim :: TestCases/Posix/new_array_cookie_with_new_from_class.cc (165 of 459) PASS: AddressSanitizer-x86_64-iossim :: TestCases/Posix/no-fd.cc (166 of 459) PASS: AddressSanitizer-x86_64-iossim :: TestCases/Posix/no_asan_gen_globals.c (167 of 459) PASS: AddressSanitizer-x86_64-iossim :: TestCases/Posix/ioctl.cc (168 of 459) PASS: AddressSanitizer-x86_64-iossim :: TestCases/Posix/print_cmdline.cc (169 of 459) PASS: AddressSanitizer-x86_64-iossim :: TestCases/Posix/readv.cc (170 of 459) UNSUPPORTED: AddressSanitizer-x86_64-iossim :: TestCases/Posix/stack-overflow.cc (171 of 459) PASS: AddressSanitizer-x86_64-iossim :: TestCases/Posix/mmap_limit_mb.cc (172 of 459) PASS: AddressSanitizer-x86_64-iossim :: TestCases/Posix/start-deactivated.cc (173 of 459) PASS: AddressSanitizer-x86_64-iossim :: TestCases/Posix/stack-use-after-return.cc (174 of 459) PASS: AddressSanitizer-x86_64-iossim :: TestCases/Posix/strchr.c (175 of 459) PASS: AddressSanitizer-x86_64-iossim :: TestCases/Posix/strerror_r_test.cc (176 of 459) PASS: AddressSanitizer-x86_64-iossim :: TestCases/Posix/shared-lib-test.cc (177 of 459) PASS: AddressSanitizer-x86_64-iossim :: TestCases/Posix/tsd_dtor_leak.cc (178 of 459) UNSUPPORTED: AddressSanitizer-x86_64-iossim :: TestCases/Posix/wait.cc (179 of 459) UNSUPPORTED: AddressSanitizer-x86_64-iossim :: TestCases/Posix/wait3.cc (180 of 459) UNSUPPORTED: AddressSanitizer-x86_64-iossim :: TestCases/Posix/wait4.cc (181 of 459) UNSUPPORTED: AddressSanitizer-x86_64-iossim :: TestCases/Posix/waitid.cc (182 of 459) PASS: AddressSanitizer-x86_64-iossim :: TestCases/Posix/wcrtomb.c (183 of 459) UNSUPPORTED: AddressSanitizer-x86_64-iossim :: TestCases/Windows/aligned_mallocs.cc (184 of 459) UNSUPPORTED: AddressSanitizer-x86_64-iossim :: TestCases/Windows/allocators_sanity.cc (185 of 459) UNSUPPORTED: AddressSanitizer-x86_64-iossim :: TestCases/Windows/beginthreadex.cc (186 of 459) UNSUPPORTED: AddressSanitizer-x86_64-iossim :: TestCases/Windows/bind_io_completion_callback.cc (187 of 459) UNSUPPORTED: AddressSanitizer-x86_64-iossim :: TestCases/Windows/bitfield.cc (188 of 459) UNSUPPORTED: AddressSanitizer-x86_64-iossim :: TestCases/Windows/bitfield_uaf.cc (189 of 459) UNSUPPORTED: AddressSanitizer-x86_64-iossim :: TestCases/Windows/calloc_left_oob.cc (190 of 459) UNSUPPORTED: AddressSanitizer-x86_64-iossim :: TestCases/Windows/calloc_right_oob.cc (191 of 459) UNSUPPORTED: AddressSanitizer-x86_64-iossim :: TestCases/Windows/calloc_uaf.cc (192 of 459) UNSUPPORTED: AddressSanitizer-x86_64-iossim :: TestCases/Windows/coverage-basic.cc (193 of 459) UNSUPPORTED: AddressSanitizer-x86_64-iossim :: TestCases/Windows/coverage-dll-stdio.cc (194 of 459) UNSUPPORTED: AddressSanitizer-x86_64-iossim :: TestCases/Windows/crash_read_write.cc (195 of 459) UNSUPPORTED: AddressSanitizer-x86_64-iossim :: TestCases/Windows/crt_initializers.cc (196 of 459) UNSUPPORTED: AddressSanitizer-x86_64-iossim :: TestCases/Windows/delay_dbghelp.cc (197 of 459) UNSUPPORTED: AddressSanitizer-x86_64-iossim :: TestCases/Windows/demangled_names.cc (198 of 459) UNSUPPORTED: AddressSanitizer-x86_64-iossim :: TestCases/Windows/dll_aligned_mallocs.cc (199 of 459) UNSUPPORTED: AddressSanitizer-x86_64-iossim :: TestCases/Windows/dll_allocators_sanity.cc (200 of 459) UNSUPPORTED: AddressSanitizer-x86_64-iossim :: TestCases/Windows/dll_and_lib.cc (201 of 459) UNSUPPORTED: AddressSanitizer-x86_64-iossim :: TestCases/Windows/dll_cerr.cc (202 of 459) UNSUPPORTED: AddressSanitizer-x86_64-iossim :: TestCases/Windows/dll_control_c.cc (203 of 459) UNSUPPORTED: AddressSanitizer-x86_64-iossim :: TestCases/Windows/dll_global_dead_strip.c (204 of 459) UNSUPPORTED: AddressSanitizer-x86_64-iossim :: TestCases/Windows/dll_heap_allocation.cc (205 of 459) UNSUPPORTED: AddressSanitizer-x86_64-iossim :: TestCases/Windows/dll_host.cc (206 of 459) UNSUPPORTED: AddressSanitizer-x86_64-iossim :: TestCases/Windows/dll_intercept_memchr.cc (207 of 459) UNSUPPORTED: AddressSanitizer-x86_64-iossim :: TestCases/Windows/dll_intercept_memcpy.cc (208 of 459) UNSUPPORTED: AddressSanitizer-x86_64-iossim :: TestCases/Windows/dll_intercept_memcpy_indirect.cc (209 of 459) UNSUPPORTED: AddressSanitizer-x86_64-iossim :: TestCases/Windows/dll_intercept_memset.cc (210 of 459) UNSUPPORTED: AddressSanitizer-x86_64-iossim :: TestCases/Windows/dll_intercept_strlen.cc (211 of 459) UNSUPPORTED: AddressSanitizer-x86_64-iossim :: TestCases/Windows/dll_large_function.cc (212 of 459) UNSUPPORTED: AddressSanitizer-x86_64-iossim :: TestCases/Windows/dll_malloc_left_oob.cc (213 of 459) UNSUPPORTED: AddressSanitizer-x86_64-iossim :: TestCases/Windows/dll_malloc_uaf.cc (214 of 459) UNSUPPORTED: AddressSanitizer-x86_64-iossim :: TestCases/Windows/dll_noreturn.cc (215 of 459) UNSUPPORTED: AddressSanitizer-x86_64-iossim :: TestCases/Windows/dll_null_deref.cc (216 of 459) UNSUPPORTED: AddressSanitizer-x86_64-iossim :: TestCases/Windows/dll_operator_array_new_left_oob.cc (217 of 459) UNSUPPORTED: AddressSanitizer-x86_64-iossim :: TestCases/Windows/dll_operator_array_new_with_dtor_left_oob.cc (218 of 459) UNSUPPORTED: AddressSanitizer-x86_64-iossim :: TestCases/Windows/dll_poison_unpoison.cc (219 of 459) UNSUPPORTED: AddressSanitizer-x86_64-iossim :: TestCases/Windows/dll_report_globals_symbolization_at_startup.cc (220 of 459) UNSUPPORTED: AddressSanitizer-x86_64-iossim :: TestCases/Windows/dll_seh.cc (221 of 459) UNSUPPORTED: AddressSanitizer-x86_64-iossim :: TestCases/Windows/dll_stack_use_after_return.cc (222 of 459) UNSUPPORTED: AddressSanitizer-x86_64-iossim :: TestCases/Windows/dll_thread_stack_array_left_oob.cc (223 of 459) UNSUPPORTED: AddressSanitizer-x86_64-iossim :: TestCases/Windows/double_free.cc (224 of 459) UNSUPPORTED: AddressSanitizer-x86_64-iossim :: TestCases/Windows/double_operator_delete.cc (225 of 459) UNSUPPORTED: AddressSanitizer-x86_64-iossim :: TestCases/Windows/free_hook_realloc.cc (226 of 459) UNSUPPORTED: AddressSanitizer-x86_64-iossim :: TestCases/Windows/fuse-lld-globals.cc (227 of 459) UNSUPPORTED: AddressSanitizer-x86_64-iossim :: TestCases/Windows/fuse-lld.cc (228 of 459) UNSUPPORTED: AddressSanitizer-x86_64-iossim :: TestCases/Windows/global_const_string.cc (229 of 459) UNSUPPORTED: AddressSanitizer-x86_64-iossim :: TestCases/Windows/global_const_string_oob.cc (230 of 459) UNSUPPORTED: AddressSanitizer-x86_64-iossim :: TestCases/Windows/global_dead_strip.c (231 of 459) UNSUPPORTED: AddressSanitizer-x86_64-iossim :: TestCases/Windows/heaprealloc_zero_size.cc (232 of 459) UNSUPPORTED: AddressSanitizer-x86_64-iossim :: TestCases/Windows/hello_world.cc (233 of 459) UNSUPPORTED: AddressSanitizer-x86_64-iossim :: TestCases/Windows/intercept_memcpy.cc (234 of 459) UNSUPPORTED: AddressSanitizer-x86_64-iossim :: TestCases/Windows/intercept_strdup.cc (235 of 459) UNSUPPORTED: AddressSanitizer-x86_64-iossim :: TestCases/Windows/intercept_strlen.cc (236 of 459) UNSUPPORTED: AddressSanitizer-x86_64-iossim :: TestCases/Windows/interface_symbols_windows.cc (237 of 459) UNSUPPORTED: AddressSanitizer-x86_64-iossim :: TestCases/Windows/iostream_sbo.cc (238 of 459) UNSUPPORTED: AddressSanitizer-x86_64-iossim :: TestCases/Windows/longjmp.cc (239 of 459) UNSUPPORTED: AddressSanitizer-x86_64-iossim :: TestCases/Windows/malloc_left_oob.cc (240 of 459) UNSUPPORTED: AddressSanitizer-x86_64-iossim :: TestCases/Windows/malloc_right_oob.cc (241 of 459) UNSUPPORTED: AddressSanitizer-x86_64-iossim :: TestCases/Windows/malloc_uaf.cc (242 of 459) UNSUPPORTED: AddressSanitizer-x86_64-iossim :: TestCases/Windows/null_deref.cc (243 of 459) UNSUPPORTED: AddressSanitizer-x86_64-iossim :: TestCases/Windows/null_deref_multiple_dlls.cc (244 of 459) UNSUPPORTED: AddressSanitizer-x86_64-iossim :: TestCases/Windows/oom.cc (245 of 459) UNSUPPORTED: AddressSanitizer-x86_64-iossim :: TestCases/Windows/operator_array_new_left_oob.cc (246 of 459) UNSUPPORTED: AddressSanitizer-x86_64-iossim :: TestCases/Windows/operator_array_new_right_oob.cc (247 of 459) UNSUPPORTED: AddressSanitizer-x86_64-iossim :: TestCases/Windows/operator_array_new_uaf.cc (248 of 459) UNSUPPORTED: AddressSanitizer-x86_64-iossim :: TestCases/Windows/operator_array_new_with_dtor_left_oob.cc (249 of 459) UNSUPPORTED: AddressSanitizer-x86_64-iossim :: TestCases/Windows/operator_delete_wrong_argument.cc (250 of 459) UNSUPPORTED: AddressSanitizer-x86_64-iossim :: TestCases/Windows/operator_new_left_oob.cc (251 of 459) UNSUPPORTED: AddressSanitizer-x86_64-iossim :: TestCases/Windows/operator_new_right_oob.cc (252 of 459) UNSUPPORTED: AddressSanitizer-x86_64-iossim :: TestCases/Windows/operator_new_uaf.cc (253 of 459) UNSUPPORTED: AddressSanitizer-x86_64-iossim :: TestCases/Windows/queue_user_work_item.cc (254 of 459) UNSUPPORTED: AddressSanitizer-x86_64-iossim :: TestCases/Windows/queue_user_work_item_report.cc (255 of 459) UNSUPPORTED: AddressSanitizer-x86_64-iossim :: TestCases/Windows/realloc_left_oob.cc (256 of 459) UNSUPPORTED: AddressSanitizer-x86_64-iossim :: TestCases/Windows/realloc_right_oob.cc (257 of 459) UNSUPPORTED: AddressSanitizer-x86_64-iossim :: TestCases/Windows/realloc_uaf.cc (258 of 459) UNSUPPORTED: AddressSanitizer-x86_64-iossim :: TestCases/Windows/recalloc_sanity.cc (259 of 459) UNSUPPORTED: AddressSanitizer-x86_64-iossim :: TestCases/Windows/report_after_syminitialize.cc (260 of 459) UNSUPPORTED: AddressSanitizer-x86_64-iossim :: TestCases/Windows/report_globals_reload_dll.cc (261 of 459) UNSUPPORTED: AddressSanitizer-x86_64-iossim :: TestCases/Windows/report_globals_vs_freelibrary.cc (262 of 459) UNSUPPORTED: AddressSanitizer-x86_64-iossim :: TestCases/Windows/seh.cc (263 of 459) UNSUPPORTED: AddressSanitizer-x86_64-iossim :: TestCases/Windows/shadow_conflict_32.cc (264 of 459) UNSUPPORTED: AddressSanitizer-x86_64-iossim :: TestCases/Windows/shadow_mapping_failure.cc (265 of 459) UNSUPPORTED: AddressSanitizer-x86_64-iossim :: TestCases/Windows/stack_array_left_oob.cc (266 of 459) UNSUPPORTED: AddressSanitizer-x86_64-iossim :: TestCases/Windows/stack_array_right_oob.cc (267 of 459) UNSUPPORTED: AddressSanitizer-x86_64-iossim :: TestCases/Windows/stack_array_sanity.cc (268 of 459) UNSUPPORTED: AddressSanitizer-x86_64-iossim :: TestCases/Windows/stack_use_after_return.cc (269 of 459) UNSUPPORTED: AddressSanitizer-x86_64-iossim :: TestCases/Windows/symbols_path.cc (270 of 459) UNSUPPORTED: AddressSanitizer-x86_64-iossim :: TestCases/Windows/thread_simple.cc (271 of 459) UNSUPPORTED: AddressSanitizer-x86_64-iossim :: TestCases/Windows/thread_stack_array_left_oob.cc (272 of 459) UNSUPPORTED: AddressSanitizer-x86_64-iossim :: TestCases/Windows/thread_stack_array_right_oob.cc (273 of 459) UNSUPPORTED: AddressSanitizer-x86_64-iossim :: TestCases/Windows/thread_stack_reuse.cc (274 of 459) UNSUPPORTED: AddressSanitizer-x86_64-iossim :: TestCases/Windows/thread_stress.cc (275 of 459) UNSUPPORTED: AddressSanitizer-x86_64-iossim :: TestCases/Windows/thread_suspended.cc (276 of 459) UNSUPPORTED: AddressSanitizer-x86_64-iossim :: TestCases/Windows/tls_init.cc (277 of 459) UNSUPPORTED: AddressSanitizer-x86_64-iossim :: TestCases/Windows/unsymbolized.cc (278 of 459) UNSUPPORTED: AddressSanitizer-x86_64-iossim :: TestCases/Windows/use_after_realloc.cc (279 of 459) UNSUPPORTED: AddressSanitizer-x86_64-iossim :: TestCases/Windows/use_after_return_linkage.cc (280 of 459) UNSUPPORTED: AddressSanitizer-x86_64-iossim :: TestCases/Windows/user-exception.cc (281 of 459) UNSUPPORTED: AddressSanitizer-x86_64-iossim :: TestCases/Windows/windows_h.cc (282 of 459) UNSUPPORTED: AddressSanitizer-x86_64-iossim :: TestCases/Windows/wrong_downcast_on_heap.cc (283 of 459) UNSUPPORTED: AddressSanitizer-x86_64-iossim :: TestCases/Windows/wrong_downcast_on_stack.cc (284 of 459) PASS: AddressSanitizer-x86_64-iossim :: TestCases/Posix/strndup_oob_test.cc (285 of 459) PASS: AddressSanitizer-x86_64-iossim :: TestCases/Posix/strndup_oob_test2.cc (286 of 459) PASS: AddressSanitizer-x86_64-iossim :: TestCases/alloca_big_alignment.cc (287 of 459) PASS: AddressSanitizer-x86_64-iossim :: TestCases/alloca_constant_size.cc (288 of 459) PASS: AddressSanitizer-x86_64-iossim :: TestCases/alloca_detect_custom_size_.cc (289 of 459) PASS: AddressSanitizer-x86_64-iossim :: TestCases/alloca_instruments_all_paddings.cc (290 of 459) PASS: AddressSanitizer-x86_64-iossim :: TestCases/alloca_loop_unpoisoning.cc (291 of 459) PASS: AddressSanitizer-x86_64-iossim :: TestCases/alloca_overflow_partial.cc (292 of 459) PASS: AddressSanitizer-x86_64-iossim :: TestCases/alloca_overflow_right.cc (293 of 459) PASS: AddressSanitizer-x86_64-iossim :: TestCases/alloca_safe_access.cc (294 of 459) PASS: AddressSanitizer-x86_64-iossim :: TestCases/alloca_underflow_left.cc (295 of 459) PASS: AddressSanitizer-x86_64-iossim :: TestCases/asan_and_llvm_coverage_test.cc (296 of 459) PASS: AddressSanitizer-x86_64-iossim :: TestCases/alloca_vla_interact.cc (297 of 459) PASS: AddressSanitizer-x86_64-iossim :: TestCases/asan_options-help.cc (298 of 459) PASS: AddressSanitizer-x86_64-iossim :: TestCases/atexit_stats.cc (299 of 459) PASS: AddressSanitizer-x86_64-iossim :: TestCases/atoi_strict.c (300 of 459) PASS: AddressSanitizer-x86_64-iossim :: TestCases/atol_strict.c (301 of 459) PASS: AddressSanitizer-x86_64-iossim :: TestCases/atoll_strict.c (302 of 459) PASS: AddressSanitizer-x86_64-iossim :: TestCases/calloc-overflow.cc (303 of 459) PASS: AddressSanitizer-x86_64-iossim :: TestCases/blacklist.cc (304 of 459) PASS: AddressSanitizer-x86_64-iossim :: TestCases/contiguous_container.cc (305 of 459) PASS: AddressSanitizer-x86_64-iossim :: TestCases/coverage-and-lsan.cc (306 of 459) PASS: AddressSanitizer-x86_64-iossim :: TestCases/coverage-disabled.cc (307 of 459) PASS: AddressSanitizer-x86_64-iossim :: TestCases/contiguous_container_crash.cc (308 of 459) PASS: AddressSanitizer-x86_64-iossim :: TestCases/coverage-trace-pc.cc (309 of 459) PASS: AddressSanitizer-x86_64-iossim :: TestCases/debug_double_free.cc (310 of 459) UNSUPPORTED: AddressSanitizer-x86_64-iossim :: TestCases/debug_ppc64_mapping.cc (311 of 459) PASS: AddressSanitizer-x86_64-iossim :: TestCases/debug_locate.cc (312 of 459) PASS: AddressSanitizer-x86_64-iossim :: TestCases/debug_mapping.cc (313 of 459) PASS: AddressSanitizer-x86_64-iossim :: TestCases/debug_report.cc (314 of 459) PASS: AddressSanitizer-x86_64-iossim :: TestCases/debug_stacks.cc (315 of 459) UNSUPPORTED: AddressSanitizer-x86_64-iossim :: TestCases/default_blacklist.cc (316 of 459) PASS: AddressSanitizer-x86_64-iossim :: TestCases/deep_stack_uaf.cc (317 of 459) PASS: AddressSanitizer-x86_64-iossim :: TestCases/default_options.cc (318 of 459) PASS: AddressSanitizer-x86_64-iossim :: TestCases/describe_address.cc (319 of 459) PASS: AddressSanitizer-x86_64-iossim :: TestCases/error_report_callback.cc (320 of 459) PASS: AddressSanitizer-x86_64-iossim :: TestCases/deep_tail_call.cc (321 of 459) PASS: AddressSanitizer-x86_64-iossim :: TestCases/exitcode.cc (322 of 459) PASS: AddressSanitizer-x86_64-iossim :: TestCases/force_inline_opt0.cc (323 of 459) PASS: AddressSanitizer-x86_64-iossim :: TestCases/double-free.cc (324 of 459) PASS: AddressSanitizer-x86_64-iossim :: TestCases/frexp_interceptor.cc (325 of 459) PASS: AddressSanitizer-x86_64-iossim :: TestCases/global-address.cpp (326 of 459) PASS: AddressSanitizer-x86_64-iossim :: TestCases/global-demangle.cc (327 of 459) PASS: AddressSanitizer-x86_64-iossim :: TestCases/global-location.cc (328 of 459) PASS: AddressSanitizer-x86_64-iossim :: TestCases/global-overflow.cc (329 of 459) PASS: AddressSanitizer-x86_64-iossim :: TestCases/global-underflow.cc (330 of 459) PASS: AddressSanitizer-x86_64-iossim :: TestCases/handle_noreturn_bug.cc (331 of 459) PASS: AddressSanitizer-x86_64-iossim :: TestCases/halt_on_error-1.c (332 of 459) UNSUPPORTED: AddressSanitizer-x86_64-iossim :: TestCases/heavy_uar_test.cc (333 of 459) PASS: AddressSanitizer-x86_64-iossim :: TestCases/heap-overflow-large.cc (334 of 459) PASS: AddressSanitizer-x86_64-iossim :: TestCases/huge_negative_hea_oob.cc (335 of 459) PASS: AddressSanitizer-x86_64-iossim :: TestCases/ill.cc (336 of 459) PASS: AddressSanitizer-x86_64-iossim :: TestCases/init-order-atexit.cc (337 of 459) UNSUPPORTED: AddressSanitizer-x86_64-iossim :: TestCases/initialization-bug.cc (338 of 459) PASS: AddressSanitizer-x86_64-iossim :: TestCases/initialization-blacklist.cc (339 of 459) PASS: AddressSanitizer-x86_64-iossim :: TestCases/heap-overflow.cc (340 of 459) PASS: AddressSanitizer-x86_64-iossim :: TestCases/inline.cc (341 of 459) PASS: AddressSanitizer-x86_64-iossim :: TestCases/initialization-constexpr.cc (342 of 459) PASS: AddressSanitizer-x86_64-iossim :: TestCases/intercept-rethrow-exception.cc (343 of 459) PASS: AddressSanitizer-x86_64-iossim :: TestCases/initialization-nobug.cc (344 of 459) PASS: AddressSanitizer-x86_64-iossim :: TestCases/interface_test.cc (345 of 459) PASS: AddressSanitizer-x86_64-iossim :: TestCases/intra-object-overflow.cc (346 of 459) PASS: AddressSanitizer-x86_64-iossim :: TestCases/interception_failure_test.cc (347 of 459) PASS: AddressSanitizer-x86_64-iossim :: TestCases/invalid-pointer-pairs-compare-errors.cc (348 of 459) PASS: AddressSanitizer-x86_64-iossim :: TestCases/invalid-pointer-pairs-compare-null.cc (349 of 459) PASS: AddressSanitizer-x86_64-iossim :: TestCases/invalid-pointer-pairs-compare-success.cc (350 of 459) PASS: AddressSanitizer-x86_64-iossim :: TestCases/invalid-free.cc (351 of 459) PASS: AddressSanitizer-x86_64-iossim :: TestCases/invalid-pointer-pairs-subtract-errors.cc (352 of 459) PASS: AddressSanitizer-x86_64-iossim :: TestCases/invalid-pointer-pairs-subtract-success.cc (353 of 459) UNSUPPORTED: AddressSanitizer-x86_64-iossim :: TestCases/log-path_test.cc (354 of 459) PASS: AddressSanitizer-x86_64-iossim :: TestCases/longjmp.cc (355 of 459) PASS: AddressSanitizer-x86_64-iossim :: TestCases/invalid-pointer-pairs.cc (356 of 459) PASS: AddressSanitizer-x86_64-iossim :: TestCases/malloc-no-intercept.c (357 of 459) PASS: AddressSanitizer-x86_64-iossim :: TestCases/lsan_annotations.cc (358 of 459) PASS: AddressSanitizer-x86_64-iossim :: TestCases/malloc-size-too-big.cc (359 of 459) PASS: AddressSanitizer-x86_64-iossim :: TestCases/large_func_test.cc (360 of 459) PASS: AddressSanitizer-x86_64-iossim :: TestCases/malloc_fill.cc (361 of 459) PASS: AddressSanitizer-x86_64-iossim :: TestCases/malloc_context_size.cc (362 of 459) PASS: AddressSanitizer-x86_64-iossim :: TestCases/memcmp_strict_test.cc (363 of 459) PASS: AddressSanitizer-x86_64-iossim :: TestCases/max_redzone.cc (364 of 459) UNSUPPORTED: AddressSanitizer-x86_64-iossim :: TestCases/non-executable-pc.cpp (365 of 459) PASS: AddressSanitizer-x86_64-iossim :: TestCases/memcmp_test.cc (366 of 459) PASS: AddressSanitizer-x86_64-iossim :: TestCases/on_error_callback.cc (367 of 459) PASS: AddressSanitizer-x86_64-iossim :: TestCases/null_deref.cc (368 of 459) PASS: AddressSanitizer-x86_64-iossim :: TestCases/pass-object-byval.cc (369 of 459) UNSUPPORTED: AddressSanitizer-x86_64-iossim :: TestCases/pass-struct-byval-uar.cc (370 of 459) PASS: AddressSanitizer-x86_64-iossim :: TestCases/pass-struct-byval.cc (371 of 459) PASS: AddressSanitizer-x86_64-iossim :: TestCases/partial_right.cc (372 of 459) PASS: AddressSanitizer-x86_64-iossim :: TestCases/poison_partial.cc (373 of 459) PASS: AddressSanitizer-x86_64-iossim :: TestCases/pr33372.cc (374 of 459) PASS: AddressSanitizer-x86_64-iossim :: TestCases/print_summary.cc (375 of 459) PASS: AddressSanitizer-x86_64-iossim :: TestCases/printf-1.c (376 of 459) PASS: AddressSanitizer-x86_64-iossim :: TestCases/printf-2.c (377 of 459) PASS: AddressSanitizer-x86_64-iossim :: TestCases/printf-3.c (378 of 459) PASS: AddressSanitizer-x86_64-iossim :: TestCases/printf-4.c (379 of 459) PASS: AddressSanitizer-x86_64-iossim :: TestCases/printf-m.c (380 of 459) PASS: AddressSanitizer-x86_64-iossim :: TestCases/printf-5.c (381 of 459) PASS: AddressSanitizer-x86_64-iossim :: TestCases/realloc.cc (382 of 459) PASS: AddressSanitizer-x86_64-iossim :: TestCases/memset_test.cc (383 of 459) PASS: AddressSanitizer-x86_64-iossim :: TestCases/sanity_check_pure_c.c (384 of 459) PASS: AddressSanitizer-x86_64-iossim :: TestCases/sleep_after_init.c (385 of 459) PASS: AddressSanitizer-x86_64-iossim :: TestCases/set_shadow_test.c (386 of 459) PASS: AddressSanitizer-x86_64-iossim :: TestCases/sleep_before_dying.c (387 of 459) PASS: AddressSanitizer-x86_64-iossim :: TestCases/speculative_load.cc (388 of 459) PASS: AddressSanitizer-x86_64-iossim :: TestCases/small_memcpy_test.cc (389 of 459) PASS: AddressSanitizer-x86_64-iossim :: TestCases/speculative_load2.cc (390 of 459) PASS: AddressSanitizer-x86_64-iossim :: TestCases/stack-buffer-overflow.cc (391 of 459) PASS: AddressSanitizer-x86_64-iossim :: TestCases/stack-frame-demangle.cc (392 of 459) PASS: AddressSanitizer-x86_64-iossim :: TestCases/stack-buffer-overflow-with-position.cc (393 of 459) PASS: AddressSanitizer-x86_64-iossim :: TestCases/stack-oob-frames.cc (394 of 459) PASS: AddressSanitizer-x86_64-iossim :: TestCases/strcasestr-1.c (395 of 459) PASS: AddressSanitizer-x86_64-iossim :: TestCases/scariness_score_test.cc (396 of 459) PASS: AddressSanitizer-x86_64-iossim :: TestCases/strcasestr-2.c (397 of 459) PASS: AddressSanitizer-x86_64-iossim :: TestCases/strcasestr_strict.c (398 of 459) PASS: AddressSanitizer-x86_64-iossim :: TestCases/strchr_strict.c (399 of 459) PASS: AddressSanitizer-x86_64-iossim :: TestCases/strcat_strict.c (400 of 459) PASS: AddressSanitizer-x86_64-iossim :: TestCases/strcmp_strict.c (401 of 459) PASS: AddressSanitizer-x86_64-iossim :: TestCases/strcspn-1.c (402 of 459) PASS: AddressSanitizer-x86_64-iossim :: TestCases/strcspn-2.c (403 of 459) PASS: AddressSanitizer-x86_64-iossim :: TestCases/strcat-overlap.cc (404 of 459) UNSUPPORTED: AddressSanitizer-x86_64-iossim :: TestCases/strdup_oob_test.cc (405 of 459) PASS: AddressSanitizer-x86_64-iossim :: TestCases/strip_path_prefix.c (406 of 459) PASS: AddressSanitizer-x86_64-iossim :: TestCases/strcspn_strict.c (407 of 459) PASS: AddressSanitizer-x86_64-iossim :: TestCases/strcpy-overlap.cc (408 of 459) PASS: AddressSanitizer-x86_64-iossim :: TestCases/strncasecmp_strict.c (409 of 459) PASS: AddressSanitizer-x86_64-iossim :: TestCases/strncat_strict.c (410 of 459) PASS: AddressSanitizer-x86_64-iossim :: TestCases/strncat-overlap.cc (411 of 459) PASS: AddressSanitizer-x86_64-iossim :: TestCases/strncpy-overflow.cc (412 of 459) PASS: AddressSanitizer-x86_64-iossim :: TestCases/strncmp_strict.c (413 of 459) PASS: AddressSanitizer-x86_64-iossim :: TestCases/strpbrk-1.c (414 of 459) PASS: AddressSanitizer-x86_64-iossim :: TestCases/strpbrk-2.c (415 of 459) PASS: AddressSanitizer-x86_64-iossim :: TestCases/strpbrk_strict.c (416 of 459) PASS: AddressSanitizer-x86_64-iossim :: TestCases/strncpy-overlap.cc (417 of 459) PASS: AddressSanitizer-x86_64-iossim :: TestCases/strspn-1.c (418 of 459) PASS: AddressSanitizer-x86_64-iossim :: TestCases/strspn-2.c (419 of 459) PASS: AddressSanitizer-x86_64-iossim :: TestCases/strstr-1.c (420 of 459) PASS: AddressSanitizer-x86_64-iossim :: TestCases/strspn_strict.c (421 of 459) PASS: AddressSanitizer-x86_64-iossim :: TestCases/strstr-2.c (422 of 459) PASS: AddressSanitizer-x86_64-iossim :: TestCases/strstr_strict.c (423 of 459) PASS: AddressSanitizer-x86_64-iossim :: TestCases/strtok.c (424 of 459) UNSUPPORTED: AddressSanitizer-x86_64-iossim :: TestCases/suppressions-exec-relative-location.cc (425 of 459) UNSUPPORTED: AddressSanitizer-x86_64-iossim :: TestCases/suppressions-function.cc (426 of 459) PASS: AddressSanitizer-x86_64-iossim :: TestCases/suppressions-interceptor.cc (427 of 459) PASS: AddressSanitizer-x86_64-iossim :: TestCases/suppressions-library.cc (428 of 459) PASS: AddressSanitizer-x86_64-iossim :: TestCases/strtol_strict.c (429 of 459) PASS: AddressSanitizer-x86_64-iossim :: TestCases/throw_call_test.cc (430 of 459) PASS: AddressSanitizer-x86_64-iossim :: TestCases/strtoll_strict.c (431 of 459) PASS: AddressSanitizer-x86_64-iossim :: TestCases/throw_catch.cc (432 of 459) PASS: AddressSanitizer-x86_64-iossim :: TestCases/throw_invoke_test.cc (433 of 459) PASS: AddressSanitizer-x86_64-iossim :: TestCases/uar_and_exceptions.cc (434 of 459) PASS: AddressSanitizer-x86_64-iossim :: TestCases/time_interceptor.cc (435 of 459) PASS: AddressSanitizer-x86_64-iossim :: TestCases/use-after-free-right.cc (436 of 459) PASS: AddressSanitizer-x86_64-iossim :: TestCases/use-after-delete.cc (437 of 459) PASS: AddressSanitizer-x86_64-iossim :: TestCases/unaligned_loads_and_stores.cc (438 of 459) PASS: AddressSanitizer-x86_64-iossim :: TestCases/use-after-poison.cc (439 of 459) XFAIL: AddressSanitizer-x86_64-iossim :: TestCases/use-after-scope-conversion.cc (440 of 459) PASS: AddressSanitizer-x86_64-iossim :: TestCases/use-after-scope-dtor-order.cc (441 of 459) PASS: AddressSanitizer-x86_64-iossim :: TestCases/use-after-scope-goto.cc (442 of 459) PASS: AddressSanitizer-x86_64-iossim :: TestCases/use-after-scope-if.cc (443 of 459) PASS: AddressSanitizer-x86_64-iossim :: TestCases/use-after-free.cc (444 of 459) PASS: AddressSanitizer-x86_64-iossim :: TestCases/use-after-scope-capture.cc (445 of 459) PASS: AddressSanitizer-x86_64-iossim :: TestCases/use-after-scope-loop-bug.cc (446 of 459) PASS: AddressSanitizer-x86_64-iossim :: TestCases/use-after-scope-inlined.cc (447 of 459) PASS: AddressSanitizer-x86_64-iossim :: TestCases/use-after-scope-loop.cc (448 of 459) PASS: AddressSanitizer-x86_64-iossim :: TestCases/use-after-scope-loop-removed.cc (449 of 459) PASS: AddressSanitizer-x86_64-iossim :: TestCases/use-after-scope-nobug.cc (450 of 459) PASS: AddressSanitizer-x86_64-iossim :: TestCases/use-after-scope-temp.cc (451 of 459) PASS: AddressSanitizer-x86_64-iossim :: TestCases/use-after-scope-temp2.cc (452 of 459) UNSUPPORTED: AddressSanitizer-x86_64-iossim :: TestCases/verbose-log-path_test.cc (453 of 459) PASS: AddressSanitizer-x86_64-iossim :: TestCases/vla_chrome_testcase.cc (454 of 459) PASS: AddressSanitizer-x86_64-iossim :: TestCases/use-after-scope.cc (455 of 459) PASS: AddressSanitizer-x86_64-iossim :: TestCases/vla_condition_overflow.cc (456 of 459) PASS: AddressSanitizer-x86_64-iossim :: TestCases/vla_loop_overfow.cc (457 of 459) PASS: AddressSanitizer-x86_64-iossim :: TestCases/zero_page_pc.cc (458 of 459) PASS: AddressSanitizer-x86_64-iossim :: TestCases/use-after-scope-types.cc (459 of 459)

Hide Details

1 warning(s) in tests. Testing Time: 206.02s Expected Passes : 221 Expected Failures : 1 Unsupported Tests : 237 + ./bin/llvm-lit -v --xunit-xml-output=asan-IOSSimI386Config.xunit.xml ./tools/clang/runtime/compiler-rt-bins/test/asan/IOSSimI386Config/ llvm-lit: /Users/buildslave/jenkins/workspace/clang-stage1-cmake-RA-expensive/llvm/utils/lit/lit/util.py:408: note: using SDKROOT: '/Applications/Xcode.app/Contents/Developer/Platforms/MacOSX.platform/Developer/SDKs/MacOSX10.13.sdk' {"env": {}} -- Testing: 459 tests, 8 threads -- UNSUPPORTED: AddressSanitizer-i386-iossim :: TestCases/Darwin/abort_on_error.cc (1 of 459) UNSUPPORTED: AddressSanitizer-i386-iossim :: TestCases/Darwin/address-range-limit.mm (2 of 459) UNSUPPORTED: AddressSanitizer-i386-iossim :: TestCases/Darwin/asan-symbolize-partial-report-no-external-symbolizer.cc (3 of 459) UNSUPPORTED: AddressSanitizer-i386-iossim :: TestCases/Darwin/asan-symbolize-partial-report-with-module-map.cc (4 of 459) UNSUPPORTED: AddressSanitizer-i386-iossim :: TestCases/Darwin/asan-symbolize-with-module-map.cc (5 of 459) UNSUPPORTED: AddressSanitizer-i386-iossim :: TestCases/Darwin/asan_gen_prefixes.cc (6 of 459) UNSUPPORTED: AddressSanitizer-i386-iossim :: TestCases/Darwin/atos-symbolizer-dyld-root-path.cc (7 of 459) UNSUPPORTED: AddressSanitizer-i386-iossim :: TestCases/Darwin/atos-symbolizer.cc (8 of 459) UNSUPPORTED: AddressSanitizer-i386-iossim :: TestCases/Darwin/crashlog-stacktraces.c (9 of 459) UNSUPPORTED: AddressSanitizer-i386-iossim :: TestCases/Darwin/cstring_literals_regtest.mm (10 of 459) UNSUPPORTED: AddressSanitizer-i386-iossim :: TestCases/Darwin/cstring_section.c (11 of 459) UNSUPPORTED: AddressSanitizer-i386-iossim :: TestCases/Darwin/dead-strip.c (12 of 459) UNSUPPORTED: AddressSanitizer-i386-iossim :: TestCases/Darwin/dladdr-demangling.cc (13 of 459) UNSUPPORTED: AddressSanitizer-i386-iossim :: TestCases/Darwin/dump_registers.cc (14 of 459) UNSUPPORTED: AddressSanitizer-i386-iossim :: TestCases/Darwin/dyld_insert_libraries_reexec.cc (15 of 459) UNSUPPORTED: AddressSanitizer-i386-iossim :: TestCases/Darwin/dyld_insert_libraries_remove.cc (16 of 459) UNSUPPORTED: AddressSanitizer-i386-iossim :: TestCases/Darwin/empty-section.cc (17 of 459) UNSUPPORTED: AddressSanitizer-i386-iossim :: TestCases/Darwin/fclose.c (18 of 459) UNSUPPORTED: AddressSanitizer-i386-iossim :: TestCases/Darwin/getpwnam.c (19 of 459) UNSUPPORTED: AddressSanitizer-i386-iossim :: TestCases/Darwin/haswell-symbolication.cc (20 of 459) UNSUPPORTED: AddressSanitizer-i386-iossim :: TestCases/Darwin/init_for_dlopen.cc (21 of 459) UNSUPPORTED: AddressSanitizer-i386-iossim :: TestCases/Darwin/interface_symbols_darwin.cc (22 of 459) UNSUPPORTED: AddressSanitizer-i386-iossim :: TestCases/Darwin/linked-only.cc (23 of 459) UNSUPPORTED: AddressSanitizer-i386-iossim :: TestCases/Darwin/malloc_destroy_zone.cc (24 of 459) UNSUPPORTED: AddressSanitizer-i386-iossim :: TestCases/Darwin/malloc_set_zone_name-mprotect.cc (25 of 459) UNSUPPORTED: AddressSanitizer-i386-iossim :: TestCases/Darwin/malloc_size_crash.mm (26 of 459) UNSUPPORTED: AddressSanitizer-i386-iossim :: TestCases/Darwin/malloc_zone-protected.cc (27 of 459) UNSUPPORTED: AddressSanitizer-i386-iossim :: TestCases/Darwin/mixing-global-constructors.cc (28 of 459) UNSUPPORTED: AddressSanitizer-i386-iossim :: TestCases/Darwin/nil-return-struct.mm (29 of 459) UNSUPPORTED: AddressSanitizer-i386-iossim :: TestCases/Darwin/objc-odr.mm (30 of 459) UNSUPPORTED: AddressSanitizer-i386-iossim :: TestCases/Darwin/odr-lto.cc (31 of 459) UNSUPPORTED: AddressSanitizer-i386-iossim :: TestCases/Darwin/reexec-insert-libraries-env.cc (32 of 459) UNSUPPORTED: AddressSanitizer-i386-iossim :: TestCases/Darwin/sandbox-symbolizer.cc (33 of 459) UNSUPPORTED: AddressSanitizer-i386-iossim :: TestCases/Darwin/scribble.cc (34 of 459) UNSUPPORTED: AddressSanitizer-i386-iossim :: TestCases/Darwin/segv_read_write.c (35 of 459) UNSUPPORTED: AddressSanitizer-i386-iossim :: TestCases/Darwin/suppressions-darwin.cc (36 of 459) UNSUPPORTED: AddressSanitizer-i386-iossim :: TestCases/Darwin/suppressions-function.cc (37 of 459) UNSUPPORTED: AddressSanitizer-i386-iossim :: TestCases/Darwin/suppressions-sandbox.cc (38 of 459) UNSUPPORTED: AddressSanitizer-i386-iossim :: TestCases/Darwin/unset-insert-libraries-on-exec.cc (39 of 459) UNSUPPORTED: AddressSanitizer-i386-iossim :: TestCases/Darwin/uuid.cc (40 of 459) UNSUPPORTED: AddressSanitizer-i386-iossim :: TestCases/Linux/abort_on_error.cc (41 of 459) UNSUPPORTED: AddressSanitizer-i386-iossim :: TestCases/Linux/activation-options.cc (42 of 459) UNSUPPORTED: AddressSanitizer-i386-iossim :: TestCases/Linux/aligned_delete_test.cc (43 of 459) UNSUPPORTED: AddressSanitizer-i386-iossim :: TestCases/Linux/allocator_oom_test.cc (44 of 459) UNSUPPORTED: AddressSanitizer-i386-iossim :: TestCases/Linux/asan_default_suppressions.cc (45 of 459) UNSUPPORTED: AddressSanitizer-i386-iossim :: TestCases/Linux/asan_dlopen_test.cc (46 of 459) UNSUPPORTED: AddressSanitizer-i386-iossim :: TestCases/Linux/asan_prelink_test.cc (47 of 459) UNSUPPORTED: AddressSanitizer-i386-iossim :: TestCases/Linux/asan_preload_test-1.cc (48 of 459) UNSUPPORTED: AddressSanitizer-i386-iossim :: TestCases/Linux/asan_preload_test-2.cc (49 of 459) UNSUPPORTED: AddressSanitizer-i386-iossim :: TestCases/Linux/asan_preload_test-3.cc (50 of 459) UNSUPPORTED: AddressSanitizer-i386-iossim :: TestCases/Linux/asan_rt_confict_test-1.cc (51 of 459) UNSUPPORTED: AddressSanitizer-i386-iossim :: TestCases/Linux/asan_rt_confict_test-2.cc (52 of 459) UNSUPPORTED: AddressSanitizer-i386-iossim :: TestCases/Linux/auto_memory_profile_test.cc (53 of 459) UNSUPPORTED: AddressSanitizer-i386-iossim :: TestCases/Linux/bzero.cc (54 of 459) UNSUPPORTED: AddressSanitizer-i386-iossim :: TestCases/Linux/calloc-preload.c (55 of 459) UNSUPPORTED: AddressSanitizer-i386-iossim :: TestCases/Linux/clang_gcc_abi.cc (56 of 459) UNSUPPORTED: AddressSanitizer-i386-iossim :: TestCases/Linux/clone_test.cc (57 of 459) UNSUPPORTED: AddressSanitizer-i386-iossim :: TestCases/Linux/coverage-missing.cc (58 of 459) UNSUPPORTED: AddressSanitizer-i386-iossim :: TestCases/Linux/cuda_test.cc (59 of 459) UNSUPPORTED: AddressSanitizer-i386-iossim :: TestCases/Linux/function-sections-are-bad.cc (60 of 459) UNSUPPORTED: AddressSanitizer-i386-iossim :: TestCases/Linux/global-overflow-bfd.cc (61 of 459) UNSUPPORTED: AddressSanitizer-i386-iossim :: TestCases/Linux/global-overflow-lld.cc (62 of 459) UNSUPPORTED: AddressSanitizer-i386-iossim :: TestCases/Linux/globals-gc-sections-lld.cc (63 of 459) UNSUPPORTED: AddressSanitizer-i386-iossim :: TestCases/Linux/init-order-dlopen.cc (64 of 459) UNSUPPORTED: AddressSanitizer-i386-iossim :: TestCases/Linux/init_fini_sections.cc (65 of 459) UNSUPPORTED: AddressSanitizer-i386-iossim :: TestCases/Linux/initialization-bug-any-order.cc (66 of 459) UNSUPPORTED: AddressSanitizer-i386-iossim :: TestCases/Linux/interception_malloc_test.cc (67 of 459) UNSUPPORTED: AddressSanitizer-i386-iossim :: TestCases/Linux/interception_readdir_r_test.cc (68 of 459) UNSUPPORTED: AddressSanitizer-i386-iossim :: TestCases/Linux/interception_test.cc (69 of 459) UNSUPPORTED: AddressSanitizer-i386-iossim :: TestCases/Linux/interface_symbols_linux.cc (70 of 459) UNSUPPORTED: AddressSanitizer-i386-iossim :: TestCases/Linux/kernel-area.cc (71 of 459) UNSUPPORTED: AddressSanitizer-i386-iossim :: TestCases/Linux/leak.cc (72 of 459) UNSUPPORTED: AddressSanitizer-i386-iossim :: TestCases/Linux/leak_check_segv.cc (73 of 459) UNSUPPORTED: AddressSanitizer-i386-iossim :: TestCases/Linux/local_alias.cc (74 of 459) UNSUPPORTED: AddressSanitizer-i386-iossim :: TestCases/Linux/long-object-path.cc (75 of 459) UNSUPPORTED: AddressSanitizer-i386-iossim :: TestCases/Linux/longjmp_chk.c (76 of 459) UNSUPPORTED: AddressSanitizer-i386-iossim :: TestCases/Linux/malloc-in-qsort.cc (77 of 459) UNSUPPORTED: AddressSanitizer-i386-iossim :: TestCases/Linux/malloc_delete_mismatch.cc (78 of 459) UNSUPPORTED: AddressSanitizer-i386-iossim :: TestCases/Linux/memmem_test.cc (79 of 459) UNSUPPORTED: AddressSanitizer-i386-iossim :: TestCases/Linux/mincore.cc (80 of 459) UNSUPPORTED: AddressSanitizer-i386-iossim :: TestCases/Linux/new_delete_mismatch.cc (81 of 459) UNSUPPORTED: AddressSanitizer-i386-iossim :: TestCases/Linux/new_delete_mismatch_global.cc (82 of 459) UNSUPPORTED: AddressSanitizer-i386-iossim :: TestCases/Linux/new_delete_mismatch_stack.cc (83 of 459) UNSUPPORTED: AddressSanitizer-i386-iossim :: TestCases/Linux/nohugepage_test.cc (84 of 459) UNSUPPORTED: AddressSanitizer-i386-iossim :: TestCases/Linux/odr-violation.cc (85 of 459) UNSUPPORTED: AddressSanitizer-i386-iossim :: TestCases/Linux/odr-vtable.cc (86 of 459) UNSUPPORTED: AddressSanitizer-i386-iossim :: TestCases/Linux/odr_c_test.c (87 of 459) UNSUPPORTED: AddressSanitizer-i386-iossim :: TestCases/Linux/odr_indicators.cc (88 of 459) UNSUPPORTED: AddressSanitizer-i386-iossim :: TestCases/Linux/overflow-in-qsort.cc (89 of 459) UNSUPPORTED: AddressSanitizer-i386-iossim :: TestCases/Linux/preinit_test.cc (90 of 459) UNSUPPORTED: AddressSanitizer-i386-iossim :: TestCases/Linux/preinstalled_signal.cc (91 of 459) UNSUPPORTED: AddressSanitizer-i386-iossim :: TestCases/Linux/print_memory_profile_test.cc (92 of 459) UNSUPPORTED: AddressSanitizer-i386-iossim :: TestCases/Linux/printf-fortify-1.c (93 of 459) UNSUPPORTED: AddressSanitizer-i386-iossim :: TestCases/Linux/printf-fortify-2.c (94 of 459) UNSUPPORTED: AddressSanitizer-i386-iossim :: TestCases/Linux/printf-fortify-3.c (95 of 459) UNSUPPORTED: AddressSanitizer-i386-iossim :: TestCases/Linux/printf-fortify-4.c (96 of 459) UNSUPPORTED: AddressSanitizer-i386-iossim :: TestCases/Linux/printf-fortify-5.c (97 of 459) UNSUPPORTED: AddressSanitizer-i386-iossim :: TestCases/Linux/pthread_create_from_constructor.cc (98 of 459) UNSUPPORTED: AddressSanitizer-i386-iossim :: TestCases/Linux/pthread_create_version.cc (99 of 459) UNSUPPORTED: AddressSanitizer-i386-iossim :: TestCases/Linux/ptrace.cc (100 of 459) UNSUPPORTED: AddressSanitizer-i386-iossim :: TestCases/Linux/quarantine_size_mb.cc (101 of 459) UNSUPPORTED: AddressSanitizer-i386-iossim :: TestCases/Linux/read_binary_name_regtest.c (102 of 459) UNSUPPORTED: AddressSanitizer-i386-iossim :: TestCases/Linux/recoverable-lsan.cc (103 of 459) UNSUPPORTED: AddressSanitizer-i386-iossim :: TestCases/Linux/recvfrom.cc (104 of 459) UNSUPPORTED: AddressSanitizer-i386-iossim :: TestCases/Linux/release_to_os_test.cc (105 of 459) UNSUPPORTED: AddressSanitizer-i386-iossim :: TestCases/Linux/rlimit_mmap_test.cc (106 of 459) UNSUPPORTED: AddressSanitizer-i386-iossim :: TestCases/Linux/sanbox_read_proc_self_maps_test.cc (107 of 459) UNSUPPORTED: AddressSanitizer-i386-iossim :: TestCases/Linux/segv_read_write.c (108 of 459) UNSUPPORTED: AddressSanitizer-i386-iossim :: TestCases/Linux/shmctl.cc (109 of 459) UNSUPPORTED: AddressSanitizer-i386-iossim :: TestCases/Linux/signal_during_stop_the_world.cc (110 of 459) UNSUPPORTED: AddressSanitizer-i386-iossim :: TestCases/Linux/sized_delete_test.cc (111 of 459) UNSUPPORTED: AddressSanitizer-i386-iossim :: TestCases/Linux/stack-overflow-recovery-mode.cc (112 of 459) UNSUPPORTED: AddressSanitizer-i386-iossim :: TestCases/Linux/stack-overflow-sigbus.cc (113 of 459) UNSUPPORTED: AddressSanitizer-i386-iossim :: TestCases/Linux/stack-trace-dlclose.cc (114 of 459) UNSUPPORTED: AddressSanitizer-i386-iossim :: TestCases/Linux/static_tls.cc (115 of 459) UNSUPPORTED: AddressSanitizer-i386-iossim :: TestCases/Linux/stress_dtls.c (116 of 459) UNSUPPORTED: AddressSanitizer-i386-iossim :: TestCases/Linux/swapcontext_annotation.cc (117 of 459) UNSUPPORTED: AddressSanitizer-i386-iossim :: TestCases/Linux/swapcontext_test.cc (118 of 459) UNSUPPORTED: AddressSanitizer-i386-iossim :: TestCases/Linux/syscalls.cc (119 of 459) UNSUPPORTED: AddressSanitizer-i386-iossim :: TestCases/Linux/textdomain.c (120 of 459) UNSUPPORTED: AddressSanitizer-i386-iossim :: TestCases/Linux/thread_local_quarantine_pthread_join.cc (121 of 459) UNSUPPORTED: AddressSanitizer-i386-iossim :: TestCases/Linux/thread_local_quarantine_size_kb.cc (122 of 459) UNSUPPORTED: AddressSanitizer-i386-iossim :: TestCases/Linux/uar_signals.cc (123 of 459) UNSUPPORTED: AddressSanitizer-i386-iossim :: TestCases/Linux/unpoison_tls.cc (124 of 459) UNSUPPORTED: AddressSanitizer-i386-iossim :: TestCases/Linux/vfork.cc (125 of 459) UNSUPPORTED: AddressSanitizer-i386-iossim :: TestCases/Posix/asan-sigbus.cpp (126 of 459) UNSUPPORTED: AddressSanitizer-i386-iossim :: TestCases/Posix/asan-symbolize-bad-path.cc (127 of 459) UNSUPPORTED: AddressSanitizer-i386-iossim :: TestCases/Posix/asan-symbolize-sanity-test.cc (128 of 459) UNSUPPORTED: AddressSanitizer-i386-iossim :: TestCases/Posix/asan_symbolize_script/logging_options_in_help.cc (129 of 459) UNSUPPORTED: AddressSanitizer-i386-iossim :: TestCases/Posix/asan_symbolize_script/plugin_no_op_help_output.cc (130 of 459) UNSUPPORTED: AddressSanitizer-i386-iossim :: TestCases/Posix/asan_symbolize_script/plugin_no_op_symbolicate.cc (131 of 459) UNSUPPORTED: AddressSanitizer-i386-iossim :: TestCases/Posix/asan_symbolize_script/set_log_dest.cc (132 of 459) UNSUPPORTED: AddressSanitizer-i386-iossim :: TestCases/Posix/asan_symbolize_script/set_log_level.cc (133 of 459) UNSUPPORTED: AddressSanitizer-i386-iossim :: TestCases/Posix/asprintf.cc (134 of 459) UNSUPPORTED: AddressSanitizer-i386-iossim :: TestCases/Posix/assign_large_valloc_to_global.cc (135 of 459) UNSUPPORTED: AddressSanitizer-i386-iossim :: TestCases/Posix/bcmp_test.cc (136 of 459) UNSUPPORTED: AddressSanitizer-i386-iossim :: TestCases/Posix/closed-fds.cc (137 of 459) UNSUPPORTED: AddressSanitizer-i386-iossim :: TestCases/Posix/concurrent_overflow.cc (138 of 459) UNSUPPORTED: AddressSanitizer-i386-iossim :: TestCases/Posix/coverage-fork.cc (139 of 459) UNSUPPORTED: AddressSanitizer-i386-iossim :: TestCases/Posix/coverage-module-unloaded.cc (140 of 459) UNSUPPORTED: AddressSanitizer-i386-iossim :: TestCases/Posix/coverage-reset.cc (141 of 459) UNSUPPORTED: AddressSanitizer-i386-iossim :: TestCases/Posix/coverage.cc (142 of 459) UNSUPPORTED: AddressSanitizer-i386-iossim :: TestCases/Posix/current_allocated_bytes.cc (143 of 459) UNSUPPORTED: AddressSanitizer-i386-iossim :: TestCases/Posix/deep_call_stack.cc (144 of 459) UNSUPPORTED: AddressSanitizer-i386-iossim :: TestCases/Posix/deep_thread_stack.cc (145 of 459) UNSUPPORTED: AddressSanitizer-i386-iossim :: TestCases/Posix/dlclose-test.cc (146 of 459) UNSUPPORTED: AddressSanitizer-i386-iossim :: TestCases/Posix/fgets_fputs.cc (147 of 459) UNSUPPORTED: AddressSanitizer-i386-iossim :: TestCases/Posix/fread_fwrite.cc (148 of 459) UNSUPPORTED: AddressSanitizer-i386-iossim :: TestCases/Posix/free_hook_realloc.cc (149 of 459) UNSUPPORTED: AddressSanitizer-i386-iossim :: TestCases/Posix/freopen.cc (150 of 459) UNSUPPORTED: AddressSanitizer-i386-iossim :: TestCases/Posix/gc-test.cc (151 of 459) UNSUPPORTED: AddressSanitizer-i386-iossim :: TestCases/Posix/glob.cc (152 of 459) UNSUPPORTED: AddressSanitizer-i386-iossim :: TestCases/Posix/global-registration.c (153 of 459) UNSUPPORTED: AddressSanitizer-i386-iossim :: TestCases/Posix/halt_on_error-signals.c (154 of 459) UNSUPPORTED: AddressSanitizer-i386-iossim :: TestCases/Posix/halt_on_error-torture.cc (155 of 459) UNSUPPORTED: AddressSanitizer-i386-iossim :: TestCases/Posix/halt_on_error_suppress_equal_pcs.cc (156 of 459) UNSUPPORTED: AddressSanitizer-i386-iossim :: TestCases/Posix/handle_abort_on_error.cc (157 of 459) UNSUPPORTED: AddressSanitizer-i386-iossim :: TestCases/Posix/init-order-pthread-create.cc (158 of 459) UNSUPPORTED: AddressSanitizer-i386-iossim :: TestCases/Posix/interception-in-shared-lib-test.cc (159 of 459) UNSUPPORTED: AddressSanitizer-i386-iossim :: TestCases/Posix/invalid-pointer-pairs-threads.cc (160 of 459) UNSUPPORTED: AddressSanitizer-i386-iossim :: TestCases/Posix/ioctl.cc (161 of 459) UNSUPPORTED: AddressSanitizer-i386-iossim :: TestCases/Posix/large_allocator_unpoisons_on_free.cc (162 of 459) UNSUPPORTED: AddressSanitizer-i386-iossim :: TestCases/Posix/lto-constmerge-odr.cc (163 of 459) UNSUPPORTED: AddressSanitizer-i386-iossim :: TestCases/Posix/mmap_limit_mb.cc (164 of 459) UNSUPPORTED: AddressSanitizer-i386-iossim :: TestCases/Posix/new_array_cookie_test.cc (165 of 459) UNSUPPORTED: AddressSanitizer-i386-iossim :: TestCases/Posix/new_array_cookie_uaf_test.cc (166 of 459) UNSUPPORTED: AddressSanitizer-i386-iossim :: TestCases/Posix/new_array_cookie_with_new_from_class.cc (167 of 459) UNSUPPORTED: AddressSanitizer-i386-iossim :: TestCases/Posix/no-fd.cc (168 of 459) UNSUPPORTED: AddressSanitizer-i386-iossim :: TestCases/Posix/no_asan_gen_globals.c (169 of 459) UNSUPPORTED: AddressSanitizer-i386-iossim :: TestCases/Posix/print_cmdline.cc (170 of 459) UNSUPPORTED: AddressSanitizer-i386-iossim :: TestCases/Posix/readv.cc (171 of 459) UNSUPPORTED: AddressSanitizer-i386-iossim :: TestCases/Posix/shared-lib-test.cc (172 of 459) UNSUPPORTED: AddressSanitizer-i386-iossim :: TestCases/Posix/stack-overflow.cc (173 of 459) UNSUPPORTED: AddressSanitizer-i386-iossim :: TestCases/Posix/stack-use-after-return.cc (174 of 459) UNSUPPORTED: AddressSanitizer-i386-iossim :: TestCases/Posix/start-deactivated.cc (175 of 459) UNSUPPORTED: AddressSanitizer-i386-iossim :: TestCases/Posix/strchr.c (176 of 459) UNSUPPORTED: AddressSanitizer-i386-iossim :: TestCases/Posix/strerror_r_test.cc (177 of 459) UNSUPPORTED: AddressSanitizer-i386-iossim :: TestCases/Posix/strndup_oob_test.cc (178 of 459) UNSUPPORTED: AddressSanitizer-i386-iossim :: TestCases/Posix/strndup_oob_test2.cc (179 of 459) UNSUPPORTED: AddressSanitizer-i386-iossim :: TestCases/Posix/tsd_dtor_leak.cc (180 of 459) UNSUPPORTED: AddressSanitizer-i386-iossim :: TestCases/Posix/wait.cc (181 of 459) UNSUPPORTED: AddressSanitizer-i386-iossim :: TestCases/Posix/wait3.cc (182 of 459) UNSUPPORTED: AddressSanitizer-i386-iossim :: TestCases/Posix/wait4.cc (183 of 459) UNSUPPORTED: AddressSanitizer-i386-iossim :: TestCases/Posix/waitid.cc (184 of 459) UNSUPPORTED: AddressSanitizer-i386-iossim :: TestCases/Posix/wcrtomb.c (185 of 459) UNSUPPORTED: AddressSanitizer-i386-iossim :: TestCases/Windows/aligned_mallocs.cc (186 of 459) UNSUPPORTED: AddressSanitizer-i386-iossim :: TestCases/Windows/allocators_sanity.cc (187 of 459) UNSUPPORTED: AddressSanitizer-i386-iossim :: TestCases/Windows/beginthreadex.cc (188 of 459) UNSUPPORTED: AddressSanitizer-i386-iossim :: TestCases/Windows/bind_io_completion_callback.cc (189 of 459) UNSUPPORTED: AddressSanitizer-i386-iossim :: TestCases/Windows/bitfield.cc (190 of 459) UNSUPPORTED: AddressSanitizer-i386-iossim :: TestCases/Windows/bitfield_uaf.cc (191 of 459) UNSUPPORTED: AddressSanitizer-i386-iossim :: TestCases/Windows/calloc_left_oob.cc (192 of 459) UNSUPPORTED: AddressSanitizer-i386-iossim :: TestCases/Windows/calloc_right_oob.cc (193 of 459) UNSUPPORTED: AddressSanitizer-i386-iossim :: TestCases/Windows/calloc_uaf.cc (194 of 459) UNSUPPORTED: AddressSanitizer-i386-iossim :: TestCases/Windows/coverage-basic.cc (195 of 459) UNSUPPORTED: AddressSanitizer-i386-iossim :: TestCases/Windows/coverage-dll-stdio.cc (196 of 459) UNSUPPORTED: AddressSanitizer-i386-iossim :: TestCases/Windows/crash_read_write.cc (197 of 459) UNSUPPORTED: AddressSanitizer-i386-iossim :: TestCases/Windows/crt_initializers.cc (198 of 459) UNSUPPORTED: AddressSanitizer-i386-iossim :: TestCases/Windows/delay_dbghelp.cc (199 of 459) UNSUPPORTED: AddressSanitizer-i386-iossim :: TestCases/Windows/demangled_names.cc (200 of 459) UNSUPPORTED: AddressSanitizer-i386-iossim :: TestCases/Windows/dll_aligned_mallocs.cc (201 of 459) UNSUPPORTED: AddressSanitizer-i386-iossim :: TestCases/Windows/dll_allocators_sanity.cc (202 of 459) UNSUPPORTED: AddressSanitizer-i386-iossim :: TestCases/Windows/dll_and_lib.cc (203 of 459) UNSUPPORTED: AddressSanitizer-i386-iossim :: TestCases/Windows/dll_cerr.cc (204 of 459) UNSUPPORTED: AddressSanitizer-i386-iossim :: TestCases/Windows/dll_control_c.cc (205 of 459) UNSUPPORTED: AddressSanitizer-i386-iossim :: TestCases/Windows/dll_global_dead_strip.c (206 of 459) UNSUPPORTED: AddressSanitizer-i386-iossim :: TestCases/Windows/dll_heap_allocation.cc (207 of 459) UNSUPPORTED: AddressSanitizer-i386-iossim :: TestCases/Windows/dll_host.cc (208 of 459) UNSUPPORTED: AddressSanitizer-i386-iossim :: TestCases/Windows/dll_intercept_memchr.cc (209 of 459) UNSUPPORTED: AddressSanitizer-i386-iossim :: TestCases/Windows/dll_intercept_memcpy.cc (210 of 459) UNSUPPORTED: AddressSanitizer-i386-iossim :: TestCases/Windows/dll_intercept_memcpy_indirect.cc (211 of 459) UNSUPPORTED: AddressSanitizer-i386-iossim :: TestCases/Windows/dll_intercept_memset.cc (212 of 459) UNSUPPORTED: AddressSanitizer-i386-iossim :: TestCases/Windows/dll_intercept_strlen.cc (213 of 459) UNSUPPORTED: AddressSanitizer-i386-iossim :: TestCases/Windows/dll_large_function.cc (214 of 459) UNSUPPORTED: AddressSanitizer-i386-iossim :: TestCases/Windows/dll_malloc_left_oob.cc (215 of 459) UNSUPPORTED: AddressSanitizer-i386-iossim :: TestCases/Windows/dll_malloc_uaf.cc (216 of 459) UNSUPPORTED: AddressSanitizer-i386-iossim :: TestCases/Windows/dll_noreturn.cc (217 of 459) UNSUPPORTED: AddressSanitizer-i386-iossim :: TestCases/Windows/dll_null_deref.cc (218 of 459) UNSUPPORTED: AddressSanitizer-i386-iossim :: TestCases/Windows/dll_operator_array_new_left_oob.cc (219 of 459) UNSUPPORTED: AddressSanitizer-i386-iossim :: TestCases/Windows/dll_operator_array_new_with_dtor_left_oob.cc (220 of 459) UNSUPPORTED: AddressSanitizer-i386-iossim :: TestCases/Windows/dll_poison_unpoison.cc (221 of 459) UNSUPPORTED: AddressSanitizer-i386-iossim :: TestCases/Windows/dll_report_globals_symbolization_at_startup.cc (222 of 459) UNSUPPORTED: AddressSanitizer-i386-iossim :: TestCases/Windows/dll_seh.cc (223 of 459) UNSUPPORTED: AddressSanitizer-i386-iossim :: TestCases/Windows/dll_stack_use_after_return.cc (224 of 459) UNSUPPORTED: AddressSanitizer-i386-iossim :: TestCases/Windows/dll_thread_stack_array_left_oob.cc (225 of 459) UNSUPPORTED: AddressSanitizer-i386-iossim :: TestCases/Windows/double_free.cc (226 of 459) UNSUPPORTED: AddressSanitizer-i386-iossim :: TestCases/Windows/double_operator_delete.cc (227 of 459) UNSUPPORTED: AddressSanitizer-i386-iossim :: TestCases/Windows/free_hook_realloc.cc (228 of 459) UNSUPPORTED: AddressSanitizer-i386-iossim :: TestCases/Windows/fuse-lld-globals.cc (229 of 459) UNSUPPORTED: AddressSanitizer-i386-iossim :: TestCases/Windows/fuse-lld.cc (230 of 459) UNSUPPORTED: AddressSanitizer-i386-iossim :: TestCases/Windows/global_const_string.cc (231 of 459) UNSUPPORTED: AddressSanitizer-i386-iossim :: TestCases/Windows/global_const_string_oob.cc (232 of 459) UNSUPPORTED: AddressSanitizer-i386-iossim :: TestCases/Windows/global_dead_strip.c (233 of 459) UNSUPPORTED: AddressSanitizer-i386-iossim :: TestCases/Windows/heaprealloc_zero_size.cc (234 of 459) UNSUPPORTED: AddressSanitizer-i386-iossim :: TestCases/Windows/hello_world.cc (235 of 459) UNSUPPORTED: AddressSanitizer-i386-iossim :: TestCases/Windows/intercept_memcpy.cc (236 of 459) UNSUPPORTED: AddressSanitizer-i386-iossim :: TestCases/Windows/intercept_strdup.cc (237 of 459) UNSUPPORTED: AddressSanitizer-i386-iossim :: TestCases/Windows/intercept_strlen.cc (238 of 459) UNSUPPORTED: AddressSanitizer-i386-iossim :: TestCases/Windows/interface_symbols_windows.cc (239 of 459) UNSUPPORTED: AddressSanitizer-i386-iossim :: TestCases/Windows/iostream_sbo.cc (240 of 459) UNSUPPORTED: AddressSanitizer-i386-iossim :: TestCases/Windows/longjmp.cc (241 of 459) UNSUPPORTED: AddressSanitizer-i386-iossim :: TestCases/Windows/malloc_left_oob.cc (242 of 459) UNSUPPORTED: AddressSanitizer-i386-iossim :: TestCases/Windows/malloc_right_oob.cc (243 of 459) UNSUPPORTED: AddressSanitizer-i386-iossim :: TestCases/Windows/malloc_uaf.cc (244 of 459) UNSUPPORTED: AddressSanitizer-i386-iossim :: TestCases/Windows/null_deref.cc (245 of 459) UNSUPPORTED: AddressSanitizer-i386-iossim :: TestCases/Windows/null_deref_multiple_dlls.cc (246 of 459) UNSUPPORTED: AddressSanitizer-i386-iossim :: TestCases/Windows/oom.cc (247 of 459) UNSUPPORTED: AddressSanitizer-i386-iossim :: TestCases/Windows/operator_array_new_left_oob.cc (248 of 459) UNSUPPORTED: AddressSanitizer-i386-iossim :: TestCases/Windows/operator_array_new_right_oob.cc (249 of 459) UNSUPPORTED: AddressSanitizer-i386-iossim :: TestCases/Windows/operator_array_new_uaf.cc (250 of 459) UNSUPPORTED: AddressSanitizer-i386-iossim :: TestCases/Windows/operator_array_new_with_dtor_left_oob.cc (251 of 459) UNSUPPORTED: AddressSanitizer-i386-iossim :: TestCases/Windows/operator_delete_wrong_argument.cc (252 of 459) UNSUPPORTED: AddressSanitizer-i386-iossim :: TestCases/Windows/operator_new_left_oob.cc (253 of 459) UNSUPPORTED: AddressSanitizer-i386-iossim :: TestCases/Windows/operator_new_right_oob.cc (254 of 459) UNSUPPORTED: AddressSanitizer-i386-iossim :: TestCases/Windows/operator_new_uaf.cc (255 of 459) UNSUPPORTED: AddressSanitizer-i386-iossim :: TestCases/Windows/queue_user_work_item.cc (256 of 459) UNSUPPORTED: AddressSanitizer-i386-iossim :: TestCases/Windows/queue_user_work_item_report.cc (257 of 459) UNSUPPORTED: AddressSanitizer-i386-iossim :: TestCases/Windows/realloc_left_oob.cc (258 of 459) UNSUPPORTED: AddressSanitizer-i386-iossim :: TestCases/Windows/realloc_right_oob.cc (259 of 459) UNSUPPORTED: AddressSanitizer-i386-iossim :: TestCases/Windows/realloc_uaf.cc (260 of 459) UNSUPPORTED: AddressSanitizer-i386-iossim :: TestCases/Windows/recalloc_sanity.cc (261 of 459) UNSUPPORTED: AddressSanitizer-i386-iossim :: TestCases/Windows/report_after_syminitialize.cc (262 of 459) UNSUPPORTED: AddressSanitizer-i386-iossim :: TestCases/Windows/report_globals_reload_dll.cc (263 of 459) UNSUPPORTED: AddressSanitizer-i386-iossim :: TestCases/Windows/report_globals_vs_freelibrary.cc (264 of 459) UNSUPPORTED: AddressSanitizer-i386-iossim :: TestCases/Windows/seh.cc (265 of 459) UNSUPPORTED: AddressSanitizer-i386-iossim :: TestCases/Windows/shadow_conflict_32.cc (266 of 459) UNSUPPORTED: AddressSanitizer-i386-iossim :: TestCases/Windows/shadow_mapping_failure.cc (267 of 459) UNSUPPORTED: AddressSanitizer-i386-iossim :: TestCases/Windows/stack_array_left_oob.cc (268 of 459) UNSUPPORTED: AddressSanitizer-i386-iossim :: TestCases/Windows/stack_array_right_oob.cc (269 of 459) UNSUPPORTED: AddressSanitizer-i386-iossim :: TestCases/Windows/stack_array_sanity.cc (270 of 459) UNSUPPORTED: AddressSanitizer-i386-iossim :: TestCases/Windows/stack_use_after_return.cc (271 of 459) UNSUPPORTED: AddressSanitizer-i386-iossim :: TestCases/Windows/symbols_path.cc (272 of 459) UNSUPPORTED: AddressSanitizer-i386-iossim :: TestCases/Windows/thread_simple.cc (273 of 459) UNSUPPORTED: AddressSanitizer-i386-iossim :: TestCases/Windows/thread_stack_array_left_oob.cc (274 of 459) UNSUPPORTED: AddressSanitizer-i386-iossim :: TestCases/Windows/thread_stack_array_right_oob.cc (275 of 459) UNSUPPORTED: AddressSanitizer-i386-iossim :: TestCases/Windows/thread_stack_reuse.cc (276 of 459) UNSUPPORTED: AddressSanitizer-i386-iossim :: TestCases/Windows/thread_stress.cc (277 of 459) UNSUPPORTED: AddressSanitizer-i386-iossim :: TestCases/Windows/thread_suspended.cc (278 of 459) UNSUPPORTED: AddressSanitizer-i386-iossim :: TestCases/Windows/tls_init.cc (279 of 459) UNSUPPORTED: AddressSanitizer-i386-iossim :: TestCases/Windows/unsymbolized.cc (280 of 459) UNSUPPORTED: AddressSanitizer-i386-iossim :: TestCases/Windows/use_after_realloc.cc (281 of 459) UNSUPPORTED: AddressSanitizer-i386-iossim :: TestCases/Windows/use_after_return_linkage.cc (282 of 459) UNSUPPORTED: AddressSanitizer-i386-iossim :: TestCases/Windows/user-exception.cc (283 of 459) UNSUPPORTED: AddressSanitizer-i386-iossim :: TestCases/Windows/windows_h.cc (284 of 459) UNSUPPORTED: AddressSanitizer-i386-iossim :: TestCases/Windows/wrong_downcast_on_heap.cc (285 of 459) UNSUPPORTED: AddressSanitizer-i386-iossim :: TestCases/Windows/wrong_downcast_on_stack.cc (286 of 459) UNSUPPORTED: AddressSanitizer-i386-iossim :: TestCases/alloca_big_alignment.cc (287 of 459) UNSUPPORTED: AddressSanitizer-i386-iossim :: TestCases/alloca_constant_size.cc (288 of 459) UNSUPPORTED: AddressSanitizer-i386-iossim :: TestCases/alloca_detect_custom_size_.cc (289 of 459) UNSUPPORTED: AddressSanitizer-i386-iossim :: TestCases/alloca_instruments_all_paddings.cc (290 of 459) UNSUPPORTED: AddressSanitizer-i386-iossim :: TestCases/alloca_loop_unpoisoning.cc (291 of 459) UNSUPPORTED: AddressSanitizer-i386-iossim :: TestCases/alloca_overflow_partial.cc (292 of 459) UNSUPPORTED: AddressSanitizer-i386-iossim :: TestCases/alloca_overflow_right.cc (293 of 459) UNSUPPORTED: AddressSanitizer-i386-iossim :: TestCases/alloca_safe_access.cc (294 of 459) UNSUPPORTED: AddressSanitizer-i386-iossim :: TestCases/alloca_underflow_left.cc (295 of 459) UNSUPPORTED: AddressSanitizer-i386-iossim :: TestCases/alloca_vla_interact.cc (296 of 459) UNSUPPORTED: AddressSanitizer-i386-iossim :: TestCases/asan_and_llvm_coverage_test.cc (297 of 459) UNSUPPORTED: AddressSanitizer-i386-iossim :: TestCases/asan_options-help.cc (298 of 459) UNSUPPORTED: AddressSanitizer-i386-iossim :: TestCases/atexit_stats.cc (299 of 459) UNSUPPORTED: AddressSanitizer-i386-iossim :: TestCases/atoi_strict.c (300 of 459) UNSUPPORTED: AddressSanitizer-i386-iossim :: TestCases/atol_strict.c (301 of 459) UNSUPPORTED: AddressSanitizer-i386-iossim :: TestCases/atoll_strict.c (302 of 459) UNSUPPORTED: AddressSanitizer-i386-iossim :: TestCases/blacklist.cc (303 of 459) UNSUPPORTED: AddressSanitizer-i386-iossim :: TestCases/calloc-overflow.cc (304 of 459) UNSUPPORTED: AddressSanitizer-i386-iossim :: TestCases/contiguous_container.cc (305 of 459) UNSUPPORTED: AddressSanitizer-i386-iossim :: TestCases/contiguous_container_crash.cc (306 of 459) UNSUPPORTED: AddressSanitizer-i386-iossim :: TestCases/coverage-and-lsan.cc (307 of 459) UNSUPPORTED: AddressSanitizer-i386-iossim :: TestCases/coverage-disabled.cc (308 of 459) UNSUPPORTED: AddressSanitizer-i386-iossim :: TestCases/coverage-trace-pc.cc (309 of 459) UNSUPPORTED: AddressSanitizer-i386-iossim :: TestCases/debug_double_free.cc (310 of 459) UNSUPPORTED: AddressSanitizer-i386-iossim :: TestCases/debug_locate.cc (311 of 459) UNSUPPORTED: AddressSanitizer-i386-iossim :: TestCases/debug_mapping.cc (312 of 459) UNSUPPORTED: AddressSanitizer-i386-iossim :: TestCases/debug_ppc64_mapping.cc (313 of 459) UNSUPPORTED: AddressSanitizer-i386-iossim :: TestCases/debug_report.cc (314 of 459) UNSUPPORTED: AddressSanitizer-i386-iossim :: TestCases/debug_stacks.cc (315 of 459) UNSUPPORTED: AddressSanitizer-i386-iossim :: TestCases/deep_stack_uaf.cc (316 of 459) UNSUPPORTED: AddressSanitizer-i386-iossim :: TestCases/deep_tail_call.cc (317 of 459) UNSUPPORTED: AddressSanitizer-i386-iossim :: TestCases/default_blacklist.cc (318 of 459) UNSUPPORTED: AddressSanitizer-i386-iossim :: TestCases/default_options.cc (319 of 459) UNSUPPORTED: AddressSanitizer-i386-iossim :: TestCases/describe_address.cc (320 of 459) UNSUPPORTED: AddressSanitizer-i386-iossim :: TestCases/double-free.cc (321 of 459) UNSUPPORTED: AddressSanitizer-i386-iossim :: TestCases/error_report_callback.cc (322 of 459) UNSUPPORTED: AddressSanitizer-i386-iossim :: TestCases/exitcode.cc (323 of 459) UNSUPPORTED: AddressSanitizer-i386-iossim :: TestCases/force_inline_opt0.cc (324 of 459) UNSUPPORTED: AddressSanitizer-i386-iossim :: TestCases/frexp_interceptor.cc (325 of 459) UNSUPPORTED: AddressSanitizer-i386-iossim :: TestCases/global-address.cpp (326 of 459) UNSUPPORTED: AddressSanitizer-i386-iossim :: TestCases/global-demangle.cc (327 of 459) UNSUPPORTED: AddressSanitizer-i386-iossim :: TestCases/global-location.cc (328 of 459) UNSUPPORTED: AddressSanitizer-i386-iossim :: TestCases/global-overflow.cc (329 of 459) UNSUPPORTED: AddressSanitizer-i386-iossim :: TestCases/global-underflow.cc (330 of 459) UNSUPPORTED: AddressSanitizer-i386-iossim :: TestCases/halt_on_error-1.c (331 of 459) UNSUPPORTED: AddressSanitizer-i386-iossim :: TestCases/handle_noreturn_bug.cc (332 of 459) UNSUPPORTED: AddressSanitizer-i386-iossim :: TestCases/heap-overflow-large.cc (333 of 459) UNSUPPORTED: AddressSanitizer-i386-iossim :: TestCases/heap-overflow.cc (334 of 459) UNSUPPORTED: AddressSanitizer-i386-iossim :: TestCases/heavy_uar_test.cc (335 of 459) UNSUPPORTED: AddressSanitizer-i386-iossim :: TestCases/huge_negative_hea_oob.cc (336 of 459) UNSUPPORTED: AddressSanitizer-i386-iossim :: TestCases/ill.cc (337 of 459) UNSUPPORTED: AddressSanitizer-i386-iossim :: TestCases/init-order-atexit.cc (338 of 459) UNSUPPORTED: AddressSanitizer-i386-iossim :: TestCases/initialization-blacklist.cc (339 of 459) UNSUPPORTED: AddressSanitizer-i386-iossim :: TestCases/initialization-bug.cc (340 of 459) UNSUPPORTED: AddressSanitizer-i386-iossim :: TestCases/initialization-constexpr.cc (341 of 459) UNSUPPORTED: AddressSanitizer-i386-iossim :: TestCases/initialization-nobug.cc (342 of 459) UNSUPPORTED: AddressSanitizer-i386-iossim :: TestCases/inline.cc (343 of 459) UNSUPPORTED: AddressSanitizer-i386-iossim :: TestCases/intercept-rethrow-exception.cc (344 of 459) UNSUPPORTED: AddressSanitizer-i386-iossim :: TestCases/interception_failure_test.cc (345 of 459) UNSUPPORTED: AddressSanitizer-i386-iossim :: TestCases/interface_test.cc (346 of 459) UNSUPPORTED: AddressSanitizer-i386-iossim :: TestCases/intra-object-overflow.cc (347 of 459) UNSUPPORTED: AddressSanitizer-i386-iossim :: TestCases/invalid-free.cc (348 of 459) UNSUPPORTED: AddressSanitizer-i386-iossim :: TestCases/invalid-pointer-pairs-compare-errors.cc (349 of 459) UNSUPPORTED: AddressSanitizer-i386-iossim :: TestCases/invalid-pointer-pairs-compare-null.cc (350 of 459) UNSUPPORTED: AddressSanitizer-i386-iossim :: TestCases/invalid-pointer-pairs-compare-success.cc (351 of 459) UNSUPPORTED: AddressSanitizer-i386-iossim :: TestCases/invalid-pointer-pairs-subtract-errors.cc (352 of 459) UNSUPPORTED: AddressSanitizer-i386-iossim :: TestCases/invalid-pointer-pairs-subtract-success.cc (353 of 459) UNSUPPORTED: AddressSanitizer-i386-iossim :: TestCases/invalid-pointer-pairs.cc (354 of 459) UNSUPPORTED: AddressSanitizer-i386-iossim :: TestCases/large_func_test.cc (355 of 459) UNSUPPORTED: AddressSanitizer-i386-iossim :: TestCases/log-path_test.cc (356 of 459) UNSUPPORTED: AddressSanitizer-i386-iossim :: TestCases/longjmp.cc (357 of 459) UNSUPPORTED: AddressSanitizer-i386-iossim :: TestCases/lsan_annotations.cc (358 of 459) UNSUPPORTED: AddressSanitizer-i386-iossim :: TestCases/malloc-no-intercept.c (359 of 459) UNSUPPORTED: AddressSanitizer-i386-iossim :: TestCases/malloc-size-too-big.cc (360 of 459) UNSUPPORTED: AddressSanitizer-i386-iossim :: TestCases/malloc_context_size.cc (361 of 459) UNSUPPORTED: AddressSanitizer-i386-iossim :: TestCases/malloc_fill.cc (362 of 459) UNSUPPORTED: AddressSanitizer-i386-iossim :: TestCases/max_redzone.cc (363 of 459) UNSUPPORTED: AddressSanitizer-i386-iossim :: TestCases/memcmp_strict_test.cc (364 of 459) UNSUPPORTED: AddressSanitizer-i386-iossim :: TestCases/memcmp_test.cc (365 of 459) UNSUPPORTED: AddressSanitizer-i386-iossim :: TestCases/memset_test.cc (366 of 459) UNSUPPORTED: AddressSanitizer-i386-iossim :: TestCases/non-executable-pc.cpp (367 of 459) UNSUPPORTED: AddressSanitizer-i386-iossim :: TestCases/null_deref.cc (368 of 459) UNSUPPORTED: AddressSanitizer-i386-iossim :: TestCases/on_error_callback.cc (369 of 459) UNSUPPORTED: AddressSanitizer-i386-iossim :: TestCases/partial_right.cc (370 of 459) UNSUPPORTED: AddressSanitizer-i386-iossim :: TestCases/pass-object-byval.cc (371 of 459) UNSUPPORTED: AddressSanitizer-i386-iossim :: TestCases/pass-struct-byval-uar.cc (372 of 459) UNSUPPORTED: AddressSanitizer-i386-iossim :: TestCases/pass-struct-byval.cc (373 of 459) UNSUPPORTED: AddressSanitizer-i386-iossim :: TestCases/poison_partial.cc (374 of 459) UNSUPPORTED: AddressSanitizer-i386-iossim :: TestCases/pr33372.cc (375 of 459) UNSUPPORTED: AddressSanitizer-i386-iossim :: TestCases/print_summary.cc (376 of 459) UNSUPPORTED: AddressSanitizer-i386-iossim :: TestCases/printf-1.c (377 of 459) UNSUPPORTED: AddressSanitizer-i386-iossim :: TestCases/printf-2.c (378 of 459) UNSUPPORTED: AddressSanitizer-i386-iossim :: TestCases/printf-3.c (379 of 459) UNSUPPORTED: AddressSanitizer-i386-iossim :: TestCases/printf-4.c (380 of 459) UNSUPPORTED: AddressSanitizer-i386-iossim :: TestCases/printf-5.c (381 of 459) UNSUPPORTED: AddressSanitizer-i386-iossim :: TestCases/printf-m.c (382 of 459) UNSUPPORTED: AddressSanitizer-i386-iossim :: TestCases/realloc.cc (383 of 459) UNSUPPORTED: AddressSanitizer-i386-iossim :: TestCases/sanity_check_pure_c.c (384 of 459) UNSUPPORTED: AddressSanitizer-i386-iossim :: TestCases/scariness_score_test.cc (385 of 459) UNSUPPORTED: AddressSanitizer-i386-iossim :: TestCases/set_shadow_test.c (386 of 459) UNSUPPORTED: AddressSanitizer-i386-iossim :: TestCases/sleep_after_init.c (387 of 459) UNSUPPORTED: AddressSanitizer-i386-iossim :: TestCases/sleep_before_dying.c (388 of 459) UNSUPPORTED: AddressSanitizer-i386-iossim :: TestCases/small_memcpy_test.cc (389 of 459) UNSUPPORTED: AddressSanitizer-i386-iossim :: TestCases/speculative_load.cc (390 of 459) UNSUPPORTED: AddressSanitizer-i386-iossim :: TestCases/speculative_load2.cc (391 of 459) UNSUPPORTED: AddressSanitizer-i386-iossim :: TestCases/stack-buffer-overflow-with-position.cc (392 of 459) UNSUPPORTED: AddressSanitizer-i386-iossim :: TestCases/stack-buffer-overflow.cc (393 of 459) UNSUPPORTED: AddressSanitizer-i386-iossim :: TestCases/stack-frame-demangle.cc (394 of 459) UNSUPPORTED: AddressSanitizer-i386-iossim :: TestCases/stack-oob-frames.cc (395 of 459) UNSUPPORTED: AddressSanitizer-i386-iossim :: TestCases/strcasestr-1.c (396 of 459) UNSUPPORTED: AddressSanitizer-i386-iossim :: TestCases/strcasestr-2.c (397 of 459) UNSUPPORTED: AddressSanitizer-i386-iossim :: TestCases/strcasestr_strict.c (398 of 459) UNSUPPORTED: AddressSanitizer-i386-iossim :: TestCases/strcat-overlap.cc (399 of 459) UNSUPPORTED: AddressSanitizer-i386-iossim :: TestCases/strcat_strict.c (400 of 459) UNSUPPORTED: AddressSanitizer-i386-iossim :: TestCases/strchr_strict.c (401 of 459) UNSUPPORTED: AddressSanitizer-i386-iossim :: TestCases/strcmp_strict.c (402 of 459) UNSUPPORTED: AddressSanitizer-i386-iossim :: TestCases/strcpy-overlap.cc (403 of 459) UNSUPPORTED: AddressSanitizer-i386-iossim :: TestCases/strcspn-1.c (404 of 459) UNSUPPORTED: AddressSanitizer-i386-iossim :: TestCases/strcspn-2.c (405 of 459) UNSUPPORTED: AddressSanitizer-i386-iossim :: TestCases/strcspn_strict.c (406 of 459) UNSUPPORTED: AddressSanitizer-i386-iossim :: TestCases/strdup_oob_test.cc (407 of 459) UNSUPPORTED: AddressSanitizer-i386-iossim :: TestCases/strip_path_prefix.c (408 of 459) UNSUPPORTED: AddressSanitizer-i386-iossim :: TestCases/strncasecmp_strict.c (409 of 459) UNSUPPORTED: AddressSanitizer-i386-iossim :: TestCases/strncat-overlap.cc (410 of 459) UNSUPPORTED: AddressSanitizer-i386-iossim :: TestCases/strncat_strict.c (411 of 459) UNSUPPORTED: AddressSanitizer-i386-iossim :: TestCases/strncmp_strict.c (412 of 459) UNSUPPORTED: AddressSanitizer-i386-iossim :: TestCases/strncpy-overflow.cc (413 of 459) UNSUPPORTED: AddressSanitizer-i386-iossim :: TestCases/strncpy-overlap.cc (414 of 459) UNSUPPORTED: AddressSanitizer-i386-iossim :: TestCases/strpbrk-1.c (415 of 459) UNSUPPORTED: AddressSanitizer-i386-iossim :: TestCases/strpbrk-2.c (416 of 459) UNSUPPORTED: AddressSanitizer-i386-iossim :: TestCases/strpbrk_strict.c (417 of 459) UNSUPPORTED: AddressSanitizer-i386-iossim :: TestCases/strspn-1.c (418 of 459) UNSUPPORTED: AddressSanitizer-i386-iossim :: TestCases/strspn-2.c (419 of 459) UNSUPPORTED: AddressSanitizer-i386-iossim :: TestCases/strspn_strict.c (420 of 459) UNSUPPORTED: AddressSanitizer-i386-iossim :: TestCases/strstr-1.c (421 of 459) UNSUPPORTED: AddressSanitizer-i386-iossim :: TestCases/strstr-2.c (422 of 459) UNSUPPORTED: AddressSanitizer-i386-iossim :: TestCases/strstr_strict.c (423 of 459) UNSUPPORTED: AddressSanitizer-i386-iossim :: TestCases/strtok.c (424 of 459) UNSUPPORTED: AddressSanitizer-i386-iossim :: TestCases/strtol_strict.c (425 of 459) UNSUPPORTED: AddressSanitizer-i386-iossim :: TestCases/strtoll_strict.c (426 of 459) UNSUPPORTED: AddressSanitizer-i386-iossim :: TestCases/suppressions-exec-relative-location.cc (427 of 459) UNSUPPORTED: AddressSanitizer-i386-iossim :: TestCases/suppressions-function.cc (428 of 459) UNSUPPORTED: AddressSanitizer-i386-iossim :: TestCases/suppressions-interceptor.cc (429 of 459) UNSUPPORTED: AddressSanitizer-i386-iossim :: TestCases/suppressions-library.cc (430 of 459) UNSUPPORTED: AddressSanitizer-i386-iossim :: TestCases/throw_call_test.cc (431 of 459) UNSUPPORTED: AddressSanitizer-i386-iossim :: TestCases/throw_catch.cc (432 of 459) UNSUPPORTED: AddressSanitizer-i386-iossim :: TestCases/throw_invoke_test.cc (433 of 459) UNSUPPORTED: AddressSanitizer-i386-iossim :: TestCases/time_interceptor.cc (434 of 459) UNSUPPORTED: AddressSanitizer-i386-iossim :: TestCases/uar_and_exceptions.cc (435 of 459) UNSUPPORTED: AddressSanitizer-i386-iossim :: TestCases/unaligned_loads_and_stores.cc (436 of 459) UNSUPPORTED: AddressSanitizer-i386-iossim :: TestCases/use-after-delete.cc (437 of 459) UNSUPPORTED: AddressSanitizer-i386-iossim :: TestCases/use-after-free-right.cc (438 of 459) UNSUPPORTED: AddressSanitizer-i386-iossim :: TestCases/use-after-free.cc (439 of 459) UNSUPPORTED: AddressSanitizer-i386-iossim :: TestCases/use-after-poison.cc (440 of 459) UNSUPPORTED: AddressSanitizer-i386-iossim :: TestCases/use-after-scope-capture.cc (441 of 459) UNSUPPORTED: AddressSanitizer-i386-iossim :: TestCases/use-after-scope-conversion.cc (442 of 459) UNSUPPORTED: AddressSanitizer-i386-iossim :: TestCases/use-after-scope-dtor-order.cc (443 of 459) UNSUPPORTED: AddressSanitizer-i386-iossim :: TestCases/use-after-scope-goto.cc (444 of 459) UNSUPPORTED: AddressSanitizer-i386-iossim :: TestCases/use-after-scope-if.cc (445 of 459) UNSUPPORTED: AddressSanitizer-i386-iossim :: TestCases/use-after-scope-inlined.cc (446 of 459) UNSUPPORTED: AddressSanitizer-i386-iossim :: TestCases/use-after-scope-loop-bug.cc (447 of 459) UNSUPPORTED: AddressSanitizer-i386-iossim :: TestCases/use-after-scope-loop-removed.cc (448 of 459) UNSUPPORTED: AddressSanitizer-i386-iossim :: TestCases/use-after-scope-loop.cc (449 of 459) UNSUPPORTED: AddressSanitizer-i386-iossim :: TestCases/use-after-scope-nobug.cc (450 of 459) UNSUPPORTED: AddressSanitizer-i386-iossim :: TestCases/use-after-scope-temp.cc (451 of 459) UNSUPPORTED: AddressSanitizer-i386-iossim :: TestCases/use-after-scope-temp2.cc (452 of 459) UNSUPPORTED: AddressSanitizer-i386-iossim :: TestCases/use-after-scope-types.cc (453 of 459) UNSUPPORTED: AddressSanitizer-i386-iossim :: TestCases/use-after-scope.cc (454 of 459) UNSUPPORTED: AddressSanitizer-i386-iossim :: TestCases/verbose-log-path_test.cc (455 of 459) UNSUPPORTED: AddressSanitizer-i386-iossim :: TestCases/vla_chrome_testcase.cc (456 of 459) UNSUPPORTED: AddressSanitizer-i386-iossim :: TestCases/vla_condition_overflow.cc (457 of 459) UNSUPPORTED: AddressSanitizer-i386-iossim :: TestCases/vla_loop_overfow.cc (458 of 459) UNSUPPORTED: AddressSanitizer-i386-iossim :: TestCases/zero_page_pc.cc (459 of 459) Testing Time: 0.35s Unsupported Tests : 459 + ./bin/llvm-lit -v --xunit-xml-output=tsan-IOSSimX86_64Config.xunit.xml ./tools/clang/runtime/compiler-rt-bins/test/tsan/IOSSimX86_64Config/ llvm-lit: /Users/buildslave/jenkins/workspace/clang-stage1-cmake-RA-expensive/llvm/utils/lit/lit/util.py:408: note: using SDKROOT: '/Applications/Xcode.app/Contents/Developer/Platforms/MacOSX.platform/Developer/SDKs/MacOSX10.13.sdk' llvm-lit: /Users/buildslave/jenkins/workspace/clang-stage1-cmake-RA-expensive/llvm/projects/compiler-rt/test/lit.common.cfg.py:427: warning: Throttling sanitizer tests that require shadow memory on Darwin 64bit {"env": {}} -- Testing: 319 tests, 8 threads -- XFAIL: ThreadSanitizer-x86_64-iossim :: Darwin/dlopen.cc (1 of 319) PASS: ThreadSanitizer-x86_64-iossim :: Darwin/debug_external.cc (2 of 319) PASS: ThreadSanitizer-x86_64-iossim :: Darwin/deadlock.mm (3 of 319) PASS: ThreadSanitizer-x86_64-iossim :: Darwin/external-lib.cc (4 of 319) PASS: ThreadSanitizer-x86_64-iossim :: Darwin/external-noninstrumented-module.cc (5 of 319) PASS: ThreadSanitizer-x86_64-iossim :: Darwin/external-dups.cc (6 of 319) PASS: ThreadSanitizer-x86_64-iossim :: Darwin/external-ignore-noninstrumented.cc (7 of 319) PASS: ThreadSanitizer-x86_64-iossim :: Darwin/external-swift-debugging.cc (8 of 319) PASS: ThreadSanitizer-x86_64-iossim :: Darwin/external-swift.cc (9 of 319) PASS: ThreadSanitizer-x86_64-iossim :: Darwin/gcd-sync-block-copy.mm (10 of 319) PASS: ThreadSanitizer-x86_64-iossim :: Darwin/ignore-noninstrumented.mm (11 of 319) PASS: ThreadSanitizer-x86_64-iossim :: Darwin/libcxx-call-once.mm (12 of 319) PASS: ThreadSanitizer-x86_64-iossim :: Darwin/libcxx-future.mm (13 of 319) PASS: ThreadSanitizer-x86_64-iossim :: Darwin/external.cc (14 of 319) PASS: ThreadSanitizer-x86_64-iossim :: Darwin/libcxx-shared-ptr-recursive.mm (15 of 319) PASS: ThreadSanitizer-x86_64-iossim :: Darwin/main_tid.mm (16 of 319) PASS: ThreadSanitizer-x86_64-iossim :: Darwin/libcxx-shared-ptr-stress.mm (17 of 319) PASS: ThreadSanitizer-x86_64-iossim :: Darwin/libcxx-shared-ptr.mm (18 of 319) PASS: ThreadSanitizer-x86_64-iossim :: Darwin/malloc-stack-logging.cc (19 of 319) PASS: ThreadSanitizer-x86_64-iossim :: Darwin/malloc_size.mm (20 of 319) PASS: ThreadSanitizer-x86_64-iossim :: Darwin/norace-objcxx-run-time.mm (21 of 319) PASS: ThreadSanitizer-x86_64-iossim :: Darwin/objc-race.mm (22 of 319) PASS: ThreadSanitizer-x86_64-iossim :: Darwin/objc-simple.mm (23 of 319) PASS: ThreadSanitizer-x86_64-iossim :: Darwin/objc-synchronize-cycle-tagged.mm (24 of 319) PASS: ThreadSanitizer-x86_64-iossim :: Darwin/objc-synchronize-cycle.mm (25 of 319) PASS: ThreadSanitizer-x86_64-iossim :: Darwin/objc-double-property.mm (26 of 319) PASS: ThreadSanitizer-x86_64-iossim :: Darwin/objc-synchronize-nested-recursive.mm (27 of 319) PASS: ThreadSanitizer-x86_64-iossim :: Darwin/objc-synchronize-tagged.mm (28 of 319) PASS: ThreadSanitizer-x86_64-iossim :: Darwin/objc-synchronize.mm (29 of 319) PASS: ThreadSanitizer-x86_64-iossim :: Darwin/osatomics-add.mm (30 of 319) PASS: ThreadSanitizer-x86_64-iossim :: Darwin/osatomics-bitops.mm (31 of 319) PASS: ThreadSanitizer-x86_64-iossim :: Darwin/osspinlock-norace.cc (32 of 319) PASS: ThreadSanitizer-x86_64-iossim :: Darwin/realloc-zero.cc (33 of 319) PASS: ThreadSanitizer-x86_64-iossim :: Darwin/signals-blocked.cc (34 of 319) PASS: ThreadSanitizer-x86_64-iossim :: Darwin/osatomics-list.mm (35 of 319) PASS: ThreadSanitizer-x86_64-iossim :: Darwin/symbolizer-dladdr.cc (36 of 319) UNSUPPORTED: ThreadSanitizer-x86_64-iossim :: Darwin/xpc-cancel.mm (37 of 319) UNSUPPORTED: ThreadSanitizer-x86_64-iossim :: Darwin/xpc-race.mm (38 of 319) UNSUPPORTED: ThreadSanitizer-x86_64-iossim :: Darwin/xpc.mm (39 of 319) UNSUPPORTED: ThreadSanitizer-x86_64-iossim :: Linux/check_memcpy.c (40 of 319) UNSUPPORTED: ThreadSanitizer-x86_64-iossim :: Linux/check_preinit.cc (41 of 319) UNSUPPORTED: ThreadSanitizer-x86_64-iossim :: Linux/double_race.cc (42 of 319) UNSUPPORTED: ThreadSanitizer-x86_64-iossim :: Linux/mutex_robust.cc (43 of 319) UNSUPPORTED: ThreadSanitizer-x86_64-iossim :: Linux/mutex_robust2.cc (44 of 319) UNSUPPORTED: ThreadSanitizer-x86_64-iossim :: Linux/pie_no_aslr.cc (45 of 319) UNSUPPORTED: ThreadSanitizer-x86_64-iossim :: Linux/thread_timedjoin.c (46 of 319) UNSUPPORTED: ThreadSanitizer-x86_64-iossim :: Linux/thread_tryjoin.c (47 of 319) UNSUPPORTED: ThreadSanitizer-x86_64-iossim :: Linux/user_fopen.cc (48 of 319) UNSUPPORTED: ThreadSanitizer-x86_64-iossim :: Linux/user_malloc.cc (49 of 319) PASS: ThreadSanitizer-x86_64-iossim :: Darwin/workerthreads.mm (50 of 319) PASS: ThreadSanitizer-x86_64-iossim :: aligned_vs_unaligned_race.cc (51 of 319) PASS: ThreadSanitizer-x86_64-iossim :: Darwin/symbolizer-atos.cc (52 of 319) PASS: ThreadSanitizer-x86_64-iossim :: annotate_happens_before.cc (53 of 319) PASS: ThreadSanitizer-x86_64-iossim :: atexit.cc (54 of 319) PASS: ThreadSanitizer-x86_64-iossim :: atexit2.cc (55 of 319) PASS: ThreadSanitizer-x86_64-iossim :: atexit3.cc (56 of 319) PASS: ThreadSanitizer-x86_64-iossim :: atomic_free2.cc (57 of 319) PASS: ThreadSanitizer-x86_64-iossim :: atomic_free3.cc (58 of 319) PASS: ThreadSanitizer-x86_64-iossim :: atomic_hle.cc (59 of 319) PASS: ThreadSanitizer-x86_64-iossim :: atomic_norace.cc (60 of 319) PASS: ThreadSanitizer-x86_64-iossim :: atomic_race.cc (61 of 319) PASS: ThreadSanitizer-x86_64-iossim :: atomic_stack.cc (62 of 319) UNSUPPORTED: ThreadSanitizer-x86_64-iossim :: barrier.cc (63 of 319) UNSUPPORTED: ThreadSanitizer-x86_64-iossim :: bench_acquire_only.cc (64 of 319) UNSUPPORTED: ThreadSanitizer-x86_64-iossim :: bench_acquire_release.cc (65 of 319) UNSUPPORTED: ThreadSanitizer-x86_64-iossim :: bench_local_mutex.cc (66 of 319) UNSUPPORTED: ThreadSanitizer-x86_64-iossim :: bench_mutex.cc (67 of 319) UNSUPPORTED: ThreadSanitizer-x86_64-iossim :: bench_release_only.cc (68 of 319) UNSUPPORTED: ThreadSanitizer-x86_64-iossim :: bench_rwmutex.cc (69 of 319) PASS: ThreadSanitizer-x86_64-iossim :: bench_shadow_flush.cc (70 of 319) UNSUPPORTED: ThreadSanitizer-x86_64-iossim :: bench_single_writer.cc (71 of 319) UNSUPPORTED: ThreadSanitizer-x86_64-iossim :: bench_ten_mutexes.cc (72 of 319) PASS: ThreadSanitizer-x86_64-iossim :: atomic_store.cc (73 of 319) PASS: ThreadSanitizer-x86_64-iossim :: benign_race.cc (74 of 319) PASS: ThreadSanitizer-x86_64-iossim :: blacklist.cc (75 of 319) PASS: ThreadSanitizer-x86_64-iossim :: cond.c (76 of 319) PASS: ThreadSanitizer-x86_64-iossim :: blacklist2.cc (77 of 319) PASS: ThreadSanitizer-x86_64-iossim :: cond_cancel.c (78 of 319) PASS: ThreadSanitizer-x86_64-iossim :: cond_destruction.cc (79 of 319) UNSUPPORTED: ThreadSanitizer-x86_64-iossim :: cond_version.c (80 of 319) PASS: ThreadSanitizer-x86_64-iossim :: cond_race.cc (81 of 319) PASS: ThreadSanitizer-x86_64-iossim :: custom_mutex0.cc (82 of 319) PASS: ThreadSanitizer-x86_64-iossim :: custom_mutex1.cc (83 of 319) PASS: ThreadSanitizer-x86_64-iossim :: atomic_free.cc (84 of 319) PASS: ThreadSanitizer-x86_64-iossim :: custom_mutex2.cc (85 of 319) PASS: ThreadSanitizer-x86_64-iossim :: custom_mutex3.cc (86 of 319) PASS: ThreadSanitizer-x86_64-iossim :: custom_mutex4.cc (87 of 319) PASS: ThreadSanitizer-x86_64-iossim :: cxa_guard_acquire.cc (88 of 319) UNSUPPORTED: ThreadSanitizer-x86_64-iossim :: debug_alloc_stack.cc (89 of 319) PASS: ThreadSanitizer-x86_64-iossim :: custom_mutex5.cc (90 of 319) PASS: ThreadSanitizer-x86_64-iossim :: debug_locate.cc (91 of 319) PASS: ThreadSanitizer-x86_64-iossim :: debugging.cc (92 of 319) PASS: ThreadSanitizer-x86_64-iossim :: default_options.cc (93 of 319) UNSUPPORTED: ThreadSanitizer-x86_64-iossim :: dl_iterate_phdr.cc (94 of 319) PASS: ThreadSanitizer-x86_64-iossim :: deep_stack1.cc (95 of 319) PASS: ThreadSanitizer-x86_64-iossim :: dlclose.cc (96 of 319) PASS: ThreadSanitizer-x86_64-iossim :: dtls.c (97 of 319) PASS: ThreadSanitizer-x86_64-iossim :: fd_close_norace.cc (98 of 319) PASS: ThreadSanitizer-x86_64-iossim :: fd_close_norace2.cc (99 of 319) PASS: ThreadSanitizer-x86_64-iossim :: exceptions.cc (100 of 319) PASS: ThreadSanitizer-x86_64-iossim :: fd_dup_norace.cc (101 of 319) PASS: ThreadSanitizer-x86_64-iossim :: fd_dup_norace2.cc (102 of 319) PASS: ThreadSanitizer-x86_64-iossim :: fd_dup_race.cc (103 of 319) PASS: ThreadSanitizer-x86_64-iossim :: fd_location.cc (104 of 319) PASS: ThreadSanitizer-x86_64-iossim :: fd_pipe_norace.cc (105 of 319) PASS: ThreadSanitizer-x86_64-iossim :: fd_socket_connect_norace.cc (106 of 319) PASS: ThreadSanitizer-x86_64-iossim :: fd_pipe_race.cc (107 of 319) PASS: ThreadSanitizer-x86_64-iossim :: deadlock_detector_stress_test.cc (108 of 319) PASS: ThreadSanitizer-x86_64-iossim :: fd_socket_norace.cc (109 of 319) PASS: ThreadSanitizer-x86_64-iossim :: fd_socketpair_norace.cc (110 of 319) PASS: ThreadSanitizer-x86_64-iossim :: fiber_asm.cc (111 of 319) PASS: ThreadSanitizer-x86_64-iossim :: fd_stdout_race.cc (112 of 319) PASS: ThreadSanitizer-x86_64-iossim :: fd_tid_recycled.cc (113 of 319) XPASS: ThreadSanitizer-x86_64-iossim :: fiber_from_thread.cc (114 of 319) ******************** TEST 'ThreadSanitizer-x86_64-iossim :: fiber_from_thread.cc' FAILED ******************** Script: -- : 'RUN: at line 1'; /Users/buildslave/jenkins/workspace/clang-stage1-cmake-RA-expensive/llvm/projects/compiler-rt/test/sanitizer_common/ios_commands/iossim_compile.py /Users/buildslave/jenkins/workspace/clang-stage1-cmake-RA-expensive/clang-build/./bin/clang -fsanitize=thread -Wall -arch x86_64 -isysroot /Applications/Xcode.app/Contents/Developer/Platforms/iPhoneSimulator.platform/Developer/SDKs/iPhoneSimulator11.4.sdk -gline-tables-only -I/Users/buildslave/jenkins/workspace/clang-stage1-cmake-RA-expensive/llvm/projects/compiler-rt/test/tsan/../ -O1 /Users/buildslave/jenkins/workspace/clang-stage1-cmake-RA-expensive/llvm/projects/compiler-rt/test/tsan/fiber_from_thread.cc -o /Users/buildslave/jenkins/workspace/clang-stage1-cmake-RA-expensive/clang-build/tools/clang/runtime/compiler-rt-bins/test/tsan/IOSSimX86_64Config/Output/fiber_from_thread.cc.tmp && /Users/buildslave/jenkins/workspace/clang-stage1-cmake-RA-expensive/llvm/projects/compiler-rt/test/sanitizer_common/ios_commands/iossim_run.py /Users/buildslave/jenkins/workspace/clang-stage1-cmake-RA-expensive/clang-build/tools/clang/runtime/compiler-rt-bins/test/tsan/IOSSimX86_64Config/Output/fiber_from_thread.cc.tmp 2>&1 | FileCheck /Users/buildslave/jenkins/workspace/clang-stage1-cmake-RA-expensive/llvm/projects/compiler-rt/test/tsan/fiber_from_thread.cc -- Exit Code: 0

Hide Details

Hide Details

******************** XPASS: ThreadSanitizer-x86_64-iossim :: fiber_longjmp.cc (115 of 319) ******************** TEST 'ThreadSanitizer-x86_64-iossim :: fiber_longjmp.cc' FAILED ******************** Script: -- : 'RUN: at line 1'; /Users/buildslave/jenkins/workspace/clang-stage1-cmake-RA-expensive/llvm/projects/compiler-rt/test/sanitizer_common/ios_commands/iossim_compile.py /Users/buildslave/jenkins/workspace/clang-stage1-cmake-RA-expensive/clang-build/./bin/clang -fsanitize=thread -Wall -arch x86_64 -isysroot /Applications/Xcode.app/Contents/Developer/Platforms/iPhoneSimulator.platform/Developer/SDKs/iPhoneSimulator11.4.sdk -gline-tables-only -I/Users/buildslave/jenkins/workspace/clang-stage1-cmake-RA-expensive/llvm/projects/compiler-rt/test/tsan/../ -O1 /Users/buildslave/jenkins/workspace/clang-stage1-cmake-RA-expensive/llvm/projects/compiler-rt/test/tsan/fiber_longjmp.cc -o /Users/buildslave/jenkins/workspace/clang-stage1-cmake-RA-expensive/clang-build/tools/clang/runtime/compiler-rt-bins/test/tsan/IOSSimX86_64Config/Output/fiber_longjmp.cc.tmp && /Users/buildslave/jenkins/workspace/clang-stage1-cmake-RA-expensive/llvm/projects/compiler-rt/test/sanitizer_common/ios_commands/iossim_run.py /Users/buildslave/jenkins/workspace/clang-stage1-cmake-RA-expensive/clang-build/tools/clang/runtime/compiler-rt-bins/test/tsan/IOSSimX86_64Config/Output/fiber_longjmp.cc.tmp 2>&1 | FileCheck /Users/buildslave/jenkins/workspace/clang-stage1-cmake-RA-expensive/llvm/projects/compiler-rt/test/tsan/fiber_longjmp.cc -- Exit Code: 0

Hide Details

Hide Details

******************** XPASS: ThreadSanitizer-x86_64-iossim :: fiber_race.cc (116 of 319) ******************** TEST 'ThreadSanitizer-x86_64-iossim :: fiber_race.cc' FAILED ******************** Script: -- : 'RUN: at line 1'; /Users/buildslave/jenkins/workspace/clang-stage1-cmake-RA-expensive/llvm/projects/compiler-rt/test/sanitizer_common/ios_commands/iossim_compile.py /Users/buildslave/jenkins/workspace/clang-stage1-cmake-RA-expensive/clang-build/./bin/clang -fsanitize=thread -Wall -arch x86_64 -isysroot /Applications/Xcode.app/Contents/Developer/Platforms/iPhoneSimulator.platform/Developer/SDKs/iPhoneSimulator11.4.sdk -gline-tables-only -I/Users/buildslave/jenkins/workspace/clang-stage1-cmake-RA-expensive/llvm/projects/compiler-rt/test/tsan/../ -O1 /Users/buildslave/jenkins/workspace/clang-stage1-cmake-RA-expensive/llvm/projects/compiler-rt/test/tsan/fiber_race.cc -o /Users/buildslave/jenkins/workspace/clang-stage1-cmake-RA-expensive/clang-build/tools/clang/runtime/compiler-rt-bins/test/tsan/IOSSimX86_64Config/Output/fiber_race.cc.tmp && /Users/buildslave/jenkins/workspace/clang-stage1-cmake-RA-expensive/llvm/projects/compiler-rt/test/tsan/deflake.bash /Users/buildslave/jenkins/workspace/clang-stage1-cmake-RA-expensive/llvm/projects/compiler-rt/test/sanitizer_common/ios_commands/iossim_run.py /Users/buildslave/jenkins/workspace/clang-stage1-cmake-RA-expensive/clang-build/tools/clang/runtime/compiler-rt-bins/test/tsan/IOSSimX86_64Config/Output/fiber_race.cc.tmp 2>&1 | FileCheck /Users/buildslave/jenkins/workspace/clang-stage1-cmake-RA-expensive/llvm/projects/compiler-rt/test/tsan/fiber_race.cc -- Exit Code: 0

Hide Details

Hide Details

******************** XPASS: ThreadSanitizer-x86_64-iossim :: fiber_simple.cc (117 of 319) ******************** TEST 'ThreadSanitizer-x86_64-iossim :: fiber_simple.cc' FAILED ******************** Script: -- : 'RUN: at line 1'; /Users/buildslave/jenkins/workspace/clang-stage1-cmake-RA-expensive/llvm/projects/compiler-rt/test/sanitizer_common/ios_commands/iossim_compile.py /Users/buildslave/jenkins/workspace/clang-stage1-cmake-RA-expensive/clang-build/./bin/clang -fsanitize=thread -Wall -arch x86_64 -isysroot /Applications/Xcode.app/Contents/Developer/Platforms/iPhoneSimulator.platform/Developer/SDKs/iPhoneSimulator11.4.sdk -gline-tables-only -I/Users/buildslave/jenkins/workspace/clang-stage1-cmake-RA-expensive/llvm/projects/compiler-rt/test/tsan/../ -O1 /Users/buildslave/jenkins/workspace/clang-stage1-cmake-RA-expensive/llvm/projects/compiler-rt/test/tsan/fiber_simple.cc -o /Users/buildslave/jenkins/workspace/clang-stage1-cmake-RA-expensive/clang-build/tools/clang/runtime/compiler-rt-bins/test/tsan/IOSSimX86_64Config/Output/fiber_simple.cc.tmp && /Users/buildslave/jenkins/workspace/clang-stage1-cmake-RA-expensive/llvm/projects/compiler-rt/test/sanitizer_common/ios_commands/iossim_run.py /Users/buildslave/jenkins/workspace/clang-stage1-cmake-RA-expensive/clang-build/tools/clang/runtime/compiler-rt-bins/test/tsan/IOSSimX86_64Config/Output/fiber_simple.cc.tmp 2>&1 | FileCheck /Users/buildslave/jenkins/workspace/clang-stage1-cmake-RA-expensive/llvm/projects/compiler-rt/test/tsan/fiber_simple.cc -- Exit Code: 0

Hide Details

Hide Details

******************** XPASS: ThreadSanitizer-x86_64-iossim :: fiber_two_threads.cc (118 of 319) ******************** TEST 'ThreadSanitizer-x86_64-iossim :: fiber_two_threads.cc' FAILED ******************** Script: -- : 'RUN: at line 1'; /Users/buildslave/jenkins/workspace/clang-stage1-cmake-RA-expensive/llvm/projects/compiler-rt/test/sanitizer_common/ios_commands/iossim_compile.py /Users/buildslave/jenkins/workspace/clang-stage1-cmake-RA-expensive/clang-build/./bin/clang -fsanitize=thread -Wall -arch x86_64 -isysroot /Applications/Xcode.app/Contents/Developer/Platforms/iPhoneSimulator.platform/Developer/SDKs/iPhoneSimulator11.4.sdk -gline-tables-only -I/Users/buildslave/jenkins/workspace/clang-stage1-cmake-RA-expensive/llvm/projects/compiler-rt/test/tsan/../ -O1 /Users/buildslave/jenkins/workspace/clang-stage1-cmake-RA-expensive/llvm/projects/compiler-rt/test/tsan/fiber_two_threads.cc -o /Users/buildslave/jenkins/workspace/clang-stage1-cmake-RA-expensive/clang-build/tools/clang/runtime/compiler-rt-bins/test/tsan/IOSSimX86_64Config/Output/fiber_two_threads.cc.tmp && /Users/buildslave/jenkins/workspace/clang-stage1-cmake-RA-expensive/llvm/projects/compiler-rt/test/sanitizer_common/ios_commands/iossim_run.py /Users/buildslave/jenkins/workspace/clang-stage1-cmake-RA-expensive/clang-build/tools/clang/runtime/compiler-rt-bins/test/tsan/IOSSimX86_64Config/Output/fiber_two_threads.cc.tmp 2>&1 | FileCheck /Users/buildslave/jenkins/workspace/clang-stage1-cmake-RA-expensive/llvm/projects/compiler-rt/test/tsan/fiber_two_threads.cc -- Exit Code: 0

Hide Details

Hide Details

******************** PASS: ThreadSanitizer-x86_64-iossim :: fork_atexit.cc (119 of 319) PASS: ThreadSanitizer-x86_64-iossim :: fork_multithreaded3.cc (120 of 319) PASS: ThreadSanitizer-x86_64-iossim :: fork_multithreaded.cc (121 of 319) PASS: ThreadSanitizer-x86_64-iossim :: free_race2.c (122 of 319) PASS: ThreadSanitizer-x86_64-iossim :: free_race.c (123 of 319) PASS: ThreadSanitizer-x86_64-iossim :: getline_nohang.cc (124 of 319) PASS: ThreadSanitizer-x86_64-iossim :: fork_deadlock.cc (125 of 319) PASS: ThreadSanitizer-x86_64-iossim :: global_race2.cc (126 of 319) PASS: ThreadSanitizer-x86_64-iossim :: global_race3.cc (127 of 319) PASS: ThreadSanitizer-x86_64-iossim :: halt_on_error.cc (128 of 319) PASS: ThreadSanitizer-x86_64-iossim :: heap_race.cc (129 of 319) UNSUPPORTED: ThreadSanitizer-x86_64-iossim :: ignore_lib0.cc (130 of 319) PASS: ThreadSanitizer-x86_64-iossim :: ignore_free.cc (131 of 319) PASS: ThreadSanitizer-x86_64-iossim :: ignore_lib2.cc (132 of 319) PASS: ThreadSanitizer-x86_64-iossim :: ignore_lib1.cc (133 of 319) PASS: ThreadSanitizer-x86_64-iossim :: ignore_lib3.cc (134 of 319) PASS: ThreadSanitizer-x86_64-iossim :: ignore_lib5.cc (135 of 319) PASS: ThreadSanitizer-x86_64-iossim :: global_race.cc (136 of 319) PASS: ThreadSanitizer-x86_64-iossim :: ignore_lib4.cc (137 of 319) PASS: ThreadSanitizer-x86_64-iossim :: ignore_malloc.cc (138 of 319) PASS: ThreadSanitizer-x86_64-iossim :: ignore_race.cc (139 of 319) PASS: ThreadSanitizer-x86_64-iossim :: ignore_sync.cc (140 of 319) PASS: ThreadSanitizer-x86_64-iossim :: ignored-interceptors-mmap.cc (141 of 319) PASS: ThreadSanitizer-x86_64-iossim :: inlined_memcpy_race.cc (142 of 319) PASS: ThreadSanitizer-x86_64-iossim :: inlined_memcpy_race2.cc (143 of 319) PASS: ThreadSanitizer-x86_64-iossim :: interface_atomic_test.c (144 of 319) PASS: ThreadSanitizer-x86_64-iossim :: java_alloc.cc (145 of 319) PASS: ThreadSanitizer-x86_64-iossim :: java_finalizer.cc (146 of 319) PASS: ThreadSanitizer-x86_64-iossim :: java_find.cc (147 of 319) PASS: ThreadSanitizer-x86_64-iossim :: java_heap_init.cc (148 of 319) PASS: ThreadSanitizer-x86_64-iossim :: java_lock.cc (149 of 319) PASS: ThreadSanitizer-x86_64-iossim :: java_lock_move.cc (150 of 319) PASS: ThreadSanitizer-x86_64-iossim :: java_lock_rec.cc (151 of 319) PASS: ThreadSanitizer-x86_64-iossim :: java_lock_rec_race.cc (152 of 319) PASS: ThreadSanitizer-x86_64-iossim :: java_move_overlap.cc (153 of 319) PASS: ThreadSanitizer-x86_64-iossim :: java_move_overlap_race.cc (154 of 319) PASS: ThreadSanitizer-x86_64-iossim :: java_race.cc (155 of 319) PASS: ThreadSanitizer-x86_64-iossim :: java_race_move.cc (156 of 319) PASS: ThreadSanitizer-x86_64-iossim :: java_rwlock.cc (157 of 319) PASS: ThreadSanitizer-x86_64-iossim :: java_race_pc.cc (158 of 319) PASS: ThreadSanitizer-x86_64-iossim :: java_symbolization.cc (159 of 319) UNSUPPORTED: ThreadSanitizer-x86_64-iossim :: large_malloc_meta.cc (160 of 319) PASS: ThreadSanitizer-x86_64-iossim :: java_symbolization_legacy.cc (161 of 319) PASS: ThreadSanitizer-x86_64-iossim :: java_volatile.cc (162 of 319) PASS: ThreadSanitizer-x86_64-iossim :: libdispatch/after.c (163 of 319) PASS: ThreadSanitizer-x86_64-iossim :: libdispatch/apply-race.c (164 of 319) PASS: ThreadSanitizer-x86_64-iossim :: libdispatch/apply.c (165 of 319) PASS: ThreadSanitizer-x86_64-iossim :: libdispatch/async-norace.c (166 of 319) PASS: ThreadSanitizer-x86_64-iossim :: libcxx/std_shared_ptr.cc (167 of 319) PASS: ThreadSanitizer-x86_64-iossim :: libdispatch/async-race.c (168 of 319) PASS: ThreadSanitizer-x86_64-iossim :: libdispatch/barrier.c (169 of 319) PASS: ThreadSanitizer-x86_64-iossim :: libdispatch/barrier-race.c (170 of 319) PASS: ThreadSanitizer-x86_64-iossim :: libdispatch/blocks.c (171 of 319) PASS: ThreadSanitizer-x86_64-iossim :: libdispatch/data.c (172 of 319) PASS: ThreadSanitizer-x86_64-iossim :: libdispatch/fd.c (173 of 319) PASS: ThreadSanitizer-x86_64-iossim :: libdispatch/dispatch_main.c (174 of 319) PASS: ThreadSanitizer-x86_64-iossim :: libdispatch/dispatch_once_deadlock.c (175 of 319) PASS: ThreadSanitizer-x86_64-iossim :: libdispatch/groups-leave.c (176 of 319) PASS: ThreadSanitizer-x86_64-iossim :: libdispatch/groups-norace.c (177 of 319) PASS: ThreadSanitizer-x86_64-iossim :: libdispatch/groups-destructor.cc (178 of 319) PASS: ThreadSanitizer-x86_64-iossim :: libdispatch/io-barrier.c (179 of 319) PASS: ThreadSanitizer-x86_64-iossim :: libdispatch/io-barrier-race.c (180 of 319) PASS: ThreadSanitizer-x86_64-iossim :: libdispatch/io-cleanup.c (181 of 319) PASS: ThreadSanitizer-x86_64-iossim :: libdispatch/groups-stress.c (182 of 319) PASS: ThreadSanitizer-x86_64-iossim :: libdispatch/io.c (183 of 319) PASS: ThreadSanitizer-x86_64-iossim :: libdispatch/io-race.c (184 of 319) PASS: ThreadSanitizer-x86_64-iossim :: libdispatch/once.c (185 of 319) PASS: ThreadSanitizer-x86_64-iossim :: libdispatch/semaphore-norace.c (186 of 319) PASS: ThreadSanitizer-x86_64-iossim :: libdispatch/serial-queue-norace.c (187 of 319) PASS: ThreadSanitizer-x86_64-iossim :: libdispatch/source-cancel.c (188 of 319) PASS: ThreadSanitizer-x86_64-iossim :: libdispatch/source-cancel2.c (189 of 319) PASS: ThreadSanitizer-x86_64-iossim :: libdispatch/source-event.c (190 of 319) PASS: ThreadSanitizer-x86_64-iossim :: libdispatch/source-event2.c (191 of 319) PASS: ThreadSanitizer-x86_64-iossim :: libdispatch/source-registration.c (192 of 319) PASS: ThreadSanitizer-x86_64-iossim :: libdispatch/source-registration2.c (193 of 319) PASS: ThreadSanitizer-x86_64-iossim :: libdispatch/source-serial.c (194 of 319) PASS: ThreadSanitizer-x86_64-iossim :: libdispatch/suspend.c (195 of 319) PASS: ThreadSanitizer-x86_64-iossim :: libdispatch/sync-norace.c (196 of 319) PASS: ThreadSanitizer-x86_64-iossim :: libdispatch/sync-block-copy.cc (197 of 319) PASS: ThreadSanitizer-x86_64-iossim :: libdispatch/sync-race.c (198 of 319) PASS: ThreadSanitizer-x86_64-iossim :: libdispatch/target-queue-norace.c (199 of 319) PASS: ThreadSanitizer-x86_64-iossim :: longjmp.cc (200 of 319) PASS: ThreadSanitizer-x86_64-iossim :: longjmp2.cc (201 of 319) PASS: ThreadSanitizer-x86_64-iossim :: load_shared_lib.cc (202 of 319) PASS: ThreadSanitizer-x86_64-iossim :: longjmp3.cc (203 of 319) PASS: ThreadSanitizer-x86_64-iossim :: longjmp4.cc (204 of 319) PASS: ThreadSanitizer-x86_64-iossim :: malloc_overflow.cc (205 of 319) UNSUPPORTED: ThreadSanitizer-x86_64-iossim :: map32bit.cc (206 of 319) PASS: ThreadSanitizer-x86_64-iossim :: lots_of_threads.c (207 of 319) PASS: ThreadSanitizer-x86_64-iossim :: malloc_stack.cc (208 of 319) UNSUPPORTED: ThreadSanitizer-x86_64-iossim :: mmap_large.cc (209 of 319) PASS: ThreadSanitizer-x86_64-iossim :: memcmp_race.cc (210 of 319) PASS: ThreadSanitizer-x86_64-iossim :: mmap_stress.cc (211 of 319) PASS: ThreadSanitizer-x86_64-iossim :: memcpy_race.cc (212 of 319) PASS: ThreadSanitizer-x86_64-iossim :: mop1.c (213 of 319) XFAIL: ThreadSanitizer-x86_64-iossim :: must_deadlock.cc (214 of 319) PASS: ThreadSanitizer-x86_64-iossim :: mop_with_offset.cc (215 of 319) PASS: ThreadSanitizer-x86_64-iossim :: mop_with_offset2.cc (216 of 319) PASS: ThreadSanitizer-x86_64-iossim :: mutex_annotations.cc (217 of 319) PASS: ThreadSanitizer-x86_64-iossim :: mutex_bad_read_lock.cc (218 of 319) PASS: ThreadSanitizer-x86_64-iossim :: mutex_bad_read_unlock.cc (219 of 319) PASS: ThreadSanitizer-x86_64-iossim :: mutex_bad_unlock.cc (220 of 319) PASS: ThreadSanitizer-x86_64-iossim :: mutex_destroy_locked.cc (221 of 319) PASS: ThreadSanitizer-x86_64-iossim :: mutex_destroy_locked2.cc (222 of 319) PASS: ThreadSanitizer-x86_64-iossim :: mutex_double_lock.cc (223 of 319) PASS: ThreadSanitizer-x86_64-iossim :: mutex_cycle2.c (224 of 319) PASS: ThreadSanitizer-x86_64-iossim :: mutex_cycle_long.c (225 of 319) PASS: ThreadSanitizer-x86_64-iossim :: mutexset1.cc (226 of 319) PASS: ThreadSanitizer-x86_64-iossim :: mutex_lock_destroyed.cc (227 of 319) PASS: ThreadSanitizer-x86_64-iossim :: mutexset2.cc (228 of 319) PASS: ThreadSanitizer-x86_64-iossim :: mutexset3.cc (229 of 319) PASS: ThreadSanitizer-x86_64-iossim :: mutexset5.cc (230 of 319) PASS: ThreadSanitizer-x86_64-iossim :: mutexset4.cc (231 of 319) PASS: ThreadSanitizer-x86_64-iossim :: mutexset6.cc (232 of 319) PASS: ThreadSanitizer-x86_64-iossim :: mutexset8.cc (233 of 319) PASS: ThreadSanitizer-x86_64-iossim :: mutexset7.cc (234 of 319) PASS: ThreadSanitizer-x86_64-iossim :: pie_test.cc (235 of 319) PASS: ThreadSanitizer-x86_64-iossim :: pthread_atfork_deadlock.c (236 of 319) UNSUPPORTED: ThreadSanitizer-x86_64-iossim :: race_on_barrier.c (237 of 319) UNSUPPORTED: ThreadSanitizer-x86_64-iossim :: race_on_barrier2.c (238 of 319) PASS: ThreadSanitizer-x86_64-iossim :: pthread_key.cc (239 of 319) PASS: ThreadSanitizer-x86_64-iossim :: printf-1.c (240 of 319) PASS: ThreadSanitizer-x86_64-iossim :: race_on_fputs.cc (241 of 319) PASS: ThreadSanitizer-x86_64-iossim :: race_on_mutex.c (242 of 319) PASS: ThreadSanitizer-x86_64-iossim :: race_on_heap.cc (243 of 319) PASS: ThreadSanitizer-x86_64-iossim :: race_on_mutex2.c (244 of 319) PASS: ThreadSanitizer-x86_64-iossim :: race_on_puts.cc (245 of 319) PASS: ThreadSanitizer-x86_64-iossim :: race_on_read.cc (246 of 319) PASS: ThreadSanitizer-x86_64-iossim :: race_on_speculative_load.cc (247 of 319) PASS: ThreadSanitizer-x86_64-iossim :: race_on_write.cc (248 of 319) PASS: ThreadSanitizer-x86_64-iossim :: race_stress.cc (249 of 319) PASS: ThreadSanitizer-x86_64-iossim :: race_top_suppression.cc (250 of 319) PASS: ThreadSanitizer-x86_64-iossim :: race_top_suppression1.cc (251 of 319) PASS: ThreadSanitizer-x86_64-iossim :: race_with_finished_thread.cc (252 of 319) PASS: ThreadSanitizer-x86_64-iossim :: setuid.c (253 of 319) PASS: ThreadSanitizer-x86_64-iossim :: real_deadlock_detector_stress_test.cc (254 of 319) PASS: ThreadSanitizer-x86_64-iossim :: signal_block.cc (255 of 319) PASS: ThreadSanitizer-x86_64-iossim :: setuid2.c (256 of 319) PASS: ThreadSanitizer-x86_64-iossim :: restore_stack.cc (257 of 319) PASS: ThreadSanitizer-x86_64-iossim :: signal_cond.cc (258 of 319) PASS: ThreadSanitizer-x86_64-iossim :: signal_longjmp.cc (259 of 319) PASS: ThreadSanitizer-x86_64-iossim :: signal_errno.cc (260 of 319) UNSUPPORTED: ThreadSanitizer-x86_64-iossim :: signal_recursive.cc (261 of 319) UNSUPPORTED: ThreadSanitizer-x86_64-iossim :: signal_reset.cc (262 of 319) UNSUPPORTED: ThreadSanitizer-x86_64-iossim :: signal_sync.cc (263 of 319) UNSUPPORTED: ThreadSanitizer-x86_64-iossim :: signal_sync2.cc (264 of 319) UNSUPPORTED: ThreadSanitizer-x86_64-iossim :: signal_thread.cc (265 of 319) PASS: ThreadSanitizer-x86_64-iossim :: signal_pause.cc (266 of 319) PASS: ThreadSanitizer-x86_64-iossim :: signal_write.cc (267 of 319) PASS: ThreadSanitizer-x86_64-iossim :: signal_malloc.cc (268 of 319) PASS: ThreadSanitizer-x86_64-iossim :: sigsuspend.cc (269 of 319) PASS: ThreadSanitizer-x86_64-iossim :: simple_race.c (270 of 319) PASS: ThreadSanitizer-x86_64-iossim :: simple_race.cc (271 of 319) PASS: ThreadSanitizer-x86_64-iossim :: simple_stack2.cc (272 of 319) PASS: ThreadSanitizer-x86_64-iossim :: sleep_sync.cc (273 of 319) PASS: ThreadSanitizer-x86_64-iossim :: simple_stack.c (274 of 319) PASS: ThreadSanitizer-x86_64-iossim :: sleep_sync2.cc (275 of 319) PASS: ThreadSanitizer-x86_64-iossim :: stack_race.cc (276 of 319) PASS: ThreadSanitizer-x86_64-iossim :: stack_sync_reuse.cc (277 of 319) PASS: ThreadSanitizer-x86_64-iossim :: static_init1.cc (278 of 319) PASS: ThreadSanitizer-x86_64-iossim :: stack_race2.cc (279 of 319) PASS: ThreadSanitizer-x86_64-iossim :: static_init2.cc (280 of 319) PASS: ThreadSanitizer-x86_64-iossim :: static_init4.cc (281 of 319) PASS: ThreadSanitizer-x86_64-iossim :: static_init3.cc (282 of 319) UNSUPPORTED: ThreadSanitizer-x86_64-iossim :: strerror_r.cc (283 of 319) UNSUPPORTED: ThreadSanitizer-x86_64-iossim :: sunrpc.cc (284 of 319) PASS: ThreadSanitizer-x86_64-iossim :: static_init5.cc (285 of 319) PASS: ThreadSanitizer-x86_64-iossim :: static_init6.cc (286 of 319) PASS: ThreadSanitizer-x86_64-iossim :: suppress_same_address.cc (287 of 319) PASS: ThreadSanitizer-x86_64-iossim :: suppress_same_stacks.cc (288 of 319) PASS: ThreadSanitizer-x86_64-iossim :: suppressions_global.cc (289 of 319) PASS: ThreadSanitizer-x86_64-iossim :: suppressions_race.cc (290 of 319) PASS: ThreadSanitizer-x86_64-iossim :: suppressions_mutex.cc (291 of 319) PASS: ThreadSanitizer-x86_64-iossim :: suppressions_race2.cc (292 of 319) PASS: ThreadSanitizer-x86_64-iossim :: thread_detach2.c (293 of 319) PASS: ThreadSanitizer-x86_64-iossim :: thread_detach.c (294 of 319) PASS: ThreadSanitizer-x86_64-iossim :: thread_end_with_ignore.cc (295 of 319) PASS: ThreadSanitizer-x86_64-iossim :: thread_end_with_ignore2.cc (296 of 319) PASS: ThreadSanitizer-x86_64-iossim :: thread_exit.c (297 of 319) PASS: ThreadSanitizer-x86_64-iossim :: thread_end_with_ignore3.cc (298 of 319) PASS: ThreadSanitizer-x86_64-iossim :: thread_leak.c (299 of 319) PASS: ThreadSanitizer-x86_64-iossim :: thread_leak2.c (300 of 319) PASS: ThreadSanitizer-x86_64-iossim :: thread_leak4.c (301 of 319) PASS: ThreadSanitizer-x86_64-iossim :: thread_leak3.c (302 of 319) UNSUPPORTED: ThreadSanitizer-x86_64-iossim :: thread_name2.cc (303 of 319) PASS: ThreadSanitizer-x86_64-iossim :: thread_leak5.c (304 of 319) PASS: ThreadSanitizer-x86_64-iossim :: thread_name.cc (305 of 319) PASS: ThreadSanitizer-x86_64-iossim :: tiny_race.c (306 of 319) PASS: ThreadSanitizer-x86_64-iossim :: tls_race.cc (307 of 319) PASS: ThreadSanitizer-x86_64-iossim :: tls_race2.cc (308 of 319) PASS: ThreadSanitizer-x86_64-iossim :: unaligned_norace.cc (309 of 319) PASS: ThreadSanitizer-x86_64-iossim :: tsan-vs-gvn.cc (310 of 319) PASS: ThreadSanitizer-x86_64-iossim :: virtual_inheritance_compile_bug.cc (311 of 319) PASS: ThreadSanitizer-x86_64-iossim :: vfork.cc (312 of 319) PASS: ThreadSanitizer-x86_64-iossim :: vptr_benign_race.cc (313 of 319) PASS: ThreadSanitizer-x86_64-iossim :: unaligned_race.cc (314 of 319) PASS: ThreadSanitizer-x86_64-iossim :: vptr_harmful_race.cc (315 of 319) PASS: ThreadSanitizer-x86_64-iossim :: vptr_harmful_race2.cc (316 of 319) PASS: ThreadSanitizer-x86_64-iossim :: vptr_harmful_race4.cc (317 of 319) PASS: ThreadSanitizer-x86_64-iossim :: vptr_harmful_race3.cc (318 of 319) PASS: ThreadSanitizer-x86_64-iossim :: write_in_reader_lock.cc (319 of 319)

Hide Details

1 warning(s) in tests. Testing Time: 347.21s ******************** Unexpected Passing Tests (5): ThreadSanitizer-x86_64-iossim :: fiber_from_thread.cc ThreadSanitizer-x86_64-iossim :: fiber_longjmp.cc ThreadSanitizer-x86_64-iossim :: fiber_race.cc ThreadSanitizer-x86_64-iossim :: fiber_simple.cc ThreadSanitizer-x86_64-iossim :: fiber_two_threads.cc

Hide Details

Expected Passes : 273 Expected Failures : 2 Unsupported Tests : 39 Unexpected Passes : 5 Build step 'Execute shell' marked build as failure Recording test results [BFA] Scanning build for known causes... [BFA] Found failure cause(s): [BFA] Regression test failed from category Test [BFA] Unexpected pass from category Tests [BFA] Done. 5s No emails were triggered. Finished: FAILURE