FailedConsole Output

Skipping 14,150 KB.. Full Log
/MacOSX.platform/Developer/SDKs/MacOSX10.14.sdk  -fsanitize=implicit-integer-truncation -fno-sanitize-recover=implicit-integer-truncation -fsanitize-blacklist=/Users/buildslave/jenkins/workspace/clang-stage2-Rthinlto/clang-build/Build/tools/clang/runtime/compiler-rt-bins/test/ubsan/ThreadSanitizer-x86_64/TestCases/ImplicitConversion/Output/signed-integer-truncation-blacklist.c.tmpmp -O2 /Users/buildslave/jenkins/workspace/clang-stage2-Rthinlto/llvm/projects/compiler-rt/test/ubsan/TestCases/ImplicitConversion/signed-integer-truncation-blacklist.c -o /Users/buildslave/jenkins/workspace/clang-stage2-Rthinlto/clang-build/Build/tools/clang/runtime/compiler-rt-bins/test/ubsan/ThreadSanitizer-x86_64/TestCases/ImplicitConversion/Output/signed-integer-truncation-blacklist.c.tmp && not  /Users/buildslave/jenkins/workspace/clang-stage2-Rthinlto/clang-build/Build/tools/clang/runtime/compiler-rt-bins/test/ubsan/ThreadSanitizer-x86_64/TestCases/ImplicitConversion/Output/signed-integer-truncation-blacklist.c.tmp 2>&1 | not FileCheck /Users/buildslave/jenkins/workspace/clang-stage2-Rthinlto/llvm/projects/compiler-rt/test/ubsan/TestCases/ImplicitConversion/signed-integer-truncation-blacklist.c
: 'RUN: at line 41';      /Users/buildslave/jenkins/workspace/clang-stage2-Rthinlto/clang-build/Build/./bin/clang  -fsanitize=thread  -arch x86_64 -stdlib=libc++ -mmacosx-version-min=10.9 -isysroot /Applications/Xcode.app/Contents/Developer/Platforms/MacOSX.platform/Developer/SDKs/MacOSX10.14.sdk  -fsanitize=implicit-integer-truncation -fno-sanitize-recover=implicit-integer-truncation -fsanitize-blacklist=/Users/buildslave/jenkins/workspace/clang-stage2-Rthinlto/clang-build/Build/tools/clang/runtime/compiler-rt-bins/test/ubsan/ThreadSanitizer-x86_64/TestCases/ImplicitConversion/Output/signed-integer-truncation-blacklist.c.tmpmp -O3 /Users/buildslave/jenkins/workspace/clang-stage2-Rthinlto/llvm/projects/compiler-rt/test/ubsan/TestCases/ImplicitConversion/signed-integer-truncation-blacklist.c -o /Users/buildslave/jenkins/workspace/clang-stage2-Rthinlto/clang-build/Build/tools/clang/runtime/compiler-rt-bins/test/ubsan/ThreadSanitizer-x86_64/TestCases/ImplicitConversion/Output/signed-integer-truncation-blacklist.c.tmp && not  /Users/buildslave/jenkins/workspace/clang-stage2-Rthinlto/clang-build/Build/tools/clang/runtime/compiler-rt-bins/test/ubsan/ThreadSanitizer-x86_64/TestCases/ImplicitConversion/Output/signed-integer-truncation-blacklist.c.tmp 2>&1 | not FileCheck /Users/buildslave/jenkins/workspace/clang-stage2-Rthinlto/llvm/projects/compiler-rt/test/ubsan/TestCases/ImplicitConversion/signed-integer-truncation-blacklist.c
: 'RUN: at line 43';   rm -f /Users/buildslave/jenkins/workspace/clang-stage2-Rthinlto/clang-build/Build/tools/clang/runtime/compiler-rt-bins/test/ubsan/ThreadSanitizer-x86_64/TestCases/ImplicitConversion/Output/signed-integer-truncation-blacklist.c.tmpmp
: 'RUN: at line 44';   echo "[implicit-unsigned-integer-truncation]" >> /Users/buildslave/jenkins/workspace/clang-stage2-Rthinlto/clang-build/Build/tools/clang/runtime/compiler-rt-bins/test/ubsan/ThreadSanitizer-x86_64/TestCases/ImplicitConversion/Output/signed-integer-truncation-blacklist.c.tmpmp
: 'RUN: at line 45';   echo "fun:implicitUnsignedTruncation" >> /Users/buildslave/jenkins/workspace/clang-stage2-Rthinlto/clang-build/Build/tools/clang/runtime/compiler-rt-bins/test/ubsan/ThreadSanitizer-x86_64/TestCases/ImplicitConversion/Output/signed-integer-truncation-blacklist.c.tmpmp
: 'RUN: at line 46';      /Users/buildslave/jenkins/workspace/clang-stage2-Rthinlto/clang-build/Build/./bin/clang  -fsanitize=thread  -arch x86_64 -stdlib=libc++ -mmacosx-version-min=10.9 -isysroot /Applications/Xcode.app/Contents/Developer/Platforms/MacOSX.platform/Developer/SDKs/MacOSX10.14.sdk  -fsanitize=implicit-integer-truncation -fno-sanitize-recover=implicit-integer-truncation -fsanitize-blacklist=/Users/buildslave/jenkins/workspace/clang-stage2-Rthinlto/clang-build/Build/tools/clang/runtime/compiler-rt-bins/test/ubsan/ThreadSanitizer-x86_64/TestCases/ImplicitConversion/Output/signed-integer-truncation-blacklist.c.tmpmp -O0 /Users/buildslave/jenkins/workspace/clang-stage2-Rthinlto/llvm/projects/compiler-rt/test/ubsan/TestCases/ImplicitConversion/signed-integer-truncation-blacklist.c -o /Users/buildslave/jenkins/workspace/clang-stage2-Rthinlto/clang-build/Build/tools/clang/runtime/compiler-rt-bins/test/ubsan/ThreadSanitizer-x86_64/TestCases/ImplicitConversion/Output/signed-integer-truncation-blacklist.c.tmp && not  /Users/buildslave/jenkins/workspace/clang-stage2-Rthinlto/clang-build/Build/tools/clang/runtime/compiler-rt-bins/test/ubsan/ThreadSanitizer-x86_64/TestCases/ImplicitConversion/Output/signed-integer-truncation-blacklist.c.tmp 2>&1 | FileCheck /Users/buildslave/jenkins/workspace/clang-stage2-Rthinlto/llvm/projects/compiler-rt/test/ubsan/TestCases/ImplicitConversion/signed-integer-truncation-blacklist.c
: 'RUN: at line 47';      /Users/buildslave/jenkins/workspace/clang-stage2-Rthinlto/clang-build/Build/./bin/clang  -fsanitize=thread  -arch x86_64 -stdlib=libc++ -mmacosx-version-min=10.9 -isysroot /Applications/Xcode.app/Contents/Developer/Platforms/MacOSX.platform/Developer/SDKs/MacOSX10.14.sdk  -fsanitize=implicit-integer-truncation -fno-sanitize-recover=implicit-integer-truncation -fsanitize-blacklist=/Users/buildslave/jenkins/workspace/clang-stage2-Rthinlto/clang-build/Build/tools/clang/runtime/compiler-rt-bins/test/ubsan/ThreadSanitizer-x86_64/TestCases/ImplicitConversion/Output/signed-integer-truncation-blacklist.c.tmpmp -O1 /Users/buildslave/jenkins/workspace/clang-stage2-Rthinlto/llvm/projects/compiler-rt/test/ubsan/TestCases/ImplicitConversion/signed-integer-truncation-blacklist.c -o /Users/buildslave/jenkins/workspace/clang-stage2-Rthinlto/clang-build/Build/tools/clang/runtime/compiler-rt-bins/test/ubsan/ThreadSanitizer-x86_64/TestCases/ImplicitConversion/Output/signed-integer-truncation-blacklist.c.tmp && not  /Users/buildslave/jenkins/workspace/clang-stage2-Rthinlto/clang-build/Build/tools/clang/runtime/compiler-rt-bins/test/ubsan/ThreadSanitizer-x86_64/TestCases/ImplicitConversion/Output/signed-integer-truncation-blacklist.c.tmp 2>&1 | FileCheck /Users/buildslave/jenkins/workspace/clang-stage2-Rthinlto/llvm/projects/compiler-rt/test/ubsan/TestCases/ImplicitConversion/signed-integer-truncation-blacklist.c
: 'RUN: at line 48';      /Users/buildslave/jenkins/workspace/clang-stage2-Rthinlto/clang-build/Build/./bin/clang  -fsanitize=thread  -arch x86_64 -stdlib=libc++ -mmacosx-version-min=10.9 -isysroot /Applications/Xcode.app/Contents/Developer/Platforms/MacOSX.platform/Developer/SDKs/MacOSX10.14.sdk  -fsanitize=implicit-integer-truncation -fno-sanitize-recover=implicit-integer-truncation -fsanitize-blacklist=/Users/buildslave/jenkins/workspace/clang-stage2-Rthinlto/clang-build/Build/tools/clang/runtime/compiler-rt-bins/test/ubsan/ThreadSanitizer-x86_64/TestCases/ImplicitConversion/Output/signed-integer-truncation-blacklist.c.tmpmp -O2 /Users/buildslave/jenkins/workspace/clang-stage2-Rthinlto/llvm/projects/compiler-rt/test/ubsan/TestCases/ImplicitConversion/signed-integer-truncation-blacklist.c -o /Users/buildslave/jenkins/workspace/clang-stage2-Rthinlto/clang-build/Build/tools/clang/runtime/compiler-rt-bins/test/ubsan/ThreadSanitizer-x86_64/TestCases/ImplicitConversion/Output/signed-integer-truncation-blacklist.c.tmp && not  /Users/buildslave/jenkins/workspace/clang-stage2-Rthinlto/clang-build/Build/tools/clang/runtime/compiler-rt-bins/test/ubsan/ThreadSanitizer-x86_64/TestCases/ImplicitConversion/Output/signed-integer-truncation-blacklist.c.tmp 2>&1 | FileCheck /Users/buildslave/jenkins/workspace/clang-stage2-Rthinlto/llvm/projects/compiler-rt/test/ubsan/TestCases/ImplicitConversion/signed-integer-truncation-blacklist.c
: 'RUN: at line 49';      /Users/buildslave/jenkins/workspace/clang-stage2-Rthinlto/clang-build/Build/./bin/clang  -fsanitize=thread  -arch x86_64 -stdlib=libc++ -mmacosx-version-min=10.9 -isysroot /Applications/Xcode.app/Contents/Developer/Platforms/MacOSX.platform/Developer/SDKs/MacOSX10.14.sdk  -fsanitize=implicit-integer-truncation -fno-sanitize-recover=implicit-integer-truncation -fsanitize-blacklist=/Users/buildslave/jenkins/workspace/clang-stage2-Rthinlto/clang-build/Build/tools/clang/runtime/compiler-rt-bins/test/ubsan/ThreadSanitizer-x86_64/TestCases/ImplicitConversion/Output/signed-integer-truncation-blacklist.c.tmpmp -O3 /Users/buildslave/jenkins/workspace/clang-stage2-Rthinlto/llvm/projects/compiler-rt/test/ubsan/TestCases/ImplicitConversion/signed-integer-truncation-blacklist.c -o /Users/buildslave/jenkins/workspace/clang-stage2-Rthinlto/clang-build/Build/tools/clang/runtime/compiler-rt-bins/test/ubsan/ThreadSanitizer-x86_64/TestCases/ImplicitConversion/Output/signed-integer-truncation-blacklist.c.tmp && not  /Users/buildslave/jenkins/workspace/clang-stage2-Rthinlto/clang-build/Build/tools/clang/runtime/compiler-rt-bins/test/ubsan/ThreadSanitizer-x86_64/TestCases/ImplicitConversion/Output/signed-integer-truncation-blacklist.c.tmp 2>&1 | FileCheck /Users/buildslave/jenkins/workspace/clang-stage2-Rthinlto/llvm/projects/compiler-rt/test/ubsan/TestCases/ImplicitConversion/signed-integer-truncation-blacklist.c
--
Exit Code: -9
Timeout: Reached timeout of 600 seconds

Hide Details

Command Output (stderr): -- FileCheck error: '-' is empty. FileCheck command line: FileCheck /Users/buildslave/jenkins/workspace/clang-stage2-Rthinlto/llvm/projects/compiler-rt/test/ubsan/TestCases/ImplicitConversion/signed-integer-truncation-blacklist.c FileCheck error: '-' is empty. FileCheck command line: FileCheck /Users/buildslave/jenkins/workspace/clang-stage2-Rthinlto/llvm/projects/compiler-rt/test/ubsan/TestCases/ImplicitConversion/signed-integer-truncation-blacklist.c FileCheck error: '-' is empty. FileCheck command line: FileCheck /Users/buildslave/jenkins/workspace/clang-stage2-Rthinlto/llvm/projects/compiler-rt/test/ubsan/TestCases/ImplicitConversion/signed-integer-truncation-blacklist.c FileCheck error: '-' is empty. FileCheck command line: FileCheck /Users/buildslave/jenkins/workspace/clang-stage2-Rthinlto/llvm/projects/compiler-rt/test/ubsan/TestCases/ImplicitConversion/signed-integer-truncation-blacklist.c FileCheck error: '-' is empty. FileCheck command line: FileCheck /Users/buildslave/jenkins/workspace/clang-stage2-Rthinlto/llvm/projects/compiler-rt/test/ubsan/TestCases/ImplicitConversion/signed-integer-truncation-blacklist.c FileCheck error: '-' is empty. FileCheck command line: FileCheck /Users/buildslave/jenkins/workspace/clang-stage2-Rthinlto/llvm/projects/compiler-rt/test/ubsan/TestCases/ImplicitConversion/signed-integer-truncation-blacklist.c FileCheck error: '-' is empty. FileCheck command line: FileCheck /Users/buildslave/jenkins/workspace/clang-stage2-Rthinlto/llvm/projects/compiler-rt/test/ubsan/TestCases/ImplicitConversion/signed-integer-truncation-blacklist.c FileCheck error: '-' is empty. FileCheck command line: FileCheck /Users/buildslave/jenkins/workspace/clang-stage2-Rthinlto/llvm/projects/compiler-rt/test/ubsan/TestCases/ImplicitConversion/signed-integer-truncation-blacklist.c FileCheck error: '-' is empty. FileCheck command line: FileCheck /Users/buildslave/jenkins/workspace/clang-stage2-Rthinlto/llvm/projects/compiler-rt/test/ubsan/TestCases/ImplicitConversion/signed-integer-truncation-blacklist.c

Hide Details

--

Hide Details

******************** TIMEOUT: UBSan-ThreadSanitizer-x86_64 :: TestCases/ImplicitConversion/signed-integer-truncation-or-sign-change-blacklist.c (2351 of 2622) ******************** TEST 'UBSan-ThreadSanitizer-x86_64 :: TestCases/ImplicitConversion/signed-integer-truncation-or-sign-change-blacklist.c' FAILED ******************** Script: -- : 'RUN: at line 8'; /Users/buildslave/jenkins/workspace/clang-stage2-Rthinlto/clang-build/Build/./bin/clang -fsanitize=thread -arch x86_64 -stdlib=libc++ -mmacosx-version-min=10.9 -isysroot /Applications/Xcode.app/Contents/Developer/Platforms/MacOSX.platform/Developer/SDKs/MacOSX10.14.sdk -fsanitize=implicit-signed-integer-truncation,implicit-integer-sign-change -fno-sanitize-recover=implicit-signed-integer-truncation,implicit-integer-sign-change -O0 /Users/buildslave/jenkins/workspace/clang-stage2-Rthinlto/llvm/projects/compiler-rt/test/ubsan/TestCases/ImplicitConversion/signed-integer-truncation-or-sign-change-blacklist.c -o /Users/buildslave/jenkins/workspace/clang-stage2-Rthinlto/clang-build/Build/tools/clang/runtime/compiler-rt-bins/test/ubsan/ThreadSanitizer-x86_64/TestCases/ImplicitConversion/Output/signed-integer-truncation-or-sign-change-blacklist.c.tmp && not /Users/buildslave/jenkins/workspace/clang-stage2-Rthinlto/clang-build/Build/tools/clang/runtime/compiler-rt-bins/test/ubsan/ThreadSanitizer-x86_64/TestCases/ImplicitConversion/Output/signed-integer-truncation-or-sign-change-blacklist.c.tmp 2>&1 | FileCheck /Users/buildslave/jenkins/workspace/clang-stage2-Rthinlto/llvm/projects/compiler-rt/test/ubsan/TestCases/ImplicitConversion/signed-integer-truncation-or-sign-change-blacklist.c --implicit-check-not="implicit conversion" : 'RUN: at line 9'; /Users/buildslave/jenkins/workspace/clang-stage2-Rthinlto/clang-build/Build/./bin/clang -fsanitize=thread -arch x86_64 -stdlib=libc++ -mmacosx-version-min=10.9 -isysroot /Applications/Xcode.app/Contents/Developer/Platforms/MacOSX.platform/Developer/SDKs/MacOSX10.14.sdk -fsanitize=implicit-signed-integer-truncation,implicit-integer-sign-change -fno-sanitize-recover=implicit-signed-integer-truncation,implicit-integer-sign-change -O1 /Users/buildslave/jenkins/workspace/clang-stage2-Rthinlto/llvm/projects/compiler-rt/test/ubsan/TestCases/ImplicitConversion/signed-integer-truncation-or-sign-change-blacklist.c -o /Users/buildslave/jenkins/workspace/clang-stage2-Rthinlto/clang-build/Build/tools/clang/runtime/compiler-rt-bins/test/ubsan/ThreadSanitizer-x86_64/TestCases/ImplicitConversion/Output/signed-integer-truncation-or-sign-change-blacklist.c.tmp && not /Users/buildslave/jenkins/workspace/clang-stage2-Rthinlto/clang-build/Build/tools/clang/runtime/compiler-rt-bins/test/ubsan/ThreadSanitizer-x86_64/TestCases/ImplicitConversion/Output/signed-integer-truncation-or-sign-change-blacklist.c.tmp 2>&1 | FileCheck /Users/buildslave/jenkins/workspace/clang-stage2-Rthinlto/llvm/projects/compiler-rt/test/ubsan/TestCases/ImplicitConversion/signed-integer-truncation-or-sign-change-blacklist.c --implicit-check-not="implicit conversion" : 'RUN: at line 10'; /Users/buildslave/jenkins/workspace/clang-stage2-Rthinlto/clang-build/Build/./bin/clang -fsanitize=thread -arch x86_64 -stdlib=libc++ -mmacosx-version-min=10.9 -isysroot /Applications/Xcode.app/Contents/Developer/Platforms/MacOSX.platform/Developer/SDKs/MacOSX10.14.sdk -fsanitize=implicit-signed-integer-truncation,implicit-integer-sign-change -fno-sanitize-recover=implicit-signed-integer-truncation,implicit-integer-sign-change -O2 /Users/buildslave/jenkins/workspace/clang-stage2-Rthinlto/llvm/projects/compiler-rt/test/ubsan/TestCases/ImplicitConversion/signed-integer-truncation-or-sign-change-blacklist.c -o /Users/buildslave/jenkins/workspace/clang-stage2-Rthinlto/clang-build/Build/tools/clang/runtime/compiler-rt-bins/test/ubsan/ThreadSanitizer-x86_64/TestCases/ImplicitConversion/Output/signed-integer-truncation-or-sign-change-blacklist.c.tmp && not /Users/buildslave/jenkins/workspace/clang-stage2-Rthinlto/clang-build/Build/tools/clang/runtime/compiler-rt-bins/test/ubsan/ThreadSanitizer-x86_64/TestCases/ImplicitConversion/Output/signed-integer-truncation-or-sign-change-blacklist.c.tmp 2>&1 | FileCheck /Users/buildslave/jenkins/workspace/clang-stage2-Rthinlto/llvm/projects/compiler-rt/test/ubsan/TestCases/ImplicitConversion/signed-integer-truncation-or-sign-change-blacklist.c --implicit-check-not="implicit conversion" : 'RUN: at line 11'; /Users/buildslave/jenkins/workspace/clang-stage2-Rthinlto/clang-build/Build/./bin/clang -fsanitize=thread -arch x86_64 -stdlib=libc++ -mmacosx-version-min=10.9 -isysroot /Applications/Xcode.app/Contents/Developer/Platforms/MacOSX.platform/Developer/SDKs/MacOSX10.14.sdk -fsanitize=implicit-signed-integer-truncation,implicit-integer-sign-change -fno-sanitize-recover=implicit-signed-integer-truncation,implicit-integer-sign-change -O3 /Users/buildslave/jenkins/workspace/clang-stage2-Rthinlto/llvm/projects/compiler-rt/test/ubsan/TestCases/ImplicitConversion/signed-integer-truncation-or-sign-change-blacklist.c -o /Users/buildslave/jenkins/workspace/clang-stage2-Rthinlto/clang-build/Build/tools/clang/runtime/compiler-rt-bins/test/ubsan/ThreadSanitizer-x86_64/TestCases/ImplicitConversion/Output/signed-integer-truncation-or-sign-change-blacklist.c.tmp && not /Users/buildslave/jenkins/workspace/clang-stage2-Rthinlto/clang-build/Build/tools/clang/runtime/compiler-rt-bins/test/ubsan/ThreadSanitizer-x86_64/TestCases/ImplicitConversion/Output/signed-integer-truncation-or-sign-change-blacklist.c.tmp 2>&1 | FileCheck /Users/buildslave/jenkins/workspace/clang-stage2-Rthinlto/llvm/projects/compiler-rt/test/ubsan/TestCases/ImplicitConversion/signed-integer-truncation-or-sign-change-blacklist.c --implicit-check-not="implicit conversion" : 'RUN: at line 13'; rm -f /Users/buildslave/jenkins/workspace/clang-stage2-Rthinlto/clang-build/Build/tools/clang/runtime/compiler-rt-bins/test/ubsan/ThreadSanitizer-x86_64/TestCases/ImplicitConversion/Output/signed-integer-truncation-or-sign-change-blacklist.c.tmpmp : 'RUN: at line 14'; echo "[implicit-signed-integer-truncation]" >> /Users/buildslave/jenkins/workspace/clang-stage2-Rthinlto/clang-build/Build/tools/clang/runtime/compiler-rt-bins/test/ubsan/ThreadSanitizer-x86_64/TestCases/ImplicitConversion/Output/signed-integer-truncation-or-sign-change-blacklist.c.tmpmp : 'RUN: at line 15'; echo "fun:implicitConversion" >> /Users/buildslave/jenkins/workspace/clang-stage2-Rthinlto/clang-build/Build/tools/clang/runtime/compiler-rt-bins/test/ubsan/ThreadSanitizer-x86_64/TestCases/ImplicitConversion/Output/signed-integer-truncation-or-sign-change-blacklist.c.tmpmp : 'RUN: at line 16'; /Users/buildslave/jenkins/workspace/clang-stage2-Rthinlto/clang-build/Build/./bin/clang -fsanitize=thread -arch x86_64 -stdlib=libc++ -mmacosx-version-min=10.9 -isysroot /Applications/Xcode.app/Contents/Developer/Platforms/MacOSX.platform/Developer/SDKs/MacOSX10.14.sdk -fsanitize=implicit-signed-integer-truncation,implicit-integer-sign-change -fno-sanitize-recover=implicit-signed-integer-truncation,implicit-integer-sign-change -fsanitize-blacklist=/Users/buildslave/jenkins/workspace/clang-stage2-Rthinlto/clang-build/Build/tools/clang/runtime/compiler-rt-bins/test/ubsan/ThreadSanitizer-x86_64/TestCases/ImplicitConversion/Output/signed-integer-truncation-or-sign-change-blacklist.c.tmpmp -O0 /Users/buildslave/jenkins/workspace/clang-stage2-Rthinlto/llvm/projects/compiler-rt/test/ubsan/TestCases/ImplicitConversion/signed-integer-truncation-or-sign-change-blacklist.c -o /Users/buildslave/jenkins/workspace/clang-stage2-Rthinlto/clang-build/Build/tools/clang/runtime/compiler-rt-bins/test/ubsan/ThreadSanitizer-x86_64/TestCases/ImplicitConversion/Output/signed-integer-truncation-or-sign-change-blacklist.c.tmp && not /Users/buildslave/jenkins/workspace/clang-stage2-Rthinlto/clang-build/Build/tools/clang/runtime/compiler-rt-bins/test/ubsan/ThreadSanitizer-x86_64/TestCases/ImplicitConversion/Output/signed-integer-truncation-or-sign-change-blacklist.c.tmp 2>&1 | FileCheck /Users/buildslave/jenkins/workspace/clang-stage2-Rthinlto/llvm/projects/compiler-rt/test/ubsan/TestCases/ImplicitConversion/signed-integer-truncation-or-sign-change-blacklist.c --implicit-check-not="implicit conversion" : 'RUN: at line 17'; /Users/buildslave/jenkins/workspace/clang-stage2-Rthinlto/clang-build/Build/./bin/clang -fsanitize=thread -arch x86_64 -stdlib=libc++ -mmacosx-version-min=10.9 -isysroot /Applications/Xcode.app/Contents/Developer/Platforms/MacOSX.platform/Developer/SDKs/MacOSX10.14.sdk -fsanitize=implicit-signed-integer-truncation,implicit-integer-sign-change -fno-sanitize-recover=implicit-signed-integer-truncation,implicit-integer-sign-change -fsanitize-blacklist=/Users/buildslave/jenkins/workspace/clang-stage2-Rthinlto/clang-build/Build/tools/clang/runtime/compiler-rt-bins/test/ubsan/ThreadSanitizer-x86_64/TestCases/ImplicitConversion/Output/signed-integer-truncation-or-sign-change-blacklist.c.tmpmp -O1 /Users/buildslave/jenkins/workspace/clang-stage2-Rthinlto/llvm/projects/compiler-rt/test/ubsan/TestCases/ImplicitConversion/signed-integer-truncation-or-sign-change-blacklist.c -o /Users/buildslave/jenkins/workspace/clang-stage2-Rthinlto/clang-build/Build/tools/clang/runtime/compiler-rt-bins/test/ubsan/ThreadSanitizer-x86_64/TestCases/ImplicitConversion/Output/signed-integer-truncation-or-sign-change-blacklist.c.tmp && not /Users/buildslave/jenkins/workspace/clang-stage2-Rthinlto/clang-build/Build/tools/clang/runtime/compiler-rt-bins/test/ubsan/ThreadSanitizer-x86_64/TestCases/ImplicitConversion/Output/signed-integer-truncation-or-sign-change-blacklist.c.tmp 2>&1 | FileCheck /Users/buildslave/jenkins/workspace/clang-stage2-Rthinlto/llvm/projects/compiler-rt/test/ubsan/TestCases/ImplicitConversion/signed-integer-truncation-or-sign-change-blacklist.c --implicit-check-not="implicit conversion" : 'RUN: at line 18'; /Users/buildslave/jenkins/workspace/clang-stage2-Rthinlto/clang-build/Build/./bin/clang -fsanitize=thread -arch x86_64 -stdlib=libc++ -mmacosx-version-min=10.9 -isysroot /Applications/Xcode.app/Contents/Developer/Platforms/MacOSX.platform/Developer/SDKs/MacOSX10.14.sdk -fsanitize=implicit-signed-integer-truncation,implicit-integer-sign-change -fno-sanitize-recover=implicit-signed-integer-truncation,implicit-integer-sign-change -fsanitize-blacklist=/Users/buildslave/jenkins/workspace/clang-stage2-Rthinlto/clang-build/Build/tools/clang/runtime/compiler-rt-bins/test/ubsan/ThreadSanitizer-x86_64/TestCases/ImplicitConversion/Output/signed-integer-truncation-or-sign-change-blacklist.c.tmpmp -O2 /Users/buildslave/jenkins/workspace/clang-stage2-Rthinlto/llvm/projects/compiler-rt/test/ubsan/TestCases/ImplicitConversion/signed-integer-truncation-or-sign-change-blacklist.c -o /Users/buildslave/jenkins/workspace/clang-stage2-Rthinlto/clang-build/Build/tools/clang/runtime/compiler-rt-bins/test/ubsan/ThreadSanitizer-x86_64/TestCases/ImplicitConversion/Output/signed-integer-truncation-or-sign-change-blacklist.c.tmp && not /Users/buildslave/jenkins/workspace/clang-stage2-Rthinlto/clang-build/Build/tools/clang/runtime/compiler-rt-bins/test/ubsan/ThreadSanitizer-x86_64/TestCases/ImplicitConversion/Output/signed-integer-truncation-or-sign-change-blacklist.c.tmp 2>&1 | FileCheck /Users/buildslave/jenkins/workspace/clang-stage2-Rthinlto/llvm/projects/compiler-rt/test/ubsan/TestCases/ImplicitConversion/signed-integer-truncation-or-sign-change-blacklist.c --implicit-check-not="implicit conversion" : 'RUN: at line 19'; /Users/buildslave/jenkins/workspace/clang-stage2-Rthinlto/clang-build/Build/./bin/clang -fsanitize=thread -arch x86_64 -stdlib=libc++ -mmacosx-version-min=10.9 -isysroot /Applications/Xcode.app/Contents/Developer/Platforms/MacOSX.platform/Developer/SDKs/MacOSX10.14.sdk -fsanitize=implicit-signed-integer-truncation,implicit-integer-sign-change -fno-sanitize-recover=implicit-signed-integer-truncation,implicit-integer-sign-change -fsanitize-blacklist=/Users/buildslave/jenkins/workspace/clang-stage2-Rthinlto/clang-build/Build/tools/clang/runtime/compiler-rt-bins/test/ubsan/ThreadSanitizer-x86_64/TestCases/ImplicitConversion/Output/signed-integer-truncation-or-sign-change-blacklist.c.tmpmp -O3 /Users/buildslave/jenkins/workspace/clang-stage2-Rthinlto/llvm/projects/compiler-rt/test/ubsan/TestCases/ImplicitConversion/signed-integer-truncation-or-sign-change-blacklist.c -o /Users/buildslave/jenkins/workspace/clang-stage2-Rthinlto/clang-build/Build/tools/clang/runtime/compiler-rt-bins/test/ubsan/ThreadSanitizer-x86_64/TestCases/ImplicitConversion/Output/signed-integer-truncation-or-sign-change-blacklist.c.tmp && not /Users/buildslave/jenkins/workspace/clang-stage2-Rthinlto/clang-build/Build/tools/clang/runtime/compiler-rt-bins/test/ubsan/ThreadSanitizer-x86_64/TestCases/ImplicitConversion/Output/signed-integer-truncation-or-sign-change-blacklist.c.tmp 2>&1 | FileCheck /Users/buildslave/jenkins/workspace/clang-stage2-Rthinlto/llvm/projects/compiler-rt/test/ubsan/TestCases/ImplicitConversion/signed-integer-truncation-or-sign-change-blacklist.c --implicit-check-not="implicit conversion" : 'RUN: at line 21'; rm -f /Users/buildslave/jenkins/workspace/clang-stage2-Rthinlto/clang-build/Build/tools/clang/runtime/compiler-rt-bins/test/ubsan/ThreadSanitizer-x86_64/TestCases/ImplicitConversion/Output/signed-integer-truncation-or-sign-change-blacklist.c.tmpmp : 'RUN: at line 22'; echo "[implicit-signed-integer-truncation,implicit-integer-sign-change]" >> /Users/buildslave/jenkins/workspace/clang-stage2-Rthinlto/clang-build/Build/tools/clang/runtime/compiler-rt-bins/test/ubsan/ThreadSanitizer-x86_64/TestCases/ImplicitConversion/Output/signed-integer-truncation-or-sign-change-blacklist.c.tmpmp : 'RUN: at line 23'; echo "fun:implicitConversion" >> /Users/buildslave/jenkins/workspace/clang-stage2-Rthinlto/clang-build/Build/tools/clang/runtime/compiler-rt-bins/test/ubsan/ThreadSanitizer-x86_64/TestCases/ImplicitConversion/Output/signed-integer-truncation-or-sign-change-blacklist.c.tmpmp : 'RUN: at line 24'; /Users/buildslave/jenkins/workspace/clang-stage2-Rthinlto/clang-build/Build/./bin/clang -fsanitize=thread -arch x86_64 -stdlib=libc++ -mmacosx-version-min=10.9 -isysroot /Applications/Xcode.app/Contents/Developer/Platforms/MacOSX.platform/Developer/SDKs/MacOSX10.14.sdk -fsanitize=implicit-signed-integer-truncation,implicit-integer-sign-change -fno-sanitize-recover=implicit-signed-integer-truncation,implicit-integer-sign-change -fsanitize-blacklist=/Users/buildslave/jenkins/workspace/clang-stage2-Rthinlto/clang-build/Build/tools/clang/runtime/compiler-rt-bins/test/ubsan/ThreadSanitizer-x86_64/TestCases/ImplicitConversion/Output/signed-integer-truncation-or-sign-change-blacklist.c.tmpmp -O0 /Users/buildslave/jenkins/workspace/clang-stage2-Rthinlto/llvm/projects/compiler-rt/test/ubsan/TestCases/ImplicitConversion/signed-integer-truncation-or-sign-change-blacklist.c -o /Users/buildslave/jenkins/workspace/clang-stage2-Rthinlto/clang-build/Build/tools/clang/runtime/compiler-rt-bins/test/ubsan/ThreadSanitizer-x86_64/TestCases/ImplicitConversion/Output/signed-integer-truncation-or-sign-change-blacklist.c.tmp && not /Users/buildslave/jenkins/workspace/clang-stage2-Rthinlto/clang-build/Build/tools/clang/runtime/compiler-rt-bins/test/ubsan/ThreadSanitizer-x86_64/TestCases/ImplicitConversion/Output/signed-integer-truncation-or-sign-change-blacklist.c.tmp 2>&1 | FileCheck /Users/buildslave/jenkins/workspace/clang-stage2-Rthinlto/llvm/projects/compiler-rt/test/ubsan/TestCases/ImplicitConversion/signed-integer-truncation-or-sign-change-blacklist.c --implicit-check-not="implicit conversion" : 'RUN: at line 25'; /Users/buildslave/jenkins/workspace/clang-stage2-Rthinlto/clang-build/Build/./bin/clang -fsanitize=thread -arch x86_64 -stdlib=libc++ -mmacosx-version-min=10.9 -isysroot /Applications/Xcode.app/Contents/Developer/Platforms/MacOSX.platform/Developer/SDKs/MacOSX10.14.sdk -fsanitize=implicit-signed-integer-truncation,implicit-integer-sign-change -fno-sanitize-recover=implicit-signed-integer-truncation,implicit-integer-sign-change -fsanitize-blacklist=/Users/buildslave/jenkins/workspace/clang-stage2-Rthinlto/clang-build/Build/tools/clang/runtime/compiler-rt-bins/test/ubsan/ThreadSanitizer-x86_64/TestCases/ImplicitConversion/Output/signed-integer-truncation-or-sign-change-blacklist.c.tmpmp -O1 /Users/buildslave/jenkins/workspace/clang-stage2-Rthinlto/llvm/projects/compiler-rt/test/ubsan/TestCases/ImplicitConversion/signed-integer-truncation-or-sign-change-blacklist.c -o /Users/buildslave/jenkins/workspace/clang-stage2-Rthinlto/clang-build/Build/tools/clang/runtime/compiler-rt-bins/test/ubsan/ThreadSanitizer-x86_64/TestCases/ImplicitConversion/Output/signed-integer-truncation-or-sign-change-blacklist.c.tmp && not /Users/buildslave/jenkins/workspace/clang-stage2-Rthinlto/clang-build/Build/tools/clang/runtime/compiler-rt-bins/test/ubsan/ThreadSanitizer-x86_64/TestCases/ImplicitConversion/Output/signed-integer-truncation-or-sign-change-blacklist.c.tmp 2>&1 | FileCheck /Users/buildslave/jenkins/workspace/clang-stage2-Rthinlto/llvm/projects/compiler-rt/test/ubsan/TestCases/ImplicitConversion/signed-integer-truncation-or-sign-change-blacklist.c --implicit-check-not="implicit conversion" : 'RUN: at line 26'; /Users/buildslave/jenkins/workspace/clang-stage2-Rthinlto/clang-build/Build/./bin/clang -fsanitize=thread -arch x86_64 -stdlib=libc++ -mmacosx-version-min=10.9 -isysroot /Applications/Xcode.app/Contents/Developer/Platforms/MacOSX.platform/Developer/SDKs/MacOSX10.14.sdk -fsanitize=implicit-signed-integer-truncation,implicit-integer-sign-change -fno-sanitize-recover=implicit-signed-integer-truncation,implicit-integer-sign-change -fsanitize-blacklist=/Users/buildslave/jenkins/workspace/clang-stage2-Rthinlto/clang-build/Build/tools/clang/runtime/compiler-rt-bins/test/ubsan/ThreadSanitizer-x86_64/TestCases/ImplicitConversion/Output/signed-integer-truncation-or-sign-change-blacklist.c.tmpmp -O2 /Users/buildslave/jenkins/workspace/clang-stage2-Rthinlto/llvm/projects/compiler-rt/test/ubsan/TestCases/ImplicitConversion/signed-integer-truncation-or-sign-change-blacklist.c -o /Users/buildslave/jenkins/workspace/clang-stage2-Rthinlto/clang-build/Build/tools/clang/runtime/compiler-rt-bins/test/ubsan/ThreadSanitizer-x86_64/TestCases/ImplicitConversion/Output/signed-integer-truncation-or-sign-change-blacklist.c.tmp && not /Users/buildslave/jenkins/workspace/clang-stage2-Rthinlto/clang-build/Build/tools/clang/runtime/compiler-rt-bins/test/ubsan/ThreadSanitizer-x86_64/TestCases/ImplicitConversion/Output/signed-integer-truncation-or-sign-change-blacklist.c.tmp 2>&1 | FileCheck /Users/buildslave/jenkins/workspace/clang-stage2-Rthinlto/llvm/projects/compiler-rt/test/ubsan/TestCases/ImplicitConversion/signed-integer-truncation-or-sign-change-blacklist.c --implicit-check-not="implicit conversion" : 'RUN: at line 27'; /Users/buildslave/jenkins/workspace/clang-stage2-Rthinlto/clang-build/Build/./bin/clang -fsanitize=thread -arch x86_64 -stdlib=libc++ -mmacosx-version-min=10.9 -isysroot /Applications/Xcode.app/Contents/Developer/Platforms/MacOSX.platform/Developer/SDKs/MacOSX10.14.sdk -fsanitize=implicit-signed-integer-truncation,implicit-integer-sign-change -fno-sanitize-recover=implicit-signed-integer-truncation,implicit-integer-sign-change -fsanitize-blacklist=/Users/buildslave/jenkins/workspace/clang-stage2-Rthinlto/clang-build/Build/tools/clang/runtime/compiler-rt-bins/test/ubsan/ThreadSanitizer-x86_64/TestCases/ImplicitConversion/Output/signed-integer-truncation-or-sign-change-blacklist.c.tmpmp -O3 /Users/buildslave/jenkins/workspace/clang-stage2-Rthinlto/llvm/projects/compiler-rt/test/ubsan/TestCases/ImplicitConversion/signed-integer-truncation-or-sign-change-blacklist.c -o /Users/buildslave/jenkins/workspace/clang-stage2-Rthinlto/clang-build/Build/tools/clang/runtime/compiler-rt-bins/test/ubsan/ThreadSanitizer-x86_64/TestCases/ImplicitConversion/Output/signed-integer-truncation-or-sign-change-blacklist.c.tmp && not /Users/buildslave/jenkins/workspace/clang-stage2-Rthinlto/clang-build/Build/tools/clang/runtime/compiler-rt-bins/test/ubsan/ThreadSanitizer-x86_64/TestCases/ImplicitConversion/Output/signed-integer-truncation-or-sign-change-blacklist.c.tmp 2>&1 | FileCheck /Users/buildslave/jenkins/workspace/clang-stage2-Rthinlto/llvm/projects/compiler-rt/test/ubsan/TestCases/ImplicitConversion/signed-integer-truncation-or-sign-change-blacklist.c --implicit-check-not="implicit conversion" : 'RUN: at line 32'; rm -f /Users/buildslave/jenkins/workspace/clang-stage2-Rthinlto/clang-build/Build/tools/clang/runtime/compiler-rt-bins/test/ubsan/ThreadSanitizer-x86_64/TestCases/ImplicitConversion/Output/signed-integer-truncation-or-sign-change-blacklist.c.tmpmp : 'RUN: at line 33'; echo "[implicit-integer-sign-change]" >> /Users/buildslave/jenkins/workspace/clang-stage2-Rthinlto/clang-build/Build/tools/clang/runtime/compiler-rt-bins/test/ubsan/ThreadSanitizer-x86_64/TestCases/ImplicitConversion/Output/signed-integer-truncation-or-sign-change-blacklist.c.tmpmp : 'RUN: at line 34'; echo "fun:implicitConversion" >> /Users/buildslave/jenkins/workspace/clang-stage2-Rthinlto/clang-build/Build/tools/clang/runtime/compiler-rt-bins/test/ubsan/ThreadSanitizer-x86_64/TestCases/ImplicitConversion/Output/signed-integer-truncation-or-sign-change-blacklist.c.tmpmp : 'RUN: at line 35'; /Users/buildslave/jenkins/workspace/clang-stage2-Rthinlto/clang-build/Build/./bin/clang -fsanitize=thread -arch x86_64 -stdlib=libc++ -mmacosx-version-min=10.9 -isysroot /Applications/Xcode.app/Contents/Developer/Platforms/MacOSX.platform/Developer/SDKs/MacOSX10.14.sdk -fsanitize=implicit-signed-integer-truncation,implicit-integer-sign-change -fno-sanitize-recover=implicit-signed-integer-truncation,implicit-integer-sign-change -fsanitize-blacklist=/Users/buildslave/jenkins/workspace/clang-stage2-Rthinlto/clang-build/Build/tools/clang/runtime/compiler-rt-bins/test/ubsan/ThreadSanitizer-x86_64/TestCases/ImplicitConversion/Output/signed-integer-truncation-or-sign-change-blacklist.c.tmpmp -O0 /Users/buildslave/jenkins/workspace/clang-stage2-Rthinlto/llvm/projects/compiler-rt/test/ubsan/TestCases/ImplicitConversion/signed-integer-truncation-or-sign-change-blacklist.c -o /Users/buildslave/jenkins/workspace/clang-stage2-Rthinlto/clang-build/Build/tools/clang/runtime/compiler-rt-bins/test/ubsan/ThreadSanitizer-x86_64/TestCases/ImplicitConversion/Output/signed-integer-truncation-or-sign-change-blacklist.c.tmp && not /Users/buildslave/jenkins/workspace/clang-stage2-Rthinlto/clang-build/Build/tools/clang/runtime/compiler-rt-bins/test/ubsan/ThreadSanitizer-x86_64/TestCases/ImplicitConversion/Output/signed-integer-truncation-or-sign-change-blacklist.c.tmp 2>&1 | not FileCheck /Users/buildslave/jenkins/workspace/clang-stage2-Rthinlto/llvm/projects/compiler-rt/test/ubsan/TestCases/ImplicitConversion/signed-integer-truncation-or-sign-change-blacklist.c : 'RUN: at line 36'; /Users/buildslave/jenkins/workspace/clang-stage2-Rthinlto/clang-build/Build/./bin/clang -fsanitize=thread -arch x86_64 -stdlib=libc++ -mmacosx-version-min=10.9 -isysroot /Applications/Xcode.app/Contents/Developer/Platforms/MacOSX.platform/Developer/SDKs/MacOSX10.14.sdk -fsanitize=implicit-signed-integer-truncation,implicit-integer-sign-change -fno-sanitize-recover=implicit-signed-integer-truncation,implicit-integer-sign-change -fsanitize-blacklist=/Users/buildslave/jenkins/workspace/clang-stage2-Rthinlto/clang-build/Build/tools/clang/runtime/compiler-rt-bins/test/ubsan/ThreadSanitizer-x86_64/TestCases/ImplicitConversion/Output/signed-integer-truncation-or-sign-change-blacklist.c.tmpmp -O1 /Users/buildslave/jenkins/workspace/clang-stage2-Rthinlto/llvm/projects/compiler-rt/test/ubsan/TestCases/ImplicitConversion/signed-integer-truncation-or-sign-change-blacklist.c -o /Users/buildslave/jenkins/workspace/clang-stage2-Rthinlto/clang-build/Build/tools/clang/runtime/compiler-rt-bins/test/ubsan/ThreadSanitizer-x86_64/TestCases/ImplicitConversion/Output/signed-integer-truncation-or-sign-change-blacklist.c.tmp && not /Users/buildslave/jenkins/workspace/clang-stage2-Rthinlto/clang-build/Build/tools/clang/runtime/compiler-rt-bins/test/ubsan/ThreadSanitizer-x86_64/TestCases/ImplicitConversion/Output/signed-integer-truncation-or-sign-change-blacklist.c.tmp 2>&1 | not FileCheck /Users/buildslave/jenkins/workspace/clang-stage2-Rthinlto/llvm/projects/compiler-rt/test/ubsan/TestCases/ImplicitConversion/signed-integer-truncation-or-sign-change-blacklist.c : 'RUN: at line 37'; /Users/buildslave/jenkins/workspace/clang-stage2-Rthinlto/clang-build/Build/./bin/clang -fsanitize=thread -arch x86_64 -stdlib=libc++ -mmacosx-version-min=10.9 -isysroot /Applications/Xcode.app/Contents/Developer/Platforms/MacOSX.platform/Developer/SDKs/MacOSX10.14.sdk -fsanitize=implicit-signed-integer-truncation,implicit-integer-sign-change -fno-sanitize-recover=implicit-signed-integer-truncation,implicit-integer-sign-change -fsanitize-blacklist=/Users/buildslave/jenkins/workspace/clang-stage2-Rthinlto/clang-build/Build/tools/clang/runtime/compiler-rt-bins/test/ubsan/ThreadSanitizer-x86_64/TestCases/ImplicitConversion/Output/signed-integer-truncation-or-sign-change-blacklist.c.tmpmp -O2 /Users/buildslave/jenkins/workspace/clang-stage2-Rthinlto/llvm/projects/compiler-rt/test/ubsan/TestCases/ImplicitConversion/signed-integer-truncation-or-sign-change-blacklist.c -o /Users/buildslave/jenkins/workspace/clang-stage2-Rthinlto/clang-build/Build/tools/clang/runtime/compiler-rt-bins/test/ubsan/ThreadSanitizer-x86_64/TestCases/ImplicitConversion/Output/signed-integer-truncation-or-sign-change-blacklist.c.tmp && not /Users/buildslave/jenkins/workspace/clang-stage2-Rthinlto/clang-build/Build/tools/clang/runtime/compiler-rt-bins/test/ubsan/ThreadSanitizer-x86_64/TestCases/ImplicitConversion/Output/signed-integer-truncation-or-sign-change-blacklist.c.tmp 2>&1 | not FileCheck /Users/buildslave/jenkins/workspace/clang-stage2-Rthinlto/llvm/projects/compiler-rt/test/ubsan/TestCases/ImplicitConversion/signed-integer-truncation-or-sign-change-blacklist.c : 'RUN: at line 38'; /Users/buildslave/jenkins/workspace/clang-stage2-Rthinlto/clang-build/Build/./bin/clang -fsanitize=thread -arch x86_64 -stdlib=libc++ -mmacosx-version-min=10.9 -isysroot /Applications/Xcode.app/Contents/Developer/Platforms/MacOSX.platform/Developer/SDKs/MacOSX10.14.sdk -fsanitize=implicit-signed-integer-truncation,implicit-integer-sign-change -fno-sanitize-recover=implicit-signed-integer-truncation,implicit-integer-sign-change -fsanitize-blacklist=/Users/buildslave/jenkins/workspace/clang-stage2-Rthinlto/clang-build/Build/tools/clang/runtime/compiler-rt-bins/test/ubsan/ThreadSanitizer-x86_64/TestCases/ImplicitConversion/Output/signed-integer-truncation-or-sign-change-blacklist.c.tmpmp -O3 /Users/buildslave/jenkins/workspace/clang-stage2-Rthinlto/llvm/projects/compiler-rt/test/ubsan/TestCases/ImplicitConversion/signed-integer-truncation-or-sign-change-blacklist.c -o /Users/buildslave/jenkins/workspace/clang-stage2-Rthinlto/clang-build/Build/tools/clang/runtime/compiler-rt-bins/test/ubsan/ThreadSanitizer-x86_64/TestCases/ImplicitConversion/Output/signed-integer-truncation-or-sign-change-blacklist.c.tmp && not /Users/buildslave/jenkins/workspace/clang-stage2-Rthinlto/clang-build/Build/tools/clang/runtime/compiler-rt-bins/test/ubsan/ThreadSanitizer-x86_64/TestCases/ImplicitConversion/Output/signed-integer-truncation-or-sign-change-blacklist.c.tmp 2>&1 | not FileCheck /Users/buildslave/jenkins/workspace/clang-stage2-Rthinlto/llvm/projects/compiler-rt/test/ubsan/TestCases/ImplicitConversion/signed-integer-truncation-or-sign-change-blacklist.c : 'RUN: at line 40'; rm -f /Users/buildslave/jenkins/workspace/clang-stage2-Rthinlto/clang-build/Build/tools/clang/runtime/compiler-rt-bins/test/ubsan/ThreadSanitizer-x86_64/TestCases/ImplicitConversion/Output/signed-integer-truncation-or-sign-change-blacklist.c.tmpmp : 'RUN: at line 41'; echo "[implicit-signed-integer-truncation]" >> /Users/buildslave/jenkins/workspace/clang-stage2-Rthinlto/clang-build/Build/tools/clang/runtime/compiler-rt-bins/test/ubsan/ThreadSanitizer-x86_64/TestCases/ImplicitConversion/Output/signed-integer-truncation-or-sign-change-blacklist.c.tmpmp : 'RUN: at line 42'; echo "[implicit-integer-sign-change]" >> /Users/buildslave/jenkins/workspace/clang-stage2-Rthinlto/clang-build/Build/tools/clang/runtime/compiler-rt-bins/test/ubsan/ThreadSanitizer-x86_64/TestCases/ImplicitConversion/Output/signed-integer-truncation-or-sign-change-blacklist.c.tmpmp : 'RUN: at line 43'; echo "fun:implicitConversion" >> /Users/buildslave/jenkins/workspace/clang-stage2-Rthinlto/clang-build/Build/tools/clang/runtime/compiler-rt-bins/test/ubsan/ThreadSanitizer-x86_64/TestCases/ImplicitConversion/Output/signed-integer-truncation-or-sign-change-blacklist.c.tmpmp : 'RUN: at line 44'; /Users/buildslave/jenkins/workspace/clang-stage2-Rthinlto/clang-build/Build/./bin/clang -fsanitize=thread -arch x86_64 -stdlib=libc++ -mmacosx-version-min=10.9 -isysroot /Applications/Xcode.app/Contents/Developer/Platforms/MacOSX.platform/Developer/SDKs/MacOSX10.14.sdk -fsanitize=implicit-signed-integer-truncation,implicit-integer-sign-change -fno-sanitize-recover=implicit-signed-integer-truncation,implicit-integer-sign-change -fsanitize-blacklist=/Users/buildslave/jenkins/workspace/clang-stage2-Rthinlto/clang-build/Build/tools/clang/runtime/compiler-rt-bins/test/ubsan/ThreadSanitizer-x86_64/TestCases/ImplicitConversion/Output/signed-integer-truncation-or-sign-change-blacklist.c.tmpmp -O0 /Users/buildslave/jenkins/workspace/clang-stage2-Rthinlto/llvm/projects/compiler-rt/test/ubsan/TestCases/ImplicitConversion/signed-integer-truncation-or-sign-change-blacklist.c -o /Users/buildslave/jenkins/workspace/clang-stage2-Rthinlto/clang-build/Build/tools/clang/runtime/compiler-rt-bins/test/ubsan/ThreadSanitizer-x86_64/TestCases/ImplicitConversion/Output/signed-integer-truncation-or-sign-change-blacklist.c.tmp && not /Users/buildslave/jenkins/workspace/clang-stage2-Rthinlto/clang-build/Build/tools/clang/runtime/compiler-rt-bins/test/ubsan/ThreadSanitizer-x86_64/TestCases/ImplicitConversion/Output/signed-integer-truncation-or-sign-change-blacklist.c.tmp 2>&1 | not FileCheck /Users/buildslave/jenkins/workspace/clang-stage2-Rthinlto/llvm/projects/compiler-rt/test/ubsan/TestCases/ImplicitConversion/signed-integer-truncation-or-sign-change-blacklist.c : 'RUN: at line 45'; /Users/buildslave/jenkins/workspace/clang-stage2-Rthinlto/clang-build/Build/./bin/clang -fsanitize=thread -arch x86_64 -stdlib=libc++ -mmacosx-version-min=10.9 -isysroot /Applications/Xcode.app/Contents/Developer/Platforms/MacOSX.platform/Developer/SDKs/MacOSX10.14.sdk -fsanitize=implicit-signed-integer-truncation,implicit-integer-sign-change -fno-sanitize-recover=implicit-signed-integer-truncation,implicit-integer-sign-change -fsanitize-blacklist=/Users/buildslave/jenkins/workspace/clang-stage2-Rthinlto/clang-build/Build/tools/clang/runtime/compiler-rt-bins/test/ubsan/ThreadSanitizer-x86_64/TestCases/ImplicitConversion/Output/signed-integer-truncation-or-sign-change-blacklist.c.tmpmp -O1 /Users/buildslave/jenkins/workspace/clang-stage2-Rthinlto/llvm/projects/compiler-rt/test/ubsan/TestCases/ImplicitConversion/signed-integer-truncation-or-sign-change-blacklist.c -o /Users/buildslave/jenkins/workspace/clang-stage2-Rthinlto/clang-build/Build/tools/clang/runtime/compiler-rt-bins/test/ubsan/ThreadSanitizer-x86_64/TestCases/ImplicitConversion/Output/signed-integer-truncation-or-sign-change-blacklist.c.tmp && not /Users/buildslave/jenkins/workspace/clang-stage2-Rthinlto/clang-build/Build/tools/clang/runtime/compiler-rt-bins/test/ubsan/ThreadSanitizer-x86_64/TestCases/ImplicitConversion/Output/signed-integer-truncation-or-sign-change-blacklist.c.tmp 2>&1 | not FileCheck /Users/buildslave/jenkins/workspace/clang-stage2-Rthinlto/llvm/projects/compiler-rt/test/ubsan/TestCases/ImplicitConversion/signed-integer-truncation-or-sign-change-blacklist.c : 'RUN: at line 46'; /Users/buildslave/jenkins/workspace/clang-stage2-Rthinlto/clang-build/Build/./bin/clang -fsanitize=thread -arch x86_64 -stdlib=libc++ -mmacosx-version-min=10.9 -isysroot /Applications/Xcode.app/Contents/Developer/Platforms/MacOSX.platform/Developer/SDKs/MacOSX10.14.sdk -fsanitize=implicit-signed-integer-truncation,implicit-integer-sign-change -fno-sanitize-recover=implicit-signed-integer-truncation,implicit-integer-sign-change -fsanitize-blacklist=/Users/buildslave/jenkins/workspace/clang-stage2-Rthinlto/clang-build/Build/tools/clang/runtime/compiler-rt-bins/test/ubsan/ThreadSanitizer-x86_64/TestCases/ImplicitConversion/Output/signed-integer-truncation-or-sign-change-blacklist.c.tmpmp -O2 /Users/buildslave/jenkins/workspace/clang-stage2-Rthinlto/llvm/projects/compiler-rt/test/ubsan/TestCases/ImplicitConversion/signed-integer-truncation-or-sign-change-blacklist.c -o /Users/buildslave/jenkins/workspace/clang-stage2-Rthinlto/clang-build/Build/tools/clang/runtime/compiler-rt-bins/test/ubsan/ThreadSanitizer-x86_64/TestCases/ImplicitConversion/Output/signed-integer-truncation-or-sign-change-blacklist.c.tmp && not /Users/buildslave/jenkins/workspace/clang-stage2-Rthinlto/clang-build/Build/tools/clang/runtime/compiler-rt-bins/test/ubsan/ThreadSanitizer-x86_64/TestCases/ImplicitConversion/Output/signed-integer-truncation-or-sign-change-blacklist.c.tmp 2>&1 | not FileCheck /Users/buildslave/jenkins/workspace/clang-stage2-Rthinlto/llvm/projects/compiler-rt/test/ubsan/TestCases/ImplicitConversion/signed-integer-truncation-or-sign-change-blacklist.c : 'RUN: at line 47'; /Users/buildslave/jenkins/workspace/clang-stage2-Rthinlto/clang-build/Build/./bin/clang -fsanitize=thread -arch x86_64 -stdlib=libc++ -mmacosx-version-min=10.9 -isysroot /Applications/Xcode.app/Contents/Developer/Platforms/MacOSX.platform/Developer/SDKs/MacOSX10.14.sdk -fsanitize=implicit-signed-integer-truncation,implicit-integer-sign-change -fno-sanitize-recover=implicit-signed-integer-truncation,implicit-integer-sign-change -fsanitize-blacklist=/Users/buildslave/jenkins/workspace/clang-stage2-Rthinlto/clang-build/Build/tools/clang/runtime/compiler-rt-bins/test/ubsan/ThreadSanitizer-x86_64/TestCases/ImplicitConversion/Output/signed-integer-truncation-or-sign-change-blacklist.c.tmpmp -O3 /Users/buildslave/jenkins/workspace/clang-stage2-Rthinlto/llvm/projects/compiler-rt/test/ubsan/TestCases/ImplicitConversion/signed-integer-truncation-or-sign-change-blacklist.c -o /Users/buildslave/jenkins/workspace/clang-stage2-Rthinlto/clang-build/Build/tools/clang/runtime/compiler-rt-bins/test/ubsan/ThreadSanitizer-x86_64/TestCases/ImplicitConversion/Output/signed-integer-truncation-or-sign-change-blacklist.c.tmp && not /Users/buildslave/jenkins/workspace/clang-stage2-Rthinlto/clang-build/Build/tools/clang/runtime/compiler-rt-bins/test/ubsan/ThreadSanitizer-x86_64/TestCases/ImplicitConversion/Output/signed-integer-truncation-or-sign-change-blacklist.c.tmp 2>&1 | not FileCheck /Users/buildslave/jenkins/workspace/clang-stage2-Rthinlto/llvm/projects/compiler-rt/test/ubsan/TestCases/ImplicitConversion/signed-integer-truncation-or-sign-change-blacklist.c -- Exit Code: -9 Timeout: Reached timeout of 600 seconds

Hide Details

Hide Details

******************** TIMEOUT: UBSan-ThreadSanitizer-x86_64 :: TestCases/ImplicitConversion/unsigned-integer-truncation-blacklist.c (2352 of 2622) ******************** TEST 'UBSan-ThreadSanitizer-x86_64 :: TestCases/ImplicitConversion/unsigned-integer-truncation-blacklist.c' FAILED ******************** Script: -- : 'RUN: at line 6'; /Users/buildslave/jenkins/workspace/clang-stage2-Rthinlto/clang-build/Build/./bin/clang -fsanitize=thread -arch x86_64 -stdlib=libc++ -mmacosx-version-min=10.9 -isysroot /Applications/Xcode.app/Contents/Developer/Platforms/MacOSX.platform/Developer/SDKs/MacOSX10.14.sdk -fsanitize=implicit-integer-truncation -fno-sanitize-recover=implicit-integer-truncation -O0 /Users/buildslave/jenkins/workspace/clang-stage2-Rthinlto/llvm/projects/compiler-rt/test/ubsan/TestCases/ImplicitConversion/unsigned-integer-truncation-blacklist.c -o /Users/buildslave/jenkins/workspace/clang-stage2-Rthinlto/clang-build/Build/tools/clang/runtime/compiler-rt-bins/test/ubsan/ThreadSanitizer-x86_64/TestCases/ImplicitConversion/Output/unsigned-integer-truncation-blacklist.c.tmp && not /Users/buildslave/jenkins/workspace/clang-stage2-Rthinlto/clang-build/Build/tools/clang/runtime/compiler-rt-bins/test/ubsan/ThreadSanitizer-x86_64/TestCases/ImplicitConversion/Output/unsigned-integer-truncation-blacklist.c.tmp 2>&1 | FileCheck /Users/buildslave/jenkins/workspace/clang-stage2-Rthinlto/llvm/projects/compiler-rt/test/ubsan/TestCases/ImplicitConversion/unsigned-integer-truncation-blacklist.c --implicit-check-not="implicit conversion" : 'RUN: at line 7'; /Users/buildslave/jenkins/workspace/clang-stage2-Rthinlto/clang-build/Build/./bin/clang -fsanitize=thread -arch x86_64 -stdlib=libc++ -mmacosx-version-min=10.9 -isysroot /Applications/Xcode.app/Contents/Developer/Platforms/MacOSX.platform/Developer/SDKs/MacOSX10.14.sdk -fsanitize=implicit-integer-truncation -fno-sanitize-recover=implicit-integer-truncation -O1 /Users/buildslave/jenkins/workspace/clang-stage2-Rthinlto/llvm/projects/compiler-rt/test/ubsan/TestCases/ImplicitConversion/unsigned-integer-truncation-blacklist.c -o /Users/buildslave/jenkins/workspace/clang-stage2-Rthinlto/clang-build/Build/tools/clang/runtime/compiler-rt-bins/test/ubsan/ThreadSanitizer-x86_64/TestCases/ImplicitConversion/Output/unsigned-integer-truncation-blacklist.c.tmp && not /Users/buildslave/jenkins/workspace/clang-stage2-Rthinlto/clang-build/Build/tools/clang/runtime/compiler-rt-bins/test/ubsan/ThreadSanitizer-x86_64/TestCases/ImplicitConversion/Output/unsigned-integer-truncation-blacklist.c.tmp 2>&1 | FileCheck /Users/buildslave/jenkins/workspace/clang-stage2-Rthinlto/llvm/projects/compiler-rt/test/ubsan/TestCases/ImplicitConversion/unsigned-integer-truncation-blacklist.c --implicit-check-not="implicit conversion" : 'RUN: at line 8'; /Users/buildslave/jenkins/workspace/clang-stage2-Rthinlto/clang-build/Build/./bin/clang -fsanitize=thread -arch x86_64 -stdlib=libc++ -mmacosx-version-min=10.9 -isysroot /Applications/Xcode.app/Contents/Developer/Platforms/MacOSX.platform/Developer/SDKs/MacOSX10.14.sdk -fsanitize=implicit-integer-truncation -fno-sanitize-recover=implicit-integer-truncation -O2 /Users/buildslave/jenkins/workspace/clang-stage2-Rthinlto/llvm/projects/compiler-rt/test/ubsan/TestCases/ImplicitConversion/unsigned-integer-truncation-blacklist.c -o /Users/buildslave/jenkins/workspace/clang-stage2-Rthinlto/clang-build/Build/tools/clang/runtime/compiler-rt-bins/test/ubsan/ThreadSanitizer-x86_64/TestCases/ImplicitConversion/Output/unsigned-integer-truncation-blacklist.c.tmp && not /Users/buildslave/jenkins/workspace/clang-stage2-Rthinlto/clang-build/Build/tools/clang/runtime/compiler-rt-bins/test/ubsan/ThreadSanitizer-x86_64/TestCases/ImplicitConversion/Output/unsigned-integer-truncation-blacklist.c.tmp 2>&1 | FileCheck /Users/buildslave/jenkins/workspace/clang-stage2-Rthinlto/llvm/projects/compiler-rt/test/ubsan/TestCases/ImplicitConversion/unsigned-integer-truncation-blacklist.c --implicit-check-not="implicit conversion" : 'RUN: at line 9'; /Users/buildslave/jenkins/workspace/clang-stage2-Rthinlto/clang-build/Build/./bin/clang -fsanitize=thread -arch x86_64 -stdlib=libc++ -mmacosx-version-min=10.9 -isysroot /Applications/Xcode.app/Contents/Developer/Platforms/MacOSX.platform/Developer/SDKs/MacOSX10.14.sdk -fsanitize=implicit-integer-truncation -fno-sanitize-recover=implicit-integer-truncation -O3 /Users/buildslave/jenkins/workspace/clang-stage2-Rthinlto/llvm/projects/compiler-rt/test/ubsan/TestCases/ImplicitConversion/unsigned-integer-truncation-blacklist.c -o /Users/buildslave/jenkins/workspace/clang-stage2-Rthinlto/clang-build/Build/tools/clang/runtime/compiler-rt-bins/test/ubsan/ThreadSanitizer-x86_64/TestCases/ImplicitConversion/Output/unsigned-integer-truncation-blacklist.c.tmp && not /Users/buildslave/jenkins/workspace/clang-stage2-Rthinlto/clang-build/Build/tools/clang/runtime/compiler-rt-bins/test/ubsan/ThreadSanitizer-x86_64/TestCases/ImplicitConversion/Output/unsigned-integer-truncation-blacklist.c.tmp 2>&1 | FileCheck /Users/buildslave/jenkins/workspace/clang-stage2-Rthinlto/llvm/projects/compiler-rt/test/ubsan/TestCases/ImplicitConversion/unsigned-integer-truncation-blacklist.c --implicit-check-not="implicit conversion" : 'RUN: at line 11'; rm -f /Users/buildslave/jenkins/workspace/clang-stage2-Rthinlto/clang-build/Build/tools/clang/runtime/compiler-rt-bins/test/ubsan/ThreadSanitizer-x86_64/TestCases/ImplicitConversion/Output/unsigned-integer-truncation-blacklist.c.tmpmp : 'RUN: at line 12'; echo "[integer]" >> /Users/buildslave/jenkins/workspace/clang-stage2-Rthinlto/clang-build/Build/tools/clang/runtime/compiler-rt-bins/test/ubsan/ThreadSanitizer-x86_64/TestCases/ImplicitConversion/Output/unsigned-integer-truncation-blacklist.c.tmpmp : 'RUN: at line 13'; echo "fun:implicitUnsignedTruncation" >> /Users/buildslave/jenkins/workspace/clang-stage2-Rthinlto/clang-build/Build/tools/clang/runtime/compiler-rt-bins/test/ubsan/ThreadSanitizer-x86_64/TestCases/ImplicitConversion/Output/unsigned-integer-truncation-blacklist.c.tmpmp : 'RUN: at line 14'; /Users/buildslave/jenkins/workspace/clang-stage2-Rthinlto/clang-build/Build/./bin/clang -fsanitize=thread -arch x86_64 -stdlib=libc++ -mmacosx-version-min=10.9 -isysroot /Applications/Xcode.app/Contents/Developer/Platforms/MacOSX.platform/Developer/SDKs/MacOSX10.14.sdk -fsanitize=implicit-integer-truncation -fno-sanitize-recover=implicit-integer-truncation -fsanitize-blacklist=/Users/buildslave/jenkins/workspace/clang-stage2-Rthinlto/clang-build/Build/tools/clang/runtime/compiler-rt-bins/test/ubsan/ThreadSanitizer-x86_64/TestCases/ImplicitConversion/Output/unsigned-integer-truncation-blacklist.c.tmpmp -O0 /Users/buildslave/jenkins/workspace/clang-stage2-Rthinlto/llvm/projects/compiler-rt/test/ubsan/TestCases/ImplicitConversion/unsigned-integer-truncation-blacklist.c -o /Users/buildslave/jenkins/workspace/clang-stage2-Rthinlto/clang-build/Build/tools/clang/runtime/compiler-rt-bins/test/ubsan/ThreadSanitizer-x86_64/TestCases/ImplicitConversion/Output/unsigned-integer-truncation-blacklist.c.tmp && not /Users/buildslave/jenkins/workspace/clang-stage2-Rthinlto/clang-build/Build/tools/clang/runtime/compiler-rt-bins/test/ubsan/ThreadSanitizer-x86_64/TestCases/ImplicitConversion/Output/unsigned-integer-truncation-blacklist.c.tmp 2>&1 | not FileCheck /Users/buildslave/jenkins/workspace/clang-stage2-Rthinlto/llvm/projects/compiler-rt/test/ubsan/TestCases/ImplicitConversion/unsigned-integer-truncation-blacklist.c : 'RUN: at line 15'; /Users/buildslave/jenkins/workspace/clang-stage2-Rthinlto/clang-build/Build/./bin/clang -fsanitize=thread -arch x86_64 -stdlib=libc++ -mmacosx-version-min=10.9 -isysroot /Applications/Xcode.app/Contents/Developer/Platforms/MacOSX.platform/Developer/SDKs/MacOSX10.14.sdk -fsanitize=implicit-integer-truncation -fno-sanitize-recover=implicit-integer-truncation -fsanitize-blacklist=/Users/buildslave/jenkins/workspace/clang-stage2-Rthinlto/clang-build/Build/tools/clang/runtime/compiler-rt-bins/test/ubsan/ThreadSanitizer-x86_64/TestCases/ImplicitConversion/Output/unsigned-integer-truncation-blacklist.c.tmpmp -O1 /Users/buildslave/jenkins/workspace/clang-stage2-Rthinlto/llvm/projects/compiler-rt/test/ubsan/TestCases/ImplicitConversion/unsigned-integer-truncation-blacklist.c -o /Users/buildslave/jenkins/workspace/clang-stage2-Rthinlto/clang-build/Build/tools/clang/runtime/compiler-rt-bins/test/ubsan/ThreadSanitizer-x86_64/TestCases/ImplicitConversion/Output/unsigned-integer-truncation-blacklist.c.tmp && not /Users/buildslave/jenkins/workspace/clang-stage2-Rthinlto/clang-build/Build/tools/clang/runtime/compiler-rt-bins/test/ubsan/ThreadSanitizer-x86_64/TestCases/ImplicitConversion/Output/unsigned-integer-truncation-blacklist.c.tmp 2>&1 | not FileCheck /Users/buildslave/jenkins/workspace/clang-stage2-Rthinlto/llvm/projects/compiler-rt/test/ubsan/TestCases/ImplicitConversion/unsigned-integer-truncation-blacklist.c : 'RUN: at line 16'; /Users/buildslave/jenkins/workspace/clang-stage2-Rthinlto/clang-build/Build/./bin/clang -fsanitize=thread -arch x86_64 -stdlib=libc++ -mmacosx-version-min=10.9 -isysroot /Applications/Xcode.app/Contents/Developer/Platforms/MacOSX.platform/Developer/SDKs/MacOSX10.14.sdk -fsanitize=implicit-integer-truncation -fno-sanitize-recover=implicit-integer-truncation -fsanitize-blacklist=/Users/buildslave/jenkins/workspace/clang-stage2-Rthinlto/clang-build/Build/tools/clang/runtime/compiler-rt-bins/test/ubsan/ThreadSanitizer-x86_64/TestCases/ImplicitConversion/Output/unsigned-integer-truncation-blacklist.c.tmpmp -O2 /Users/buildslave/jenkins/workspace/clang-stage2-Rthinlto/llvm/projects/compiler-rt/test/ubsan/TestCases/ImplicitConversion/unsigned-integer-truncation-blacklist.c -o /Users/buildslave/jenkins/workspace/clang-stage2-Rthinlto/clang-build/Build/tools/clang/runtime/compiler-rt-bins/test/ubsan/ThreadSanitizer-x86_64/TestCases/ImplicitConversion/Output/unsigned-integer-truncation-blacklist.c.tmp && not /Users/buildslave/jenkins/workspace/clang-stage2-Rthinlto/clang-build/Build/tools/clang/runtime/compiler-rt-bins/test/ubsan/ThreadSanitizer-x86_64/TestCases/ImplicitConversion/Output/unsigned-integer-truncation-blacklist.c.tmp 2>&1 | not FileCheck /Users/buildslave/jenkins/workspace/clang-stage2-Rthinlto/llvm/projects/compiler-rt/test/ubsan/TestCases/ImplicitConversion/unsigned-integer-truncation-blacklist.c : 'RUN: at line 17'; /Users/buildslave/jenkins/workspace/clang-stage2-Rthinlto/clang-build/Build/./bin/clang -fsanitize=thread -arch x86_64 -stdlib=libc++ -mmacosx-version-min=10.9 -isysroot /Applications/Xcode.app/Contents/Developer/Platforms/MacOSX.platform/Developer/SDKs/MacOSX10.14.sdk -fsanitize=implicit-integer-truncation -fno-sanitize-recover=implicit-integer-truncation -fsanitize-blacklist=/Users/buildslave/jenkins/workspace/clang-stage2-Rthinlto/clang-build/Build/tools/clang/runtime/compiler-rt-bins/test/ubsan/ThreadSanitizer-x86_64/TestCases/ImplicitConversion/Output/unsigned-integer-truncation-blacklist.c.tmpmp -O3 /Users/buildslave/jenkins/workspace/clang-stage2-Rthinlto/llvm/projects/compiler-rt/test/ubsan/TestCases/ImplicitConversion/unsigned-integer-truncation-blacklist.c -o /Users/buildslave/jenkins/workspace/clang-stage2-Rthinlto/clang-build/Build/tools/clang/runtime/compiler-rt-bins/test/ubsan/ThreadSanitizer-x86_64/TestCases/ImplicitConversion/Output/unsigned-integer-truncation-blacklist.c.tmp && not /Users/buildslave/jenkins/workspace/clang-stage2-Rthinlto/clang-build/Build/tools/clang/runtime/compiler-rt-bins/test/ubsan/ThreadSanitizer-x86_64/TestCases/ImplicitConversion/Output/unsigned-integer-truncation-blacklist.c.tmp 2>&1 | not FileCheck /Users/buildslave/jenkins/workspace/clang-stage2-Rthinlto/llvm/projects/compiler-rt/test/ubsan/TestCases/ImplicitConversion/unsigned-integer-truncation-blacklist.c : 'RUN: at line 19'; rm -f /Users/buildslave/jenkins/workspace/clang-stage2-Rthinlto/clang-build/Build/tools/clang/runtime/compiler-rt-bins/test/ubsan/ThreadSanitizer-x86_64/TestCases/ImplicitConversion/Output/unsigned-integer-truncation-blacklist.c.tmpmp : 'RUN: at line 20'; echo "[implicit-conversion]" >> /Users/buildslave/jenkins/workspace/clang-stage2-Rthinlto/clang-build/Build/tools/clang/runtime/compiler-rt-bins/test/ubsan/ThreadSanitizer-x86_64/TestCases/ImplicitConversion/Output/unsigned-integer-truncation-blacklist.c.tmpmp : 'RUN: at line 21'; echo "fun:implicitUnsignedTruncation" >> /Users/buildslave/jenkins/workspace/clang-stage2-Rthinlto/clang-build/Build/tools/clang/runtime/compiler-rt-bins/test/ubsan/ThreadSanitizer-x86_64/TestCases/ImplicitConversion/Output/unsigned-integer-truncation-blacklist.c.tmpmp : 'RUN: at line 22'; /Users/buildslave/jenkins/workspace/clang-stage2-Rthinlto/clang-build/Build/./bin/clang -fsanitize=thread -arch x86_64 -stdlib=libc++ -mmacosx-version-min=10.9 -isysroot /Applications/Xcode.app/Contents/Developer/Platforms/MacOSX.platform/Developer/SDKs/MacOSX10.14.sdk -fsanitize=implicit-integer-truncation -fno-sanitize-recover=implicit-integer-truncation -fsanitize-blacklist=/Users/buildslave/jenkins/workspace/clang-stage2-Rthinlto/clang-build/Build/tools/clang/runtime/compiler-rt-bins/test/ubsan/ThreadSanitizer-x86_64/TestCases/ImplicitConversion/Output/unsigned-integer-truncation-blacklist.c.tmpmp -O0 /Users/buildslave/jenkins/workspace/clang-stage2-Rthinlto/llvm/projects/compiler-rt/test/ubsan/TestCases/ImplicitConversion/unsigned-integer-truncation-blacklist.c -o /Users/buildslave/jenkins/workspace/clang-stage2-Rthinlto/clang-build/Build/tools/clang/runtime/compiler-rt-bins/test/ubsan/ThreadSanitizer-x86_64/TestCases/ImplicitConversion/Output/unsigned-integer-truncation-blacklist.c.tmp && not /Users/buildslave/jenkins/workspace/clang-stage2-Rthinlto/clang-build/Build/tools/clang/runtime/compiler-rt-bins/test/ubsan/ThreadSanitizer-x86_64/TestCases/ImplicitConversion/Output/unsigned-integer-truncation-blacklist.c.tmp 2>&1 | not FileCheck /Users/buildslave/jenkins/workspace/clang-stage2-Rthinlto/llvm/projects/compiler-rt/test/ubsan/TestCases/ImplicitConversion/unsigned-integer-truncation-blacklist.c : 'RUN: at line 23'; /Users/buildslave/jenkins/workspace/clang-stage2-Rthinlto/clang-build/Build/./bin/clang -fsanitize=thread -arch x86_64 -stdlib=libc++ -mmacosx-version-min=10.9 -isysroot /Applications/Xcode.app/Contents/Developer/Platforms/MacOSX.platform/Developer/SDKs/MacOSX10.14.sdk -fsanitize=implicit-integer-truncation -fno-sanitize-recover=implicit-integer-truncation -fsanitize-blacklist=/Users/buildslave/jenkins/workspace/clang-stage2-Rthinlto/clang-build/Build/tools/clang/runtime/compiler-rt-bins/test/ubsan/ThreadSanitizer-x86_64/TestCases/ImplicitConversion/Output/unsigned-integer-truncation-blacklist.c.tmpmp -O1 /Users/buildslave/jenkins/workspace/clang-stage2-Rthinlto/llvm/projects/compiler-rt/test/ubsan/TestCases/ImplicitConversion/unsigned-integer-truncation-blacklist.c -o /Users/buildslave/jenkins/workspace/clang-stage2-Rthinlto/clang-build/Build/tools/clang/runtime/compiler-rt-bins/test/ubsan/ThreadSanitizer-x86_64/TestCases/ImplicitConversion/Output/unsigned-integer-truncation-blacklist.c.tmp && not /Users/buildslave/jenkins/workspace/clang-stage2-Rthinlto/clang-build/Build/tools/clang/runtime/compiler-rt-bins/test/ubsan/ThreadSanitizer-x86_64/TestCases/ImplicitConversion/Output/unsigned-integer-truncation-blacklist.c.tmp 2>&1 | not FileCheck /Users/buildslave/jenkins/workspace/clang-stage2-Rthinlto/llvm/projects/compiler-rt/test/ubsan/TestCases/ImplicitConversion/unsigned-integer-truncation-blacklist.c : 'RUN: at line 24'; /Users/buildslave/jenkins/workspace/clang-stage2-Rthinlto/clang-build/Build/./bin/clang -fsanitize=thread -arch x86_64 -stdlib=libc++ -mmacosx-version-min=10.9 -isysroot /Applications/Xcode.app/Contents/Developer/Platforms/MacOSX.platform/Developer/SDKs/MacOSX10.14.sdk -fsanitize=implicit-integer-truncation -fno-sanitize-recover=implicit-integer-truncation -fsanitize-blacklist=/Users/buildslave/jenkins/workspace/clang-stage2-Rthinlto/clang-build/Build/tools/clang/runtime/compiler-rt-bins/test/ubsan/ThreadSanitizer-x86_64/TestCases/ImplicitConversion/Output/unsigned-integer-truncation-blacklist.c.tmpmp -O2 /Users/buildslave/jenkins/workspace/clang-stage2-Rthinlto/llvm/projects/compiler-rt/test/ubsan/TestCases/ImplicitConversion/unsigned-integer-truncation-blacklist.c -o /Users/buildslave/jenkins/workspace/clang-stage2-Rthinlto/clang-build/Build/tools/clang/runtime/compiler-rt-bins/test/ubsan/ThreadSanitizer-x86_64/TestCases/ImplicitConversion/Output/unsigned-integer-truncation-blacklist.c.tmp && not /Users/buildslave/jenkins/workspace/clang-stage2-Rthinlto/clang-build/Build/tools/clang/runtime/compiler-rt-bins/test/ubsan/ThreadSanitizer-x86_64/TestCases/ImplicitConversion/Output/unsigned-integer-truncation-blacklist.c.tmp 2>&1 | not FileCheck /Users/buildslave/jenkins/workspace/clang-stage2-Rthinlto/llvm/projects/compiler-rt/test/ubsan/TestCases/ImplicitConversion/unsigned-integer-truncation-blacklist.c : 'RUN: at line 25'; /Users/buildslave/jenkins/workspace/clang-stage2-Rthinlto/clang-build/Build/./bin/clang -fsanitize=thread -arch x86_64 -stdlib=libc++ -mmacosx-version-min=10.9 -isysroot /Applications/Xcode.app/Contents/Developer/Platforms/MacOSX.platform/Developer/SDKs/MacOSX10.14.sdk -fsanitize=implicit-integer-truncation -fno-sanitize-recover=implicit-integer-truncation -fsanitize-blacklist=/Users/buildslave/jenkins/workspace/clang-stage2-Rthinlto/clang-build/Build/tools/clang/runtime/compiler-rt-bins/test/ubsan/ThreadSanitizer-x86_64/TestCases/ImplicitConversion/Output/unsigned-integer-truncation-blacklist.c.tmpmp -O3 /Users/buildslave/jenkins/workspace/clang-stage2-Rthinlto/llvm/projects/compiler-rt/test/ubsan/TestCases/ImplicitConversion/unsigned-integer-truncation-blacklist.c -o /Users/buildslave/jenkins/workspace/clang-stage2-Rthinlto/clang-build/Build/tools/clang/runtime/compiler-rt-bins/test/ubsan/ThreadSanitizer-x86_64/TestCases/ImplicitConversion/Output/unsigned-integer-truncation-blacklist.c.tmp && not /Users/buildslave/jenkins/workspace/clang-stage2-Rthinlto/clang-build/Build/tools/clang/runtime/compiler-rt-bins/test/ubsan/ThreadSanitizer-x86_64/TestCases/ImplicitConversion/Output/unsigned-integer-truncation-blacklist.c.tmp 2>&1 | not FileCheck /Users/buildslave/jenkins/workspace/clang-stage2-Rthinlto/llvm/projects/compiler-rt/test/ubsan/TestCases/ImplicitConversion/unsigned-integer-truncation-blacklist.c : 'RUN: at line 27'; rm -f /Users/buildslave/jenkins/workspace/clang-stage2-Rthinlto/clang-build/Build/tools/clang/runtime/compiler-rt-bins/test/ubsan/ThreadSanitizer-x86_64/TestCases/ImplicitConversion/Output/unsigned-integer-truncation-blacklist.c.tmpmp : 'RUN: at line 28'; echo "[implicit-integer-truncation]" >> /Users/buildslave/jenkins/workspace/clang-stage2-Rthinlto/clang-build/Build/tools/clang/runtime/compiler-rt-bins/test/ubsan/ThreadSanitizer-x86_64/TestCases/ImplicitConversion/Output/unsigned-integer-truncation-blacklist.c.tmpmp : 'RUN: at line 29'; echo "fun:implicitUnsignedTruncation" >> /Users/buildslave/jenkins/workspace/clang-stage2-Rthinlto/clang-build/Build/tools/clang/runtime/compiler-rt-bins/test/ubsan/ThreadSanitizer-x86_64/TestCases/ImplicitConversion/Output/unsigned-integer-truncation-blacklist.c.tmpmp : 'RUN: at line 30'; /Users/buildslave/jenkins/workspace/clang-stage2-Rthinlto/clang-build/Build/./bin/clang -fsanitize=thread -arch x86_64 -stdlib=libc++ -mmacosx-version-min=10.9 -isysroot /Applications/Xcode.app/Contents/Developer/Platforms/MacOSX.platform/Developer/SDKs/MacOSX10.14.sdk -fsanitize=implicit-integer-truncation -fno-sanitize-recover=implicit-integer-truncation -fsanitize-blacklist=/Users/buildslave/jenkins/workspace/clang-stage2-Rthinlto/clang-build/Build/tools/clang/runtime/compiler-rt-bins/test/ubsan/ThreadSanitizer-x86_64/TestCases/ImplicitConversion/Output/unsigned-integer-truncation-blacklist.c.tmpmp -O0 /Users/buildslave/jenkins/workspace/clang-stage2-Rthinlto/llvm/projects/compiler-rt/test/ubsan/TestCases/ImplicitConversion/unsigned-integer-truncation-blacklist.c -o /Users/buildslave/jenkins/workspace/clang-stage2-Rthinlto/clang-build/Build/tools/clang/runtime/compiler-rt-bins/test/ubsan/ThreadSanitizer-x86_64/TestCases/ImplicitConversion/Output/unsigned-integer-truncation-blacklist.c.tmp && not /Users/buildslave/jenkins/workspace/clang-stage2-Rthinlto/clang-build/Build/tools/clang/runtime/compiler-rt-bins/test/ubsan/ThreadSanitizer-x86_64/TestCases/ImplicitConversion/Output/unsigned-integer-truncation-blacklist.c.tmp 2>&1 | not FileCheck /Users/buildslave/jenkins/workspace/clang-stage2-Rthinlto/llvm/projects/compiler-rt/test/ubsan/TestCases/ImplicitConversion/unsigned-integer-truncation-blacklist.c : 'RUN: at line 31'; /Users/buildslave/jenkins/workspace/clang-stage2-Rthinlto/clang-build/Build/./bin/clang -fsanitize=thread -arch x86_64 -stdlib=libc++ -mmacosx-version-min=10.9 -isysroot /Applications/Xcode.app/Contents/Developer/Platforms/MacOSX.platform/Developer/SDKs/MacOSX10.14.sdk -fsanitize=implicit-integer-truncation -fno-sanitize-recover=implicit-integer-truncation -fsanitize-blacklist=/Users/buildslave/jenkins/workspace/clang-stage2-Rthinlto/clang-build/Build/tools/clang/runtime/compiler-rt-bins/test/ubsan/ThreadSanitizer-x86_64/TestCases/ImplicitConversion/Output/unsigned-integer-truncation-blacklist.c.tmpmp -O1 /Users/buildslave/jenkins/workspace/clang-stage2-Rthinlto/llvm/projects/compiler-rt/test/ubsan/TestCases/ImplicitConversion/unsigned-integer-truncation-blacklist.c -o /Users/buildslave/jenkins/workspace/clang-stage2-Rthinlto/clang-build/Build/tools/clang/runtime/compiler-rt-bins/test/ubsan/ThreadSanitizer-x86_64/TestCases/ImplicitConversion/Output/unsigned-integer-truncation-blacklist.c.tmp && not /Users/buildslave/jenkins/workspace/clang-stage2-Rthinlto/clang-build/Build/tools/clang/runtime/compiler-rt-bins/test/ubsan/ThreadSanitizer-x86_64/TestCases/ImplicitConversion/Output/unsigned-integer-truncation-blacklist.c.tmp 2>&1 | not FileCheck /Users/buildslave/jenkins/workspace/clang-stage2-Rthinlto/llvm/projects/compiler-rt/test/ubsan/TestCases/ImplicitConversion/unsigned-integer-truncation-blacklist.c : 'RUN: at line 32'; /Users/buildslave/jenkins/workspace/clang-stage2-Rthinlto/clang-build/Build/./bin/clang -fsanitize=thread -arch x86_64 -stdlib=libc++ -mmacosx-version-min=10.9 -isysroot /Applications/Xcode.app/Contents/Developer/Platforms/MacOSX.platform/Developer/SDKs/MacOSX10.14.sdk -fsanitize=implicit-integer-truncation -fno-sanitize-recover=implicit-integer-truncation -fsanitize-blacklist=/Users/buildslave/jenkins/workspace/clang-stage2-Rthinlto/clang-build/Build/tools/clang/runtime/compiler-rt-bins/test/ubsan/ThreadSanitizer-x86_64/TestCases/ImplicitConversion/Output/unsigned-integer-truncation-blacklist.c.tmpmp -O2 /Users/buildslave/jenkins/workspace/clang-stage2-Rthinlto/llvm/projects/compiler-rt/test/ubsan/TestCases/ImplicitConversion/unsigned-integer-truncation-blacklist.c -o /Users/buildslave/jenkins/workspace/clang-stage2-Rthinlto/clang-build/Build/tools/clang/runtime/compiler-rt-bins/test/ubsan/ThreadSanitizer-x86_64/TestCases/ImplicitConversion/Output/unsigned-integer-truncation-blacklist.c.tmp && not /Users/buildslave/jenkins/workspace/clang-stage2-Rthinlto/clang-build/Build/tools/clang/runtime/compiler-rt-bins/test/ubsan/ThreadSanitizer-x86_64/TestCases/ImplicitConversion/Output/unsigned-integer-truncation-blacklist.c.tmp 2>&1 | not FileCheck /Users/buildslave/jenkins/workspace/clang-stage2-Rthinlto/llvm/projects/compiler-rt/test/ubsan/TestCases/ImplicitConversion/unsigned-integer-truncation-blacklist.c : 'RUN: at line 33'; /Users/buildslave/jenkins/workspace/clang-stage2-Rthinlto/clang-build/Build/./bin/clang -fsanitize=thread -arch x86_64 -stdlib=libc++ -mmacosx-version-min=10.9 -isysroot /Applications/Xcode.app/Contents/Developer/Platforms/MacOSX.platform/Developer/SDKs/MacOSX10.14.sdk -fsanitize=implicit-integer-truncation -fno-sanitize-recover=implicit-integer-truncation -fsanitize-blacklist=/Users/buildslave/jenkins/workspace/clang-stage2-Rthinlto/clang-build/Build/tools/clang/runtime/compiler-rt-bins/test/ubsan/ThreadSanitizer-x86_64/TestCases/ImplicitConversion/Output/unsigned-integer-truncation-blacklist.c.tmpmp -O3 /Users/buildslave/jenkins/workspace/clang-stage2-Rthinlto/llvm/projects/compiler-rt/test/ubsan/TestCases/ImplicitConversion/unsigned-integer-truncation-blacklist.c -o /Users/buildslave/jenkins/workspace/clang-stage2-Rthinlto/clang-build/Build/tools/clang/runtime/compiler-rt-bins/test/ubsan/ThreadSanitizer-x86_64/TestCases/ImplicitConversion/Output/unsigned-integer-truncation-blacklist.c.tmp && not /Users/buildslave/jenkins/workspace/clang-stage2-Rthinlto/clang-build/Build/tools/clang/runtime/compiler-rt-bins/test/ubsan/ThreadSanitizer-x86_64/TestCases/ImplicitConversion/Output/unsigned-integer-truncation-blacklist.c.tmp 2>&1 | not FileCheck /Users/buildslave/jenkins/workspace/clang-stage2-Rthinlto/llvm/projects/compiler-rt/test/ubsan/TestCases/ImplicitConversion/unsigned-integer-truncation-blacklist.c : 'RUN: at line 35'; rm -f /Users/buildslave/jenkins/workspace/clang-stage2-Rthinlto/clang-build/Build/tools/clang/runtime/compiler-rt-bins/test/ubsan/ThreadSanitizer-x86_64/TestCases/ImplicitConversion/Output/unsigned-integer-truncation-blacklist.c.tmpmp : 'RUN: at line 36'; echo "[implicit-unsigned-integer-truncation]" >> /Users/buildslave/jenkins/workspace/clang-stage2-Rthinlto/clang-build/Build/tools/clang/runtime/compiler-rt-bins/test/ubsan/ThreadSanitizer-x86_64/TestCases/ImplicitConversion/Output/unsigned-integer-truncation-blacklist.c.tmpmp : 'RUN: at line 37'; echo "fun:implicitUnsignedTruncation" >> /Users/buildslave/jenkins/workspace/clang-stage2-Rthinlto/clang-build/Build/tools/clang/runtime/compiler-rt-bins/test/ubsan/ThreadSanitizer-x86_64/TestCases/ImplicitConversion/Output/unsigned-integer-truncation-blacklist.c.tmpmp : 'RUN: at line 38'; /Users/buildslave/jenkins/workspace/clang-stage2-Rthinlto/clang-build/Build/./bin/clang -fsanitize=thread -arch x86_64 -stdlib=libc++ -mmacosx-version-min=10.9 -isysroot /Applications/Xcode.app/Contents/Developer/Platforms/MacOSX.platform/Developer/SDKs/MacOSX10.14.sdk -fsanitize=implicit-integer-truncation -fno-sanitize-recover=implicit-integer-truncation -fsanitize-blacklist=/Users/buildslave/jenkins/workspace/clang-stage2-Rthinlto/clang-build/Build/tools/clang/runtime/compiler-rt-bins/test/ubsan/ThreadSanitizer-x86_64/TestCases/ImplicitConversion/Output/unsigned-integer-truncation-blacklist.c.tmpmp -O0 /Users/buildslave/jenkins/workspace/clang-stage2-Rthinlto/llvm/projects/compiler-rt/test/ubsan/TestCases/ImplicitConversion/unsigned-integer-truncation-blacklist.c -o /Users/buildslave/jenkins/workspace/clang-stage2-Rthinlto/clang-build/Build/tools/clang/runtime/compiler-rt-bins/test/ubsan/ThreadSanitizer-x86_64/TestCases/ImplicitConversion/Output/unsigned-integer-truncation-blacklist.c.tmp && not /Users/buildslave/jenkins/workspace/clang-stage2-Rthinlto/clang-build/Build/tools/clang/runtime/compiler-rt-bins/test/ubsan/ThreadSanitizer-x86_64/TestCases/ImplicitConversion/Output/unsigned-integer-truncation-blacklist.c.tmp 2>&1 | not FileCheck /Users/buildslave/jenkins/workspace/clang-stage2-Rthinlto/llvm/projects/compiler-rt/test/ubsan/TestCases/ImplicitConversion/unsigned-integer-truncation-blacklist.c : 'RUN: at line 39'; /Users/buildslave/jenkins/workspace/clang-stage2-Rthinlto/clang-build/Build/./bin/clang -fsanitize=thread -arch x86_64 -stdlib=libc++ -mmacosx-version-min=10.9 -isysroot /Applications/Xcode.app/Contents/Developer/Platforms/MacOSX.platform/Developer/SDKs/MacOSX10.14.sdk -fsanitize=implicit-integer-truncation -fno-sanitize-recover=implicit-integer-truncation -fsanitize-blacklist=/Users/buildslave/jenkins/workspace/clang-stage2-Rthinlto/clang-build/Build/tools/clang/runtime/compiler-rt-bins/test/ubsan/ThreadSanitizer-x86_64/TestCases/ImplicitConversion/Output/unsigned-integer-truncation-blacklist.c.tmpmp -O1 /Users/buildslave/jenkins/workspace/clang-stage2-Rthinlto/llvm/projects/compiler-rt/test/ubsan/TestCases/ImplicitConversion/unsigned-integer-truncation-blacklist.c -o /Users/buildslave/jenkins/workspace/clang-stage2-Rthinlto/clang-build/Build/tools/clang/runtime/compiler-rt-bins/test/ubsan/ThreadSanitizer-x86_64/TestCases/ImplicitConversion/Output/unsigned-integer-truncation-blacklist.c.tmp && not /Users/buildslave/jenkins/workspace/clang-stage2-Rthinlto/clang-build/Build/tools/clang/runtime/compiler-rt-bins/test/ubsan/ThreadSanitizer-x86_64/TestCases/ImplicitConversion/Output/unsigned-integer-truncation-blacklist.c.tmp 2>&1 | not FileCheck /Users/buildslave/jenkins/workspace/clang-stage2-Rthinlto/llvm/projects/compiler-rt/test/ubsan/TestCases/ImplicitConversion/unsigned-integer-truncation-blacklist.c : 'RUN: at line 40'; /Users/buildslave/jenkins/workspace/clang-stage2-Rthinlto/clang-build/Build/./bin/clang -fsanitize=thread -arch x86_64 -stdlib=libc++ -mmacosx-version-min=10.9 -isysroot /Applications/Xcode.app/Contents/Developer/Platforms/MacOSX.platform/Developer/SDKs/MacOSX10.14.sdk -fsanitize=implicit-integer-truncation -fno-sanitize-recover=implicit-integer-truncation -fsanitize-blacklist=/Users/buildslave/jenkins/workspace/clang-stage2-Rthinlto/clang-build/Build/tools/clang/runtime/compiler-rt-bins/test/ubsan/ThreadSanitizer-x86_64/TestCases/ImplicitConversion/Output/unsigned-integer-truncation-blacklist.c.tmpmp -O2 /Users/buildslave/jenkins/workspace/clang-stage2-Rthinlto/llvm/projects/compiler-rt/test/ubsan/TestCases/ImplicitConversion/unsigned-integer-truncation-blacklist.c -o /Users/buildslave/jenkins/workspace/clang-stage2-Rthinlto/clang-build/Build/tools/clang/runtime/compiler-rt-bins/test/ubsan/ThreadSanitizer-x86_64/TestCases/ImplicitConversion/Output/unsigned-integer-truncation-blacklist.c.tmp && not /Users/buildslave/jenkins/workspace/clang-stage2-Rthinlto/clang-build/Build/tools/clang/runtime/compiler-rt-bins/test/ubsan/ThreadSanitizer-x86_64/TestCases/ImplicitConversion/Output/unsigned-integer-truncation-blacklist.c.tmp 2>&1 | not FileCheck /Users/buildslave/jenkins/workspace/clang-stage2-Rthinlto/llvm/projects/compiler-rt/test/ubsan/TestCases/ImplicitConversion/unsigned-integer-truncation-blacklist.c : 'RUN: at line 41'; /Users/buildslave/jenkins/workspace/clang-stage2-Rthinlto/clang-build/Build/./bin/clang -fsanitize=thread -arch x86_64 -stdlib=libc++ -mmacosx-version-min=10.9 -isysroot /Applications/Xcode.app/Contents/Developer/Platforms/MacOSX.platform/Developer/SDKs/MacOSX10.14.sdk -fsanitize=implicit-integer-truncation -fno-sanitize-recover=implicit-integer-truncation -fsanitize-blacklist=/Users/buildslave/jenkins/workspace/clang-stage2-Rthinlto/clang-build/Build/tools/clang/runtime/compiler-rt-bins/test/ubsan/ThreadSanitizer-x86_64/TestCases/ImplicitConversion/Output/unsigned-integer-truncation-blacklist.c.tmpmp -O3 /Users/buildslave/jenkins/workspace/clang-stage2-Rthinlto/llvm/projects/compiler-rt/test/ubsan/TestCases/ImplicitConversion/unsigned-integer-truncation-blacklist.c -o /Users/buildslave/jenkins/workspace/clang-stage2-Rthinlto/clang-build/Build/tools/clang/runtime/compiler-rt-bins/test/ubsan/ThreadSanitizer-x86_64/TestCases/ImplicitConversion/Output/unsigned-integer-truncation-blacklist.c.tmp && not /Users/buildslave/jenkins/workspace/clang-stage2-Rthinlto/clang-build/Build/tools/clang/runtime/compiler-rt-bins/test/ubsan/ThreadSanitizer-x86_64/TestCases/ImplicitConversion/Output/unsigned-integer-truncation-blacklist.c.tmp 2>&1 | not FileCheck /Users/buildslave/jenkins/workspace/clang-stage2-Rthinlto/llvm/projects/compiler-rt/test/ubsan/TestCases/ImplicitConversion/unsigned-integer-truncation-blacklist.c : 'RUN: at line 43'; rm -f /Users/buildslave/jenkins/workspace/clang-stage2-Rthinlto/clang-build/Build/tools/clang/runtime/compiler-rt-bins/test/ubsan/ThreadSanitizer-x86_64/TestCases/ImplicitConversion/Output/unsigned-integer-truncation-blacklist.c.tmpmp : 'RUN: at line 44'; echo "[implicit-signed-integer-truncation]" >> /Users/buildslave/jenkins/workspace/clang-stage2-Rthinlto/clang-build/Build/tools/clang/runtime/compiler-rt-bins/test/ubsan/ThreadSanitizer-x86_64/TestCases/ImplicitConversion/Output/unsigned-integer-truncation-blacklist.c.tmpmp : 'RUN: at line 45'; echo "fun:implicitUnsignedTruncation" >> /Users/buildslave/jenkins/workspace/clang-stage2-Rthinlto/clang-build/Build/tools/clang/runtime/compiler-rt-bins/test/ubsan/ThreadSanitizer-x86_64/TestCases/ImplicitConversion/Output/unsigned-integer-truncation-blacklist.c.tmpmp : 'RUN: at line 46'; /Users/buildslave/jenkins/workspace/clang-stage2-Rthinlto/clang-build/Build/./bin/clang -fsanitize=thread -arch x86_64 -stdlib=libc++ -mmacosx-version-min=10.9 -isysroot /Applications/Xcode.app/Contents/Developer/Platforms/MacOSX.platform/Developer/SDKs/MacOSX10.14.sdk -fsanitize=implicit-integer-truncation -fno-sanitize-recover=implicit-integer-truncation -fsanitize-blacklist=/Users/buildslave/jenkins/workspace/clang-stage2-Rthinlto/clang-build/Build/tools/clang/runtime/compiler-rt-bins/test/ubsan/ThreadSanitizer-x86_64/TestCases/ImplicitConversion/Output/unsigned-integer-truncation-blacklist.c.tmpmp -O0 /Users/buildslave/jenkins/workspace/clang-stage2-Rthinlto/llvm/projects/compiler-rt/test/ubsan/TestCases/ImplicitConversion/unsigned-integer-truncation-blacklist.c -o /Users/buildslave/jenkins/workspace/clang-stage2-Rthinlto/clang-build/Build/tools/clang/runtime/compiler-rt-bins/test/ubsan/ThreadSanitizer-x86_64/TestCases/ImplicitConversion/Output/unsigned-integer-truncation-blacklist.c.tmp && not /Users/buildslave/jenkins/workspace/clang-stage2-Rthinlto/clang-build/Build/tools/clang/runtime/compiler-rt-bins/test/ubsan/ThreadSanitizer-x86_64/TestCases/ImplicitConversion/Output/unsigned-integer-truncation-blacklist.c.tmp 2>&1 | FileCheck /Users/buildslave/jenkins/workspace/clang-stage2-Rthinlto/llvm/projects/compiler-rt/test/ubsan/TestCases/ImplicitConversion/unsigned-integer-truncation-blacklist.c : 'RUN: at line 47'; /Users/buildslave/jenkins/workspace/clang-stage2-Rthinlto/clang-build/Build/./bin/clang -fsanitize=thread -arch x86_64 -stdlib=libc++ -mmacosx-version-min=10.9 -isysroot /Applications/Xcode.app/Contents/Developer/Platforms/MacOSX.platform/Developer/SDKs/MacOSX10.14.sdk -fsanitize=implicit-integer-truncation -fno-sanitize-recover=implicit-integer-truncation -fsanitize-blacklist=/Users/buildslave/jenkins/workspace/clang-stage2-Rthinlto/clang-build/Build/tools/clang/runtime/compiler-rt-bins/test/ubsan/ThreadSanitizer-x86_64/TestCases/ImplicitConversion/Output/unsigned-integer-truncation-blacklist.c.tmpmp -O1 /Users/buildslave/jenkins/workspace/clang-stage2-Rthinlto/llvm/projects/compiler-rt/test/ubsan/TestCases/ImplicitConversion/unsigned-integer-truncation-blacklist.c -o /Users/buildslave/jenkins/workspace/clang-stage2-Rthinlto/clang-build/Build/tools/clang/runtime/compiler-rt-bins/test/ubsan/ThreadSanitizer-x86_64/TestCases/ImplicitConversion/Output/unsigned-integer-truncation-blacklist.c.tmp && not /Users/buildslave/jenkins/workspace/clang-stage2-Rthinlto/clang-build/Build/tools/clang/runtime/compiler-rt-bins/test/ubsan/ThreadSanitizer-x86_64/TestCases/ImplicitConversion/Output/unsigned-integer-truncation-blacklist.c.tmp 2>&1 | FileCheck /Users/buildslave/jenkins/workspace/clang-stage2-Rthinlto/llvm/projects/compiler-rt/test/ubsan/TestCases/ImplicitConversion/unsigned-integer-truncation-blacklist.c : 'RUN: at line 48'; /Users/buildslave/jenkins/workspace/clang-stage2-Rthinlto/clang-build/Build/./bin/clang -fsanitize=thread -arch x86_64 -stdlib=libc++ -mmacosx-version-min=10.9 -isysroot /Applications/Xcode.app/Contents/Developer/Platforms/MacOSX.platform/Developer/SDKs/MacOSX10.14.sdk -fsanitize=implicit-integer-truncation -fno-sanitize-recover=implicit-integer-truncation -fsanitize-blacklist=/Users/buildslave/jenkins/workspace/clang-stage2-Rthinlto/clang-build/Build/tools/clang/runtime/compiler-rt-bins/test/ubsan/ThreadSanitizer-x86_64/TestCases/ImplicitConversion/Output/unsigned-integer-truncation-blacklist.c.tmpmp -O2 /Users/buildslave/jenkins/workspace/clang-stage2-Rthinlto/llvm/projects/compiler-rt/test/ubsan/TestCases/ImplicitConversion/unsigned-integer-truncation-blacklist.c -o /Users/buildslave/jenkins/workspace/clang-stage2-Rthinlto/clang-build/Build/tools/clang/runtime/compiler-rt-bins/test/ubsan/ThreadSanitizer-x86_64/TestCases/ImplicitConversion/Output/unsigned-integer-truncation-blacklist.c.tmp && not /Users/buildslave/jenkins/workspace/clang-stage2-Rthinlto/clang-build/Build/tools/clang/runtime/compiler-rt-bins/test/ubsan/ThreadSanitizer-x86_64/TestCases/ImplicitConversion/Output/unsigned-integer-truncation-blacklist.c.tmp 2>&1 | FileCheck /Users/buildslave/jenkins/workspace/clang-stage2-Rthinlto/llvm/projects/compiler-rt/test/ubsan/TestCases/ImplicitConversion/unsigned-integer-truncation-blacklist.c : 'RUN: at line 49'; /Users/buildslave/jenkins/workspace/clang-stage2-Rthinlto/clang-build/Build/./bin/clang -fsanitize=thread -arch x86_64 -stdlib=libc++ -mmacosx-version-min=10.9 -isysroot /Applications/Xcode.app/Contents/Developer/Platforms/MacOSX.platform/Developer/SDKs/MacOSX10.14.sdk -fsanitize=implicit-integer-truncation -fno-sanitize-recover=implicit-integer-truncation -fsanitize-blacklist=/Users/buildslave/jenkins/workspace/clang-stage2-Rthinlto/clang-build/Build/tools/clang/runtime/compiler-rt-bins/test/ubsan/ThreadSanitizer-x86_64/TestCases/ImplicitConversion/Output/unsigned-integer-truncation-blacklist.c.tmpmp -O3 /Users/buildslave/jenkins/workspace/clang-stage2-Rthinlto/llvm/projects/compiler-rt/test/ubsan/TestCases/ImplicitConversion/unsigned-integer-truncation-blacklist.c -o /Users/buildslave/jenkins/workspace/clang-stage2-Rthinlto/clang-build/Build/tools/clang/runtime/compiler-rt-bins/test/ubsan/ThreadSanitizer-x86_64/TestCases/ImplicitConversion/Output/unsigned-integer-truncation-blacklist.c.tmp && not /Users/buildslave/jenkins/workspace/clang-stage2-Rthinlto/clang-build/Build/tools/clang/runtime/compiler-rt-bins/test/ubsan/ThreadSanitizer-x86_64/TestCases/ImplicitConversion/Output/unsigned-integer-truncation-blacklist.c.tmp 2>&1 | FileCheck /Users/buildslave/jenkins/workspace/clang-stage2-Rthinlto/llvm/projects/compiler-rt/test/ubsan/TestCases/ImplicitConversion/unsigned-integer-truncation-blacklist.c -- Exit Code: -9 Timeout: Reached timeout of 600 seconds

Hide Details

Command Output (stderr): -- FileCheck error: '-' is empty. FileCheck command line: FileCheck /Users/buildslave/jenkins/workspace/clang-stage2-Rthinlto/llvm/projects/compiler-rt/test/ubsan/TestCases/ImplicitConversion/unsigned-integer-truncation-blacklist.c FileCheck error: '-' is empty. FileCheck command line: FileCheck /Users/buildslave/jenkins/workspace/clang-stage2-Rthinlto/llvm/projects/compiler-rt/test/ubsan/TestCases/ImplicitConversion/unsigned-integer-truncation-blacklist.c FileCheck error: '-' is empty. FileCheck command line: FileCheck /Users/buildslave/jenkins/workspace/clang-stage2-Rthinlto/llvm/projects/compiler-rt/test/ubsan/TestCases/ImplicitConversion/unsigned-integer-truncation-blacklist.c FileCheck error: '-' is empty. FileCheck command line: FileCheck /Users/buildslave/jenkins/workspace/clang-stage2-Rthinlto/llvm/projects/compiler-rt/test/ubsan/TestCases/ImplicitConversion/unsigned-integer-truncation-blacklist.c FileCheck error: '-' is empty. FileCheck command line: FileCheck /Users/buildslave/jenkins/workspace/clang-stage2-Rthinlto/llvm/projects/compiler-rt/test/ubsan/TestCases/ImplicitConversion/unsigned-integer-truncation-blacklist.c FileCheck error: '-' is empty. FileCheck command line: FileCheck /Users/buildslave/jenkins/workspace/clang-stage2-Rthinlto/llvm/projects/compiler-rt/test/ubsan/TestCases/ImplicitConversion/unsigned-integer-truncation-blacklist.c FileCheck error: '-' is empty. FileCheck command line: FileCheck /Users/buildslave/jenkins/workspace/clang-stage2-Rthinlto/llvm/projects/compiler-rt/test/ubsan/TestCases/ImplicitConversion/unsigned-integer-truncation-blacklist.c FileCheck error: '-' is empty. FileCheck command line: FileCheck /Users/buildslave/jenkins/workspace/clang-stage2-Rthinlto/llvm/projects/compiler-rt/test/ubsan/TestCases/ImplicitConversion/unsigned-integer-truncation-blacklist.c FileCheck error: '-' is empty. FileCheck command line: FileCheck /Users/buildslave/jenkins/workspace/clang-stage2-Rthinlto/llvm/projects/compiler-rt/test/ubsan/TestCases/ImplicitConversion/unsigned-integer-truncation-blacklist.c /Users/buildslave/jenkins/workspace/clang-stage2-Rthinlto/clang-build/Build/tools/clang/runtime/compiler-rt-bins/test/ubsan/ThreadSanitizer-x86_64/TestCases/ImplicitConversion/Output/unsigned-integer-truncation-blacklist.c.script: line 39: 81108 Killed: 9 not /Users/buildslave/jenkins/workspace/clang-stage2-Rthinlto/clang-build/Build/tools/clang/runtime/compiler-rt-bins/test/ubsan/ThreadSanitizer-x86_64/TestCases/ImplicitConversion/Output/unsigned-integer-truncation-blacklist.c.tmp 2>&1 81111 | not FileCheck /Users/buildslave/jenkins/workspace/clang-stage2-Rthinlto/llvm/projects/compiler-rt/test/ubsan/TestCases/ImplicitConversion/unsigned-integer-truncation-blacklist.c

Hide Details

--

Hide Details

******************** TIMEOUT: UBSan-ThreadSanitizer-x86_64 :: TestCases/ImplicitConversion/unsigned-integer-truncation.c (2353 of 2622) ******************** TEST 'UBSan-ThreadSanitizer-x86_64 :: TestCases/ImplicitConversion/unsigned-integer-truncation.c' FAILED ******************** Script: -- : 'RUN: at line 1'; /Users/buildslave/jenkins/workspace/clang-stage2-Rthinlto/clang-build/Build/./bin/clang -fsanitize=thread -arch x86_64 -stdlib=libc++ -mmacosx-version-min=10.9 -isysroot /Applications/Xcode.app/Contents/Developer/Platforms/MacOSX.platform/Developer/SDKs/MacOSX10.14.sdk -x c -fsanitize=implicit-unsigned-integer-truncation /Users/buildslave/jenkins/workspace/clang-stage2-Rthinlto/llvm/projects/compiler-rt/test/ubsan/TestCases/ImplicitConversion/unsigned-integer-truncation.c -DV0 -o /Users/buildslave/jenkins/workspace/clang-stage2-Rthinlto/clang-build/Build/tools/clang/runtime/compiler-rt-bins/test/ubsan/ThreadSanitizer-x86_64/TestCases/ImplicitConversion/Output/unsigned-integer-truncation.c.tmp && /Users/buildslave/jenkins/workspace/clang-stage2-Rthinlto/clang-build/Build/tools/clang/runtime/compiler-rt-bins/test/ubsan/ThreadSanitizer-x86_64/TestCases/ImplicitConversion/Output/unsigned-integer-truncation.c.tmp 2>&1 | FileCheck /Users/buildslave/jenkins/workspace/clang-stage2-Rthinlto/llvm/projects/compiler-rt/test/ubsan/TestCases/ImplicitConversion/unsigned-integer-truncation.c --implicit-check-not="implicit conversion" --check-prefixes=CHECK-V0 : 'RUN: at line 2'; /Users/buildslave/jenkins/workspace/clang-stage2-Rthinlto/clang-build/Build/./bin/clang -fsanitize=thread -arch x86_64 -stdlib=libc++ -mmacosx-version-min=10.9 -isysroot /Applications/Xcode.app/Contents/Developer/Platforms/MacOSX.platform/Developer/SDKs/MacOSX10.14.sdk -x c -fsanitize=implicit-unsigned-integer-truncation /Users/buildslave/jenkins/workspace/clang-stage2-Rthinlto/llvm/projects/compiler-rt/test/ubsan/TestCases/ImplicitConversion/unsigned-integer-truncation.c -DV1 -o /Users/buildslave/jenkins/workspace/clang-stage2-Rthinlto/clang-build/Build/tools/clang/runtime/compiler-rt-bins/test/ubsan/ThreadSanitizer-x86_64/TestCases/ImplicitConversion/Output/unsigned-integer-truncation.c.tmp && /Users/buildslave/jenkins/workspace/clang-stage2-Rthinlto/clang-build/Build/tools/clang/runtime/compiler-rt-bins/test/ubsan/ThreadSanitizer-x86_64/TestCases/ImplicitConversion/Output/unsigned-integer-truncation.c.tmp 2>&1 | FileCheck /Users/buildslave/jenkins/workspace/clang-stage2-Rthinlto/llvm/projects/compiler-rt/test/ubsan/TestCases/ImplicitConversion/unsigned-integer-truncation.c --implicit-check-not="implicit conversion" --check-prefixes=CHECK-V1 : 'RUN: at line 3'; /Users/buildslave/jenkins/workspace/clang-stage2-Rthinlto/clang-build/Build/./bin/clang -fsanitize=thread -arch x86_64 -stdlib=libc++ -mmacosx-version-min=10.9 -isysroot /Applications/Xcode.app/Contents/Developer/Platforms/MacOSX.platform/Developer/SDKs/MacOSX10.14.sdk -x c -fsanitize=implicit-unsigned-integer-truncation /Users/buildslave/jenkins/workspace/clang-stage2-Rthinlto/llvm/projects/compiler-rt/test/ubsan/TestCases/ImplicitConversion/unsigned-integer-truncation.c -DV2 -o /Users/buildslave/jenkins/workspace/clang-stage2-Rthinlto/clang-build/Build/tools/clang/runtime/compiler-rt-bins/test/ubsan/ThreadSanitizer-x86_64/TestCases/ImplicitConversion/Output/unsigned-integer-truncation.c.tmp && /Users/buildslave/jenkins/workspace/clang-stage2-Rthinlto/clang-build/Build/tools/clang/runtime/compiler-rt-bins/test/ubsan/ThreadSanitizer-x86_64/TestCases/ImplicitConversion/Output/unsigned-integer-truncation.c.tmp 2>&1 | FileCheck /Users/buildslave/jenkins/workspace/clang-stage2-Rthinlto/llvm/projects/compiler-rt/test/ubsan/TestCases/ImplicitConversion/unsigned-integer-truncation.c --implicit-check-not="implicit conversion" --check-prefixes=CHECK-V2 : 'RUN: at line 4'; /Users/buildslave/jenkins/workspace/clang-stage2-Rthinlto/clang-build/Build/./bin/clang -fsanitize=thread -arch x86_64 -stdlib=libc++ -mmacosx-version-min=10.9 -isysroot /Applications/Xcode.app/Contents/Developer/Platforms/MacOSX.platform/Developer/SDKs/MacOSX10.14.sdk -x c -fsanitize=implicit-unsigned-integer-truncation /Users/buildslave/jenkins/workspace/clang-stage2-Rthinlto/llvm/projects/compiler-rt/test/ubsan/TestCases/ImplicitConversion/unsigned-integer-truncation.c -DV3 -o /Users/buildslave/jenkins/workspace/clang-stage2-Rthinlto/clang-build/Build/tools/clang/runtime/compiler-rt-bins/test/ubsan/ThreadSanitizer-x86_64/TestCases/ImplicitConversion/Output/unsigned-integer-truncation.c.tmp && /Users/buildslave/jenkins/workspace/clang-stage2-Rthinlto/clang-build/Build/tools/clang/runtime/compiler-rt-bins/test/ubsan/ThreadSanitizer-x86_64/TestCases/ImplicitConversion/Output/unsigned-integer-truncation.c.tmp 2>&1 | not FileCheck /Users/buildslave/jenkins/workspace/clang-stage2-Rthinlto/llvm/projects/compiler-rt/test/ubsan/TestCases/ImplicitConversion/unsigned-integer-truncation.c --implicit-check-not="implicit conversion" --check-prefixes=CHECK-V3 : 'RUN: at line 5'; /Users/buildslave/jenkins/workspace/clang-stage2-Rthinlto/clang-build/Build/./bin/clang -fsanitize=thread -arch x86_64 -stdlib=libc++ -mmacosx-version-min=10.9 -isysroot /Applications/Xcode.app/Contents/Developer/Platforms/MacOSX.platform/Developer/SDKs/MacOSX10.14.sdk -x c -fsanitize=implicit-unsigned-integer-truncation /Users/buildslave/jenkins/workspace/clang-stage2-Rthinlto/llvm/projects/compiler-rt/test/ubsan/TestCases/ImplicitConversion/unsigned-integer-truncation.c -DV4 -o /Users/buildslave/jenkins/workspace/clang-stage2-Rthinlto/clang-build/Build/tools/clang/runtime/compiler-rt-bins/test/ubsan/ThreadSanitizer-x86_64/TestCases/ImplicitConversion/Output/unsigned-integer-truncation.c.tmp && /Users/buildslave/jenkins/workspace/clang-stage2-Rthinlto/clang-build/Build/tools/clang/runtime/compiler-rt-bins/test/ubsan/ThreadSanitizer-x86_64/TestCases/ImplicitConversion/Output/unsigned-integer-truncation.c.tmp 2>&1 | not FileCheck /Users/buildslave/jenkins/workspace/clang-stage2-Rthinlto/llvm/projects/compiler-rt/test/ubsan/TestCases/ImplicitConversion/unsigned-integer-truncation.c --implicit-check-not="implicit conversion" --check-prefixes=CHECK-V4 : 'RUN: at line 6'; /Users/buildslave/jenkins/workspace/clang-stage2-Rthinlto/clang-build/Build/./bin/clang -fsanitize=thread -arch x86_64 -stdlib=libc++ -mmacosx-version-min=10.9 -isysroot /Applications/Xcode.app/Contents/Developer/Platforms/MacOSX.platform/Developer/SDKs/MacOSX10.14.sdk -x c -fsanitize=implicit-unsigned-integer-truncation /Users/buildslave/jenkins/workspace/clang-stage2-Rthinlto/llvm/projects/compiler-rt/test/ubsan/TestCases/ImplicitConversion/unsigned-integer-truncation.c -DV5 -o /Users/buildslave/jenkins/workspace/clang-stage2-Rthinlto/clang-build/Build/tools/clang/runtime/compiler-rt-bins/test/ubsan/ThreadSanitizer-x86_64/TestCases/ImplicitConversion/Output/unsigned-integer-truncation.c.tmp && /Users/buildslave/jenkins/workspace/clang-stage2-Rthinlto/clang-build/Build/tools/clang/runtime/compiler-rt-bins/test/ubsan/ThreadSanitizer-x86_64/TestCases/ImplicitConversion/Output/unsigned-integer-truncation.c.tmp 2>&1 | FileCheck /Users/buildslave/jenkins/workspace/clang-stage2-Rthinlto/llvm/projects/compiler-rt/test/ubsan/TestCases/ImplicitConversion/unsigned-integer-truncation.c --implicit-check-not="implicit conversion" --check-prefixes=CHECK-V5 : 'RUN: at line 7'; /Users/buildslave/jenkins/workspace/clang-stage2-Rthinlto/clang-build/Build/./bin/clang -fsanitize=thread -arch x86_64 -stdlib=libc++ -mmacosx-version-min=10.9 -isysroot /Applications/Xcode.app/Contents/Developer/Platforms/MacOSX.platform/Developer/SDKs/MacOSX10.14.sdk -x c -fsanitize=implicit-unsigned-integer-truncation /Users/buildslave/jenkins/workspace/clang-stage2-Rthinlto/llvm/projects/compiler-rt/test/ubsan/TestCases/ImplicitConversion/unsigned-integer-truncation.c -DV6 -o /Users/buildslave/jenkins/workspace/clang-stage2-Rthinlto/clang-build/Build/tools/clang/runtime/compiler-rt-bins/test/ubsan/ThreadSanitizer-x86_64/TestCases/ImplicitConversion/Output/unsigned-integer-truncation.c.tmp && /Users/buildslave/jenkins/workspace/clang-stage2-Rthinlto/clang-build/Build/tools/clang/runtime/compiler-rt-bins/test/ubsan/ThreadSanitizer-x86_64/TestCases/ImplicitConversion/Output/unsigned-integer-truncation.c.tmp 2>&1 | FileCheck /Users/buildslave/jenkins/workspace/clang-stage2-Rthinlto/llvm/projects/compiler-rt/test/ubsan/TestCases/ImplicitConversion/unsigned-integer-truncation.c --implicit-check-not="implicit conversion" --check-prefixes=CHECK-V6 : 'RUN: at line 8'; /Users/buildslave/jenkins/workspace/clang-stage2-Rthinlto/clang-build/Build/./bin/clang -fsanitize=thread -arch x86_64 -stdlib=libc++ -mmacosx-version-min=10.9 -isysroot /Applications/Xcode.app/Contents/Developer/Platforms/MacOSX.platform/Developer/SDKs/MacOSX10.14.sdk -x c -fsanitize=implicit-unsigned-integer-truncation /Users/buildslave/jenkins/workspace/clang-stage2-Rthinlto/llvm/projects/compiler-rt/test/ubsan/TestCases/ImplicitConversion/unsigned-integer-truncation.c -DV7 -o /Users/buildslave/jenkins/workspace/clang-stage2-Rthinlto/clang-build/Build/tools/clang/runtime/compiler-rt-bins/test/ubsan/ThreadSanitizer-x86_64/TestCases/ImplicitConversion/Output/unsigned-integer-truncation.c.tmp && /Users/buildslave/jenkins/workspace/clang-stage2-Rthinlto/clang-build/Build/tools/clang/runtime/compiler-rt-bins/test/ubsan/ThreadSanitizer-x86_64/TestCases/ImplicitConversion/Output/unsigned-integer-truncation.c.tmp 2>&1 | FileCheck /Users/buildslave/jenkins/workspace/clang-stage2-Rthinlto/llvm/projects/compiler-rt/test/ubsan/TestCases/ImplicitConversion/unsigned-integer-truncation.c --implicit-check-not="implicit conversion" --check-prefixes=CHECK-V7 : 'RUN: at line 10'; /Users/buildslave/jenkins/workspace/clang-stage2-Rthinlto/clang-build/Build/./bin/clang -fsanitize=thread -arch x86_64 -stdlib=libc++ -mmacosx-version-min=10.9 -isysroot /Applications/Xcode.app/Contents/Developer/Platforms/MacOSX.platform/Developer/SDKs/MacOSX10.14.sdk -x c++ -fsanitize=implicit-unsigned-integer-truncation /Users/buildslave/jenkins/workspace/clang-stage2-Rthinlto/llvm/projects/compiler-rt/test/ubsan/TestCases/ImplicitConversion/unsigned-integer-truncation.c -DV0 -o /Users/buildslave/jenkins/workspace/clang-stage2-Rthinlto/clang-build/Build/tools/clang/runtime/compiler-rt-bins/test/ubsan/ThreadSanitizer-x86_64/TestCases/ImplicitConversion/Output/unsigned-integer-truncation.c.tmp && /Users/buildslave/jenkins/workspace/clang-stage2-Rthinlto/clang-build/Build/tools/clang/runtime/compiler-rt-bins/test/ubsan/ThreadSanitizer-x86_64/TestCases/ImplicitConversion/Output/unsigned-integer-truncation.c.tmp 2>&1 | FileCheck /Users/buildslave/jenkins/workspace/clang-stage2-Rthinlto/llvm/projects/compiler-rt/test/ubsan/TestCases/ImplicitConversion/unsigned-integer-truncation.c --implicit-check-not="implicit conversion" --check-prefixes=CHECK-V0 : 'RUN: at line 11'; /Users/buildslave/jenkins/workspace/clang-stage2-Rthinlto/clang-build/Build/./bin/clang -fsanitize=thread -arch x86_64 -stdlib=libc++ -mmacosx-version-min=10.9 -isysroot /Applications/Xcode.app/Contents/Developer/Platforms/MacOSX.platform/Developer/SDKs/MacOSX10.14.sdk -x c++ -fsanitize=implicit-unsigned-integer-truncation /Users/buildslave/jenkins/workspace/clang-stage2-Rthinlto/llvm/projects/compiler-rt/test/ubsan/TestCases/ImplicitConversion/unsigned-integer-truncation.c -DV1 -o /Users/buildslave/jenkins/workspace/clang-stage2-Rthinlto/clang-build/Build/tools/clang/runtime/compiler-rt-bins/test/ubsan/ThreadSanitizer-x86_64/TestCases/ImplicitConversion/Output/unsigned-integer-truncation.c.tmp && /Users/buildslave/jenkins/workspace/clang-stage2-Rthinlto/clang-build/Build/tools/clang/runtime/compiler-rt-bins/test/ubsan/ThreadSanitizer-x86_64/TestCases/ImplicitConversion/Output/unsigned-integer-truncation.c.tmp 2>&1 | FileCheck /Users/buildslave/jenkins/workspace/clang-stage2-Rthinlto/llvm/projects/compiler-rt/test/ubsan/TestCases/ImplicitConversion/unsigned-integer-truncation.c --implicit-check-not="implicit conversion" --check-prefixes=CHECK-V1 : 'RUN: at line 12'; /Users/buildslave/jenkins/workspace/clang-stage2-Rthinlto/clang-build/Build/./bin/clang -fsanitize=thread -arch x86_64 -stdlib=libc++ -mmacosx-version-min=10.9 -isysroot /Applications/Xcode.app/Contents/Developer/Platforms/MacOSX.platform/Developer/SDKs/MacOSX10.14.sdk -x c++ -fsanitize=implicit-unsigned-integer-truncation /Users/buildslave/jenkins/workspace/clang-stage2-Rthinlto/llvm/projects/compiler-rt/test/ubsan/TestCases/ImplicitConversion/unsigned-integer-truncation.c -DV2 -o /Users/buildslave/jenkins/workspace/clang-stage2-Rthinlto/clang-build/Build/tools/clang/runtime/compiler-rt-bins/test/ubsan/ThreadSanitizer-x86_64/TestCases/ImplicitConversion/Output/unsigned-integer-truncation.c.tmp && /Users/buildslave/jenkins/workspace/clang-stage2-Rthinlto/clang-build/Build/tools/clang/runtime/compiler-rt-bins/test/ubsan/ThreadSanitizer-x86_64/TestCases/ImplicitConversion/Output/unsigned-integer-truncation.c.tmp 2>&1 | FileCheck /Users/buildslave/jenkins/workspace/clang-stage2-Rthinlto/llvm/projects/compiler-rt/test/ubsan/TestCases/ImplicitConversion/unsigned-integer-truncation.c --implicit-check-not="implicit conversion" --check-prefixes=CHECK-V2 : 'RUN: at line 13'; /Users/buildslave/jenkins/workspace/clang-stage2-Rthinlto/clang-build/Build/./bin/clang -fsanitize=thread -arch x86_64 -stdlib=libc++ -mmacosx-version-min=10.9 -isysroot /Applications/Xcode.app/Contents/Developer/Platforms/MacOSX.platform/Developer/SDKs/MacOSX10.14.sdk -x c++ -fsanitize=implicit-unsigned-integer-truncation /Users/buildslave/jenkins/workspace/clang-stage2-Rthinlto/llvm/projects/compiler-rt/test/ubsan/TestCases/ImplicitConversion/unsigned-integer-truncation.c -DV3 -o /Users/buildslave/jenkins/workspace/clang-stage2-Rthinlto/clang-build/Build/tools/clang/runtime/compiler-rt-bins/test/ubsan/ThreadSanitizer-x86_64/TestCases/ImplicitConversion/Output/unsigned-integer-truncation.c.tmp && /Users/buildslave/jenkins/workspace/clang-stage2-Rthinlto/clang-build/Build/tools/clang/runtime/compiler-rt-bins/test/ubsan/ThreadSanitizer-x86_64/TestCases/ImplicitConversion/Output/unsigned-integer-truncation.c.tmp 2>&1 | not FileCheck /Users/buildslave/jenkins/workspace/clang-stage2-Rthinlto/llvm/projects/compiler-rt/test/ubsan/TestCases/ImplicitConversion/unsigned-integer-truncation.c --implicit-check-not="implicit conversion" --check-prefixes=CHECK-V3 : 'RUN: at line 14'; /Users/buildslave/jenkins/workspace/clang-stage2-Rthinlto/clang-build/Build/./bin/clang -fsanitize=thread -arch x86_64 -stdlib=libc++ -mmacosx-version-min=10.9 -isysroot /Applications/Xcode.app/Contents/Developer/Platforms/MacOSX.platform/Developer/SDKs/MacOSX10.14.sdk -x c++ -fsanitize=implicit-unsigned-integer-truncation /Users/buildslave/jenkins/workspace/clang-stage2-Rthinlto/llvm/projects/compiler-rt/test/ubsan/TestCases/ImplicitConversion/unsigned-integer-truncation.c -DV4 -o /Users/buildslave/jenkins/workspace/clang-stage2-Rthinlto/clang-build/Build/tools/clang/runtime/compiler-rt-bins/test/ubsan/ThreadSanitizer-x86_64/TestCases/ImplicitConversion/Output/unsigned-integer-truncation.c.tmp && /Users/buildslave/jenkins/workspace/clang-stage2-Rthinlto/clang-build/Build/tools/clang/runtime/compiler-rt-bins/test/ubsan/ThreadSanitizer-x86_64/TestCases/ImplicitConversion/Output/unsigned-integer-truncation.c.tmp 2>&1 | not FileCheck /Users/buildslave/jenkins/workspace/clang-stage2-Rthinlto/llvm/projects/compiler-rt/test/ubsan/TestCases/ImplicitConversion/unsigned-integer-truncation.c --implicit-check-not="implicit conversion" --check-prefixes=CHECK-V4 : 'RUN: at line 15'; /Users/buildslave/jenkins/workspace/clang-stage2-Rthinlto/clang-build/Build/./bin/clang -fsanitize=thread -arch x86_64 -stdlib=libc++ -mmacosx-version-min=10.9 -isysroot /Applications/Xcode.app/Contents/Developer/Platforms/MacOSX.platform/Developer/SDKs/MacOSX10.14.sdk -x c++ -fsanitize=implicit-unsigned-integer-truncation /Users/buildslave/jenkins/workspace/clang-stage2-Rthinlto/llvm/projects/compiler-rt/test/ubsan/TestCases/ImplicitConversion/unsigned-integer-truncation.c -DV5 -o /Users/buildslave/jenkins/workspace/clang-stage2-Rthinlto/clang-build/Build/tools/clang/runtime/compiler-rt-bins/test/ubsan/ThreadSanitizer-x86_64/TestCases/ImplicitConversion/Output/unsigned-integer-truncation.c.tmp && /Users/buildslave/jenkins/workspace/clang-stage2-Rthinlto/clang-build/Build/tools/clang/runtime/compiler-rt-bins/test/ubsan/ThreadSanitizer-x86_64/TestCases/ImplicitConversion/Output/unsigned-integer-truncation.c.tmp 2>&1 | FileCheck /Users/buildslave/jenkins/workspace/clang-stage2-Rthinlto/llvm/projects/compiler-rt/test/ubsan/TestCases/ImplicitConversion/unsigned-integer-truncation.c --implicit-check-not="implicit conversion" --check-prefixes=CHECK-V5 : 'RUN: at line 16'; /Users/buildslave/jenkins/workspace/clang-stage2-Rthinlto/clang-build/Build/./bin/clang -fsanitize=thread -arch x86_64 -stdlib=libc++ -mmacosx-version-min=10.9 -isysroot /Applications/Xcode.app/Contents/Developer/Platforms/MacOSX.platform/Developer/SDKs/MacOSX10.14.sdk -x c++ -fsanitize=implicit-unsigned-integer-truncation /Users/buildslave/jenkins/workspace/clang-stage2-Rthinlto/llvm/projects/compiler-rt/test/ubsan/TestCases/ImplicitConversion/unsigned-integer-truncation.c -DV6 -o /Users/buildslave/jenkins/workspace/clang-stage2-Rthinlto/clang-build/Build/tools/clang/runtime/compiler-rt-bins/test/ubsan/ThreadSanitizer-x86_64/TestCases/ImplicitConversion/Output/unsigned-integer-truncation.c.tmp && /Users/buildslave/jenkins/workspace/clang-stage2-Rthinlto/clang-build/Build/tools/clang/runtime/compiler-rt-bins/test/ubsan/ThreadSanitizer-x86_64/TestCases/ImplicitConversion/Output/unsigned-integer-truncation.c.tmp 2>&1 | FileCheck /Users/buildslave/jenkins/workspace/clang-stage2-Rthinlto/llvm/projects/compiler-rt/test/ubsan/TestCases/ImplicitConversion/unsigned-integer-truncation.c --implicit-check-not="implicit conversion" --check-prefixes=CHECK-V6 : 'RUN: at line 17'; /Users/buildslave/jenkins/workspace/clang-stage2-Rthinlto/clang-build/Build/./bin/clang -fsanitize=thread -arch x86_64 -stdlib=libc++ -mmacosx-version-min=10.9 -isysroot /Applications/Xcode.app/Contents/Developer/Platforms/MacOSX.platform/Developer/SDKs/MacOSX10.14.sdk -x c++ -fsanitize=implicit-unsigned-integer-truncation /Users/buildslave/jenkins/workspace/clang-stage2-Rthinlto/llvm/projects/compiler-rt/test/ubsan/TestCases/ImplicitConversion/unsigned-integer-truncation.c -DV7 -o /Users/buildslave/jenkins/workspace/clang-stage2-Rthinlto/clang-build/Build/tools/clang/runtime/compiler-rt-bins/test/ubsan/ThreadSanitizer-x86_64/TestCases/ImplicitConversion/Output/unsigned-integer-truncation.c.tmp && /Users/buildslave/jenkins/workspace/clang-stage2-Rthinlto/clang-build/Build/tools/clang/runtime/compiler-rt-bins/test/ubsan/ThreadSanitizer-x86_64/TestCases/ImplicitConversion/Output/unsigned-integer-truncation.c.tmp 2>&1 | FileCheck /Users/buildslave/jenkins/workspace/clang-stage2-Rthinlto/llvm/projects/compiler-rt/test/ubsan/TestCases/ImplicitConversion/unsigned-integer-truncation.c --implicit-check-not="implicit conversion" --check-prefixes=CHECK-V7 -- Exit Code: -9 Timeout: Reached timeout of 600 seconds

Hide Details

Command Output (stderr): -- FileCheck error: '-' is empty. FileCheck command line: FileCheck /Users/buildslave/jenkins/workspace/clang-stage2-Rthinlto/llvm/projects/compiler-rt/test/ubsan/TestCases/ImplicitConversion/unsigned-integer-truncation.c --implicit-check-not=implicit conversion --check-prefixes=CHECK-V3 FileCheck error: '-' is empty. FileCheck command line: FileCheck /Users/buildslave/jenkins/workspace/clang-stage2-Rthinlto/llvm/projects/compiler-rt/test/ubsan/TestCases/ImplicitConversion/unsigned-integer-truncation.c --implicit-check-not=implicit conversion --check-prefixes=CHECK-V4 FileCheck error: '-' is empty. FileCheck command line: FileCheck /Users/buildslave/jenkins/workspace/clang-stage2-Rthinlto/llvm/projects/compiler-rt/test/ubsan/TestCases/ImplicitConversion/unsigned-integer-truncation.c --implicit-check-not=implicit conversion --check-prefixes=CHECK-V3

Hide Details

--

Hide Details

******************** PASS: UBSan-ThreadSanitizer-x86_64 :: TestCases/Integer/suppressions.cpp (2354 of 2622) PASS: UBSan-ThreadSanitizer-x86_64 :: TestCases/Misc/monitor.cpp (2355 of 2622) PASS: UBSan-ThreadSanitizer-x86_64 :: TestCases/Misc/bounds.cpp (2356 of 2622) PASS: UBSan-ThreadSanitizer-x86_64 :: TestCases/Misc/log-path_test.cc (2357 of 2622) PASS: UBSan-ThreadSanitizer-x86_64 :: TestCases/Misc/enum.cpp (2358 of 2622) PASS: UBSan-ThreadSanitizer-x86_64 :: TestCases/Misc/nullability.c (2359 of 2622) PASS: UBSan-ThreadSanitizer-x86_64 :: TestCases/Misc/missing_return.cpp (2360 of 2622) PASS: UBSan-ThreadSanitizer-x86_64 :: TestCases/Pointer/alignment-assumption-blacklist.cpp (2361 of 2622) PASS: UBSan-ThreadSanitizer-x86_64 :: TestCases/Misc/nonnull.cpp (2362 of 2622) PASS: UBSan-ThreadSanitizer-x86_64 :: TestCases/Misc/unreachable.cpp (2363 of 2622) TIMEOUT: UBSan-ThreadSanitizer-x86_64 :: TestCases/Integer/shift.cpp (2364 of 2622) ******************** TEST 'UBSan-ThreadSanitizer-x86_64 :: TestCases/Integer/shift.cpp' FAILED ******************** Script: -- : 'RUN: at line 1'; /Users/buildslave/jenkins/workspace/clang-stage2-Rthinlto/clang-build/Build/./bin/clang --driver-mode=g++ -fsanitize=thread -arch x86_64 -stdlib=libc++ -mmacosx-version-min=10.9 -isysroot /Applications/Xcode.app/Contents/Developer/Platforms/MacOSX.platform/Developer/SDKs/MacOSX10.14.sdk -DLSH_OVERFLOW -DOP='<<' -fsanitize=shift-base -fno-sanitize-recover=shift /Users/buildslave/jenkins/workspace/clang-stage2-Rthinlto/llvm/projects/compiler-rt/test/ubsan/TestCases/Integer/shift.cpp -o /Users/buildslave/jenkins/workspace/clang-stage2-Rthinlto/clang-build/Build/tools/clang/runtime/compiler-rt-bins/test/ubsan/ThreadSanitizer-x86_64/TestCases/Integer/Output/shift.cpp.tmp1 && not /Users/buildslave/jenkins/workspace/clang-stage2-Rthinlto/clang-build/Build/tools/clang/runtime/compiler-rt-bins/test/ubsan/ThreadSanitizer-x86_64/TestCases/Integer/Output/shift.cpp.tmp1 2>&1 | FileCheck /Users/buildslave/jenkins/workspace/clang-stage2-Rthinlto/llvm/projects/compiler-rt/test/ubsan/TestCases/Integer/shift.cpp --check-prefix=CHECK-LSH_OVERFLOW : 'RUN: at line 2'; /Users/buildslave/jenkins/workspace/clang-stage2-Rthinlto/clang-build/Build/./bin/clang --driver-mode=g++ -fsanitize=thread -arch x86_64 -stdlib=libc++ -mmacosx-version-min=10.9 -isysroot /Applications/Xcode.app/Contents/Developer/Platforms/MacOSX.platform/Developer/SDKs/MacOSX10.14.sdk -DLSH_OVERFLOW -DOP='<<=' -fsanitize=shift -fno-sanitize-recover=shift /Users/buildslave/jenkins/workspace/clang-stage2-Rthinlto/llvm/projects/compiler-rt/test/ubsan/TestCases/Integer/shift.cpp -o /Users/buildslave/jenkins/workspace/clang-stage2-Rthinlto/clang-build/Build/tools/clang/runtime/compiler-rt-bins/test/ubsan/ThreadSanitizer-x86_64/TestCases/Integer/Output/shift.cpp.tmp2 && not /Users/buildslave/jenkins/workspace/clang-stage2-Rthinlto/clang-build/Build/tools/clang/runtime/compiler-rt-bins/test/ubsan/ThreadSanitizer-x86_64/TestCases/Integer/Output/shift.cpp.tmp2 2>&1 | FileCheck /Users/buildslave/jenkins/workspace/clang-stage2-Rthinlto/llvm/projects/compiler-rt/test/ubsan/TestCases/Integer/shift.cpp --check-prefix=CHECK-LSH_OVERFLOW : 'RUN: at line 3'; /Users/buildslave/jenkins/workspace/clang-stage2-Rthinlto/clang-build/Build/./bin/clang --driver-mode=g++ -fsanitize=thread -arch x86_64 -stdlib=libc++ -mmacosx-version-min=10.9 -isysroot /Applications/Xcode.app/Contents/Developer/Platforms/MacOSX.platform/Developer/SDKs/MacOSX10.14.sdk -DTOO_LOW -DOP='<<' -fsanitize=shift-exponent -fno-sanitize-recover=shift /Users/buildslave/jenkins/workspace/clang-stage2-Rthinlto/llvm/projects/compiler-rt/test/ubsan/TestCases/Integer/shift.cpp -o /Users/buildslave/jenkins/workspace/clang-stage2-Rthinlto/clang-build/Build/tools/clang/runtime/compiler-rt-bins/test/ubsan/ThreadSanitizer-x86_64/TestCases/Integer/Output/shift.cpp.tmp3 && not /Users/buildslave/jenkins/workspace/clang-stage2-Rthinlto/clang-build/Build/tools/clang/runtime/compiler-rt-bins/test/ubsan/ThreadSanitizer-x86_64/TestCases/Integer/Output/shift.cpp.tmp3 2>&1 | FileCheck /Users/buildslave/jenkins/workspace/clang-stage2-Rthinlto/llvm/projects/compiler-rt/test/ubsan/TestCases/Integer/shift.cpp --check-prefix=CHECK-TOO_LOW : 'RUN: at line 4'; /Users/buildslave/jenkins/workspace/clang-stage2-Rthinlto/clang-build/Build/./bin/clang --driver-mode=g++ -fsanitize=thread -arch x86_64 -stdlib=libc++ -mmacosx-version-min=10.9 -isysroot /Applications/Xcode.app/Contents/Developer/Platforms/MacOSX.platform/Developer/SDKs/MacOSX10.14.sdk -DTOO_LOW -DOP='>>' -fsanitize=shift -fno-sanitize-recover=shift /Users/buildslave/jenkins/workspace/clang-stage2-Rthinlto/llvm/projects/compiler-rt/test/ubsan/TestCases/Integer/shift.cpp -o /Users/buildslave/jenkins/workspace/clang-stage2-Rthinlto/clang-build/Build/tools/clang/runtime/compiler-rt-bins/test/ubsan/ThreadSanitizer-x86_64/TestCases/Integer/Output/shift.cpp.tmp4 && not /Users/buildslave/jenkins/workspace/clang-stage2-Rthinlto/clang-build/Build/tools/clang/runtime/compiler-rt-bins/test/ubsan/ThreadSanitizer-x86_64/TestCases/Integer/Output/shift.cpp.tmp4 2>&1 | FileCheck /Users/buildslave/jenkins/workspace/clang-stage2-Rthinlto/llvm/projects/compiler-rt/test/ubsan/TestCases/Integer/shift.cpp --check-prefix=CHECK-TOO_LOW : 'RUN: at line 5'; /Users/buildslave/jenkins/workspace/clang-stage2-Rthinlto/clang-build/Build/./bin/clang --driver-mode=g++ -fsanitize=thread -arch x86_64 -stdlib=libc++ -mmacosx-version-min=10.9 -isysroot /Applications/Xcode.app/Contents/Developer/Platforms/MacOSX.platform/Developer/SDKs/MacOSX10.14.sdk -DTOO_LOW -DOP='<<=' -fsanitize=shift -fno-sanitize-recover=shift /Users/buildslave/jenkins/workspace/clang-stage2-Rthinlto/llvm/projects/compiler-rt/test/ubsan/TestCases/Integer/shift.cpp -o /Users/buildslave/jenkins/workspace/clang-stage2-Rthinlto/clang-build/Build/tools/clang/runtime/compiler-rt-bins/test/ubsan/ThreadSanitizer-x86_64/TestCases/Integer/Output/shift.cpp.tmp5 && not /Users/buildslave/jenkins/workspace/clang-stage2-Rthinlto/clang-build/Build/tools/clang/runtime/compiler-rt-bins/test/ubsan/ThreadSanitizer-x86_64/TestCases/Integer/Output/shift.cpp.tmp5 2>&1 | FileCheck /Users/buildslave/jenkins/workspace/clang-stage2-Rthinlto/llvm/projects/compiler-rt/test/ubsan/TestCases/Integer/shift.cpp --check-prefix=CHECK-TOO_LOW : 'RUN: at line 6'; /Users/buildslave/jenkins/workspace/clang-stage2-Rthinlto/clang-build/Build/./bin/clang --driver-mode=g++ -fsanitize=thread -arch x86_64 -stdlib=libc++ -mmacosx-version-min=10.9 -isysroot /Applications/Xcode.app/Contents/Developer/Platforms/MacOSX.platform/Developer/SDKs/MacOSX10.14.sdk -DTOO_LOW -DOP='>>=' -fsanitize=shift -fno-sanitize-recover=shift /Users/buildslave/jenkins/workspace/clang-stage2-Rthinlto/llvm/projects/compiler-rt/test/ubsan/TestCases/Integer/shift.cpp -o /Users/buildslave/jenkins/workspace/clang-stage2-Rthinlto/clang-build/Build/tools/clang/runtime/compiler-rt-bins/test/ubsan/ThreadSanitizer-x86_64/TestCases/Integer/Output/shift.cpp.tmp6 && not /Users/buildslave/jenkins/workspace/clang-stage2-Rthinlto/clang-build/Build/tools/clang/runtime/compiler-rt-bins/test/ubsan/ThreadSanitizer-x86_64/TestCases/Integer/Output/shift.cpp.tmp6 2>&1 | FileCheck /Users/buildslave/jenkins/workspace/clang-stage2-Rthinlto/llvm/projects/compiler-rt/test/ubsan/TestCases/Integer/shift.cpp --check-prefix=CHECK-TOO_LOW : 'RUN: at line 7'; /Users/buildslave/jenkins/workspace/clang-stage2-Rthinlto/clang-build/Build/./bin/clang --driver-mode=g++ -fsanitize=thread -arch x86_64 -stdlib=libc++ -mmacosx-version-min=10.9 -isysroot /Applications/Xcode.app/Contents/Developer/Platforms/MacOSX.platform/Developer/SDKs/MacOSX10.14.sdk -DTOO_HIGH -DOP='<<' -fsanitize=shift-exponent -fno-sanitize-recover=shift /Users/buildslave/jenkins/workspace/clang-stage2-Rthinlto/llvm/projects/compiler-rt/test/ubsan/TestCases/Integer/shift.cpp -o /Users/buildslave/jenkins/workspace/clang-stage2-Rthinlto/clang-build/Build/tools/clang/runtime/compiler-rt-bins/test/ubsan/ThreadSanitizer-x86_64/TestCases/Integer/Output/shift.cpp.tmp7 && not /Users/buildslave/jenkins/workspace/clang-stage2-Rthinlto/clang-build/Build/tools/clang/runtime/compiler-rt-bins/test/ubsan/ThreadSanitizer-x86_64/TestCases/Integer/Output/shift.cpp.tmp7 2>&1 | FileCheck /Users/buildslave/jenkins/workspace/clang-stage2-Rthinlto/llvm/projects/compiler-rt/test/ubsan/TestCases/Integer/shift.cpp --check-prefix=CHECK-TOO_HIGH : 'RUN: at line 8'; /Users/buildslave/jenkins/workspace/clang-stage2-Rthinlto/clang-build/Build/./bin/clang --driver-mode=g++ -fsanitize=thread -arch x86_64 -stdlib=libc++ -mmacosx-version-min=10.9 -isysroot /Applications/Xcode.app/Contents/Developer/Platforms/MacOSX.platform/Developer/SDKs/MacOSX10.14.sdk -DTOO_HIGH -DOP='>>' -fsanitize=shift -fno-sanitize-recover=shift /Users/buildslave/jenkins/workspace/clang-stage2-Rthinlto/llvm/projects/compiler-rt/test/ubsan/TestCases/Integer/shift.cpp -o /Users/buildslave/jenkins/workspace/clang-stage2-Rthinlto/clang-build/Build/tools/clang/runtime/compiler-rt-bins/test/ubsan/ThreadSanitizer-x86_64/TestCases/Integer/Output/shift.cpp.tmp8 && not /Users/buildslave/jenkins/workspace/clang-stage2-Rthinlto/clang-build/Build/tools/clang/runtime/compiler-rt-bins/test/ubsan/ThreadSanitizer-x86_64/TestCases/Integer/Output/shift.cpp.tmp8 2>&1 | FileCheck /Users/buildslave/jenkins/workspace/clang-stage2-Rthinlto/llvm/projects/compiler-rt/test/ubsan/TestCases/Integer/shift.cpp --check-prefix=CHECK-TOO_HIGH : 'RUN: at line 9'; /Users/buildslave/jenkins/workspace/clang-stage2-Rthinlto/clang-build/Build/./bin/clang --driver-mode=g++ -fsanitize=thread -arch x86_64 -stdlib=libc++ -mmacosx-version-min=10.9 -isysroot /Applications/Xcode.app/Contents/Developer/Platforms/MacOSX.platform/Developer/SDKs/MacOSX10.14.sdk -DTOO_HIGH -DOP='<<=' -fsanitize=shift -fno-sanitize-recover=shift /Users/buildslave/jenkins/workspace/clang-stage2-Rthinlto/llvm/projects/compiler-rt/test/ubsan/TestCases/Integer/shift.cpp -o /Users/buildslave/jenkins/workspace/clang-stage2-Rthinlto/clang-build/Build/tools/clang/runtime/compiler-rt-bins/test/ubsan/ThreadSanitizer-x86_64/TestCases/Integer/Output/shift.cpp.tmp9 && not /Users/buildslave/jenkins/workspace/clang-stage2-Rthinlto/clang-build/Build/tools/clang/runtime/compiler-rt-bins/test/ubsan/ThreadSanitizer-x86_64/TestCases/Integer/Output/shift.cpp.tmp9 2>&1 | FileCheck /Users/buildslave/jenkins/workspace/clang-stage2-Rthinlto/llvm/projects/compiler-rt/test/ubsan/TestCases/Integer/shift.cpp --check-prefix=CHECK-TOO_HIGH : 'RUN: at line 10'; /Users/buildslave/jenkins/workspace/clang-stage2-Rthinlto/clang-build/Build/./bin/clang --driver-mode=g++ -fsanitize=thread -arch x86_64 -stdlib=libc++ -mmacosx-version-min=10.9 -isysroot /Applications/Xcode.app/Contents/Developer/Platforms/MacOSX.platform/Developer/SDKs/MacOSX10.14.sdk -DTOO_HIGH -DOP='>>=' -fsanitize=shift -fno-sanitize-recover=shift /Users/buildslave/jenkins/workspace/clang-stage2-Rthinlto/llvm/projects/compiler-rt/test/ubsan/TestCases/Integer/shift.cpp -o /Users/buildslave/jenkins/workspace/clang-stage2-Rthinlto/clang-build/Build/tools/clang/runtime/compiler-rt-bins/test/ubsan/ThreadSanitizer-x86_64/TestCases/Integer/Output/shift.cpp.tmp10 && not /Users/buildslave/jenkins/workspace/clang-stage2-Rthinlto/clang-build/Build/tools/clang/runtime/compiler-rt-bins/test/ubsan/ThreadSanitizer-x86_64/TestCases/Integer/Output/shift.cpp.tmp10 2>&1 | FileCheck /Users/buildslave/jenkins/workspace/clang-stage2-Rthinlto/llvm/projects/compiler-rt/test/ubsan/TestCases/Integer/shift.cpp --check-prefix=CHECK-TOO_HIGH : 'RUN: at line 12'; /Users/buildslave/jenkins/workspace/clang-stage2-Rthinlto/clang-build/Build/./bin/clang --driver-mode=g++ -fsanitize=thread -arch x86_64 -stdlib=libc++ -mmacosx-version-min=10.9 -isysroot /Applications/Xcode.app/Contents/Developer/Platforms/MacOSX.platform/Developer/SDKs/MacOSX10.14.sdk -DLSH_OVERFLOW -DOP='<<' -fsanitize=shift-exponent -fno-sanitize-recover=shift /Users/buildslave/jenkins/workspace/clang-stage2-Rthinlto/llvm/projects/compiler-rt/test/ubsan/TestCases/Integer/shift.cpp -o /Users/buildslave/jenkins/workspace/clang-stage2-Rthinlto/clang-build/Build/tools/clang/runtime/compiler-rt-bins/test/ubsan/ThreadSanitizer-x86_64/TestCases/Integer/Output/shift.cpp.tmp12 && /Users/buildslave/jenkins/workspace/clang-stage2-Rthinlto/clang-build/Build/tools/clang/runtime/compiler-rt-bins/test/ubsan/ThreadSanitizer-x86_64/TestCases/Integer/Output/shift.cpp.tmp12 : 'RUN: at line 13'; /Users/buildslave/jenkins/workspace/clang-stage2-Rthinlto/clang-build/Build/./bin/clang --driver-mode=g++ -fsanitize=thread -arch x86_64 -stdlib=libc++ -mmacosx-version-min=10.9 -isysroot /Applications/Xcode.app/Contents/Developer/Platforms/MacOSX.platform/Developer/SDKs/MacOSX10.14.sdk -DLSH_OVERFLOW -DOP='>>' -fsanitize=shift-exponent -fno-sanitize-recover=shift /Users/buildslave/jenkins/workspace/clang-stage2-Rthinlto/llvm/projects/compiler-rt/test/ubsan/TestCases/Integer/shift.cpp -o /Users/buildslave/jenkins/workspace/clang-stage2-Rthinlto/clang-build/Build/tools/clang/runtime/compiler-rt-bins/test/ubsan/ThreadSanitizer-x86_64/TestCases/Integer/Output/shift.cpp.tmp13 && /Users/buildslave/jenkins/workspace/clang-stage2-Rthinlto/clang-build/Build/tools/clang/runtime/compiler-rt-bins/test/ubsan/ThreadSanitizer-x86_64/TestCases/Integer/Output/shift.cpp.tmp13 : 'RUN: at line 14'; /Users/buildslave/jenkins/workspace/clang-stage2-Rthinlto/clang-build/Build/./bin/clang --driver-mode=g++ -fsanitize=thread -arch x86_64 -stdlib=libc++ -mmacosx-version-min=10.9 -isysroot /Applications/Xcode.app/Contents/Developer/Platforms/MacOSX.platform/Developer/SDKs/MacOSX10.14.sdk -DTOO_LOW -DOP='<<' -fsanitize=shift-base -fno-sanitize-recover=shift /Users/buildslave/jenkins/workspace/clang-stage2-Rthinlto/llvm/projects/compiler-rt/test/ubsan/TestCases/Integer/shift.cpp -o /Users/buildslave/jenkins/workspace/clang-stage2-Rthinlto/clang-build/Build/tools/clang/runtime/compiler-rt-bins/test/ubsan/ThreadSanitizer-x86_64/TestCases/Integer/Output/shift.cpp.tmp14 && /Users/buildslave/jenkins/workspace/clang-stage2-Rthinlto/clang-build/Build/tools/clang/runtime/compiler-rt-bins/test/ubsan/ThreadSanitizer-x86_64/TestCases/Integer/Output/shift.cpp.tmp14 : 'RUN: at line 15'; /Users/buildslave/jenkins/workspace/clang-stage2-Rthinlto/clang-build/Build/./bin/clang --driver-mode=g++ -fsanitize=thread -arch x86_64 -stdlib=libc++ -mmacosx-version-min=10.9 -isysroot /Applications/Xcode.app/Contents/Developer/Platforms/MacOSX.platform/Developer/SDKs/MacOSX10.14.sdk -DTOO_LOW -DOP='>>' -fsanitize=shift-base -fno-sanitize-recover=shift /Users/buildslave/jenkins/workspace/clang-stage2-Rthinlto/llvm/projects/compiler-rt/test/ubsan/TestCases/Integer/shift.cpp -o /Users/buildslave/jenkins/workspace/clang-stage2-Rthinlto/clang-build/Build/tools/clang/runtime/compiler-rt-bins/test/ubsan/ThreadSanitizer-x86_64/TestCases/Integer/Output/shift.cpp.tmp15 && /Users/buildslave/jenkins/workspace/clang-stage2-Rthinlto/clang-build/Build/tools/clang/runtime/compiler-rt-bins/test/ubsan/ThreadSanitizer-x86_64/TestCases/Integer/Output/shift.cpp.tmp15 : 'RUN: at line 16'; /Users/buildslave/jenkins/workspace/clang-stage2-Rthinlto/clang-build/Build/./bin/clang --driver-mode=g++ -fsanitize=thread -arch x86_64 -stdlib=libc++ -mmacosx-version-min=10.9 -isysroot /Applications/Xcode.app/Contents/Developer/Platforms/MacOSX.platform/Developer/SDKs/MacOSX10.14.sdk -DTOO_HIGH -DOP='<<' -fsanitize=shift-base -fno-sanitize-recover=shift /Users/buildslave/jenkins/workspace/clang-stage2-Rthinlto/llvm/projects/compiler-rt/test/ubsan/TestCases/Integer/shift.cpp -o /Users/buildslave/jenkins/workspace/clang-stage2-Rthinlto/clang-build/Build/tools/clang/runtime/compiler-rt-bins/test/ubsan/ThreadSanitizer-x86_64/TestCases/Integer/Output/shift.cpp.tmp16 && /Users/buildslave/jenkins/workspace/clang-stage2-Rthinlto/clang-build/Build/tools/clang/runtime/compiler-rt-bins/test/ubsan/ThreadSanitizer-x86_64/TestCases/Integer/Output/shift.cpp.tmp16 : 'RUN: at line 17'; /Users/buildslave/jenkins/workspace/clang-stage2-Rthinlto/clang-build/Build/./bin/clang --driver-mode=g++ -fsanitize=thread -arch x86_64 -stdlib=libc++ -mmacosx-version-min=10.9 -isysroot /Applications/Xcode.app/Contents/Developer/Platforms/MacOSX.platform/Developer/SDKs/MacOSX10.14.sdk -DTOO_HIGH -DOP='>>' -fsanitize=shift-base -fno-sanitize-recover=shift /Users/buildslave/jenkins/workspace/clang-stage2-Rthinlto/llvm/projects/compiler-rt/test/ubsan/TestCases/Integer/shift.cpp -o /Users/buildslave/jenkins/workspace/clang-stage2-Rthinlto/clang-build/Build/tools/clang/runtime/compiler-rt-bins/test/ubsan/ThreadSanitizer-x86_64/TestCases/Integer/Output/shift.cpp.tmp17 && /Users/buildslave/jenkins/workspace/clang-stage2-Rthinlto/clang-build/Build/tools/clang/runtime/compiler-rt-bins/test/ubsan/ThreadSanitizer-x86_64/TestCases/Integer/Output/shift.cpp.tmp17 -- Exit Code: -9 Timeout: Reached timeout of 600 seconds

Hide Details

Command Output (stderr): -- /Users/buildslave/jenkins/workspace/clang-stage2-Rthinlto/llvm/projects/compiler-rt/test/ubsan/TestCases/Integer/shift.cpp:37:5: warning: shift count is negative [-Wshift-count-negative] a OP (-3); ^ ~~~~ <command line>:2:12: note: expanded from here #define OP << ^ 1 warning generated. /Users/buildslave/jenkins/workspace/clang-stage2-Rthinlto/llvm/projects/compiler-rt/test/ubsan/TestCases/Integer/shift.cpp:37:5: warning: shift count is negative [-Wshift-count-negative] a OP (-3); ^ ~~~~ <command line>:2:12: note: expanded from here #define OP >> ^ 1 warning generated. /Users/buildslave/jenkins/workspace/clang-stage2-Rthinlto/llvm/projects/compiler-rt/test/ubsan/TestCases/Integer/shift.cpp:37:5: warning: shift count is negative [-Wshift-count-negative] a OP (-3); ^ ~~~~ <command line>:2:12: note: expanded from here #define OP <<= ^ 1 warning generated. /Users/buildslave/jenkins/workspace/clang-stage2-Rthinlto/llvm/projects/compiler-rt/test/ubsan/TestCases/Integer/shift.cpp:37:5: warning: shift count is negative [-Wshift-count-negative] a OP (-3); ^ ~~~~ <command line>:2:12: note: expanded from here #define OP >>= ^ 1 warning generated. /Users/buildslave/jenkins/workspace/clang-stage2-Rthinlto/llvm/projects/compiler-rt/test/ubsan/TestCases/Integer/shift.cpp:43:5: warning: shift count >= width of type [-Wshift-count-overflow] a OP 32; ^ ~~ <command line>:2:12: note: expanded from here #define OP << ^ 1 warning generated. /Users/buildslave/jenkins/workspace/clang-stage2-Rthinlto/llvm/projects/compiler-rt/test/ubsan/TestCases/Integer/shift.cpp:43:5: warning: shift count >= width of type [-Wshift-count-overflow] a OP 32; ^ ~~ <command line>:2:12: note: expanded from here #define OP >> ^ 1 warning generated. /Users/buildslave/jenkins/workspace/clang-stage2-Rthinlto/llvm/projects/compiler-rt/test/ubsan/TestCases/Integer/shift.cpp:43:5: warning: shift count >= width of type [-Wshift-count-overflow] a OP 32; ^ ~~ <command line>:2:12: note: expanded from here #define OP <<= ^ 1 warning generated. /Users/buildslave/jenkins/workspace/clang-stage2-Rthinlto/llvm/projects/compiler-rt/test/ubsan/TestCases/Integer/shift.cpp:43:5: warning: shift count >= width of type [-Wshift-count-overflow] a OP 32; ^ ~~ <command line>:2:12: note: expanded from here #define OP >>= ^ 1 warning generated.

Hide Details

--

Hide Details

******************** PASS: UBSan-ThreadSanitizer-x86_64 :: TestCases/Misc/vla.c (2365 of 2622) UNSUPPORTED: UBSan-ThreadSanitizer-x86_64 :: TestCases/TypeCheck/Linux/PR33221.cpp (2366 of 2622) PASS: UBSan-ThreadSanitizer-x86_64 :: TestCases/TypeCheck/PR33221.cpp (2367 of 2622) PASS: UBSan-ThreadSanitizer-x86_64 :: TestCases/Pointer/alignment-assumption-summary.cpp (2368 of 2622) PASS: UBSan-ThreadSanitizer-x86_64 :: TestCases/Pointer/unsigned-index-expression.cpp (2369 of 2622) PASS: UBSan-ThreadSanitizer-x86_64 :: TestCases/Pointer/index-overflow.cpp (2370 of 2622) PASS: UBSan-ThreadSanitizer-x86_64 :: TestCases/TypeCheck/vptr-corrupted-vtable-itanium.cpp (2371 of 2622) PASS: UBSan-ThreadSanitizer-x86_64 :: TestCases/TypeCheck/vptr-non-unique-typeinfo.cpp (2372 of 2622) PASS: UBSan-ThreadSanitizer-x86_64 :: TestCases/TypeCheck/vptr-virtual-base-construction.cpp (2373 of 2622) PASS: UBSan-ThreadSanitizer-x86_64 :: TestCases/TypeCheck/Function/function.cpp (2374 of 2622) UNSUPPORTED: XRay-x86_64-darwin :: TestCases/Posix/always-never-instrument.cc (2375 of 2622) UNSUPPORTED: XRay-x86_64-darwin :: TestCases/Posix/arg1-arg0-logging.cc (2376 of 2622) UNSUPPORTED: XRay-x86_64-darwin :: TestCases/Posix/arg1-logger.cc (2377 of 2622) UNSUPPORTED: XRay-x86_64-darwin :: TestCases/Posix/arg1-logging-implicit-this.cc (2378 of 2622) UNSUPPORTED: XRay-x86_64-darwin :: TestCases/Posix/argv0-log-file-name.cc (2379 of 2622) UNSUPPORTED: XRay-x86_64-darwin :: TestCases/Posix/basic-filtering.cc (2380 of 2622) UNSUPPORTED: XRay-x86_64-darwin :: TestCases/Posix/c-test.cc (2381 of 2622) UNSUPPORTED: XRay-x86_64-darwin :: TestCases/Posix/clang-no-xray-instrument.cc (2382 of 2622) UNSUPPORTED: XRay-x86_64-darwin :: TestCases/Posix/common-trampoline-alignment.cc (2383 of 2622) UNSUPPORTED: XRay-x86_64-darwin :: TestCases/Posix/coverage-sample.cc (2384 of 2622) UNSUPPORTED: XRay-x86_64-darwin :: TestCases/Posix/custom-event-handler-alignment.cc (2385 of 2622) UNSUPPORTED: XRay-x86_64-darwin :: TestCases/Posix/custom-event-logging.cc (2386 of 2622) UNSUPPORTED: XRay-x86_64-darwin :: TestCases/Posix/fdr-mode-inmemory.cc (2387 of 2622) UNSUPPORTED: XRay-x86_64-darwin :: TestCases/Posix/fdr-mode-multiple.cc (2388 of 2622) UNSUPPORTED: XRay-x86_64-darwin :: TestCases/Posix/fdr-mode.cc (2389 of 2622) UNSUPPORTED: XRay-x86_64-darwin :: TestCases/Posix/fdr-reinit.cc (2390 of 2622) UNSUPPORTED: XRay-x86_64-darwin :: TestCases/Posix/fdr-single-thread.cc (2391 of 2622) UNSUPPORTED: XRay-x86_64-darwin :: TestCases/Posix/fdr-thread-order.cc (2392 of 2622) UNSUPPORTED: XRay-x86_64-darwin :: TestCases/Posix/fixedsize-logging.cc (2393 of 2622) UNSUPPORTED: XRay-x86_64-darwin :: TestCases/Posix/fork_basic_logging.cc (2394 of 2622) UNSUPPORTED: XRay-x86_64-darwin :: TestCases/Posix/func-id-utils.cc (2395 of 2622) UNSUPPORTED: XRay-x86_64-darwin :: TestCases/Posix/logging-modes.cc (2396 of 2622) UNSUPPORTED: XRay-x86_64-darwin :: TestCases/Posix/optional-inmemory-log.cc (2397 of 2622) UNSUPPORTED: XRay-x86_64-darwin :: TestCases/Posix/patching-unpatching.cc (2398 of 2622) UNSUPPORTED: XRay-x86_64-darwin :: TestCases/Posix/pic_test.cc (2399 of 2622) UNSUPPORTED: XRay-x86_64-darwin :: TestCases/Posix/profiling-multi-threaded.cc (2400 of 2622) UNSUPPORTED: XRay-x86_64-darwin :: TestCases/Posix/profiling-single-threaded.cc (2401 of 2622) UNSUPPORTED: XRay-x86_64-darwin :: TestCases/Posix/quiet-start.cc (2402 of 2622) UNSUPPORTED: XRay-x86_64h-darwin :: TestCases/Posix/always-never-instrument.cc (2403 of 2622) UNSUPPORTED: XRay-x86_64h-darwin :: TestCases/Posix/arg1-arg0-logging.cc (2404 of 2622) UNSUPPORTED: XRay-x86_64h-darwin :: TestCases/Posix/arg1-logger.cc (2405 of 2622) UNSUPPORTED: XRay-x86_64h-darwin :: TestCases/Posix/arg1-logging-implicit-this.cc (2406 of 2622) UNSUPPORTED: XRay-x86_64h-darwin :: TestCases/Posix/argv0-log-file-name.cc (2407 of 2622) UNSUPPORTED: XRay-x86_64h-darwin :: TestCases/Posix/basic-filtering.cc (2408 of 2622) UNSUPPORTED: XRay-x86_64h-darwin :: TestCases/Posix/c-test.cc (2409 of 2622) UNSUPPORTED: XRay-x86_64h-darwin :: TestCases/Posix/clang-no-xray-instrument.cc (2410 of 2622) UNSUPPORTED: XRay-x86_64h-darwin :: TestCases/Posix/common-trampoline-alignment.cc (2411 of 2622) UNSUPPORTED: XRay-x86_64h-darwin :: TestCases/Posix/coverage-sample.cc (2412 of 2622) UNSUPPORTED: XRay-x86_64h-darwin :: TestCases/Posix/custom-event-handler-alignment.cc (2413 of 2622) UNSUPPORTED: XRay-x86_64h-darwin :: TestCases/Posix/custom-event-logging.cc (2414 of 2622) UNSUPPORTED: XRay-x86_64h-darwin :: TestCases/Posix/fdr-mode-inmemory.cc (2415 of 2622) UNSUPPORTED: XRay-x86_64h-darwin :: TestCases/Posix/fdr-mode-multiple.cc (2416 of 2622) UNSUPPORTED: XRay-x86_64h-darwin :: TestCases/Posix/fdr-mode.cc (2417 of 2622) UNSUPPORTED: XRay-x86_64h-darwin :: TestCases/Posix/fdr-reinit.cc (2418 of 2622) UNSUPPORTED: XRay-x86_64h-darwin :: TestCases/Posix/fdr-single-thread.cc (2419 of 2622) UNSUPPORTED: XRay-x86_64h-darwin :: TestCases/Posix/fdr-thread-order.cc (2420 of 2622) UNSUPPORTED: XRay-x86_64h-darwin :: TestCases/Posix/fixedsize-logging.cc (2421 of 2622) UNSUPPORTED: XRay-x86_64h-darwin :: TestCases/Posix/fork_basic_logging.cc (2422 of 2622) UNSUPPORTED: XRay-x86_64h-darwin :: TestCases/Posix/func-id-utils.cc (2423 of 2622) UNSUPPORTED: XRay-x86_64h-darwin :: TestCases/Posix/logging-modes.cc (2424 of 2622) UNSUPPORTED: XRay-x86_64h-darwin :: TestCases/Posix/optional-inmemory-log.cc (2425 of 2622) UNSUPPORTED: XRay-x86_64h-darwin :: TestCases/Posix/patching-unpatching.cc (2426 of 2622) UNSUPPORTED: XRay-x86_64h-darwin :: TestCases/Posix/pic_test.cc (2427 of 2622) UNSUPPORTED: XRay-x86_64h-darwin :: TestCases/Posix/profiling-multi-threaded.cc (2428 of 2622) UNSUPPORTED: XRay-x86_64h-darwin :: TestCases/Posix/profiling-single-threaded.cc (2429 of 2622) UNSUPPORTED: XRay-x86_64h-darwin :: TestCases/Posix/quiet-start.cc (2430 of 2622) PASS: cfi-devirt-x86_64 :: anon-namespace.cpp (2431 of 2622) PASS: cfi-devirt-x86_64 :: bad-cast.cpp (2432 of 2622) PASS: cfi-devirt-x86_64 :: bad-split.cpp (2433 of 2622) PASS: cfi-devirt-x86_64 :: base-derived-destructor.cpp (2434 of 2622) UNSUPPORTED: cfi-devirt-x86_64 :: create-derivers.test (2435 of 2622) PASS: cfi-devirt-x86_64 :: cross-dso-diagnostic.cpp (2436 of 2622) UNSUPPORTED: cfi-devirt-x86_64 :: cross-dso/icall/diag.cpp (2437 of 2622) UNSUPPORTED: cfi-devirt-x86_64 :: cross-dso/icall/dlopen.cpp (2438 of 2622) UNSUPPORTED: cfi-devirt-x86_64 :: cross-dso/icall/icall-from-dso.cpp (2439 of 2622) UNSUPPORTED: cfi-devirt-x86_64 :: cross-dso/icall/icall.cpp (2440 of 2622) UNSUPPORTED: cfi-devirt-x86_64 :: cross-dso/shadow_is_read_only.cpp (2441 of 2622) UNSUPPORTED: cfi-devirt-x86_64 :: cross-dso/simple-fail.cpp (2442 of 2622) UNSUPPORTED: cfi-devirt-x86_64 :: cross-dso/simple-pass.cpp (2443 of 2622) UNSUPPORTED: cfi-devirt-x86_64 :: cross-dso/stats.cpp (2444 of 2622) UNSUPPORTED: cfi-devirt-x86_64 :: cross-dso/target_out_of_bounds.cpp (2445 of 2622) PASS: cfi-devirt-x86_64 :: icall/bad-signature.c (2446 of 2622) UNSUPPORTED: cfi-devirt-x86_64 :: icall/external-call.c (2447 of 2622) XFAIL: cfi-devirt-x86_64 :: icall/weak.c (2448 of 2622) UNSUPPORTED: cfi-devirt-x86_64 :: icall/wrong-signature-mixed-lto.c (2449 of 2622) PASS: UBSan-ThreadSanitizer-x86_64 :: TestCases/TypeCheck/vptr-virtual-base.cpp (2450 of 2622) PASS: cfi-devirt-x86_64 :: mfcall.cpp (2451 of 2622) PASS: UBSan-ThreadSanitizer-x86_64 :: TestCases/Pointer/alignment-assumption-attribute-assume_aligned-on-function-two-params.cpp (2452 of 2622) PASS: UBSan-ThreadSanitizer-x86_64 :: TestCases/Pointer/alignment-assumption-attribute-align_value-on-lvalue.cpp (2453 of 2622) PASS: UBSan-ThreadSanitizer-x86_64 :: TestCases/Misc/nonnull-arg.cpp (2454 of 2622) XFAIL: cfi-devirt-x86_64 :: sibling.cpp (2455 of 2622) XFAIL: cfi-devirt-x86_64 :: simple-pass.cpp (2456 of 2622) UNSUPPORTED: cfi-devirt-x86_64 :: stats.cpp (2457 of 2622) PASS: cfi-devirt-x86_64 :: nvcall.cpp (2458 of 2622) PASS: cfi-devirt-x86_64 :: target_uninstrumented.cpp (2459 of 2622) PASS: cfi-devirt-x86_64 :: multiple-inheritance.cpp (2460 of 2622) PASS: cfi-devirt-x86_64 :: vtable-may-alias.cpp (2461 of 2622) PASS: cfi-devirt-x86_64 :: overwrite.cpp (2462 of 2622) XFAIL: cfi-devirt-x86_64 :: two-vcalls.cpp (2463 of 2622) PASS: cfi-standalone-x86_64 :: bad-split.cpp (2464 of 2622) PASS: cfi-devirt-x86_64 :: vdtor.cpp (2465 of 2622) UNSUPPORTED: cfi-standalone-x86_64 :: create-derivers.test (2466 of 2622) PASS: cfi-standalone-x86_64 :: cross-dso-diagnostic.cpp (2467 of 2622) UNSUPPORTED: cfi-standalone-x86_64 :: cross-dso/icall/diag.cpp (2468 of 2622) UNSUPPORTED: cfi-standalone-x86_64 :: cross-dso/icall/dlopen.cpp (2469 of 2622) UNSUPPORTED: cfi-standalone-x86_64 :: cross-dso/icall/icall-from-dso.cpp (2470 of 2622) UNSUPPORTED: cfi-standalone-x86_64 :: cross-dso/icall/icall.cpp (2471 of 2622) UNSUPPORTED: cfi-standalone-x86_64 :: cross-dso/shadow_is_read_only.cpp (2472 of 2622) UNSUPPORTED: cfi-standalone-x86_64 :: cross-dso/simple-fail.cpp (2473 of 2622) UNSUPPORTED: cfi-standalone-x86_64 :: cross-dso/simple-pass.cpp (2474 of 2622) UNSUPPORTED: cfi-standalone-x86_64 :: cross-dso/stats.cpp (2475 of 2622) UNSUPPORTED: cfi-standalone-x86_64 :: cross-dso/target_out_of_bounds.cpp (2476 of 2622) PASS: cfi-standalone-x86_64 :: anon-namespace.cpp (2477 of 2622) UNSUPPORTED: cfi-standalone-x86_64 :: icall/external-call.c (2478 of 2622) PASS: cfi-standalone-x86_64 :: bad-cast.cpp (2479 of 2622) UNSUPPORTED: cfi-standalone-x86_64 :: icall/wrong-signature-mixed-lto.c (2480 of 2622) XFAIL: cfi-standalone-x86_64 :: icall/weak.c (2481 of 2622) PASS: UBSan-ThreadSanitizer-x86_64 :: TestCases/Pointer/alignment-assumption-attribute-alloc_align-on-function-variable.cpp (2482 of 2622) PASS: cfi-standalone-x86_64 :: icall/bad-signature.c (2483 of 2622) PASS: cfi-standalone-x86_64 :: mfcall.cpp (2484 of 2622) PASS: cfi-standalone-x86_64 :: base-derived-destructor.cpp (2485 of 2622) PASS: cfi-standalone-x86_64 :: nvcall.cpp (2486 of 2622) XFAIL: cfi-standalone-x86_64 :: sibling.cpp (2487 of 2622) PASS: cfi-standalone-x86_64 :: stats.cpp (2488 of 2622) XFAIL: cfi-standalone-x86_64 :: simple-pass.cpp (2489 of 2622) PASS: cfi-devirt-x86_64 :: simple-fail.cpp (2490 of 2622) PASS: cfi-standalone-x86_64 :: multiple-inheritance.cpp (2491 of 2622) PASS: cfi-standalone-x86_64 :: vtable-may-alias.cpp (2492 of 2622) PASS: cfi-standalone-x86_64 :: overwrite.cpp (2493 of 2622) UNSUPPORTED: libFuzzer :: afl-driver-close-fd-mask.test (2494 of 2622) PASS: cfi-standalone-x86_64 :: target_uninstrumented.cpp (2495 of 2622) UNSUPPORTED: libFuzzer :: afl-driver.test (2496 of 2622) XFAIL: cfi-standalone-x86_64 :: two-vcalls.cpp (2497 of 2622) PASS: cfi-standalone-x86_64 :: vdtor.cpp (2498 of 2622) PASS: libFuzzer :: acquire-crash-state.test (2499 of 2622) PASS: libFuzzer :: bad-strcmp.test (2500 of 2622) PASS: libFuzzer :: bogus-initialize.test (2501 of 2622) PASS: UBSan-ThreadSanitizer-x86_64 :: TestCases/Pointer/alignment-assumption-attribute-align_value-on-paramvar.cpp (2502 of 2622) PASS: UBSan-ThreadSanitizer-x86_64 :: TestCases/Pointer/alignment-assumption-attribute-alloc_align-on-function.cpp (2503 of 2622) PASS: UBSan-ThreadSanitizer-x86_64 :: TestCases/Pointer/alignment-assumption-attribute-assume_aligned-on-function.cpp (2504 of 2622) PASS: cfi-standalone-x86_64 :: simple-fail.cpp (2505 of 2622) PASS: libFuzzer :: afl-driver-stderr.test (2506 of 2622) PASS: libFuzzer :: buffer-overflow-on-input.test (2507 of 2622) UNSUPPORTED: libFuzzer :: compressed.test (2508 of 2622) PASS: libFuzzer :: caller-callee.test (2509 of 2622) PASS: UBSan-ThreadSanitizer-x86_64 :: TestCases/Pointer/alignment-assumption-builtin_assume_aligned-three-params-variable.cpp (2510 of 2622) PASS: UBSan-ThreadSanitizer-x86_64 :: TestCases/Pointer/alignment-assumption-builtin_assume_aligned-three-params.cpp (2511 of 2622) PASS: libFuzzer :: counters.test (2512 of 2622) PASS: UBSan-ThreadSanitizer-x86_64 :: TestCases/Pointer/alignment-assumption-builtin_assume_aligned-two-params.cpp (2513 of 2622) PASS: libFuzzer :: coverage.test (2514 of 2622) PASS: UBSan-ThreadSanitizer-x86_64 :: TestCases/Pointer/alignment-assumption-openmp.cpp (2515 of 2622) PASS: UBSan-ThreadSanitizer-x86_64 :: TestCases/TypeCheck/null.cpp (2516 of 2622) PASS: libFuzzer :: cxxstring.test (2517 of 2622) UNSUPPORTED: libFuzzer :: dataflow.test (2518 of 2622) PASS: libFuzzer :: dead-stripping.test (2519 of 2622) UNSUPPORTED: libFuzzer :: deep-recursion.test (2520 of 2622) PASS: libFuzzer :: deprecated-instrumentation.test (2521 of 2622) UNSUPPORTED: libFuzzer :: disable-leaks.test (2522 of 2622) PASS: libFuzzer :: dso.test (2523 of 2622) UNSUPPORTED: libFuzzer :: equivalence-signals.test (2524 of 2622) UNSUPPORTED: libFuzzer :: equivalence.test (2525 of 2622) PASS: libFuzzer :: cross_over.test (2526 of 2622) PASS: libFuzzer :: exit-report.test (2527 of 2622) UNSUPPORTED: libFuzzer :: extra-counters.test (2528 of 2622) UNSUPPORTED: libFuzzer :: features_dir.test (2529 of 2622) UNSUPPORTED: libFuzzer :: fork-sigusr.test (2530 of 2622) UNSUPPORTED: libFuzzer :: fork-ubsan.test (2531 of 2622) UNSUPPORTED: libFuzzer :: fork.test (2532 of 2622) PASS: libFuzzer :: full-coverage-set.test (2533 of 2622) PASS: libFuzzer :: exit_on_src_pos.test (2534 of 2622) PASS: libFuzzer :: fuzzer-alignment-assumption.test (2535 of 2622) PASS: UBSan-ThreadSanitizer-x86_64 :: TestCases/TypeCheck/misaligned.cpp (2536 of 2622) PASS: libFuzzer :: fuzzer-customcrossoverandmutate.test (2537 of 2622) PASS: libFuzzer :: cleanse.test (2538 of 2622) PASS: libFuzzer :: fuzzer-customcrossover.test (2539 of 2622) PASS: libFuzzer :: fuzzer-custommutator.test (2540 of 2622) PASS: libFuzzer :: fuzzer-dirs.test (2541 of 2622) PASS: libFuzzer :: fuzzer-fdmask.test (2542 of 2622) PASS: libFuzzer :: fuzzer-finalstats.test (2543 of 2622) PASS: libFuzzer :: fuzzer-implicit-integer-sign-change.test (2544 of 2622) PASS: libFuzzer :: fuzzer-dict.test (2545 of 2622) PASS: libFuzzer :: fuzzer-flags.test (2546 of 2622) PASS: libFuzzer :: fuzzer-implicit-signed-integer-truncation-or-sign-change.test (2547 of 2622) UNSUPPORTED: libFuzzer :: fuzzer-leak.test (2548 of 2622) UNSUPPORTED: libFuzzer :: fuzzer-oom-with-profile.test (2549 of 2622) PASS: libFuzzer :: fuzzer-implicit-signed-integer-truncation.test (2550 of 2622) PASS: libFuzzer :: fuzzer-implicit-unsigned-integer-truncation.test (2551 of 2622) PASS: libFuzzer :: fuzzer-printcovpcs.test (2552 of 2622) PASS: libFuzzer :: fuzzer-runs.test (2553 of 2622) PASS: libFuzzer :: fuzzer-seed.test (2554 of 2622) PASS: libFuzzer :: fuzzer-segv.test (2555 of 2622) PASS: libFuzzer :: fuzzer-singleinputs.test (2556 of 2622) PASS: libFuzzer :: fuzzer-oom.test (2557 of 2622) PASS: libFuzzer :: fuzzer-ubsan.test (2558 of 2622) UNSUPPORTED: libFuzzer :: gc-sections.test (2559 of 2622) PASS: libFuzzer :: initialize.test (2560 of 2622) UNSUPPORTED: libFuzzer :: large.test (2561 of 2622) PASS: libFuzzer :: fuzzer-threaded.test (2562 of 2622) UNSUPPORTED: libFuzzer :: libcxx.test (2563 of 2622) UNSUPPORTED: libFuzzer :: magic-separator.test (2564 of 2622) PASS: libFuzzer :: max-number-of-runs.test (2565 of 2622) PASS: libFuzzer :: len_control.test (2566 of 2622) PASS: libFuzzer :: memcmp.test (2567 of 2622) PASS: libFuzzer :: memcmp64.test (2568 of 2622) PASS: libFuzzer :: fuzzer-timeout.test (2569 of 2622) UNSUPPORTED: libFuzzer :: merge-sigusr.test (2570 of 2622) PASS: libFuzzer :: merge-posix.test (2571 of 2622) PASS: UBSan-ThreadSanitizer-x86_64 :: TestCases/TypeCheck/vptr.cpp (2572 of 2622) PASS: libFuzzer :: merge-control-file.test (2573 of 2622) PASS: libFuzzer :: merge.test (2574 of 2622) UNSUPPORTED: libFuzzer :: msan-param-unpoison.test (2575 of 2622) UNSUPPORTED: libFuzzer :: msan.test (2576 of 2622) PASS: libFuzzer :: not-instrumented.test (2577 of 2622) PASS: libFuzzer :: null-deref-on-empty.test (2578 of 2622) PASS: libFuzzer :: minimize_two_crashes.test (2579 of 2622) UNSUPPORTED: libFuzzer :: only-some-bytes-fork.test (2580 of 2622) UNSUPPORTED: libFuzzer :: only-some-bytes.test (2581 of 2622) PASS: libFuzzer :: null-deref.test (2582 of 2622) UNSUPPORTED: libFuzzer :: print-func.test (2583 of 2622) PASS: libFuzzer :: overwrite-input.test (2584 of 2622) PASS: libFuzzer :: recommended-dictionary.test (2585 of 2622) PASS: libFuzzer :: read-binary.test (2586 of 2622) PASS: libFuzzer :: reduce_inputs.test (2587 of 2622) PASS: libFuzzer :: reload.test (2588 of 2622) PASS: libFuzzer :: repeated-bytes.test (2589 of 2622) PASS: libFuzzer :: seed_inputs.test (2590 of 2622) UNSUPPORTED: libFuzzer :: sigint.test (2591 of 2622) UNSUPPORTED: libFuzzer :: sigusr.test (2592 of 2622) UNSUPPORTED: libFuzzer :: simple-cmp.test (2593 of 2622) PASS: libFuzzer :: shrink.test (2594 of 2622) PASS: libFuzzer :: simple.test (2595 of 2622) PASS: libFuzzer :: standalone.test (2596 of 2622) PASS: libFuzzer :: strcmp.test (2597 of 2622) PASS: libFuzzer :: strncmp-oob.test (2598 of 2622) PASS: libFuzzer :: strstr.test (2599 of 2622) PASS: libFuzzer :: swap-cmp.test (2600 of 2622) PASS: libFuzzer :: symbolize-deadlock.test (2601 of 2622) UNSUPPORTED: libFuzzer :: target-function.test (2602 of 2622) PASS: libFuzzer :: minimize_crash.test (2603 of 2622) UNSUPPORTED: libFuzzer :: trace-malloc-2.test (2604 of 2622) UNSUPPORTED: libFuzzer :: trace-malloc-threaded.test (2605 of 2622) UNSUPPORTED: libFuzzer :: trace-malloc-unbalanced.test (2606 of 2622) PASS: libFuzzer :: three-bytes.test (2607 of 2622) PASS: libFuzzer :: trace-malloc.test (2608 of 2622) PASS: libFuzzer :: ulimit.test (2609 of 2622) PASS: libFuzzer :: strncmp.test (2610 of 2622) PASS: libFuzzer :: value-profile-cmp2.test (2611 of 2622) PASS: libFuzzer :: value-profile-cmp3.test (2612 of 2622) PASS: libFuzzer :: value-profile-div.test (2613 of 2622) PASS: libFuzzer :: value-profile-cmp4.test (2614 of 2622) PASS: libFuzzer :: value-profile-cmp.test (2615 of 2622) PASS: libFuzzer :: value-profile-mem.test (2616 of 2622) PASS: libFuzzer :: value-profile-strcmp.test (2617 of 2622) PASS: libFuzzer :: value-profile-strncmp.test (2618 of 2622) PASS: libFuzzer :: value-profile-set.test (2619 of 2622) UNSUPPORTED: libFuzzer :: windows-opt-ref.test (2620 of 2622) PASS: libFuzzer :: value-profile-load.test (2621 of 2622) PASS: libFuzzer :: value-profile-switch.test (2622 of 2622)

Hide Details

21 warning(s) in tests. Testing Time: 3179.93s ******************** Timed Out Tests (10): UBSan-ThreadSanitizer-x86_64 :: TestCases/ImplicitConversion/integer-arithmetic-value-change.c UBSan-ThreadSanitizer-x86_64 :: TestCases/ImplicitConversion/integer-conversion.c UBSan-ThreadSanitizer-x86_64 :: TestCases/ImplicitConversion/integer-sign-change.c UBSan-ThreadSanitizer-x86_64 :: TestCases/ImplicitConversion/integer-truncation.c UBSan-ThreadSanitizer-x86_64 :: TestCases/ImplicitConversion/signed-integer-truncation-blacklist.c UBSan-ThreadSanitizer-x86_64 :: TestCases/ImplicitConversion/signed-integer-truncation-or-sign-change-blacklist.c UBSan-ThreadSanitizer-x86_64 :: TestCases/ImplicitConversion/signed-integer-truncation.c UBSan-ThreadSanitizer-x86_64 :: TestCases/ImplicitConversion/unsigned-integer-truncation-blacklist.c UBSan-ThreadSanitizer-x86_64 :: TestCases/ImplicitConversion/unsigned-integer-truncation.c UBSan-ThreadSanitizer-x86_64 :: TestCases/Integer/shift.cpp

Hide Details

Expected Passes : 1830 Expected Failures : 31 Unsupported Tests : 751 Individual Timeouts: 10 FAILED: test/CMakeFiles/check-compiler-rt cd /Users/buildslave/jenkins/workspace/clang-stage2-Rthinlto/clang-build/Build/tools/clang/runtime/compiler-rt-bins/test && /usr/local/bin/python2.7 /Users/buildslave/jenkins/workspace/clang-stage2-Rthinlto/clang-build/Build/bin/llvm-lit --xunit-xml-output=testresults.xunit.xml -v --timeout=600 /Users/buildslave/jenkins/workspace/clang-stage2-Rthinlto/clang-build/Build/tools/clang/runtime/compiler-rt-bins/test/builtins/TestCases /Users/buildslave/jenkins/workspace/clang-stage2-Rthinlto/clang-build/Build/tools/clang/runtime/compiler-rt-bins/test/lsan/X86_64LsanConfig /Users/buildslave/jenkins/workspace/clang-stage2-Rthinlto/clang-build/Build/tools/clang/runtime/compiler-rt-bins/test/lsan/X86_64AsanConfig /Users/buildslave/jenkins/workspace/clang-stage2-Rthinlto/clang-build/Build/tools/clang/runtime/compiler-rt-bins/test/ubsan/Standalone-x86_64 /Users/buildslave/jenkins/workspace/clang-stage2-Rthinlto/clang-build/Build/tools/clang/runtime/compiler-rt-bins/test/ubsan/AddressSanitizer-x86_64 /Users/buildslave/jenkins/workspace/clang-stage2-Rthinlto/clang-build/Build/tools/clang/runtime/compiler-rt-bins/test/ubsan/ThreadSanitizer-x86_64 /Users/buildslave/jenkins/workspace/clang-stage2-Rthinlto/clang-build/Build/tools/clang/runtime/compiler-rt-bins/test/ubsan/StandaloneStatic-x86_64 /Users/buildslave/jenkins/workspace/clang-stage2-Rthinlto/clang-build/Build/tools/clang/runtime/compiler-rt-bins/test/cfi/Standalone-x86_64 /Users/buildslave/jenkins/workspace/clang-stage2-Rthinlto/clang-build/Build/tools/clang/runtime/compiler-rt-bins/test/cfi/Devirt-x86_64 /Users/buildslave/jenkins/workspace/clang-stage2-Rthinlto/clang-build/Build/tools/clang/runtime/compiler-rt-bins/test/sanitizer_common/asan-x86_64-Darwin /Users/buildslave/jenkins/workspace/clang-stage2-Rthinlto/clang-build/Build/tools/clang/runtime/compiler-rt-bins/test/sanitizer_common/lsan-x86_64-Darwin /Users/buildslave/jenkins/workspace/clang-stage2-Rthinlto/clang-build/Build/tools/clang/runtime/compiler-rt-bins/test/sanitizer_common/tsan-x86_64-Darwin /Users/buildslave/jenkins/workspace/clang-stage2-Rthinlto/clang-build/Build/tools/clang/runtime/compiler-rt-bins/test/sanitizer_common/ubsan-x86_64-Darwin /Users/buildslave/jenkins/workspace/clang-stage2-Rthinlto/clang-build/Build/tools/clang/runtime/compiler-rt-bins/test/sanitizer_common/Unit /Users/buildslave/jenkins/workspace/clang-stage2-Rthinlto/clang-build/Build/tools/clang/runtime/compiler-rt-bins/test/fuzzer/unit /Users/buildslave/jenkins/workspace/clang-stage2-Rthinlto/clang-build/Build/tools/clang/runtime/compiler-rt-bins/test/fuzzer/X86_64DefaultDarwinConfig/ /Users/buildslave/jenkins/workspace/clang-stage2-Rthinlto/clang-build/Build/tools/clang/runtime/compiler-rt-bins/test/asan/X86_64DarwinConfig /Users/buildslave/jenkins/workspace/clang-stage2-Rthinlto/clang-build/Build/tools/clang/runtime/compiler-rt-bins/test/asan/Unit /Users/buildslave/jenkins/workspace/clang-stage2-Rthinlto/clang-build/Build/tools/clang/runtime/compiler-rt-bins/test/tsan/X86_64Config /Users/buildslave/jenkins/workspace/clang-stage2-Rthinlto/clang-build/Build/tools/clang/runtime/compiler-rt-bins/test/tsan/Unit /Users/buildslave/jenkins/workspace/clang-stage2-Rthinlto/clang-build/Build/tools/clang/runtime/compiler-rt-bins/test/ubsan_minimal/x86_64 /Users/buildslave/jenkins/workspace/clang-stage2-Rthinlto/clang-build/Build/tools/clang/runtime/compiler-rt-bins/test/profile/Profile-x86_64 /Users/buildslave/jenkins/workspace/clang-stage2-Rthinlto/clang-build/Build/tools/clang/runtime/compiler-rt-bins/test/xray/X86_64DarwinConfig /Users/buildslave/jenkins/workspace/clang-stage2-Rthinlto/clang-build/Build/tools/clang/runtime/compiler-rt-bins/test/xray/X86_64HDarwinConfig /Users/buildslave/jenkins/workspace/clang-stage2-Rthinlto/clang-build/Build/tools/clang/runtime/compiler-rt-bins/test/shadowcallstack/arm64 ninja: build stopped: subcommand failed. [2/4] cd /Users/buildslave/jenkins/workspace/clang-stage2-Rthinlto/llvm/tools/clang/bindings/python && /usr/local/Cellar/cmake/3.11.4/bin/cmake -E env CLANG_LIBRARY_PATH=/Users/buildslave/jenkins/workspace/clang-stage2-Rthinlto/clang-build/Build/lib /usr/local/bin/python2.7 -m unittest discover .................................................s................................................s.s.......s...s.........s... ---------------------------------------------------------------------- Ran 126 tests in 1.582s

Hide Details

OK (skipped=6) FAILED: tools/clang/runtime/CMakeFiles/check-compiler-rt cd /Users/buildslave/jenkins/workspace/clang-stage2-Rthinlto/clang-build/Build/tools/clang/runtime/compiler-rt-bins && /usr/local/Cellar/cmake/3.11.4/bin/cmake --build . --target check-all --config RelWithDebInfo ninja: build stopped: cannot make progress due to previous errors. Command failed Command: ['env', 'MALLOC_LOG_FILE=/dev/null', '/usr/local/bin/ninja', '-v', '-k', '0', 'check-all'] Build step 'Execute shell' marked build as failure [WARNINGS] Skipping publisher since build result is FAILURE Recording test results ERROR: Step ‘Publish JUnit test result report’ failed: No test report files were found. Configuration error? [BFA] Scanning build for known causes... [BFA] Found failure cause(s): [BFA] Regression test failed from category Test [BFA] Missing test results from category Infrastructure [BFA] Ninja target failed from category Compile [BFA] Done. 3s No emails were triggered. Finished: FAILURE