Started 11 days ago
Took 36 min on green-dragon-17

Failed Build #18409 (Jul 8, 2019 4:16:20 PM)

Revisions
  • http://llvm.org/svn/llvm-project/llvm/trunk : 365387
  • http://llvm.org/svn/llvm-project/cfe/trunk : 365382
  • http://llvm.org/svn/llvm-project/compiler-rt/trunk : 365384
  • http://llvm.org/svn/llvm-project/debuginfo-tests/trunk : 364589
  • http://llvm.org/svn/llvm-project/libcxx/trunk : 365359
  • http://llvm.org/svn/llvm-project/clang-tools-extra/trunk : 365380
Changes
  1. Standardize on MSVC behavior for triples with no environment

    Summary:
    This makes it so that IR files using triples without an environment work
    out of the box, without normalizing them.

    Typically, the MSVC behavior is more desirable. For example, it tends to
    enable things like constant merging, use of associative comdats, etc.

    Addresses PR42491

    Reviewers: compnerd

    Subscribers: hiraditya, dexonsmith, llvm-commits

    Tags: #llvm

    Differential Revision: https://reviews.llvm.org/D64109 (detail/ViewSVN)
    by rnk
  2. llvm-profdata] Handle the cases of overlapping input file and output file

    Currently llvm-profdata does not expect the same file name for the input profile
    and the output profile.
    >llvm-profdata merge A.profraw B.profraw -o B.profraw
    The above command runs successfully but the resulted B.profraw is not correct.
    This patch fixes the issue by moving the initialization of writer after loading
    the profile.

    For the show command, the following will report a confusing error of
    "Empty raw profile file":
    >llvm-profdata show B.profraw -o B.profraw
    It's harder to fix as we need to output something before loading the input profile.
    I don't think that a fix for this is worth the effort. I just make the error explicit for
    the show command.

    Differential Revision: https://reviews.llvm.org/D64360 (detail/ViewSVN)
    by xur
  3. Revert "[sanitizers][windows] Rtl-Heap Interception and tests"

    Causes build failure on clang-ppc64be-linux-lnt:

    compiler-rt/lib/asan/asan_malloc_win.cc:23:2: error: #error "Missing arch or unsupported platform for Windows."
    #error "Missing arch or unsupported platform for Windows."
      ^~~~~
    compiler-rt/lib/asan/asan_malloc_win.cc:25:10: fatal error: heapapi.h: No such file or directory
    #include <heapapi.h>
              ^~~~~~~~~~~
    compilation terminated.
    [39/1151] Building CXX object projects/compiler-rt/lib/asan/CMakeFiles/RTAsan.powerpc64.dir/asan_debugging.cc.o
    [40/1151] Building CXX object projects/compiler-rt/lib/asan/CMakeFiles/RTAsan.powerpc64.dir/asan_malloc_win.cc.o
    FAILED: projects/compiler-rt/lib/asan/CMakeFiles/RTAsan.powerpc64.dir/asan_malloc_win.cc.o
    /usr/bin/c++  -D_DEBUG -D_GNU_SOURCE -D__STDC_CONSTANT_MACROS -D__STDC_FORMAT_MACROS -D__STDC_LIMIT_MACROS -Iprojects/compiler-rt/lib/asan -Icompiler-rt/lib/asan -Iinclude -I/home/buildbots/ppc64be-clang-lnt-test/clang-ppc64be-lnt/llvm/include -Icompiler-rt/lib/asan/.. -fPIC -fvisibility-inlines-hidden -Werror=date-time -std=c++11 -Wall -Wextra -Wno-unused-parameter -Wwrite-strings -Wcast-qual -Wno-missing-field-initializers -pedantic -Wno-long-long -Wimplicit-fallthrough -Wno-maybe-uninitialized -Wno-noexcept-type -Wdelete-non-virtual-dtor -Wno-comment -fdiagnostics-color -ffunction-sections -fdata-sections -Wall -std=c++11 -Wno-unused-parameter -O2    -UNDEBUG  -m64 -fPIC -fno-builtin -fno-exceptions -fomit-frame-pointer -funwind-tables -fno-stack-protector -fvisibility=hidden -fno-lto -O3 -g -Wno-variadic-macros -Wno-non-virtual-dtor -fno-rtti -MD -MT projects/compiler-rt/lib/asan/CMakeFiles/RTAsan.powerpc64.dir/asan_malloc_win.cc.o -MF projects/compiler-rt/lib/asan/CMakeFiles/RTAsan.powerpc64.dir/asan_malloc_win.cc.o.d -o projects/compiler-rt/lib/asan/CMakeFiles/RTAsan.powerpc64.dir/asan_malloc_win.cc.o -c compiler-rt/lib/asan/asan_malloc_win.cc
    compiler-rt/lib/asan/asan_malloc_win.cc:23:2: error: #error "Missing arch or unsupported platform for Windows."
    #error "Missing arch or unsupported platform for Windows."
      ^~~~~
    compiler-rt/lib/asan/asan_malloc_win.cc:25:10: fatal error: heapapi.h: No such file or directory
    #include <heapapi.h>
              ^~~~~~~~~~~ (detail/ViewSVN)
    by jfb

Started by upstream project clang-stage2-Rthinlto_relay build number 1818
originally caused by:

This run spent:

  • 1 ms waiting;
  • 36 min build duration;
  • 36 min total from scheduled to completion.

Identified problems

Ninja target failed

Below is a link to the first failed ninja target.
Indication 1

Compile Error

This build failed because of a compile error. Below is a list of all errors in the build log:
Indication 2

Missing test results

The test result file Jenkins is looking for does not exist after the build.
Indication 3