FailedConsole Output

Started by upstream project "libc++ and libc++abi trunk" build number 691
originally caused by:
 Started by an SCM change
Running as SYSTEM
Building remotely on green-dragon-09 (Zorg highmem xcode8.2.1 ssd 10.11 MacMini) in workspace /Users/buildslave/jenkins/libcxx_libcxxabi_trunk_testing/CI_EXCEPTIONS/ON/CI_STD/c++17
No credentials specified
 > git rev-parse --is-inside-work-tree # timeout=10
Fetching changes from the remote Git repository
 > git config remote.origin.url http://labmaster3.local/git/llvm-project.git # timeout=10
Fetching upstream changes from http://labmaster3.local/git/llvm-project.git
 > git --version # timeout=10
 > git fetch --tags --progress -- http://labmaster3.local/git/llvm-project.git +refs/heads/*:refs/remotes/origin/* # timeout=10
Checking out Revision 5048933c47157a55349e623c289c9ed77d58d628 (refs/remotes/origin/master)
 > git config core.sparsecheckout # timeout=10
 > git checkout -f 5048933c47157a55349e623c289c9ed77d58d628 # timeout=10
Commit message: "[mlir] Added the dialect inliner to the SCF dialect"
 > git rev-list --no-walk 62c1750ea90f6c42ad8d58d341a405904560db08 # timeout=10
New run name is '#691 std=c++17 exceptions=ON'
[c++17] $ /usr/bin/env bash /var/folders/9t/lrs73ptj6lv644zvh1fk2_gc0000gn/T/jenkins7851913661327583938.sh
+ MONOREPO_ROOT=/Users/buildslave/jenkins/libcxx_libcxxabi_trunk_testing/CI_EXCEPTIONS/ON/CI_STD/c++17/llvm-project
+ ARTIFACT=clang-stage1-RA/latest
+ python /opt/llvm/zorg/zorg/jenkins/build.py fetch
Fetching Compiler

Hide Details

@@@ Fetching Compiler @@@ GETting http://labmaster2.local/artifacts//clang-stage1-RA/latest to /Users/buildslave/jenkins/libcxx_libcxxabi_trunk_testing/CI_EXCEPTIONS/ON/CI_STD/c++17/host-compiler.tar.gz ... done. Decompressing... cd /Users/buildslave/jenkins/libcxx_libcxxabi_trunk_testing/CI_EXCEPTIONS/ON/CI_STD/c++17/host-compiler/ 'tar' 'zxf' '../host-compiler.tar.gz' Completed at: 2020-06-23T10:53:29 @@@@@@
+ host_compiler=/Users/buildslave/jenkins/libcxx_libcxxabi_trunk_testing/CI_EXCEPTIONS/ON/CI_STD/c++17/host-compiler + export CXX=/Users/buildslave/jenkins/libcxx_libcxxabi_trunk_testing/CI_EXCEPTIONS/ON/CI_STD/c++17/host-compiler/bin/clang++ + CXX=/Users/buildslave/jenkins/libcxx_libcxxabi_trunk_testing/CI_EXCEPTIONS/ON/CI_STD/c++17/host-compiler/bin/clang++ + export CC=/Users/buildslave/jenkins/libcxx_libcxxabi_trunk_testing/CI_EXCEPTIONS/ON/CI_STD/c++17/host-compiler/bin/clang + CC=/Users/buildslave/jenkins/libcxx_libcxxabi_trunk_testing/CI_EXCEPTIONS/ON/CI_STD/c++17/host-compiler/bin/clang + /Users/buildslave/jenkins/libcxx_libcxxabi_trunk_testing/CI_EXCEPTIONS/ON/CI_STD/c++17/host-compiler/bin/clang++ --version clang version 11.0.0 (https://github.com/llvm/llvm-project.git a4dc61344f08f7581b8794c5819ffdf9c708ecfe) Target: x86_64-apple-darwin17.5.0 Thread model: posix InstalledDir: /Users/buildslave/jenkins/libcxx_libcxxabi_trunk_testing/CI_EXCEPTIONS/ON/CI_STD/c++17/host-compiler/bin + bash -x /Users/buildslave/jenkins/libcxx_libcxxabi_trunk_testing/CI_EXCEPTIONS/ON/CI_STD/c++17/llvm-project/libcxx/utils/ci/macos-trunk.sh --monorepo-root /Users/buildslave/jenkins/libcxx_libcxxabi_trunk_testing/CI_EXCEPTIONS/ON/CI_STD/c++17/llvm-project --std c++17 --libcxx-exceptions ON + set -ue + [[ 6 -gt 0 ]] + case "$1" in + MONOREPO_ROOT=/Users/buildslave/jenkins/libcxx_libcxxabi_trunk_testing/CI_EXCEPTIONS/ON/CI_STD/c++17/llvm-project + [[ ! -e /Users/buildslave/jenkins/libcxx_libcxxabi_trunk_testing/CI_EXCEPTIONS/ON/CI_STD/c++17/llvm-project ]] + shift + shift + [[ 4 -gt 0 ]] + case "$1" in + STD=c++17 + shift + shift + [[ 2 -gt 0 ]] + case "$1" in + LIBCXX_EXCEPTIONS=ON + shift + shift + [[ 0 -gt 0 ]] + [[ -z x ]] + [[ -z x ]] + [[ ON != \O\N ]] + [[ -z '' ]] + ADDITIONAL_CMAKE_ARGS= + [[ -z '' ]] + ADDITIONAL_LIT_ARGS= ++ mktemp -d + TEMP_DIR=/var/folders/9t/lrs73ptj6lv644zvh1fk2_gc0000gn/T/tmp.ECYCJGQK + echo 'Created temporary directory /var/folders/9t/lrs73ptj6lv644zvh1fk2_gc0000gn/T/tmp.ECYCJGQK' Created temporary directory /var/folders/9t/lrs73ptj6lv644zvh1fk2_gc0000gn/T/tmp.ECYCJGQK + trap cleanup EXIT + LLVM_BUILD_DIR=/var/folders/9t/lrs73ptj6lv644zvh1fk2_gc0000gn/T/tmp.ECYCJGQK/llvm-build + LLVM_INSTALL_DIR=/var/folders/9t/lrs73ptj6lv644zvh1fk2_gc0000gn/T/tmp.ECYCJGQK/llvm-install + echo '@@@ Setting up LIT flags @@@'
Setting up LIT flags

Hide Details

@@@ Setting up LIT flags @@@ + LIT_FLAGS='-sv --param=std=c++17 ' + echo @@@@@@ @@@@@@
+ echo '@@@ Configuring CMake @@@'
Configuring CMake

Hide Details

@@@ Configuring CMake @@@ + mkdir -p /var/folders/9t/lrs73ptj6lv644zvh1fk2_gc0000gn/T/tmp.ECYCJGQK/llvm-build + cd /var/folders/9t/lrs73ptj6lv644zvh1fk2_gc0000gn/T/tmp.ECYCJGQK/llvm-build + xcrun cmake -C /Users/buildslave/jenkins/libcxx_libcxxabi_trunk_testing/CI_EXCEPTIONS/ON/CI_STD/c++17/llvm-project/libcxx/cmake/caches/Apple.cmake -GNinja -DCMAKE_INSTALL_PREFIX=/var/folders/9t/lrs73ptj6lv644zvh1fk2_gc0000gn/T/tmp.ECYCJGQK/llvm-install -DLIBCXX_ENABLE_EXCEPTIONS=ON -DLIBCXXABI_ENABLE_EXCEPTIONS=ON '-DLLVM_LIT_ARGS=-sv --param=std=c++17 ' '-DLLVM_ENABLE_PROJECTS=libcxx;libcxxabi' -DCMAKE_OSX_ARCHITECTURES=x86_64 /Users/buildslave/jenkins/libcxx_libcxxabi_trunk_testing/CI_EXCEPTIONS/ON/CI_STD/c++17/llvm-project/llvm loading initial cache file /Users/buildslave/jenkins/libcxx_libcxxabi_trunk_testing/CI_EXCEPTIONS/ON/CI_STD/c++17/llvm-project/libcxx/cmake/caches/Apple.cmake -- The C compiler identification is Clang 11.0.0 -- The CXX compiler identification is Clang 11.0.0 -- The ASM compiler identification is Clang -- Found assembler: /Users/buildslave/jenkins/libcxx_libcxxabi_trunk_testing/CI_EXCEPTIONS/ON/CI_STD/c++17/host-compiler/bin/clang -- Check for working C compiler: /Users/buildslave/jenkins/libcxx_libcxxabi_trunk_testing/CI_EXCEPTIONS/ON/CI_STD/c++17/host-compiler/bin/clang -- Check for working C compiler: /Users/buildslave/jenkins/libcxx_libcxxabi_trunk_testing/CI_EXCEPTIONS/ON/CI_STD/c++17/host-compiler/bin/clang - broken CMake Error at /usr/local/Cellar/cmake/3.17.2/share/cmake/Modules/CMakeTestCCompiler.cmake:60 (message): The C compiler

Hide Details

"/Users/buildslave/jenkins/libcxx_libcxxabi_trunk_testing/CI_EXCEPTIONS/ON/CI_STD/c++17/host-compiler/bin/clang"

Hide Details

is not able to compile a simple test program.

Hide Details

It fails with the following output:

Hide Details

Change Dir: /var/folders/9t/lrs73ptj6lv644zvh1fk2_gc0000gn/T/tmp.ECYCJGQK/llvm-build/CMakeFiles/CMakeTmp

Hide Details

Run Build Command(s):/usr/local/bin/ninja cmTC_20dde && [1/2] Building C object CMakeFiles/cmTC_20dde.dir/testCCompiler.c.o [2/2] Linking C executable cmTC_20dde FAILED: cmTC_20dde : && /Users/buildslave/jenkins/libcxx_libcxxabi_trunk_testing/CI_EXCEPTIONS/ON/CI_STD/c++17/host-compiler/bin/clang -arch x86_64 -isysroot /Applications/Xcode.app/Contents/Developer/Platforms/MacOSX.platform/Developer/SDKs/MacOSX10.13.sdk -Wl,-search_paths_first -Wl,-headerpad_max_install_names CMakeFiles/cmTC_20dde.dir/testCCompiler.c.o -o cmTC_20dde && : ld: unknown option: -platform_version clang-11: error: linker command failed with exit code 1 (use -v to see invocation) ninja: build stopped: subcommand failed.

Hide Details

Hide Details

Hide Details

Hide Details

Hide Details

CMake will not be able to correctly generate this project. Call Stack (most recent call first): CMakeLists.txt:57 (project)

Hide Details

Hide Details

-- Configuring incomplete, errors occurred! See also "/var/folders/9t/lrs73ptj6lv644zvh1fk2_gc0000gn/T/tmp.ECYCJGQK/llvm-build/CMakeFiles/CMakeOutput.log". See also "/var/folders/9t/lrs73ptj6lv644zvh1fk2_gc0000gn/T/tmp.ECYCJGQK/llvm-build/CMakeFiles/CMakeError.log". + cleanup + [[ -z '' ]] + echo 'Removing temporary directory /var/folders/9t/lrs73ptj6lv644zvh1fk2_gc0000gn/T/tmp.ECYCJGQK' Removing temporary directory /var/folders/9t/lrs73ptj6lv644zvh1fk2_gc0000gn/T/tmp.ECYCJGQK + rm -rf /var/folders/9t/lrs73ptj6lv644zvh1fk2_gc0000gn/T/tmp.ECYCJGQK Build step 'Execute shell' marked build as failure New run name is '#691 std=c++17 exceptions=ON' Finished: FAILURE