SuccessConsole Output

Skipping 22,400 KB.. Full Log
 the symbol tables and
                                         other data can take a long time
                                         depending on your connection to the
                                         debug target. This setting helps users
                                         control how much information gets
                                         loaded when loading modules from
                                         memory.'complete' is the default value
                                         for this setting which will load all
                                         sections and symbols by reading them
                                         from memory (slowest, most accurate).
                                         'partial' will load sections and
                                         attempt to find function bounds
                                         without downloading the symbol table
                                         (faster, still accurate, missing
                                         symbol names). 'minimal' is the
                                         fastest setting and will load section
                                         data with no symbols, but should
                                         rarely be used as stack frames in
                                         these memory regions will be
                                         inaccurate and not provide any context
                                         (fastest). 
  move-to-nearest-code                -- Move breakpoints to nearest code.
  non-stop-mode                       -- Disable lock-step debugging, instead
                                         control threads independently.
  notify-about-fixits                 -- Print the fixed expression text.
  output-path                         -- The file/path to be used by the
                                         executable program for writing its
                                         standard output.
  prefer-dynamic-value                -- Should printed values be shown as
                                         their dynamic value.
  preload-symbols                     -- Enable loading of symbol tables before
                                         they are needed.
  require-hardware-breakpoint         -- Require all breakpoints to be hardware
                                         breakpoints.
  retries-with-fixits                 -- Maximum number of attempts to fix an
                                         expression with Fix-Its
  run-args                            -- A list containing all the arguments to
                                         be passed to the executable when it is
                                         run. Note that this does NOT include
                                         the argv[0] which is in target.arg0.
  save-jit-objects                    -- Save intermediate object files
                                         generated by the LLVM JIT
  skip-prologue                       -- Skip function prologues when setting
                                         breakpoints by name.
  source-map                          -- Source path remappings are used to
                                         track the change of location between a
                                         source file when built, and where it
                                         exists on the current system.  It
                                         consists of an array of duples, the
                                         first element of each duple is some
                                         part (starting at the root) of the
                                         path to the file when it was built,
                                         and the second is where the remainder
                                         of the original build hierarchy is
                                         rooted on the local system.  Each
                                         element of the array is checked in
                                         order and the first one that results
                                         in a match wins.
  trap-handler-names                  -- A list of trap handler function names,
                                         e.g. a common Unix user process one is
                                         _sigtramp.
  unset-env-vars                      -- A list of environment variable names
                                         to be unset in the inferior's
                                         environment. This is most useful to
                                         unset some host environment variables
                                         when target.inherit-env is true.
                                         target.env-vars takes precedence over
                                         target.unset-env-vars.
  use-fast-stepping                   -- Use a fast stepping algorithm based on
                                         running from branch to branch rather
                                         than instruction single-stepping.
  use-hex-immediates                  -- Show immediates in disassembly as
                                         hexadecimal.

'target.experimental' variables:

  inject-local-vars             -- If true, inject local variables explicitly
                                   into the expression text. This will fix
                                   symbol resolution when there are name
                                   collisions between ivars and local
                                   variables. But it can make expressions run
                                   much more slowly.
  os-plugin-reports-all-threads -- Set to False if your OS Plugins doesn't
                                   report all threads on each stop.

'target.process' variables:

  detach-keeps-stopped              -- If true, detach will attempt to keep the
                                       process stopped.
  disable-memory-cache              -- Disable reading and caching of memory in
                                       fixed-size units.
  extra-startup-command             -- A list containing extra commands
                                       understood by the particular process
                                       plugin used.  For instance, to turn on
                                       debugserver logging set this to
                                       'QSetLogging:bitmask=LOG_DEFAULT;'
  ignore-breakpoints-in-expressions -- If true, breakpoints will be ignored
                                       during expression evaluation.
  memory-cache-line-size            -- The memory cache line size
  python-os-plugin-path             -- A path to a python OS plug-in module
                                       file that contains a
                                       OperatingSystemPlugIn class.
  stop-on-exec                      -- If true, stop when a shared library is
                                       loaded or unloaded.
  stop-on-sharedlibrary-events      -- If true, stop when a shared library is
                                       loaded or unloaded.
  unwind-on-error-in-expressions    -- If true, errors in expression evaluation
                                       will unwind the stack back to the state
                                       before the call.
  utility-expression-timeout        -- The time in seconds to wait for
                                       LLDB-internal utility expressions.
  optimization-warnings             -- If true, warn when stopped in code that
                                       is optimized where stepping and variable
                                       availability may not behave as expected.

'target.process.thread' variables:

  trace-thread           -- If true, this thread will single-step and log
                            execution.
  max-backtrace-depth    -- Maximum number of frames to backtrace.
  step-avoid-libraries   -- A list of libraries that source stepping won't stop
                            in.
  step-avoid-regexp      -- A regular expression defining functions step-in
                            won't stop in.
  step-in-avoid-nodebug  -- If true, step-in will not stop in functions with no
                            debug information.
  step-out-avoid-nodebug -- If true, when step-in/step-out/step-over leave the
                            current frame, they will continue to step out till
                            they come to a function with debug information.
                            Passing a frame argument to step-out will override
                            this option.


Not expecting sub string: packet-timeout
Not matched

runCmd: settings list
output: Top level variables:

  auto-confirm                 -- If true all confirmation prompts will receive
                                  their default reply.
  auto-indent                  -- If true, LLDB will auto indent/outdent code.
                                  Currently only supported in the REPL
                                  (default: true).
  auto-one-line-summaries      -- If true, LLDB will automatically display
                                  small structs in one-liner format (default:
                                  true).
  disassembly-format           -- The default disassembly format string to use
                                  when disassembling instruction sequences.
  escape-non-printables        -- If true, LLDB will automatically escape
                                  non-printable and escape characters when
                                  formatting strings.
  frame-format                 -- The default frame format string to use when
                                  displaying stack frame information for
                                  threads.
  frame-format-unique          -- The default frame format string to use when
                                  displaying stack frameinformation for threads
                                  from thread backtrace unique.
  highlight-source             -- If true, LLDB will highlight the displayed
                                  source code.
  notify-void                  -- Notify the user explicitly if an expression
                                  returns void (default: false).
  print-decls                  -- If true, LLDB will print the values of
                                  variables declared in an expression.
                                  Currently only supported in the REPL
                                  (default: true).
  prompt                       -- The debugger command line prompt displayed
                                  for the user.
  script-lang                  -- The script language to be used for evaluating
                                  user-written scripts.
  stop-disassembly-count       -- The number of disassembly lines to show when
                                  displaying a stopped context.
  stop-disassembly-display     -- Control when to display disassembly when
                                  displaying a stopped context.
  stop-line-count-after        -- The number of sources lines to display that
                                  come after the current source line when
                                  displaying a stopped context.
  stop-line-count-before       -- The number of sources lines to display that
                                  come before the current source line when
                                  displaying a stopped context.
  stop-show-column             -- If true, LLDB will use the column information
                                  from the debug info to mark the current
                                  position when displaying a stopped context.
  stop-show-column-ansi-prefix -- When displaying the column marker in a
                                  color-enabled (i.e. ANSI) terminal, use the
                                  ANSI terminal code specified in this format
                                  at the immediately before the column to be
                                  marked.
  stop-show-column-ansi-suffix -- When displaying the column marker in a
                                  color-enabled (i.e. ANSI) terminal, use the
                                  ANSI terminal code specified in this format
                                  immediately after the column to be marked.
  stop-show-line-ansi-prefix   -- When displaying the line marker in a
                                  color-enabled (i.e. ANSI) terminal, use the
                                  ANSI terminal code specified in this format
                                  at the immediately before the line to be
                                  marked.
  stop-show-line-ansi-suffix   -- When displaying the line marker in a
                                  color-enabled (i.e. ANSI) terminal, use the
                                  ANSI terminal code specified in this format
                                  immediately after the line to be marked.
  tab-size                     -- The tab size to use when indenting code in
                                  multi-line input mode (default: 4).
  term-width                   -- The maximum number of columns to use for
                                  displaying text.
  thread-format                -- The default thread format string to use when
                                  displaying thread information.
  thread-stop-format           -- The default thread format  string to use when
                                  displaying thread information as part of the
                                  stop display.
  use-color                    -- Whether to use Ansi color codes or not.
  use-external-editor          -- Whether to use an external editor or not.

'target' variables:

  arg0                                -- The first argument passed to the
                                         program in the argument array which
                                         can be different from the executable
                                         itself.
  auto-apply-fixits                   -- Automatically apply fix-it hints to
                                         expressions.
  auto-import-clang-modules           -- Automatically load Clang modules
                                         referred to by the program.
  auto-install-main-executable        -- Always install the main executable
                                         when connected to a remote platform.
  breakpoints-use-platform-avoid-list -- Consult the platform module avoid list
                                         when setting non-module specific
                                         breakpoints.
  clang-module-search-paths           -- List of directories to be searched
                                         when locating modules for Clang.
  debug-file-search-paths             -- List of directories to be searched
                                         when locating debug symbol files. See
                                         also symbols.enable-external-lookup.
  default-arch                        -- Default architecture to choose, when
                                         there's a choice.
  detach-on-error                     -- debugserver will detach (rather than
                                         killing) a process if it loses
                                         connection with lldb.
  disable-aslr                        -- Disable Address Space Layout
                                         Randomization (ASLR)
  disable-stdio                       -- Disable stdin/stdout for process (e.g.
                                         for a GUI application)
  x86-disassembly-flavor              -- The default disassembly flavor to use
                                         for x86 or x86-64 targets.
  display-expression-in-crashlogs     -- Expressions that crash will show up in
                                         crash logs if the host system supports
                                         executable specific crash log strings
                                         and this setting is set to true.
  display-recognized-arguments        -- Show recognized arguments in variable
                                         listings by default.
  display-runtime-support-values      -- If true, LLDB will show variables that
                                         are meant to support the operation of
                                         a language's runtime support.
  enable-synthetic-value              -- Should synthetic values be used by
                                         default whenever available.
  env-vars                            -- A list of user provided environment
                                         variables to be passed to the
                                         executable's environment, and their
                                         values.
  error-path                          -- The file/path to be used by the
                                         executable program for writing its
                                         standard error.
  exec-search-paths                   -- Executable search paths to use when
                                         locating executable files whose paths
                                         don't match the local file system.
  expr-prefix                         -- Path to a file containing expressions
                                         to be prepended to all expressions.
  hex-immediate-style                 -- Which style to use for printing
                                         hexadecimal disassembly values.
  import-std-module                   -- Import the C++ std module to improve
                                         debugging STL containers.
  inherit-env                         -- Inherit the environment from the
                                         process that is running LLDB.
  inline-breakpoint-strategy          -- The strategy to use when settings
                                         breakpoints by file and line.
                                         Breakpoint locations can end up being
                                         inlined by the compiler, so that a
                                         compile unit 'a.c' might contain an
                                         inlined function from another source
                                         file. Usually this is limited to
                                         breakpoint locations from inlined
                                         functions from header or other include
                                         files, or more accurately
                                         non-implementation source files.
                                         Sometimes code might #include
                                         implementation files and cause inlined
                                         breakpoint locations in inlined
                                         implementation files. Always checking
                                         for inlined breakpoint locations can
                                         be expensive (memory and time), so if
                                         you have a project with many headers
                                         and find that setting breakpoints is
                                         slow, then you can change this setting
                                         to headers. This setting allows you to
                                         control exactly which strategy is used
                                         when setting file and line breakpoints.
  input-path                          -- The file/path to be used by the
                                         executable program for reading its
                                         standard input.
  language                            -- The language to use when interpreting
                                         expressions entered in commands.
  load-cwd-lldbinit                   -- Allow LLDB to .lldbinit files from the
                                         current directory automatically.
  load-script-from-symbol-file        -- Allow LLDB to load scripting resources
                                         embedded in symbol files when
                                         available.
  max-children-count                  -- Maximum number of children to expand
                                         in any level of depth.
  max-memory-read-size                -- Maximum number of bytes that 'memory
                                         read' will fetch before --force must
                                         be specified.
  max-string-summary-length           -- Maximum number of characters to show
                                         when using %s in summary strings.
  max-zero-padding-in-float-format    -- The maximum number of zeroes to insert
                                         when displaying a very small float
                                         before falling back to scientific
                                         notation.
  memory-module-load-level            -- Loading modules from memory can be
                                         slow as reading the symbol tables and
                                         other data can take a long time
                                         depending on your connection to the
                                         debug target. This setting helps users
                                         control how much information gets
                                         loaded when loading modules from
                                         memory.'complete' is the default value
                                         for this setting which will load all
                                         sections and symbols by reading them
                                         from memory (slowest, most accurate).
                                         'partial' will load sections and
                                         attempt to find function bounds
                                         without downloading the symbol table
                                         (faster, still accurate, missing
                                         symbol names). 'minimal' is the
                                         fastest setting and will load section
                                         data with no symbols, but should
                                         rarely be used as stack frames in
                                         these memory regions will be
                                         inaccurate and not provide any context
                                         (fastest). 
  move-to-nearest-code                -- Move breakpoints to nearest code.
  non-stop-mode                       -- Disable lock-step debugging, instead
                                         control threads independently.
  notify-about-fixits                 -- Print the fixed expression text.
  output-path                         -- The file/path to be used by the
                                         executable program for writing its
                                         standard output.
  prefer-dynamic-value                -- Should printed values be shown as
                                         their dynamic value.
  preload-symbols                     -- Enable loading of symbol tables before
                                         they are needed.
  require-hardware-breakpoint         -- Require all breakpoints to be hardware
                                         breakpoints.
  retries-with-fixits                 -- Maximum number of attempts to fix an
                                         expression with Fix-Its
  run-args                            -- A list containing all the arguments to
                                         be passed to the executable when it is
                                         run. Note that this does NOT include
                                         the argv[0] which is in target.arg0.
  save-jit-objects                    -- Save intermediate object files
                                         generated by the LLVM JIT
  skip-prologue                       -- Skip function prologues when setting
                                         breakpoints by name.
  source-map                          -- Source path remappings are used to
                                         track the change of location between a
                                         source file when built, and where it
                                         exists on the current system.  It
                                         consists of an array of duples, the
                                         first element of each duple is some
                                         part (starting at the root) of the
                                         path to the file when it was built,
                                         and the second is where the remainder
                                         of the original build hierarchy is
                                         rooted on the local system.  Each
                                         element of the array is checked in
                                         order and the first one that results
                                         in a match wins.
  trap-handler-names                  -- A list of trap handler function names,
                                         e.g. a common Unix user process one is
                                         _sigtramp.
  unset-env-vars                      -- A list of environment variable names
                                         to be unset in the inferior's
                                         environment. This is most useful to
                                         unset some host environment variables
                                         when target.inherit-env is true.
                                         target.env-vars takes precedence over
                                         target.unset-env-vars.
  use-fast-stepping                   -- Use a fast stepping algorithm based on
                                         running from branch to branch rather
                                         than instruction single-stepping.
  use-hex-immediates                  -- Show immediates in disassembly as
                                         hexadecimal.

'target.experimental' variables:

  inject-local-vars             -- If true, inject local variables explicitly
                                   into the expression text. This will fix
                                   symbol resolution when there are name
                                   collisions between ivars and local
                                   variables. But it can make expressions run
                                   much more slowly.
  os-plugin-reports-all-threads -- Set to False if your OS Plugins doesn't
                                   report all threads on each stop.

'target.process' variables:

  detach-keeps-stopped              -- If true, detach will attempt to keep the
                                       process stopped.
  disable-memory-cache              -- Disable reading and caching of memory in
                                       fixed-size units.
  extra-startup-command             -- A list containing extra commands
                                       understood by the particular process
                                       plugin used.  For instance, to turn on
                                       debugserver logging set this to
                                       'QSetLogging:bitmask=LOG_DEFAULT;'
  ignore-breakpoints-in-expressions -- If true, breakpoints will be ignored
                                       during expression evaluation.
  memory-cache-line-size            -- The memory cache line size
  python-os-plugin-path             -- A path to a python OS plug-in module
                                       file that contains a
                                       OperatingSystemPlugIn class.
  stop-on-exec                      -- If true, stop when a shared library is
                                       loaded or unloaded.
  stop-on-sharedlibrary-events      -- If true, stop when a shared library is
                                       loaded or unloaded.
  unwind-on-error-in-expressions    -- If true, errors in expression evaluation
                                       will unwind the stack back to the state
                                       before the call.
  utility-expression-timeout        -- The time in seconds to wait for
                                       LLDB-internal utility expressions.
  optimization-warnings             -- If true, warn when stopped in code that
                                       is optimized where stepping and variable
                                       availability may not behave as expected.

'target.process.thread' variables:

  trace-thread           -- If true, this thread will single-step and log
                            execution.
  max-backtrace-depth    -- Maximum number of frames to backtrace.
  step-avoid-libraries   -- A list of libraries that source stepping won't stop
                            in.
  step-avoid-regexp      -- A regular expression defining functions step-in
                            won't stop in.
  step-in-avoid-nodebug  -- If true, step-in will not stop in functions with no
                            debug information.
  step-out-avoid-nodebug -- If true, when step-in/step-out/step-over leave the
                            current frame, they will continue to step out till
                            they come to a function with debug information.
                            Passing a frame argument to step-out will override
                            this option.

'platform' variables:

  module-cache-directory -- Root directory for cached modules.
  use-module-cache       -- Use module cache.

'platform.plugin' variables:


'platform.plugin.darwin-kernel' variables:

  kext-directories         -- Directories/KDKs to search for kexts in when
                              starting a kernel debug session.
  search-locally-for-kexts -- Automatically search for kexts on the local
                              system when doing kernel debugging.

'symbols' variables:

  clang-modules-cache-path -- The path to the clang modules cache directory
                              (-fmodules-cache-path).
  enable-external-lookup   -- Control the use of external tools and
                              repositories to locate symbol files. Directories
                              listed in target.debug-file-search-paths and
                              directory of the executable are always checked
                              first for separate debug info files. Then
                              depending on this setting: On macOS, Spotlight
                              would be also used to locate a matching .dSYM
                              bundle based on the UUID of the executable. On
                              NetBSD, directory /usr/libdata/debug would be
                              also searched. On platforms other than NetBSD
                              directory /usr/lib/debug would be also searched.
  debug-info-symlink-paths -- Debug info path which should be resolved while
                              parsing, relative to the host filesystem.

'interpreter' variables:

  echo-commands                -- If true, commands will be echoed before they
                                  are evaluated.
  echo-comment-commands        -- If true, commands will be echoed even if they
                                  are pure comment lines.
  expand-regex-aliases         -- If true, regular expression alias commands
                                  will show the expanded command that will be
                                  executed. This can be used to debug new
                                  regular expression alias commands.
  prompt-on-quit               -- If true, LLDB will prompt you before quitting
                                  if there are any live processes being
                                  debugged. If false, LLDB will quit without
                                  asking in any case.
  space-repl-prompts           -- If true, blank lines will be printed between
                                  between REPL submissions.
  stop-command-source-on-error -- If true, LLDB will stop running a 'command
                                  source' script upon encountering an error.

'plugin' variables:


'plugin.dynamic-loader' variables:


'plugin.dynamic-loader.darwin-kernel' variables:

  load-kexts -- Automatically loads kext images when attaching to a kernel.
  scan-type  -- Control how many reads lldb will make while searching for a
                Darwin kernel on attach.

'plugin.jit-loader' variables:


'plugin.jit-loader.gdb' variables:

  enable -- Enable GDB's JIT compilation interface (default: enabled on all
            platforms except macOS)

'plugin.process' variables:


'plugin.process.kdp-remote' variables:

  packet-timeout -- Specify the default packet timeout in seconds.

'plugin.process.gdb-remote' variables:

  packet-timeout           -- Specify the default packet timeout in seconds.
  target-definition-file   -- The file that provides the description for remote
                              target registers.
  use-g-packet-for-reading -- Specify if the server should use 'g' packets to
                              read registers.
  use-libraries-svr4       -- If true, the libraries-svr4 feature will be used
                              to get a hold of the process's loaded modules.

'plugin.symbol-file' variables:


'plugin.symbol-file.dwarf' variables:

  ignore-file-indexes -- Ignore indexes present in the object files and always
                         index DWARF manually.

'plugin.structured-data' variables:


'plugin.structured-data.darwin-log' variables:

  auto-enable-options -- Specify the options to 'plugin structured-data
                         darwin-log enable' that should be applied when
                         automatically enabling logging on startup/attach.
  enable-on-startup   -- Enable Darwin os_log collection when debugged process
                         is launched or attached.


Expecting sub string: language
Matched

Expecting sub string: arg0
Matched

Expecting sub string: detach-on-error
Matched

Expecting sub string: packet-timeout
Matched

PASS: LLDB (/Users/buildslave/jenkins/workspace/lldb-cmake-matrix@2/lldb-build/bin/clang-11-x86_64) :: test_settings_list (TestSettings.SettingsCommandTestCase)
runCmd: settings clear -all
output: 

runCmd: settings set symbols.enable-external-lookup false
output: 

runCmd: settings set target.auto-apply-fixits false
output: 

runCmd: settings set plugin.process.gdb-remote.packet-timeout 60
output: 

runCmd: settings set symbols.clang-modules-cache-path "/Users/buildslave/jenkins/workspace/lldb-cmake-matrix@2/lldb-build/lldb-test-build.noindex/module-cache-lldb/lldb-api"
output: 

runCmd: settings set use-color false
output: 

runCmd: setting set target.prefer-dynamic-value no-dynamic-values
output: 

runCmd: settings remove ''
check of return status not required
runCmd failed!
error: 'settings remove' command requires a valid variable name


Expecting sub string: 'settings remove' command requires a valid variable name
Matched

PASS: LLDB (/Users/buildslave/jenkins/workspace/lldb-cmake-matrix@2/lldb-build/bin/clang-11-x86_64) :: test_settings_remove_empty_arg (TestSettings.SettingsCommandTestCase)
runCmd: settings clear -all
output: 

runCmd: settings set symbols.enable-external-lookup false
output: 

runCmd: settings set target.auto-apply-fixits false
output: 

runCmd: settings set plugin.process.gdb-remote.packet-timeout 60
output: 

runCmd: settings set symbols.clang-modules-cache-path "/Users/buildslave/jenkins/workspace/lldb-cmake-matrix@2/lldb-build/lldb-test-build.noindex/module-cache-lldb/lldb-api"
output: 

runCmd: settings set use-color false
output: 

runCmd: setting set target.prefer-dynamic-value no-dynamic-values
output: 

runCmd: settings remove
check of return status not required
runCmd failed!
error: 'settings remove' takes an array or dictionary item, or an array followed by one or more indexes, or a dictionary followed by one or more key names to remove


Expecting sub string: 'settings remove' takes an array or dictionary item, or
Matched

PASS: LLDB (/Users/buildslave/jenkins/workspace/lldb-cmake-matrix@2/lldb-build/bin/clang-11-x86_64) :: test_settings_remove_missing_arg (TestSettings.SettingsCommandTestCase)
runCmd: settings clear -all
output: 

runCmd: settings set symbols.enable-external-lookup false
output: 

runCmd: settings set target.auto-apply-fixits false
output: 

runCmd: settings set plugin.process.gdb-remote.packet-timeout 60
output: 

runCmd: settings set symbols.clang-modules-cache-path "/Users/buildslave/jenkins/workspace/lldb-cmake-matrix@2/lldb-build/lldb-test-build.noindex/module-cache-lldb/lldb-api"
output: 

runCmd: settings set use-color false
output: 

runCmd: setting set target.prefer-dynamic-value no-dynamic-values
output: 

runCmd: settings set target.env-vars a=b c=d e=f
output: 

runCmd: settings show target.env-vars
output: target.env-vars (dictionary of strings) =
  a=b
  c=d
  e=f


Expecting sub string: a=b
Matched

Expecting sub string: c=d
Matched

Expecting sub string: e=f
Matched

runCmd: settings remove target.env-vars a e
output: 

runCmd: settings show target.env-vars
output: target.env-vars (dictionary of strings) =
  c=d


Not expecting sub string: a=b
Not matched

Not expecting sub string: e=f
Not matched

runCmd: settings show target.env-vars
output: target.env-vars (dictionary of strings) =
  c=d


Expecting sub string: c=d
Matched

PASS: LLDB (/Users/buildslave/jenkins/workspace/lldb-cmake-matrix@2/lldb-build/bin/clang-11-x86_64) :: test_settings_remove_multiple (TestSettings.SettingsCommandTestCase)
runCmd: settings clear -all
output: 

runCmd: settings set symbols.enable-external-lookup false
output: 

runCmd: settings set target.auto-apply-fixits false
output: 

runCmd: settings set plugin.process.gdb-remote.packet-timeout 60
output: 

runCmd: settings set symbols.clang-modules-cache-path "/Users/buildslave/jenkins/workspace/lldb-cmake-matrix@2/lldb-build/lldb-test-build.noindex/module-cache-lldb/lldb-api"
output: 

runCmd: settings set use-color false
output: 

runCmd: setting set target.prefer-dynamic-value no-dynamic-values
output: 

runCmd: settings remove doesntexist alsodoesntexist
check of return status not required
runCmd failed!
error: invalid value path 'doesntexist'


Expecting sub string: error: invalid value path 'doesntexist'
Matched

PASS: LLDB (/Users/buildslave/jenkins/workspace/lldb-cmake-matrix@2/lldb-build/bin/clang-11-x86_64) :: test_settings_remove_nonexistent_settings (TestSettings.SettingsCommandTestCase)
runCmd: settings clear -all
output: 

runCmd: settings set symbols.enable-external-lookup false
output: 

runCmd: settings set target.auto-apply-fixits false
output: 

runCmd: settings set plugin.process.gdb-remote.packet-timeout 60
output: 

runCmd: settings set symbols.clang-modules-cache-path "/Users/buildslave/jenkins/workspace/lldb-cmake-matrix@2/lldb-build/lldb-test-build.noindex/module-cache-lldb/lldb-api"
output: 

runCmd: settings set use-color false
output: 

runCmd: setting set target.prefer-dynamic-value no-dynamic-values
output: 

runCmd: settings remove target.env-vars doesntexist
check of return status not required
runCmd failed!
error: no value found named 'doesntexist', aborting remove operation


Expecting sub string: no value found named 'doesntexist'
Matched

PASS: LLDB (/Users/buildslave/jenkins/workspace/lldb-cmake-matrix@2/lldb-build/bin/clang-11-x86_64) :: test_settings_remove_nonexistent_value (TestSettings.SettingsCommandTestCase)
runCmd: settings clear -all
output: 

runCmd: settings set symbols.enable-external-lookup false
output: 

runCmd: settings set target.auto-apply-fixits false
output: 

runCmd: settings set plugin.process.gdb-remote.packet-timeout 60
output: 

runCmd: settings set symbols.clang-modules-cache-path "/Users/buildslave/jenkins/workspace/lldb-cmake-matrix@2/lldb-build/lldb-test-build.noindex/module-cache-lldb/lldb-api"
output: 

runCmd: settings set use-color false
output: 

runCmd: setting set target.prefer-dynamic-value no-dynamic-values
output: 

runCmd: settings set target.env-vars a=b c=d
output: 

runCmd: settings show target.env-vars
output: target.env-vars (dictionary of strings) =
  a=b
  c=d


Expecting sub string: a=b
Matched

Expecting sub string: c=d
Matched

runCmd: settings remove target.env-vars a
output: 

runCmd: settings show target.env-vars
output: target.env-vars (dictionary of strings) =
  c=d


Not expecting sub string: a=b
Not matched

runCmd: settings show target.env-vars
output: target.env-vars (dictionary of strings) =
  c=d


Expecting sub string: c=d
Matched

runCmd: settings remove target.env-vars c
output: 

runCmd: settings show target.env-vars
output: target.env-vars (dictionary of strings) =


Not expecting sub string: a=b
Not matched

Not expecting sub string: c=d
Not matched

PASS: LLDB (/Users/buildslave/jenkins/workspace/lldb-cmake-matrix@2/lldb-build/bin/clang-11-x86_64) :: test_settings_remove_single (TestSettings.SettingsCommandTestCase)
runCmd: settings clear -all
output: 

runCmd: settings set symbols.enable-external-lookup false
output: 

runCmd: settings set target.auto-apply-fixits false
output: 

runCmd: settings set plugin.process.gdb-remote.packet-timeout 60
output: 

runCmd: settings set symbols.clang-modules-cache-path "/Users/buildslave/jenkins/workspace/lldb-cmake-matrix@2/lldb-build/lldb-test-build.noindex/module-cache-lldb/lldb-api"
output: 

runCmd: settings set use-color false
output: 

runCmd: setting set target.prefer-dynamic-value no-dynamic-values
output: 

runCmd: settings clear target.run-args
output: 

runCmd: settings set target.run-args a b c
output: 

runCmd: settings show target.run-args
output: target.run-args (arguments) =
  [0]: "a"
  [1]: "b"
  [2]: "c"


Expecting sub string: [0]: "a"
Matched

Expecting sub string: [1]: "b"
Matched

Expecting sub string: [2]: "c"
Matched

runCmd: settings set target.run-args 'a b c'
output: 

runCmd: settings show target.run-args
output: target.run-args (arguments) =
  [0]: "a b c"


Expecting sub string: [0]: "a b c"
Matched

runCmd: settings clear target.run-args
output: 

runCmd: settings clear target.env-vars
output: 

runCmd: settings set target.env-vars ["MY_FILE"]="this is a file name with spaces.txt"
output: 

runCmd: settings show target.env-vars
output: target.env-vars (dictionary of strings) =
  MY_FILE=this is a file name with spaces.txt


Expecting sub string: MY_FILE=this is a file name with spaces.txt
Matched

runCmd: settings clear target.env-vars
output: 

runCmd: settings set thread-format    'abc def'   
output: 

runCmd: settings show thread-format
output: thread-format (format-string) = "abc def"


runCmd: settings set thread-format    "abc def"   
output: 

runCmd: settings show thread-format
output: thread-format (format-string) = "abc def"


runCmd: settings set thread-format abc def   
output: 

runCmd: settings show thread-format
output: thread-format (format-string) = "abc def   "


runCmd: settings clear thread-format
output: 

PASS: LLDB (/Users/buildslave/jenkins/workspace/lldb-cmake-matrix@2/lldb-build/bin/clang-11-x86_64) :: test_settings_with_quotes (TestSettings.SettingsCommandTestCase)
runCmd: settings clear -all
output: 

runCmd: settings set symbols.enable-external-lookup false
output: 

runCmd: settings set target.auto-apply-fixits false
output: 

runCmd: settings set plugin.process.gdb-remote.packet-timeout 60
output: 

runCmd: settings set symbols.clang-modules-cache-path "/Users/buildslave/jenkins/workspace/lldb-cmake-matrix@2/lldb-build/lldb-test-build.noindex/module-cache-lldb/lldb-api"
output: 

runCmd: settings set use-color false
output: 

runCmd: setting set target.prefer-dynamic-value no-dynamic-values
output: 

runCmd: settings set target.skip-prologue true
output: 

runCmd: settings set target.skip-prologue false 
output: 

runCmd: settings show target.skip-prologue
output: target.skip-prologue (boolean) = false


Expecting start string: target.skip-prologue (boolean) = false
Matched

runCmd: settings clear target.skip-prologue
check of return status not required
output: 

runCmd: settings set term-width 70
output: 

runCmd: settings set term-width 60 	
output: 

runCmd: settings show term-width
output: term-width (int) = 60


Expecting start string: term-width (int) = 60
Matched

runCmd: settings clear term-width
check of return status not required
output: 

runCmd: settings set target.arg0 abc
output: 

runCmd: settings set target.arg0 cde	 
output: 

runCmd: settings show target.arg0
output: target.arg0 (string) = "cde"


Expecting start string: target.arg0 (string) = "cde"
Matched

runCmd: settings clear target.arg0
check of return status not required
output: 

runCmd: settings set target.output-path /Users/buildslave/jenkins/workspace/lldb-cmake-matrix@2/lldb-build/lldb-test-build.noindex/commands/settings/TestSettings.test_settings_with_trailing_whitespace/path1.txt
output: 

runCmd: settings show target.output-path
output: target.output-path (file) = "/Users/buildslave/jenkins/workspace/lldb-cmake-matrix@2/lldb-build/lldb-test-build.noindex/commands/settings/TestSettings.test_settings_with_trailing_whitespace/path1.txt"


Expecting start string: target.output-path (file) = 
Matched

Expecting sub string: /Users/buildslave/jenkins/workspace/lldb-cmake-matrix@2/lldb-build/lldb-test-build.noindex/commands/settings/TestSettings.test_settings_with_trailing_whitespace/path1.txt
Matched

runCmd: settings set target.output-path /Users/buildslave/jenkins/workspace/lldb-cmake-matrix@2/lldb-build/lldb-test-build.noindex/commands/settings/TestSettings.test_settings_with_trailing_whitespace/path2.txt 
output: 

runCmd: settings show target.output-path
output: target.output-path (file) = "/Users/buildslave/jenkins/workspace/lldb-cmake-matrix@2/lldb-build/lldb-test-build.noindex/commands/settings/TestSettings.test_settings_with_trailing_whitespace/path2.txt"


Expecting start string: target.output-path (file) = 
Matched

Expecting sub string: /Users/buildslave/jenkins/workspace/lldb-cmake-matrix@2/lldb-build/lldb-test-build.noindex/commands/settings/TestSettings.test_settings_with_trailing_whitespace/path2.txt
Matched

runCmd: settings clear target.output-path
check of return status not required
output: 

runCmd: settings set stop-disassembly-display never
output: 

runCmd: settings set stop-disassembly-display always 
output: 

runCmd: settings show stop-disassembly-display
output: stop-disassembly-display (enum) = always


Expecting start string: stop-disassembly-display (enum) = always
Matched

runCmd: settings clear stop-disassembly-display
check of return status not required
output: 

runCmd: settings set target.language c89
output: 

runCmd: settings set target.language c11 
output: 

runCmd: settings show target.language
output: target.language (language) = c11


Expecting start string: target.language (language) = c11
Matched

runCmd: settings clear target.language
check of return status not required
output: 

runCmd: settings set target.run-args 1 2 3
output: 

runCmd: settings set target.run-args 3 4 5 
output: 

runCmd: settings show target.run-args
output: target.run-args (arguments) =
  [0]: "3"
  [1]: "4"
  [2]: "5"


Expecting sub string: target.run-args (arguments) =
Matched

Expecting sub string: [0]: "3"
Matched

Expecting sub string: [1]: "4"
Matched

Expecting sub string: [2]: "5"
Matched

runCmd: settings set target.run-args 1 2 3
output: 

runCmd: settings set target.run-args 3 \  \ 
output: 

runCmd: settings show target.run-args
output: target.run-args (arguments) =
  [0]: "3"
  [1]: " "
  [2]: " "


Expecting sub string: target.run-args (arguments) =
Matched

Expecting sub string: [0]: "3"
Matched

Expecting sub string: [1]: " "
Matched

Expecting sub string: [2]: " "
Matched

runCmd: settings clear target.run-args
check of return status not required
output: 

runCmd: settings clear target.env-vars
output: 

runCmd: settings set target.env-vars A=B C=D	 
output: 

runCmd: settings show target.env-vars
output: target.env-vars (dictionary of strings) =
  A=B
  C=D


Expecting sub string: target.env-vars (dictionary of strings) =
Matched

Expecting sub string: A=B
Matched

Expecting sub string: C=D
Matched

runCmd: settings clear target.env-vars
check of return status not required
output: 

runCmd: settings clear target.process.thread.step-avoid-regexp
output: 

runCmd: settings set target.process.thread.step-avoid-regexp foo\ 
output: 

runCmd: settings show target.process.thread.step-avoid-regexp
output: target.process.thread.step-avoid-regexp (regex) = foo\ 


Expecting sub string: target.process.thread.step-avoid-regexp (regex) = foo\ 
Matched

runCmd: settings clear target.process.thread.step-avoid-regexp
check of return status not required
output: 

runCmd: settings clear disassembly-format
output: 

runCmd: settings set disassembly-format foo 
output: 

runCmd: settings show disassembly-format
output: disassembly-format (format-string) = "foo "


Expecting sub string: disassembly-format (format-string) = "foo "
Matched

runCmd: settings clear disassembly-format
check of return status not required
output: 

PASS: LLDB (/Users/buildslave/jenkins/workspace/lldb-cmake-matrix@2/lldb-build/bin/clang-11-x86_64) :: test_settings_with_trailing_whitespace (TestSettings.SettingsCommandTestCase)
Restore dir to: /Users/buildslave/jenkins/workspace/lldb-cmake-matrix@2/lldb-build/tools/lldb/test
======================================================================
FAIL: test_set_frame_format (TestSettings.SettingsCommandTestCase)
    Test that 'set frame-format' with a backtick char in the format string works as well as fullpath.
----------------------------------------------------------------------
Traceback (most recent call last):
  File "/Users/buildslave/jenkins/workspace/lldb-cmake-matrix@2/llvm-project/lldb/packages/Python/lldbsuite/test/decorators.py", line 140, in wrapper
    func(*args, **kwargs)
  File "/Users/buildslave/jenkins/workspace/lldb-cmake-matrix@2/llvm-project/lldb/test/API/commands/settings/TestSettings.py", line 145, in test_set_frame_format
    substrs=["`main", self.getSourceDir()])
  File "/Users/buildslave/jenkins/workspace/lldb-cmake-matrix@2/llvm-project/lldb/packages/Python/lldbsuite/test/lldbtest.py", line 2391, in expect
    if msg else EXP_MSG(str, output, exe))
AssertionError: False is not True : 'thread backtrace' returns expected result, got '* thread #1, queue = 'com.apple.main-thread', stop reason = breakpoint 1.1
  * frame #0: 0x00000001000015c0 a.out`main'
Config=x86_64-/Users/buildslave/jenkins/workspace/lldb-cmake-matrix@2/lldb-build/bin/clang-11
----------------------------------------------------------------------
Ran 27 tests in 32.379s

RESULT: FAILED (26 passes, 1 failures, 0 errors, 0 skipped, 0 expected failures, 0 unexpected successes)

--

********************
PASS: lldb-api :: lang/objc/foundation/TestFoundationDisassembly.py (1988 of 1992)
FAIL: lldb-api :: lang/objc/hidden-ivars/TestHiddenIvars.py (1989 of 1992)
******************** TEST 'lldb-api :: lang/objc/hidden-ivars/TestHiddenIvars.py' FAILED ********************
Script:
--
/usr/local/bin/python /Users/buildslave/jenkins/workspace/lldb-cmake-matrix@2/llvm-project/lldb/test/API/dotest.py --arch x86_64 -s /Users/buildslave/jenkins/workspace/lldb-cmake-matrix@2/lldb-build/lldb-test-traces -S nm -u CXXFLAGS -u CFLAGS --codesign-identity lldb_codesign --server /Users/buildslave/jenkins/workspace/lldb-cmake-matrix@2/lldb-build/./bin/debugserver --arch x86_64 --build-dir /Users/buildslave/jenkins/workspace/lldb-cmake-matrix@2/lldb-build/lldb-test-build.noindex -s=/Users/buildslave/jenkins/workspace/lldb-cmake-matrix@2/test/logs -t --env TERM=vt100 --skip-category gmodules --skip-category watchpoint --arch=x86_64 --dwarf-version=5 --env LLVM_LIBS_DIR=/Users/buildslave/jenkins/workspace/lldb-cmake-matrix@2/lldb-build/./lib --build-dir /Users/buildslave/jenkins/workspace/lldb-cmake-matrix@2/lldb-build/lldb-test-build.noindex --lldb-module-cache-dir /Users/buildslave/jenkins/workspace/lldb-cmake-matrix@2/lldb-build/lldb-test-build.noindex/module-cache-lldb/lldb-api --clang-module-cache-dir /Users/buildslave/jenkins/workspace/lldb-cmake-matrix@2/lldb-build/lldb-test-build.noindex/module-cache-clang/lldb-api --executable /Users/buildslave/jenkins/workspace/lldb-cmake-matrix@2/lldb-build/./bin/lldb --compiler /Users/buildslave/jenkins/workspace/lldb-cmake-matrix@2/lldb-build/./bin/clang --dsymutil /Users/buildslave/jenkins/workspace/lldb-cmake-matrix@2/lldb-build/./bin/dsymutil --filecheck /Users/buildslave/jenkins/workspace/lldb-cmake-matrix@2/lldb-build/./bin/FileCheck --lldb-libs-dir /Users/buildslave/jenkins/workspace/lldb-cmake-matrix@2/lldb-build/./lib /Users/buildslave/jenkins/workspace/lldb-cmake-matrix@2/llvm-project/lldb/test/API/lang/objc/hidden-ivars -p TestHiddenIvars.py
--
Exit Code: 1

Command Output (stdout):
--
lldb version 11.0.99
  clang revision 340d1119eddaa30446853832c3ad1e95c6ff96dc
  llvm revision 340d1119eddaa30446853832c3ad1e95c6ff96dc
LLDB library dir: /Users/buildslave/jenkins/workspace/lldb-cmake-matrix@2/lldb-build/bin
LLDB import library dir: /Users/buildslave/jenkins/workspace/lldb-cmake-matrix@2/lldb-build/./lib
libstdcxx tests will not be run because: Don't know how to build with libstdcxx on macosx
Skipping following debug info categories: ['dwo']

--
Command Output (stderr):
--
warning: (x86_64) /Users/buildslave/jenkins/workspace/lldb-cmake-matrix@2/lldb-build/lldb-test-build.noindex/lang/objc/hidden-ivars/TestHiddenIvars.test_expr_dsym/a.out empty dSYM file detected, dSYM was created with an executable with no debug info.
warning: (x86_64) /Users/buildslave/jenkins/workspace/lldb-cmake-matrix@2/lldb-build/lldb-test-build.noindex/lang/objc/hidden-ivars/TestHiddenIvars.test_expr_dsym/libInternalDefiner.dylib empty dSYM file detected, dSYM was created with an executable with no debug info.
warning: (x86_64) /Users/buildslave/jenkins/workspace/lldb-cmake-matrix@2/lldb-build/lldb-test-build.noindex/lang/objc/hidden-ivars/TestHiddenIvars.test_expr_stripped_dsym/stripped/a.out empty dSYM file detected, dSYM was created with an executable with no debug info.
warning: (x86_64) /Users/buildslave/jenkins/workspace/lldb-cmake-matrix@2/lldb-build/lldb-test-build.noindex/lang/objc/hidden-ivars/TestHiddenIvars.test_expr_stripped_dsym/libInternalDefiner.dylib empty dSYM file detected, dSYM was created with an executable with no debug info.
warning: (x86_64) /Users/buildslave/jenkins/workspace/lldb-cmake-matrix@2/lldb-build/lldb-test-build.noindex/lang/objc/hidden-ivars/TestHiddenIvars.test_frame_variable_across_modules_dsym/a.out empty dSYM file detected, dSYM was created with an executable with no debug info.
warning: (x86_64) /Users/buildslave/jenkins/workspace/lldb-cmake-matrix@2/lldb-build/lldb-test-build.noindex/lang/objc/hidden-ivars/TestHiddenIvars.test_frame_variable_across_modules_dsym/libInternalDefiner.dylib empty dSYM file detected, dSYM was created with an executable with no debug info.
warning: (x86_64) /Users/buildslave/jenkins/workspace/lldb-cmake-matrix@2/lldb-build/lldb-test-build.noindex/lang/objc/hidden-ivars/TestHiddenIvars.test_frame_variable_dsym/a.out empty dSYM file detected, dSYM was created with an executable with no debug info.
warning: (x86_64) /Users/buildslave/jenkins/workspace/lldb-cmake-matrix@2/lldb-build/lldb-test-build.noindex/lang/objc/hidden-ivars/TestHiddenIvars.test_frame_variable_dsym/libInternalDefiner.dylib empty dSYM file detected, dSYM was created with an executable with no debug info.

Session logs for test failures/errors/unexpected successes will go into directory '/Users/buildslave/jenkins/workspace/lldb-cmake-matrix@2/test/logs'
Command invoked: /Users/buildslave/jenkins/workspace/lldb-cmake-matrix@2/llvm-project/lldb/test/API/dotest.py --arch x86_64 -s /Users/buildslave/jenkins/workspace/lldb-cmake-matrix@2/lldb-build/lldb-test-traces -S nm -u CXXFLAGS -u CFLAGS --codesign-identity lldb_codesign --server /Users/buildslave/jenkins/workspace/lldb-cmake-matrix@2/lldb-build/./bin/debugserver --arch x86_64 --build-dir /Users/buildslave/jenkins/workspace/lldb-cmake-matrix@2/lldb-build/lldb-test-build.noindex -s=/Users/buildslave/jenkins/workspace/lldb-cmake-matrix@2/test/logs -t --env TERM=vt100 --skip-category gmodules --skip-category watchpoint --arch=x86_64 --dwarf-version=5 --env LLVM_LIBS_DIR=/Users/buildslave/jenkins/workspace/lldb-cmake-matrix@2/lldb-build/./lib --build-dir /Users/buildslave/jenkins/workspace/lldb-cmake-matrix@2/lldb-build/lldb-test-build.noindex --lldb-module-cache-dir /Users/buildslave/jenkins/workspace/lldb-cmake-matrix@2/lldb-build/lldb-test-build.noindex/module-cache-lldb/lldb-api --clang-module-cache-dir /Users/buildslave/jenkins/workspace/lldb-cmake-matrix@2/lldb-build/lldb-test-build.noindex/module-cache-clang/lldb-api --executable /Users/buildslave/jenkins/workspace/lldb-cmake-matrix@2/lldb-build/./bin/lldb --compiler /Users/buildslave/jenkins/workspace/lldb-cmake-matrix@2/lldb-build/./bin/clang --dsymutil /Users/buildslave/jenkins/workspace/lldb-cmake-matrix@2/lldb-build/./bin/dsymutil --filecheck /Users/buildslave/jenkins/workspace/lldb-cmake-matrix@2/lldb-build/./bin/FileCheck --lldb-libs-dir /Users/buildslave/jenkins/workspace/lldb-cmake-matrix@2/lldb-build/./lib /Users/buildslave/jenkins/workspace/lldb-cmake-matrix@2/llvm-project/lldb/test/API/lang/objc/hidden-ivars -p TestHiddenIvars.py
Change dir to: /Users/buildslave/jenkins/workspace/lldb-cmake-matrix@2/llvm-project/lldb/test/API/lang/objc/hidden-ivars
runCmd: settings clear -all
output: 

runCmd: settings set symbols.enable-external-lookup false
output: 

runCmd: settings set target.auto-apply-fixits false
output: 

runCmd: settings set plugin.process.gdb-remote.packet-timeout 60
output: 

runCmd: settings set symbols.clang-modules-cache-path "/Users/buildslave/jenkins/workspace/lldb-cmake-matrix@2/lldb-build/lldb-test-build.noindex/module-cache-lldb/lldb-api"
output: 

runCmd: settings set use-color false
output: 

runCmd: setting set target.prefer-dynamic-value no-dynamic-values
output: 

runCmd: file /Users/buildslave/jenkins/workspace/lldb-cmake-matrix@2/lldb-build/lldb-test-build.noindex/lang/objc/hidden-ivars/TestHiddenIvars.test_expr_dsym/a.out
output: Current executable set to '/Users/buildslave/jenkins/workspace/lldb-cmake-matrix@2/lldb-build/lldb-test-build.noindex/lang/objc/hidden-ivars/TestHiddenIvars.test_expr_dsym/a.out' (x86_64).


runCmd: breakpoint set -f "main.m" -l 49
output: Breakpoint 1: no locations (pending).
WARNING:  Unable to resolve breakpoint to any actual locations.


Expecting pattern: ^Breakpoint (?P<bpno>[0-9]+): (?P<num_locations>[0-9]+) locations\.$
Not matched

Expecting pattern: ^Breakpoint (?P<bpno>[0-9]+): (?P<num_locations>no) locations \(pending\)\.
Matched

FAIL: LLDB (/Users/buildslave/jenkins/workspace/lldb-cmake-matrix@2/lldb-build/bin/clang-11-x86_64) :: test_expr_dsym (TestHiddenIvars.HiddenIvarsTestCase)
<bound method SBProcess.Kill of <lldb.SBProcess; proxy of <Swig Object of type 'lldb::SBProcess *' at 0x1080f3840> >>: success

runCmd: settings clear -all
output: 

runCmd: settings set symbols.enable-external-lookup false
output: 

runCmd: settings set target.auto-apply-fixits false
output: 

runCmd: settings set plugin.process.gdb-remote.packet-timeout 60
output: 

runCmd: settings set symbols.clang-modules-cache-path "/Users/buildslave/jenkins/workspace/lldb-cmake-matrix@2/lldb-build/lldb-test-build.noindex/module-cache-lldb/lldb-api"
output: 

runCmd: settings set use-color false
output: 

runCmd: setting set target.prefer-dynamic-value no-dynamic-values
output: 

runCmd: file /Users/buildslave/jenkins/workspace/lldb-cmake-matrix@2/lldb-build/lldb-test-build.noindex/lang/objc/hidden-ivars/TestHiddenIvars.test_expr_dwarf/a.out
output: Current executable set to '/Users/buildslave/jenkins/workspace/lldb-cmake-matrix@2/lldb-build/lldb-test-build.noindex/lang/objc/hidden-ivars/TestHiddenIvars.test_expr_dwarf/a.out' (x86_64).


runCmd: breakpoint set -f "main.m" -l 49
output: Breakpoint 1: no locations (pending).
WARNING:  Unable to resolve breakpoint to any actual locations.


Expecting pattern: ^Breakpoint (?P<bpno>[0-9]+): (?P<num_locations>[0-9]+) locations\.$
Not matched

Expecting pattern: ^Breakpoint (?P<bpno>[0-9]+): (?P<num_locations>no) locations \(pending\)\.
Matched

FAIL: LLDB (/Users/buildslave/jenkins/workspace/lldb-cmake-matrix@2/lldb-build/bin/clang-11-x86_64) :: test_expr_dwarf (TestHiddenIvars.HiddenIvarsTestCase)
<bound method SBProcess.Kill of <lldb.SBProcess; proxy of <Swig Object of type 'lldb::SBProcess *' at 0x1032f9a80> >>: success

UNSUPPORTED: LLDB (/Users/buildslave/jenkins/workspace/lldb-cmake-matrix@2/lldb-build/bin/clang-11-x86_64) :: test_expr_dwo (TestHiddenIvars.HiddenIvarsTestCase) (test case does not fall in any category of interest for this run) 
UNSUPPORTED: LLDB (/Users/buildslave/jenkins/workspace/lldb-cmake-matrix@2/lldb-build/bin/clang-11-x86_64) :: test_expr_gmodules (TestHiddenIvars.HiddenIvarsTestCase) (test case does not fall in any category of interest for this run) 
runCmd: settings clear -all
output: 

runCmd: settings set symbols.enable-external-lookup false
output: 

runCmd: settings set target.auto-apply-fixits false
output: 

runCmd: settings set plugin.process.gdb-remote.packet-timeout 60
output: 

runCmd: settings set symbols.clang-modules-cache-path "/Users/buildslave/jenkins/workspace/lldb-cmake-matrix@2/lldb-build/lldb-test-build.noindex/module-cache-lldb/lldb-api"
output: 

runCmd: settings set use-color false
output: 

runCmd: setting set target.prefer-dynamic-value no-dynamic-values
output: 

runCmd: file /Users/buildslave/jenkins/workspace/lldb-cmake-matrix@2/lldb-build/lldb-test-build.noindex/lang/objc/hidden-ivars/TestHiddenIvars.test_expr_stripped_dsym/stripped/a.out
output: Current executable set to '/Users/buildslave/jenkins/workspace/lldb-cmake-matrix@2/lldb-build/lldb-test-build.noindex/lang/objc/hidden-ivars/TestHiddenIvars.test_expr_stripped_dsym/stripped/a.out' (x86_64).


runCmd: breakpoint set -f "main.m" -l 49
output: Breakpoint 1: no locations (pending).
WARNING:  Unable to resolve breakpoint to any actual locations.


Expecting pattern: ^Breakpoint (?P<bpno>[0-9]+): (?P<num_locations>[0-9]+) locations\.$
Not matched

Expecting pattern: ^Breakpoint (?P<bpno>[0-9]+): (?P<num_locations>no) locations \(pending\)\.
Matched

FAIL: LLDB (/Users/buildslave/jenkins/workspace/lldb-cmake-matrix@2/lldb-build/bin/clang-11-x86_64) :: test_expr_stripped_dsym (TestHiddenIvars.HiddenIvarsTestCase)
<bound method SBProcess.Kill of <lldb.SBProcess; proxy of <Swig Object of type 'lldb::SBProcess *' at 0x1080f3e10> >>: success

runCmd: settings clear -all
output: 

runCmd: settings set symbols.enable-external-lookup false
output: 

runCmd: settings set target.auto-apply-fixits false
output: 

runCmd: settings set plugin.process.gdb-remote.packet-timeout 60
output: 

runCmd: settings set symbols.clang-modules-cache-path "/Users/buildslave/jenkins/workspace/lldb-cmake-matrix@2/lldb-build/lldb-test-build.noindex/module-cache-lldb/lldb-api"
output: 

runCmd: settings set use-color false
output: 

runCmd: setting set target.prefer-dynamic-value no-dynamic-values
output: 

UNSUPPORTED: LLDB (/Users/buildslave/jenkins/workspace/lldb-cmake-matrix@2/lldb-build/bin/clang-11-x86_64) :: test_expr_stripped_dwarf (TestHiddenIvars.HiddenIvarsTestCase) (skipping due to the following parameter(s): debug info format [This test requires a stripped binary and a dSYM]) 
UNSUPPORTED: LLDB (/Users/buildslave/jenkins/workspace/lldb-cmake-matrix@2/lldb-build/bin/clang-11-x86_64) :: test_expr_stripped_dwo (TestHiddenIvars.HiddenIvarsTestCase) (test case does not fall in any category of interest for this run) 
warning: (x86_64) /Users/buildslave/jenkins/workspace/lldb-cmake-matrix@2/lldb-build/lldb-test-build.noindex/lang/objc/hidden-ivars/TestHiddenIvars.test_frame_variable_stripped_dsym/stripped/a.out empty dSYM file detected, dSYM was created with an executable with no debug info.
warning: (x86_64) /Users/buildslave/jenkins/workspace/lldb-cmake-matrix@2/lldb-build/lldb-test-build.noindex/lang/objc/hidden-ivars/TestHiddenIvars.test_frame_variable_stripped_dsym/libInternalDefiner.dylib empty dSYM file detected, dSYM was created with an executable with no debug info.
UNSUPPORTED: LLDB (/Users/buildslave/jenkins/workspace/lldb-cmake-matrix@2/lldb-build/bin/clang-11-x86_64) :: test_expr_stripped_gmodules (TestHiddenIvars.HiddenIvarsTestCase) (test case does not fall in any category of interest for this run) 
runCmd: settings clear -all
output: 

runCmd: settings set symbols.enable-external-lookup false
output: 

runCmd: settings set target.auto-apply-fixits false
output: 

runCmd: settings set plugin.process.gdb-remote.packet-timeout 60
output: 

runCmd: settings set symbols.clang-modules-cache-path "/Users/buildslave/jenkins/workspace/lldb-cmake-matrix@2/lldb-build/lldb-test-build.noindex/module-cache-lldb/lldb-api"
output: 

runCmd: settings set use-color false
output: 

runCmd: setting set target.prefer-dynamic-value no-dynamic-values
output: 

runCmd: file /Users/buildslave/jenkins/workspace/lldb-cmake-matrix@2/lldb-build/lldb-test-build.noindex/lang/objc/hidden-ivars/TestHiddenIvars.test_frame_variable_across_modules_dsym/a.out
output: Current executable set to '/Users/buildslave/jenkins/workspace/lldb-cmake-matrix@2/lldb-build/lldb-test-build.noindex/lang/objc/hidden-ivars/TestHiddenIvars.test_frame_variable_across_modules_dsym/a.out' (x86_64).


runCmd: breakpoint set -f "main.m" -l 49
output: Breakpoint 1: no locations (pending).
WARNING:  Unable to resolve breakpoint to any actual locations.


Expecting pattern: ^Breakpoint (?P<bpno>[0-9]+): (?P<num_locations>[0-9]+) locations\.$
Not matched

Expecting pattern: ^Breakpoint (?P<bpno>[0-9]+): (?P<num_locations>no) locations \(pending\)\.
Matched

XFAIL: LLDB (/Users/buildslave/jenkins/workspace/lldb-cmake-matrix@2/lldb-build/bin/clang-11-x86_64) :: test_frame_variable_across_modules_dsym (TestHiddenIvars.HiddenIvarsTestCase)
<bound method SBProcess.Kill of <lldb.SBProcess; proxy of <Swig Object of type 'lldb::SBProcess *' at 0x1080f3d80> >>: success

runCmd: settings clear -all
output: 

runCmd: settings set symbols.enable-external-lookup false
output: 

runCmd: settings set target.auto-apply-fixits false
output: 

runCmd: settings set plugin.process.gdb-remote.packet-timeout 60
output: 

runCmd: settings set symbols.clang-modules-cache-path "/Users/buildslave/jenkins/workspace/lldb-cmake-matrix@2/lldb-build/lldb-test-build.noindex/module-cache-lldb/lldb-api"
output: 

runCmd: settings set use-color false
output: 

runCmd: setting set target.prefer-dynamic-value no-dynamic-values
output: 

runCmd: file /Users/buildslave/jenkins/workspace/lldb-cmake-matrix@2/lldb-build/lldb-test-build.noindex/lang/objc/hidden-ivars/TestHiddenIvars.test_frame_variable_across_modules_dwarf/a.out
output: Current executable set to '/Users/buildslave/jenkins/workspace/lldb-cmake-matrix@2/lldb-build/lldb-test-build.noindex/lang/objc/hidden-ivars/TestHiddenIvars.test_frame_variable_across_modules_dwarf/a.out' (x86_64).


runCmd: breakpoint set -f "main.m" -l 49
output: Breakpoint 1: no locations (pending).
WARNING:  Unable to resolve breakpoint to any actual locations.


Expecting pattern: ^Breakpoint (?P<bpno>[0-9]+): (?P<num_locations>[0-9]+) locations\.$
Not matched

Expecting pattern: ^Breakpoint (?P<bpno>[0-9]+): (?P<num_locations>no) locations \(pending\)\.
Matched

XFAIL: LLDB (/Users/buildslave/jenkins/workspace/lldb-cmake-matrix@2/lldb-build/bin/clang-11-x86_64) :: test_frame_variable_across_modules_dwarf (TestHiddenIvars.HiddenIvarsTestCase)
<bound method SBProcess.Kill of <lldb.SBProcess; proxy of <Swig Object of type 'lldb::SBProcess *' at 0x1032f9ab0> >>: success

UNSUPPORTED: LLDB (/Users/buildslave/jenkins/workspace/lldb-cmake-matrix@2/lldb-build/bin/clang-11-x86_64) :: test_frame_variable_across_modules_dwo (TestHiddenIvars.HiddenIvarsTestCase) (test case does not fall in any category of interest for this run) 
UNSUPPORTED: LLDB (/Users/buildslave/jenkins/workspace/lldb-cmake-matrix@2/lldb-build/bin/clang-11-x86_64) :: test_frame_variable_across_modules_gmodules (TestHiddenIvars.HiddenIvarsTestCase) (test case does not fall in any category of interest for this run) 
runCmd: settings clear -all
output: 

runCmd: settings set symbols.enable-external-lookup false
output: 

runCmd: settings set target.auto-apply-fixits false
output: 

runCmd: settings set plugin.process.gdb-remote.packet-timeout 60
output: 

runCmd: settings set symbols.clang-modules-cache-path "/Users/buildslave/jenkins/workspace/lldb-cmake-matrix@2/lldb-build/lldb-test-build.noindex/module-cache-lldb/lldb-api"
output: 

runCmd: settings set use-color false
output: 

runCmd: setting set target.prefer-dynamic-value no-dynamic-values
output: 

runCmd: file /Users/buildslave/jenkins/workspace/lldb-cmake-matrix@2/lldb-build/lldb-test-build.noindex/lang/objc/hidden-ivars/TestHiddenIvars.test_frame_variable_dsym/a.out
output: Current executable set to '/Users/buildslave/jenkins/workspace/lldb-cmake-matrix@2/lldb-build/lldb-test-build.noindex/lang/objc/hidden-ivars/TestHiddenIvars.test_frame_variable_dsym/a.out' (x86_64).


runCmd: breakpoint set -f "main.m" -l 49
output: Breakpoint 1: no locations (pending).
WARNING:  Unable to resolve breakpoint to any actual locations.


Expecting pattern: ^Breakpoint (?P<bpno>[0-9]+): (?P<num_locations>[0-9]+) locations\.$
Not matched

Expecting pattern: ^Breakpoint (?P<bpno>[0-9]+): (?P<num_locations>no) locations \(pending\)\.
Matched

FAIL: LLDB (/Users/buildslave/jenkins/workspace/lldb-cmake-matrix@2/lldb-build/bin/clang-11-x86_64) :: test_frame_variable_dsym (TestHiddenIvars.HiddenIvarsTestCase)
<bound method SBProcess.Kill of <lldb.SBProcess; proxy of <Swig Object of type 'lldb::SBProcess *' at 0x107b72150> >>: success

runCmd: settings clear -all
output: 

runCmd: settings set symbols.enable-external-lookup false
output: 

runCmd: settings set target.auto-apply-fixits false
output: 

runCmd: settings set plugin.process.gdb-remote.packet-timeout 60
output: 

runCmd: settings set symbols.clang-modules-cache-path "/Users/buildslave/jenkins/workspace/lldb-cmake-matrix@2/lldb-build/lldb-test-build.noindex/module-cache-lldb/lldb-api"
output: 

runCmd: settings set use-color false
output: 

runCmd: setting set target.prefer-dynamic-value no-dynamic-values
output: 

runCmd: file /Users/buildslave/jenkins/workspace/lldb-cmake-matrix@2/lldb-build/lldb-test-build.noindex/lang/objc/hidden-ivars/TestHiddenIvars.test_frame_variable_dwarf/a.out
output: Current executable set to '/Users/buildslave/jenkins/workspace/lldb-cmake-matrix@2/lldb-build/lldb-test-build.noindex/lang/objc/hidden-ivars/TestHiddenIvars.test_frame_variable_dwarf/a.out' (x86_64).


runCmd: breakpoint set -f "main.m" -l 49
output: Breakpoint 1: no locations (pending).
WARNING:  Unable to resolve breakpoint to any actual locations.


Expecting pattern: ^Breakpoint (?P<bpno>[0-9]+): (?P<num_locations>[0-9]+) locations\.$
Not matched

Expecting pattern: ^Breakpoint (?P<bpno>[0-9]+): (?P<num_locations>no) locations \(pending\)\.
Matched

FAIL: LLDB (/Users/buildslave/jenkins/workspace/lldb-cmake-matrix@2/lldb-build/bin/clang-11-x86_64) :: test_frame_variable_dwarf (TestHiddenIvars.HiddenIvarsTestCase)
<bound method SBProcess.Kill of <lldb.SBProcess; proxy of <Swig Object of type 'lldb::SBProcess *' at 0x1032f9ab0> >>: success

UNSUPPORTED: LLDB (/Users/buildslave/jenkins/workspace/lldb-cmake-matrix@2/lldb-build/bin/clang-11-x86_64) :: test_frame_variable_dwo (TestHiddenIvars.HiddenIvarsTestCase) (test case does not fall in any category of interest for this run) 
UNSUPPORTED: LLDB (/Users/buildslave/jenkins/workspace/lldb-cmake-matrix@2/lldb-build/bin/clang-11-x86_64) :: test_frame_variable_gmodules (TestHiddenIvars.HiddenIvarsTestCase) (test case does not fall in any category of interest for this run) 
runCmd: settings clear -all
output: 

runCmd: settings set symbols.enable-external-lookup false
output: 

runCmd: settings set target.auto-apply-fixits false
output: 

runCmd: settings set plugin.process.gdb-remote.packet-timeout 60
output: 

runCmd: settings set symbols.clang-modules-cache-path "/Users/buildslave/jenkins/workspace/lldb-cmake-matrix@2/lldb-build/lldb-test-build.noindex/module-cache-lldb/lldb-api"
output: 

runCmd: settings set use-color false
output: 

runCmd: setting set target.prefer-dynamic-value no-dynamic-values
output: 

runCmd: file /Users/buildslave/jenkins/workspace/lldb-cmake-matrix@2/lldb-build/lldb-test-build.noindex/lang/objc/hidden-ivars/TestHiddenIvars.test_frame_variable_stripped_dsym/stripped/a.out
output: Current executable set to '/Users/buildslave/jenkins/workspace/lldb-cmake-matrix@2/lldb-build/lldb-test-build.noindex/lang/objc/hidden-ivars/TestHiddenIvars.test_frame_variable_stripped_dsym/stripped/a.out' (x86_64).


runCmd: breakpoint set -f "main.m" -l 49
output: Breakpoint 1: no locations (pending).
WARNING:  Unable to resolve breakpoint to any actual locations.


Expecting pattern: ^Breakpoint (?P<bpno>[0-9]+): (?P<num_locations>[0-9]+) locations\.$
Not matched

Expecting pattern: ^Breakpoint (?P<bpno>[0-9]+): (?P<num_locations>no) locations \(pending\)\.
Matched

FAIL: LLDB (/Users/buildslave/jenkins/workspace/lldb-cmake-matrix@2/lldb-build/bin/clang-11-x86_64) :: test_frame_variable_stripped_dsym (TestHiddenIvars.HiddenIvarsTestCase)
<bound method SBProcess.Kill of <lldb.SBProcess; proxy of <Swig Object of type 'lldb::SBProcess *' at 0x1080f3f60> >>: success

runCmd: settings clear -all
output: 

runCmd: settings set symbols.enable-external-lookup false
output: 

runCmd: settings set target.auto-apply-fixits false
output: 

runCmd: settings set plugin.process.gdb-remote.packet-timeout 60
output: 

runCmd: settings set symbols.clang-modules-cache-path "/Users/buildslave/jenkins/workspace/lldb-cmake-matrix@2/lldb-build/lldb-test-build.noindex/module-cache-lldb/lldb-api"
output: 

runCmd: settings set use-color false
output: 

runCmd: setting set target.prefer-dynamic-value no-dynamic-values
output: 

UNSUPPORTED: LLDB (/Users/buildslave/jenkins/workspace/lldb-cmake-matrix@2/lldb-build/bin/clang-11-x86_64) :: test_frame_variable_stripped_dwarf (TestHiddenIvars.HiddenIvarsTestCase) (skipping due to the following parameter(s): debug info format [This test requires a stripped binary and a dSYM]) 
UNSUPPORTED: LLDB (/Users/buildslave/jenkins/workspace/lldb-cmake-matrix@2/lldb-build/bin/clang-11-x86_64) :: test_frame_variable_stripped_dwo (TestHiddenIvars.HiddenIvarsTestCase) (test case does not fall in any category of interest for this run) 
UNSUPPORTED: LLDB (/Users/buildslave/jenkins/workspace/lldb-cmake-matrix@2/lldb-build/bin/clang-11-x86_64) :: test_frame_variable_stripped_gmodules (TestHiddenIvars.HiddenIvarsTestCase) (test case does not fall in any category of interest for this run) 
Restore dir to: /Users/buildslave/jenkins/workspace/lldb-cmake-matrix@2/lldb-build/tools/lldb/test
======================================================================
FAIL: test_expr_dsym (TestHiddenIvars.HiddenIvarsTestCase)
----------------------------------------------------------------------
Traceback (most recent call last):
  File "/Users/buildslave/jenkins/workspace/lldb-cmake-matrix@2/llvm-project/lldb/packages/Python/lldbsuite/test/lldbtest.py", line 1751, in test_method
    return attrvalue(self)
  File "/Users/buildslave/jenkins/workspace/lldb-cmake-matrix@2/llvm-project/lldb/test/API/lang/objc/hidden-ivars/TestHiddenIvars.py", line 46, in test_expr
    self.expr(False)
  File "/Users/buildslave/jenkins/workspace/lldb-cmake-matrix@2/llvm-project/lldb/test/API/lang/objc/hidden-ivars/TestHiddenIvars.py", line 122, in expr
    self.common_setup(strip)
  File "/Users/buildslave/jenkins/workspace/lldb-cmake-matrix@2/llvm-project/lldb/test/API/lang/objc/hidden-ivars/TestHiddenIvars.py", line 108, in common_setup
    self, "main.m", self.line, num_expected_locations=1, loc_exact=True)
  File "/Users/buildslave/jenkins/workspace/lldb-cmake-matrix@2/llvm-project/lldb/packages/Python/lldbsuite/test/lldbutil.py", line 384, in run_break_set_by_file_and_line
    module_name=module_name)
  File "/Users/buildslave/jenkins/workspace/lldb-cmake-matrix@2/llvm-project/lldb/packages/Python/lldbsuite/test/lldbutil.py", line 585, in check_breakpoint_result
    out_num_locations))
AssertionError: False is not True : Expecting 1 locations, got 0.
Config=x86_64-/Users/buildslave/jenkins/workspace/lldb-cmake-matrix@2/lldb-build/bin/clang-11
======================================================================
FAIL: test_expr_dwarf (TestHiddenIvars.HiddenIvarsTestCase)
----------------------------------------------------------------------
Traceback (most recent call last):
  File "/Users/buildslave/jenkins/workspace/lldb-cmake-matrix@2/llvm-project/lldb/packages/Python/lldbsuite/test/lldbtest.py", line 1751, in test_method
    return attrvalue(self)
  File "/Users/buildslave/jenkins/workspace/lldb-cmake-matrix@2/llvm-project/lldb/test/API/lang/objc/hidden-ivars/TestHiddenIvars.py", line 46, in test_expr
    self.expr(False)
  File "/Users/buildslave/jenkins/workspace/lldb-cmake-matrix@2/llvm-project/lldb/test/API/lang/objc/hidden-ivars/TestHiddenIvars.py", line 122, in expr
    self.common_setup(strip)
  File "/Users/buildslave/jenkins/workspace/lldb-cmake-matrix@2/llvm-project/lldb/test/API/lang/objc/hidden-ivars/TestHiddenIvars.py", line 108, in common_setup
    self, "main.m", self.line, num_expected_locations=1, loc_exact=True)
  File "/Users/buildslave/jenkins/workspace/lldb-cmake-matrix@2/llvm-project/lldb/packages/Python/lldbsuite/test/lldbutil.py", line 384, in run_break_set_by_file_and_line
    module_name=module_name)
  File "/Users/buildslave/jenkins/workspace/lldb-cmake-matrix@2/llvm-project/lldb/packages/Python/lldbsuite/test/lldbutil.py", line 585, in check_breakpoint_result
    out_num_locations))
AssertionError: False is not True : Expecting 1 locations, got 0.
Config=x86_64-/Users/buildslave/jenkins/workspace/lldb-cmake-matrix@2/lldb-build/bin/clang-11
======================================================================
FAIL: test_expr_stripped_dsym (TestHiddenIvars.HiddenIvarsTestCase)
----------------------------------------------------------------------
Traceback (most recent call last):
  File "/Users/buildslave/jenkins/workspace/lldb-cmake-matrix@2/llvm-project/lldb/packages/Python/lldbsuite/test/lldbtest.py", line 1751, in test_method
    return attrvalue(self)
  File "/Users/buildslave/jenkins/workspace/lldb-cmake-matrix@2/llvm-project/lldb/packages/Python/lldbsuite/test/decorators.py", line 140, in wrapper
    func(*args, **kwargs)
  File "/Users/buildslave/jenkins/workspace/lldb-cmake-matrix@2/llvm-project/lldb/test/API/lang/objc/hidden-ivars/TestHiddenIvars.py", line 38, in test_expr_stripped
    self.expr(True)
  File "/Users/buildslave/jenkins/workspace/lldb-cmake-matrix@2/llvm-project/lldb/test/API/lang/objc/hidden-ivars/TestHiddenIvars.py", line 122, in expr
    self.common_setup(strip)
  File "/Users/buildslave/jenkins/workspace/lldb-cmake-matrix@2/llvm-project/lldb/test/API/lang/objc/hidden-ivars/TestHiddenIvars.py", line 108, in common_setup
    self, "main.m", self.line, num_expected_locations=1, loc_exact=True)
  File "/Users/buildslave/jenkins/workspace/lldb-cmake-matrix@2/llvm-project/lldb/packages/Python/lldbsuite/test/lldbutil.py", line 384, in run_break_set_by_file_and_line
    module_name=module_name)
  File "/Users/buildslave/jenkins/workspace/lldb-cmake-matrix@2/llvm-project/lldb/packages/Python/lldbsuite/test/lldbutil.py", line 585, in check_breakpoint_result
    out_num_locations))
AssertionError: False is not True : Expecting 1 locations, got 0.
Config=x86_64-/Users/buildslave/jenkins/workspace/lldb-cmake-matrix@2/lldb-build/bin/clang-11
======================================================================
FAIL: test_frame_variable_dsym (TestHiddenIvars.HiddenIvarsTestCase)
----------------------------------------------------------------------
Traceback (most recent call last):
  File "/Users/buildslave/jenkins/workspace/lldb-cmake-matrix@2/llvm-project/lldb/packages/Python/lldbsuite/test/lldbtest.py", line 1751, in test_method
    return attrvalue(self)
  File "/Users/buildslave/jenkins/workspace/lldb-cmake-matrix@2/llvm-project/lldb/test/API/lang/objc/hidden-ivars/TestHiddenIvars.py", line 65, in test_frame_variable
    self.frame_var(False)
  File "/Users/buildslave/jenkins/workspace/lldb-cmake-matrix@2/llvm-project/lldb/test/API/lang/objc/hidden-ivars/TestHiddenIvars.py", line 175, in frame_var
    self.common_setup(strip)
  File "/Users/buildslave/jenkins/workspace/lldb-cmake-matrix@2/llvm-project/lldb/test/API/lang/objc/hidden-ivars/TestHiddenIvars.py", line 108, in common_setup
    self, "main.m", self.line, num_expected_locations=1, loc_exact=True)
  File "/Users/buildslave/jenkins/workspace/lldb-cmake-matrix@2/llvm-project/lldb/packages/Python/lldbsuite/test/lldbutil.py", line 384, in run_break_set_by_file_and_line
    module_name=module_name)
  File "/Users/buildslave/jenkins/workspace/lldb-cmake-matrix@2/llvm-project/lldb/packages/Python/lldbsuite/test/lldbutil.py", line 585, in check_breakpoint_result
    out_num_locations))
AssertionError: False is not True : Expecting 1 locations, got 0.
Config=x86_64-/Users/buildslave/jenkins/workspace/lldb-cmake-matrix@2/lldb-build/bin/clang-11
======================================================================
FAIL: test_frame_variable_dwarf (TestHiddenIvars.HiddenIvarsTestCase)
----------------------------------------------------------------------
Traceback (most recent call last):
  File "/Users/buildslave/jenkins/workspace/lldb-cmake-matrix@2/llvm-project/lldb/packages/Python/lldbsuite/test/lldbtest.py", line 1751, in test_method
    return attrvalue(self)
  File "/Users/buildslave/jenkins/workspace/lldb-cmake-matrix@2/llvm-project/lldb/test/API/lang/objc/hidden-ivars/TestHiddenIvars.py", line 65, in test_frame_variable
    self.frame_var(False)
  File "/Users/buildslave/jenkins/workspace/lldb-cmake-matrix@2/llvm-project/lldb/test/API/lang/objc/hidden-ivars/TestHiddenIvars.py", line 175, in frame_var
    self.common_setup(strip)
  File "/Users/buildslave/jenkins/workspace/lldb-cmake-matrix@2/llvm-project/lldb/test/API/lang/objc/hidden-ivars/TestHiddenIvars.py", line 108, in common_setup
    self, "main.m", self.line, num_expected_locations=1, loc_exact=True)
  File "/Users/buildslave/jenkins/workspace/lldb-cmake-matrix@2/llvm-project/lldb/packages/Python/lldbsuite/test/lldbutil.py", line 384, in run_break_set_by_file_and_line
    module_name=module_name)
  File "/Users/buildslave/jenkins/workspace/lldb-cmake-matrix@2/llvm-project/lldb/packages/Python/lldbsuite/test/lldbutil.py", line 585, in check_breakpoint_result
    out_num_locations))
AssertionError: False is not True : Expecting 1 locations, got 0.
Config=x86_64-/Users/buildslave/jenkins/workspace/lldb-cmake-matrix@2/lldb-build/bin/clang-11
======================================================================
FAIL: test_frame_variable_stripped_dsym (TestHiddenIvars.HiddenIvarsTestCase)
----------------------------------------------------------------------
Traceback (most recent call last):
  File "/Users/buildslave/jenkins/workspace/lldb-cmake-matrix@2/llvm-project/lldb/packages/Python/lldbsuite/test/lldbtest.py", line 1751, in test_method
    return attrvalue(self)
  File "/Users/buildslave/jenkins/workspace/lldb-cmake-matrix@2/llvm-project/lldb/packages/Python/lldbsuite/test/decorators.py", line 140, in wrapper
    func(*args, **kwargs)
  File "/Users/buildslave/jenkins/workspace/lldb-cmake-matrix@2/llvm-project/lldb/test/API/lang/objc/hidden-ivars/TestHiddenIvars.py", line 57, in test_frame_variable_stripped
    self.frame_var(True)
  File "/Users/buildslave/jenkins/workspace/lldb-cmake-matrix@2/llvm-project/lldb/test/API/lang/objc/hidden-ivars/TestHiddenIvars.py", line 175, in frame_var
    self.common_setup(strip)
  File "/Users/buildslave/jenkins/workspace/lldb-cmake-matrix@2/llvm-project/lldb/test/API/lang/objc/hidden-ivars/TestHiddenIvars.py", line 108, in common_setup
    self, "main.m", self.line, num_expected_locations=1, loc_exact=True)
  File "/Users/buildslave/jenkins/workspace/lldb-cmake-matrix@2/llvm-project/lldb/packages/Python/lldbsuite/test/lldbutil.py", line 384, in run_break_set_by_file_and_line
    module_name=module_name)
  File "/Users/buildslave/jenkins/workspace/lldb-cmake-matrix@2/llvm-project/lldb/packages/Python/lldbsuite/test/lldbutil.py", line 585, in check_breakpoint_result
    out_num_locations))
AssertionError: False is not True : Expecting 1 locations, got 0.
Config=x86_64-/Users/buildslave/jenkins/workspace/lldb-cmake-matrix@2/lldb-build/bin/clang-11
----------------------------------------------------------------------
Ran 20 tests in 50.833s

RESULT: FAILED (0 passes, 6 failures, 0 errors, 12 skipped, 2 expected failures, 0 unexpected successes)

--

********************
TIMEOUT: lldb-api :: lang/objc/foundation/TestObjCMethods.py (1990 of 1992)
******************** TEST 'lldb-api :: lang/objc/foundation/TestObjCMethods.py' FAILED ********************
Script:
--
/usr/local/bin/python /Users/buildslave/jenkins/workspace/lldb-cmake-matrix@2/llvm-project/lldb/test/API/dotest.py --arch x86_64 -s /Users/buildslave/jenkins/workspace/lldb-cmake-matrix@2/lldb-build/lldb-test-traces -S nm -u CXXFLAGS -u CFLAGS --codesign-identity lldb_codesign --server /Users/buildslave/jenkins/workspace/lldb-cmake-matrix@2/lldb-build/./bin/debugserver --arch x86_64 --build-dir /Users/buildslave/jenkins/workspace/lldb-cmake-matrix@2/lldb-build/lldb-test-build.noindex -s=/Users/buildslave/jenkins/workspace/lldb-cmake-matrix@2/test/logs -t --env TERM=vt100 --skip-category gmodules --skip-category watchpoint --arch=x86_64 --dwarf-version=5 --env LLVM_LIBS_DIR=/Users/buildslave/jenkins/workspace/lldb-cmake-matrix@2/lldb-build/./lib --build-dir /Users/buildslave/jenkins/workspace/lldb-cmake-matrix@2/lldb-build/lldb-test-build.noindex --lldb-module-cache-dir /Users/buildslave/jenkins/workspace/lldb-cmake-matrix@2/lldb-build/lldb-test-build.noindex/module-cache-lldb/lldb-api --clang-module-cache-dir /Users/buildslave/jenkins/workspace/lldb-cmake-matrix@2/lldb-build/lldb-test-build.noindex/module-cache-clang/lldb-api --executable /Users/buildslave/jenkins/workspace/lldb-cmake-matrix@2/lldb-build/./bin/lldb --compiler /Users/buildslave/jenkins/workspace/lldb-cmake-matrix@2/lldb-build/./bin/clang --dsymutil /Users/buildslave/jenkins/workspace/lldb-cmake-matrix@2/lldb-build/./bin/dsymutil --filecheck /Users/buildslave/jenkins/workspace/lldb-cmake-matrix@2/lldb-build/./bin/FileCheck --lldb-libs-dir /Users/buildslave/jenkins/workspace/lldb-cmake-matrix@2/lldb-build/./lib /Users/buildslave/jenkins/workspace/lldb-cmake-matrix@2/llvm-project/lldb/test/API/lang/objc/foundation -p TestObjCMethods.py
--
Exit Code: -9
Timeout: Reached timeout of 600 seconds

Command Output (stdout):
--
lldb version 11.0.99
  clang revision 340d1119eddaa30446853832c3ad1e95c6ff96dc
  llvm revision 340d1119eddaa30446853832c3ad1e95c6ff96dc

--
Command Output (stderr):
--
warning: (x86_64) /Users/buildslave/jenkins/workspace/lldb-cmake-matrix@2/lldb-build/lldb-test-build.noindex/lang/objc/foundation/TestObjCMethods.test_break_dsym/a.out empty dSYM file detected, dSYM was created with an executable with no debug info.

Session logs for test failures/errors/unexpected successes will go into directory '/Users/buildslave/jenkins/workspace/lldb-cmake-matrix@2/test/logs'
Command invoked: /Users/buildslave/jenkins/workspace/lldb-cmake-matrix@2/llvm-project/lldb/test/API/dotest.py --arch x86_64 -s /Users/buildslave/jenkins/workspace/lldb-cmake-matrix@2/lldb-build/lldb-test-traces -S nm -u CXXFLAGS -u CFLAGS --codesign-identity lldb_codesign --server /Users/buildslave/jenkins/workspace/lldb-cmake-matrix@2/lldb-build/./bin/debugserver --arch x86_64 --build-dir /Users/buildslave/jenkins/workspace/lldb-cmake-matrix@2/lldb-build/lldb-test-build.noindex -s=/Users/buildslave/jenkins/workspace/lldb-cmake-matrix@2/test/logs -t --env TERM=vt100 --skip-category gmodules --skip-category watchpoint --arch=x86_64 --dwarf-version=5 --env LLVM_LIBS_DIR=/Users/buildslave/jenkins/workspace/lldb-cmake-matrix@2/lldb-build/./lib --build-dir /Users/buildslave/jenkins/workspace/lldb-cmake-matrix@2/lldb-build/lldb-test-build.noindex --lldb-module-cache-dir /Users/buildslave/jenkins/workspace/lldb-cmake-matrix@2/lldb-build/lldb-test-build.noindex/module-cache-lldb/lldb-api --clang-module-cache-dir /Users/buildslave/jenkins/workspace/lldb-cmake-matrix@2/lldb-build/lldb-test-build.noindex/module-cache-clang/lldb-api --executable /Users/buildslave/jenkins/workspace/lldb-cmake-matrix@2/lldb-build/./bin/lldb --compiler /Users/buildslave/jenkins/workspace/lldb-cmake-matrix@2/lldb-build/./bin/clang --dsymutil /Users/buildslave/jenkins/workspace/lldb-cmake-matrix@2/lldb-build/./bin/dsymutil --filecheck /Users/buildslave/jenkins/workspace/lldb-cmake-matrix@2/lldb-build/./bin/FileCheck --lldb-libs-dir /Users/buildslave/jenkins/workspace/lldb-cmake-matrix@2/lldb-build/./lib /Users/buildslave/jenkins/workspace/lldb-cmake-matrix@2/llvm-project/lldb/test/API/lang/objc/foundation -p TestObjCMethods.py
Change dir to: /Users/buildslave/jenkins/workspace/lldb-cmake-matrix@2/llvm-project/lldb/test/API/lang/objc/foundation
runCmd: settings clear -all
output: 

runCmd: settings set symbols.enable-external-lookup false
output: 

runCmd: settings set target.auto-apply-fixits false
output: 

runCmd: settings set plugin.process.gdb-remote.packet-timeout 60
output: 

runCmd: settings set symbols.clang-modules-cache-path "/Users/buildslave/jenkins/workspace/lldb-cmake-matrix@2/lldb-build/lldb-test-build.noindex/module-cache-lldb/lldb-api"
output: 

runCmd: settings set use-color false
output: 

runCmd: setting set target.prefer-dynamic-value no-dynamic-values
output: 

runCmd: file /Users/buildslave/jenkins/workspace/lldb-cmake-matrix@2/lldb-build/lldb-test-build.noindex/lang/objc/foundation/TestObjCMethods.test_break_dsym/a.out
output: Current executable set to '/Users/buildslave/jenkins/workspace/lldb-cmake-matrix@2/lldb-build/lldb-test-build.noindex/lang/objc/foundation/TestObjCMethods.test_break_dsym/a.out' (x86_64).


runCmd: _regexp-break +[NSString stringWithFormat:]
output: Breakpoint 1: where = Foundation`+[NSString stringWithFormat:], address = 0x0000000000004708


Expecting pattern: ^Breakpoint (?P<bpno>[0-9]+): (?P<num_locations>[0-9]+) locations\.$
Not matched

Expecting pattern: ^Breakpoint (?P<bpno>[0-9]+): (?P<num_locations>no) locations \(pending\)\.
Not matched

Expecting pattern: ^Breakpoint (?P<bpno>[0-9]+): where = (?P<module>.*)`(?P<symbol>[+\-]{0,1}[^+]+)( \+ (?P<offset>[0-9]+)){0,1}( \[inlined\] (?P<inline_symbol>.*)){0,1} at (?P<file>[^:]+):(?P<line_no>[0-9]+)(?P<column>(:[0-9]+)?), address = (?P<address>0x[0-9a-fA-F]+)$
Not matched

Expecting pattern: ^Breakpoint (?P<bpno>[0-9]+): where = (?P<module>.*)`(?P<symbol>.*)( \+ (?P<offset>[0-9]+)){0,1}, address = (?P<address>0x[0-9a-fA-F]+)$
Matched

runCmd: breakpoint set -n "-[MyString initWithNSString:]"
output: Breakpoint 2: where = a.out`-[MyString initWithNSString:], address = 0x00000001000014a0


Expecting pattern: ^Breakpoint (?P<bpno>[0-9]+): (?P<num_locations>[0-9]+) locations\.$
Not matched

Expecting pattern: ^Breakpoint (?P<bpno>[0-9]+): (?P<num_locations>no) locations \(pending\)\.
Not matched

Expecting pattern: ^Breakpoint (?P<bpno>[0-9]+): where = (?P<module>.*)`(?P<symbol>[+\-]{0,1}[^+]+)( \+ (?P<offset>[0-9]+)){0,1}( \[inlined\] (?P<inline_symbol>.*)){0,1} at (?P<file>[^:]+):(?P<line_no>[0-9]+)(?P<column>(:[0-9]+)?), address = (?P<address>0x[0-9a-fA-F]+)$
Not matched

Expecting pattern: ^Breakpoint (?P<bpno>[0-9]+): where = (?P<module>.*)`(?P<symbol>.*)( \+ (?P<offset>[0-9]+)){0,1}, address = (?P<address>0x[0-9a-fA-F]+)$
Matched

runCmd: breakpoint set -S "description" --shlib "a.out"
output: Breakpoint 3: where = a.out`-[MyString description], address = 0x00000001000015d0


Expecting pattern: ^Breakpoint (?P<bpno>[0-9]+): (?P<num_locations>[0-9]+) locations\.$
Not matched

Expecting pattern: ^Breakpoint (?P<bpno>[0-9]+): (?P<num_locations>no) locations \(pending\)\.
Not matched

Expecting pattern: ^Breakpoint (?P<bpno>[0-9]+): where = (?P<module>.*)`(?P<symbol>[+\-]{0,1}[^+]+)( \+ (?P<offset>[0-9]+)){0,1}( \[inlined\] (?P<inline_symbol>.*)){0,1} at (?P<file>[^:]+):(?P<line_no>[0-9]+)(?P<column>(:[0-9]+)?), address = (?P<address>0x[0-9a-fA-F]+)$
Not matched

Expecting pattern: ^Breakpoint (?P<bpno>[0-9]+): where = (?P<module>.*)`(?P<symbol>.*)( \+ (?P<offset>[0-9]+)){0,1}, address = (?P<address>0x[0-9a-fA-F]+)$
Matched

runCmd: _regexp-break -[NSAutoreleasePool release]
output: Breakpoint 4: where = Foundation`-[NSAutoreleasePool release], address = 0x0000000000003cee


Expecting pattern: ^Breakpoint (?P<bpno>[0-9]+): (?P<num_locations>[0-9]+) locations\.$
Not matched

Expecting pattern: ^Breakpoint (?P<bpno>[0-9]+): (?P<num_locations>no) locations \(pending\)\.
Not matched

Expecting pattern: ^Breakpoint (?P<bpno>[0-9]+): where = (?P<module>.*)`(?P<symbol>[+\-]{0,1}[^+]+)( \+ (?P<offset>[0-9]+)){0,1}( \[inlined\] (?P<inline_symbol>.*)){0,1} at (?P<file>[^:]+):(?P<line_no>[0-9]+)(?P<column>(:[0-9]+)?), address = (?P<address>0x[0-9a-fA-F]+)$
Not matched

Expecting pattern: ^Breakpoint (?P<bpno>[0-9]+): where = (?P<module>.*)`(?P<symbol>.*)( \+ (?P<offset>[0-9]+)){0,1}, address = (?P<address>0x[0-9a-fA-F]+)$
Matched

runCmd: run
output: Process 34879 stopped
* thread #1, queue = 'com.apple.main-thread', stop reason = breakpoint 1.1
    frame #0: 0x00007fff4c9e6708 Foundation`+[NSString stringWithFormat:]
Foundation`+[NSString stringWithFormat:]:
->  0x7fff4c9e6708 <+0>: pushq  %rbp
    0x7fff4c9e6709 <+1>: movq   %rsp, %rbp
    0x7fff4c9e670c <+4>: pushq  %r15
    0x7fff4c9e670e <+6>: pushq  %r14

Process 34879 launched: '/Users/buildslave/jenkins/workspace/lldb-cmake-matrix@2/lldb-build/lldb-test-build.noindex/lang/objc/foundation/TestObjCMethods.test_break_dsym/a.out' (x86_64)


runCmd: thread backtrace
output: * thread #1, queue = 'com.apple.main-thread', stop reason = breakpoint 1.1
  * frame #0: 0x00007fff4c9e6708 Foundation`+[NSString stringWithFormat:]
    frame #1: 0x000000010000179b a.out`Test_NSString + 59
    frame #2: 0x0000000100001b45 a.out`main + 85
    frame #3: 0x00007fff777b3085 libdyld.dylib`start + 1


Expecting sub string: Foundation`+[NSString stringWithFormat:]
Matched

runCmd: process continue
output: Process 34879 resuming
Process 34879 stopped
* thread #1, queue = 'com.apple.main-thread', stop reason = breakpoint 1.1
    frame #0: 0x00007fff4c9e6708 Foundation`+[NSString stringWithFormat:]
Foundation`+[NSString stringWithFormat:]:
->  0x7fff4c9e6708 <+0>: pushq  %rbp
    0x7fff4c9e6709 <+1>: movq   %rsp, %rbp
    0x7fff4c9e670c <+4>: pushq  %r15
    0x7fff4c9e670e <+6>: pushq  %r14



runCmd: thread backtrace
output: * thread #1, queue = 'com.apple.main-thread', stop reason = breakpoint 1.1
  * frame #0: 0x00007fff4c9e6708 Foundation`+[NSString stringWithFormat:]
    frame #1: 0x00000001000018c9 a.out`Test_MyString + 73
    frame #2: 0x0000000100001b54 a.out`main + 100
    frame #3: 0x00007fff777b3085 libdyld.dylib`start + 1


Expecting sub string: Foundation`+[NSString stringWithFormat:]
Matched

runCmd: process continue
output: Process 34879 resuming
Process 34879 stopped
* thread #1, queue = 'com.apple.main-thread', stop reason = breakpoint 2.1
    frame #0: 0x00000001000014a0 a.out`-[MyString initWithNSString:]
a.out`-[MyString initWithNSString:]:
->  0x1000014a0 <+0>: pushq  %rbp
    0x1000014a1 <+1>: movq   %rsp, %rbp
    0x1000014a4 <+4>: subq   $0x30, %rsp
    0x1000014a8 <+8>: movq   %rdi, -0x8(%rbp)


warning: (x86_64) /Users/buildslave/jenkins/workspace/lldb-cmake-matrix@2/lldb-build/lldb-test-build.noindex/lang/objc/foundation/TestObjCMethods.test_data_type_and_expr_dsym/a.out empty dSYM file detected, dSYM was created with an executable with no debug info.

runCmd: thread backtrace
output: * thread #1, queue = 'com.apple.main-thread', stop reason = breakpoint 2.1
  * frame #0: 0x00000001000014a0 a.out`-[MyString initWithNSString:]
    frame #1: 0x00000001000018f0 a.out`Test_MyString + 112
    frame #2: 0x0000000100001b54 a.out`main + 100
    frame #3: 0x00007fff777b3085 libdyld.dylib`start + 1


Expecting sub string: a.out`-[MyString initWithNSString:]
Matched

runCmd: process continue
output: Process 34879 resuming
Process 34879 stopped
* thread #1, queue = 'com.apple.main-thread', stop reason = breakpoint 3.1
    frame #0: 0x00000001000015d0 a.out`-[MyString description]
a.out`-[MyString description]:
->  0x1000015d0 <+0>: pushq  %rbp
    0x1000015d1 <+1>: movq   %rsp, %rbp
    0x1000015d4 <+4>: subq   $0x20, %rsp
    0x1000015d8 <+8>: movq   %rdi, -0x8(%rbp)



runCmd: thread backtrace
output: * thread #1, queue = 'com.apple.main-thread', stop reason = breakpoint 3.1
  * frame #0: 0x00000001000015d0 a.out`-[MyString description]
    frame #1: 0x0000000100001908 a.out`Test_MyString + 136
    frame #2: 0x0000000100001b54 a.out`main + 100
    frame #3: 0x00007fff777b3085 libdyld.dylib`start + 1


Expecting sub string: a.out`-[MyString description]
Matched

runCmd: process continue
output: Process 34879 resuming
Process 34879 stopped
* thread #1, queue = 'com.apple.main-thread', stop reason = breakpoint 3.1
    frame #0: 0x00000001000015d0 a.out`-[MyString description]
a.out`-[MyString description]:
->  0x1000015d0 <+0>: pushq  %rbp
    0x1000015d1 <+1>: movq   %rsp, %rbp
    0x1000015d4 <+4>: subq   $0x20, %rsp
    0x1000015d8 <+8>: movq   %rdi, -0x8(%rbp)



runCmd: thread backtrace
output: * thread #1, queue = 'com.apple.main-thread', stop reason = breakpoint 3.1
  * frame #0: 0x00000001000015d0 a.out`-[MyString description]
    frame #1: 0x0000000100001949 a.out`Test_MyString + 201
    frame #2: 0x0000000100001b54 a.out`main + 100
    frame #3: 0x00007fff777b3085 libdyld.dylib`start + 1


Expecting sub string: a.out`-[MyString description]
Matched

runCmd: process continue
output: Process 34879 resuming
Process 34879 stopped
* thread #1, queue = 'com.apple.main-thread', stop reason = breakpoint 4.1
    frame #0: 0x00007fff4c9e5cee Foundation`-[NSAutoreleasePool release]
Foundation`-[NSAutoreleasePool release]:
->  0x7fff4c9e5cee <+0>: pushq  %rbp
    0x7fff4c9e5cef <+1>: movq   %rsp, %rbp
    0x7fff4c9e5cf2 <+4>: pushq  %r15
    0x7fff4c9e5cf4 <+6>: pushq  %r14



runCmd: thread backtrace
output: * thread #1, queue = 'com.apple.main-thread', stop reason = breakpoint 4.1
  * frame #0: 0x00007fff4c9e5cee Foundation`-[NSAutoreleasePool release]
    frame #1: 0x0000000100001ba3 a.out`main + 179
    frame #2: 0x00007fff777b3085 libdyld.dylib`start + 1


Expecting sub string: Foundation`-[NSAutoreleasePool release]
Matched

<bound method SBProcess.Kill of <lldb.SBProcess; proxy of <Swig Object of type 'lldb::SBProcess *' at 0x1147c5540> >>: success

PASS: LLDB (/Users/buildslave/jenkins/workspace/lldb-cmake-matrix@2/lldb-build/bin/clang-11-x86_64) :: test_break_dsym (TestObjCMethods.FoundationTestCase)
runCmd: settings clear -all
output: 

runCmd: settings set symbols.enable-external-lookup false
output: 

runCmd: settings set target.auto-apply-fixits false
output: 

runCmd: settings set plugin.process.gdb-remote.packet-timeout 60
output: 

runCmd: settings set symbols.clang-modules-cache-path "/Users/buildslave/jenkins/workspace/lldb-cmake-matrix@2/lldb-build/lldb-test-build.noindex/module-cache-lldb/lldb-api"
output: 

runCmd: settings set use-color false
output: 

runCmd: setting set target.prefer-dynamic-value no-dynamic-values
output: 

runCmd: file /Users/buildslave/jenkins/workspace/lldb-cmake-matrix@2/lldb-build/lldb-test-build.noindex/lang/objc/foundation/TestObjCMethods.test_break_dwarf/a.out
output: Current executable set to '/Users/buildslave/jenkins/workspace/lldb-cmake-matrix@2/lldb-build/lldb-test-build.noindex/lang/objc/foundation/TestObjCMethods.test_break_dwarf/a.out' (x86_64).


runCmd: _regexp-break +[NSString stringWithFormat:]
output: Breakpoint 1: where = Foundation`+[NSString stringWithFormat:], address = 0x0000000000004708


Expecting pattern: ^Breakpoint (?P<bpno>[0-9]+): (?P<num_locations>[0-9]+) locations\.$
Not matched

Expecting pattern: ^Breakpoint (?P<bpno>[0-9]+): (?P<num_locations>no) locations \(pending\)\.
Not matched

Expecting pattern: ^Breakpoint (?P<bpno>[0-9]+): where = (?P<module>.*)`(?P<symbol>[+\-]{0,1}[^+]+)( \+ (?P<offset>[0-9]+)){0,1}( \[inlined\] (?P<inline_symbol>.*)){0,1} at (?P<file>[^:]+):(?P<line_no>[0-9]+)(?P<column>(:[0-9]+)?), address = (?P<address>0x[0-9a-fA-F]+)$
Not matched

Expecting pattern: ^Breakpoint (?P<bpno>[0-9]+): where = (?P<module>.*)`(?P<symbol>.*)( \+ (?P<offset>[0-9]+)){0,1}, address = (?P<address>0x[0-9a-fA-F]+)$
Matched

runCmd: breakpoint set -n "-[MyString initWithNSString:]"
output: Breakpoint 2: where = a.out`-[MyString initWithNSString:], address = 0x00000001000014a0


Expecting pattern: ^Breakpoint (?P<bpno>[0-9]+): (?P<num_locations>[0-9]+) locations\.$
Not matched

Expecting pattern: ^Breakpoint (?P<bpno>[0-9]+): (?P<num_locations>no) locations \(pending\)\.
Not matched

Expecting pattern: ^Breakpoint (?P<bpno>[0-9]+): where = (?P<module>.*)`(?P<symbol>[+\-]{0,1}[^+]+)( \+ (?P<offset>[0-9]+)){0,1}( \[inlined\] (?P<inline_symbol>.*)){0,1} at (?P<file>[^:]+):(?P<line_no>[0-9]+)(?P<column>(:[0-9]+)?), address = (?P<address>0x[0-9a-fA-F]+)$
Not matched

Expecting pattern: ^Breakpoint (?P<bpno>[0-9]+): where = (?P<module>.*)`(?P<symbol>.*)( \+ (?P<offset>[0-9]+)){0,1}, address = (?P<address>0x[0-9a-fA-F]+)$
Matched

runCmd: breakpoint set -S "description" --shlib "a.out"
output: Breakpoint 3: where = a.out`-[MyString description], address = 0x00000001000015d0


Expecting pattern: ^Breakpoint (?P<bpno>[0-9]+): (?P<num_locations>[0-9]+) locations\.$
Not matched

Expecting pattern: ^Breakpoint (?P<bpno>[0-9]+): (?P<num_locations>no) locations \(pending\)\.
Not matched

Expecting pattern: ^Breakpoint (?P<bpno>[0-9]+): where = (?P<module>.*)`(?P<symbol>[+\-]{0,1}[^+]+)( \+ (?P<offset>[0-9]+)){0,1}( \[inlined\] (?P<inline_symbol>.*)){0,1} at (?P<file>[^:]+):(?P<line_no>[0-9]+)(?P<column>(:[0-9]+)?), address = (?P<address>0x[0-9a-fA-F]+)$
Not matched

Expecting pattern: ^Breakpoint (?P<bpno>[0-9]+): where = (?P<module>.*)`(?P<symbol>.*)( \+ (?P<offset>[0-9]+)){0,1}, address = (?P<address>0x[0-9a-fA-F]+)$
Matched

runCmd: _regexp-break -[NSAutoreleasePool release]
output: Breakpoint 4: where = Foundation`-[NSAutoreleasePool release], address = 0x0000000000003cee


Expecting pattern: ^Breakpoint (?P<bpno>[0-9]+): (?P<num_locations>[0-9]+) locations\.$
Not matched

Expecting pattern: ^Breakpoint (?P<bpno>[0-9]+): (?P<num_locations>no) locations \(pending\)\.
Not matched

Expecting pattern: ^Breakpoint (?P<bpno>[0-9]+): where = (?P<module>.*)`(?P<symbol>[+\-]{0,1}[^+]+)( \+ (?P<offset>[0-9]+)){0,1}( \[inlined\] (?P<inline_symbol>.*)){0,1} at (?P<file>[^:]+):(?P<line_no>[0-9]+)(?P<column>(:[0-9]+)?), address = (?P<address>0x[0-9a-fA-F]+)$
Not matched

Expecting pattern: ^Breakpoint (?P<bpno>[0-9]+): where = (?P<module>.*)`(?P<symbol>.*)( \+ (?P<offset>[0-9]+)){0,1}, address = (?P<address>0x[0-9a-fA-F]+)$
Matched

runCmd: run
output: Process 39570 stopped
* thread #1, queue = 'com.apple.main-thread', stop reason = breakpoint 1.1
    frame #0: 0x00007fff4c9e6708 Foundation`+[NSString stringWithFormat:]
Foundation`+[NSString stringWithFormat:]:
->  0x7fff4c9e6708 <+0>: pushq  %rbp
    0x7fff4c9e6709 <+1>: movq   %rsp, %rbp
    0x7fff4c9e670c <+4>: pushq  %r15
    0x7fff4c9e670e <+6>: pushq  %r14

Process 39570 launched: '/Users/buildslave/jenkins/workspace/lldb-cmake-matrix@2/lldb-build/lldb-test-build.noindex/lang/objc/foundation/TestObjCMethods.test_break_dwarf/a.out' (x86_64)


runCmd: thread backtrace
output: * thread #1, queue = 'com.apple.main-thread', stop reason = breakpoint 1.1
  * frame #0: 0x00007fff4c9e6708 Foundation`+[NSString stringWithFormat:]
    frame #1: 0x000000010000179b a.out`Test_NSString + 59
    frame #2: 0x0000000100001b45 a.out`main + 85
    frame #3: 0x00007fff777b3085 libdyld.dylib`start + 1


Expecting sub string: Foundation`+[NSString stringWithFormat:]
Matched
warning: (x86_64) /Users/buildslave/jenkins/workspace/lldb-cmake-matrix@2/lldb-build/lldb-test-build.noindex/lang/objc/foundation/TestObjCMethods.test_expression_lookups_objc_dsym/a.out empty dSYM file detected, dSYM was created with an executable with no debug info.

--

********************
TIMEOUT: lldb-api :: python_api/lldbutil/iter/TestRegistersIterator.py (1991 of 1992)
******************** TEST 'lldb-api :: python_api/lldbutil/iter/TestRegistersIterator.py' FAILED ********************
Script:
--
/usr/local/bin/python /Users/buildslave/jenkins/workspace/lldb-cmake-matrix@2/llvm-project/lldb/test/API/dotest.py --arch x86_64 -s /Users/buildslave/jenkins/workspace/lldb-cmake-matrix@2/lldb-build/lldb-test-traces -S nm -u CXXFLAGS -u CFLAGS --codesign-identity lldb_codesign --server /Users/buildslave/jenkins/workspace/lldb-cmake-matrix@2/lldb-build/./bin/debugserver --arch x86_64 --build-dir /Users/buildslave/jenkins/workspace/lldb-cmake-matrix@2/lldb-build/lldb-test-build.noindex -s=/Users/buildslave/jenkins/workspace/lldb-cmake-matrix@2/test/logs -t --env TERM=vt100 --skip-category gmodules --skip-category watchpoint --arch=x86_64 --dwarf-version=5 --env LLVM_LIBS_DIR=/Users/buildslave/jenkins/workspace/lldb-cmake-matrix@2/lldb-build/./lib --build-dir /Users/buildslave/jenkins/workspace/lldb-cmake-matrix@2/lldb-build/lldb-test-build.noindex --lldb-module-cache-dir /Users/buildslave/jenkins/workspace/lldb-cmake-matrix@2/lldb-build/lldb-test-build.noindex/module-cache-lldb/lldb-api --clang-module-cache-dir /Users/buildslave/jenkins/workspace/lldb-cmake-matrix@2/lldb-build/lldb-test-build.noindex/module-cache-clang/lldb-api --executable /Users/buildslave/jenkins/workspace/lldb-cmake-matrix@2/lldb-build/./bin/lldb --compiler /Users/buildslave/jenkins/workspace/lldb-cmake-matrix@2/lldb-build/./bin/clang --dsymutil /Users/buildslave/jenkins/workspace/lldb-cmake-matrix@2/lldb-build/./bin/dsymutil --filecheck /Users/buildslave/jenkins/workspace/lldb-cmake-matrix@2/lldb-build/./bin/FileCheck --lldb-libs-dir /Users/buildslave/jenkins/workspace/lldb-cmake-matrix@2/lldb-build/./lib /Users/buildslave/jenkins/workspace/lldb-cmake-matrix@2/llvm-project/lldb/test/API/python_api/lldbutil/iter -p TestRegistersIterator.py
--
Exit Code: -9
Timeout: Reached timeout of 600 seconds

Command Output (stdout):
--
lldb version 11.0.99
  clang revision 340d1119eddaa30446853832c3ad1e95c6ff96dc
  llvm revision 340d1119eddaa30446853832c3ad1e95c6ff96dc

--
Command Output (stderr):
--
warning: (x86_64) /Users/buildslave/jenkins/workspace/lldb-cmake-matrix@2/lldb-build/lldb-test-build.noindex/python_api/lldbutil/iter/TestRegistersIterator.test_iter_registers_dsym/a.out empty dSYM file detected, dSYM was created with an executable with no debug info.

--

********************
TIMEOUT: lldb-api :: python_api/lldbutil/iter/TestLLDBIterator.py (1992 of 1992)
******************** TEST 'lldb-api :: python_api/lldbutil/iter/TestLLDBIterator.py' FAILED ********************
Script:
--
/usr/local/bin/python /Users/buildslave/jenkins/workspace/lldb-cmake-matrix@2/llvm-project/lldb/test/API/dotest.py --arch x86_64 -s /Users/buildslave/jenkins/workspace/lldb-cmake-matrix@2/lldb-build/lldb-test-traces -S nm -u CXXFLAGS -u CFLAGS --codesign-identity lldb_codesign --server /Users/buildslave/jenkins/workspace/lldb-cmake-matrix@2/lldb-build/./bin/debugserver --arch x86_64 --build-dir /Users/buildslave/jenkins/workspace/lldb-cmake-matrix@2/lldb-build/lldb-test-build.noindex -s=/Users/buildslave/jenkins/workspace/lldb-cmake-matrix@2/test/logs -t --env TERM=vt100 --skip-category gmodules --skip-category watchpoint --arch=x86_64 --dwarf-version=5 --env LLVM_LIBS_DIR=/Users/buildslave/jenkins/workspace/lldb-cmake-matrix@2/lldb-build/./lib --build-dir /Users/buildslave/jenkins/workspace/lldb-cmake-matrix@2/lldb-build/lldb-test-build.noindex --lldb-module-cache-dir /Users/buildslave/jenkins/workspace/lldb-cmake-matrix@2/lldb-build/lldb-test-build.noindex/module-cache-lldb/lldb-api --clang-module-cache-dir /Users/buildslave/jenkins/workspace/lldb-cmake-matrix@2/lldb-build/lldb-test-build.noindex/module-cache-clang/lldb-api --executable /Users/buildslave/jenkins/workspace/lldb-cmake-matrix@2/lldb-build/./bin/lldb --compiler /Users/buildslave/jenkins/workspace/lldb-cmake-matrix@2/lldb-build/./bin/clang --dsymutil /Users/buildslave/jenkins/workspace/lldb-cmake-matrix@2/lldb-build/./bin/dsymutil --filecheck /Users/buildslave/jenkins/workspace/lldb-cmake-matrix@2/lldb-build/./bin/FileCheck --lldb-libs-dir /Users/buildslave/jenkins/workspace/lldb-cmake-matrix@2/lldb-build/./lib /Users/buildslave/jenkins/workspace/lldb-cmake-matrix@2/llvm-project/lldb/test/API/python_api/lldbutil/iter -p TestLLDBIterator.py
--
Exit Code: -9
Timeout: Reached timeout of 600 seconds

Command Output (stdout):
--
lldb version 11.0.99
  clang revision 340d1119eddaa30446853832c3ad1e95c6ff96dc
  llvm revision 340d1119eddaa30446853832c3ad1e95c6ff96dc

--
Command Output (stderr):
--
warning: (x86_64) /Users/buildslave/jenkins/workspace/lldb-cmake-matrix@2/lldb-build/lldb-test-build.noindex/python_api/lldbutil/iter/TestLLDBIterator.test_lldb_iter_breakpoint_dsym/a.out empty dSYM file detected, dSYM was created with an executable with no debug info.
warning: (x86_64) /Users/buildslave/jenkins/workspace/lldb-cmake-matrix@2/lldb-build/lldb-test-build.noindex/python_api/lldbutil/iter/TestLLDBIterator.test_lldb_iter_frame_dsym/a.out empty dSYM file detected, dSYM was created with an executable with no debug info.

--

********************
Slowest Tests:
--------------------------------------------------------------------------
600.02s: lldb-api :: lang/objc/foundation/TestObjCMethods.py
600.01s: lldb-api :: python_api/lldbutil/iter/TestRegistersIterator.py
600.00s: lldb-api :: python_api/lldbutil/iter/TestLLDBIterator.py
353.08s: lldb-api :: lang/objc/foundation/TestFoundationDisassembly.py
146.94s: lldb-api :: tools/lldb-server/TestLldbGdbServer.py
137.88s: lldb-api :: api/multithreaded/TestMultithreaded.py
99.25s: lldb-api :: driver/batch_mode/TestBatchMode.py
81.18s: lldb-api :: macosx/nslog/TestDarwinNSLogOutput.py
76.52s: lldb-api :: lang/objc/objc-new-syntax/TestObjCNewSyntaxLiteral.py
68.80s: lldb-api :: lang/objc/real-definition/TestRealDefinition.py
63.30s: lldb-api :: commands/expression/multiline-completion/TestMultilineCompletion.py
63.19s: lldb-api :: lang/objc/exceptions/TestObjCExceptions.py
54.37s: lldb-api :: lang/objc/objc-new-syntax/TestObjCNewSyntaxDictionary.py
54.21s: lldb-api :: lang/objc/foundation/TestObjCMethodsNSError.py
51.37s: lldb-api :: lang/objc/hidden-ivars/TestHiddenIvars.py
49.94s: lldb-api :: lang/objc/objc-new-syntax/TestObjCNewSyntaxArray.py
49.05s: lldb-api :: lang/objc/foundation/TestObjCMethodsString.py
48.51s: lldb-api :: lang/objc/forward-decl/TestForwardDecl.py
44.58s: lldb-api :: tools/lldb-server/TestGdbRemoteThreadsInStopReply.py
35.89s: lldb-api :: commands/register/register/register_command/TestRegisters.py

Tests Times:
--------------------------------------------------------------------------
[   Range   ] :: [               Percentage               ] :: [  Count  ]
--------------------------------------------------------------------------
[600s,650s) :: [                                        ] :: [   3/1992]
[550s,600s) :: [                                        ] :: [   0/1992]
[500s,550s) :: [                                        ] :: [   0/1992]
[450s,500s) :: [                                        ] :: [   0/1992]
[400s,450s) :: [                                        ] :: [   0/1992]
[350s,400s) :: [                                        ] :: [   1/1992]
[300s,350s) :: [                                        ] :: [   0/1992]
[250s,300s) :: [                                        ] :: [   0/1992]
[200s,250s) :: [                                        ] :: [   0/1992]
[150s,200s) :: [                                        ] :: [   1/1992]
[100s,150s) :: [                                        ] :: [   2/1992]
[ 50s,100s) :: [                                        ] :: [  11/1992]
[  0s, 50s) :: [*************************************** ] :: [1974/1992]
--------------------------------------------------------------------------
********************
Timed Out Tests (3):
  lldb-api :: lang/objc/foundation/TestObjCMethods.py
  lldb-api :: python_api/lldbutil/iter/TestRegistersIterator.py
  lldb-api :: python_api/lldbutil/iter/TestLLDBIterator.py

********************
Failing Tests (518):
  lldb-api :: functionalities/breakpoint/auto_continue/TestBreakpointAutoContinue.py
  lldb-api :: functionalities/breakpoint/source_regexp/TestSourceRegexBreakpoints.py
  lldb-api :: functionalities/completion/TestCompletion.py
  lldb-api :: functionalities/float-display/TestFloatDisplay.py
  lldb-api :: lang/cpp/virtual-functions/TestCppVirtualFunctions.py
  lldb-api :: commands/expression/deleting-implicit-copy-constructor/TestDeletingImplicitCopyConstructor.py
  lldb-api :: commands/expression/multiline-completion/TestMultilineCompletion.py
  lldb-api :: functionalities/breakpoint/hardware_breakpoints/hardware_breakpoint_on_multiple_threads/TestHWBreakMultiThread.py
  lldb-api :: functionalities/inline-stepping/TestInlineStepping.py
  lldb-api :: functionalities/plugins/python_os_plugin/TestPythonOSPlugin.py
  lldb-api :: lang/objc/foundation/TestRuntimeTypes.py
  lldb-api :: functionalities/data-formatter/data-formatter-smart-array/TestDataFormatterSmartArray.py
  lldb-api :: commands/expression/vector_of_enums/TestVectorOfEnums.py
  lldb-api :: functionalities/data-formatter/data-formatter-objc/TestDataFormatterObjNSException.py
  lldb-api :: commands/frame/diagnose/virtual-method-call/TestDiagnoseDereferenceVirtualMethodCall.py
  lldb-api :: commands/expression/scoped_enums/TestScopedEnumType.py
  lldb-api :: lang/cpp/chained-calls/TestCppChainedCalls.py
  lldb-api :: lang/c/function_types/TestFunctionTypes.py
  lldb-api :: functionalities/memory/read/TestMemoryRead.py
  lldb-api :: functionalities/breakpoint/breakpoint_ids/TestBreakpointIDs.py
  lldb-api :: lang/objc/objc-new-syntax/TestObjCNewSyntaxLiteral.py
  lldb-api :: commands/expression/import-std-module/list-dbg-info-content/TestDbgInfoContentListFromStdModule.py
  lldb-api :: functionalities/tail_call_frames/disambiguate_tail_call_seq/TestDisambiguateTailCallSeq.py
  lldb-api :: functionalities/data-formatter/data-formatter-objc/TestDataFormatterObjCNSError.py
  lldb-api :: commands/frame/language/TestGuessLanguage.py
  lldb-api :: commands/expression/import-std-module/stack/TestStackFromStdModule.py
  lldb-api :: functionalities/breakpoint/address_breakpoints/TestAddressBreakpoints.py
  lldb-api :: functionalities/breakpoint/consecutive_breakpoints/TestConsecutiveBreakpoints.py
  lldb-api :: python_api/value/linked_list/TestValueAPILinkedList.py
  lldb-api :: lang/c/forward/TestForwardDeclaration.py
  lldb-api :: lang/cpp/multiple-inheritance/TestCppMultipleInheritance.py
  lldb-api :: lang/c/tls_globals/TestTlsGlobals.py
  lldb-api :: functionalities/breakpoint/address_breakpoints/TestBadAddressBreakpoints.py
  lldb-api :: lang/cpp/nsimport/TestCppNsImport.py
  lldb-api :: functionalities/breakpoint/comp_dir_symlink/TestCompDirSymLink.py
  lldb-api :: macosx/find-dsym/bundle-with-dot-in-filename/TestBundleWithDotInFilename.py
  lldb-api :: functionalities/data-formatter/ostypeformatting/TestFormattersOsType.py
  lldb-api :: python_api/process/read-mem-cstring/TestReadMemCString.py
  lldb-api :: functionalities/data-formatter/data-formatter-stl/libcxx/multimap/TestDataFormatterLibccMultiMap.py
  lldb-api :: commands/process/attach-resume/TestAttachResume.py
  lldb-api :: lang/objc/objc-baseclass-sbtype/TestObjCBaseClassSBType.py
  lldb-api :: functionalities/data-formatter/data-formatter-stl/libcxx/optional/TestDataFormatterLibcxxOptional.py
  lldb-api :: commands/expression/completion/TestExprCompletion.py
  lldb-api :: functionalities/thread/num_threads/TestNumThreads.py
  lldb-api :: functionalities/tail_call_frames/unambiguous_sequence/TestUnambiguousTailCalls.py
  lldb-api :: functionalities/data-formatter/data-formatter-stl/libcxx/iterator/TestDataFormatterLibccIterator.py
  lldb-api :: functionalities/data-formatter/data-formatter-stl/libcxx/unordered/TestDataFormatterUnordered.py
  lldb-api :: functionalities/inferior-crashing/TestInferiorCrashing.py
  lldb-api :: lang/c/strings/TestCStrings.py
  lldb-api :: lang/objc/foundation/TestConstStrings.py
  lldb-api :: lang/c/modules/TestCModules.py
  lldb-api :: lang/c/offsetof/TestOffsetof.py
  lldb-api :: commands/expression/top-level/TestTopLevelExprs.py
  lldb-api :: commands/expression/context-object-objc/TestContextObjectObjc.py
  lldb-api :: functionalities/data-formatter/hexcaps/TestDataFormatterHexCaps.py
  lldb-api :: tools/lldb-vscode/breakpoint/TestVSCode_setFunctionBreakpoints.py
  lldb-api :: functionalities/rerun/TestRerun.py
  lldb-api :: python_api/function_symbol/TestDisasmAPI.py
  lldb-api :: commands/expression/import-std-module/vector-bool/TestVectorBoolFromStdModule.py
  lldb-api :: functionalities/data-formatter/data-formatter-named-summaries/TestDataFormatterNamedSummaries.py
  lldb-api :: lang/c/step-target/TestStepTarget.py
  lldb-api :: functionalities/breakpoint/scripted_bkpt/TestScriptedResolver.py
  lldb-api :: tools/lldb-vscode/breakpoint/TestVSCode_setBreakpoints.py
  lldb-api :: lang/cpp/unsigned_types/TestUnsignedTypes.py
  lldb-api :: types/TestCharTypeExpr.py
  lldb-api :: functionalities/data-formatter/data-formatter-skip-summary/TestDataFormatterSkipSummary.py
  lldb-api :: commands/expression/save_jit_objects/TestSaveJITObjects.py
  lldb-api :: commands/expression/static-initializers/TestStaticInitializers.py
  lldb-api :: functionalities/data-formatter/data-formatter-objc/TestDataFormatterObjCPlain.py
  lldb-api :: types/TestCharType.py
  lldb-api :: python_api/sbdata/TestSBData.py
  lldb-api :: functionalities/data-formatter/data-formatter-advanced/TestDataFormatterAdv.py
  lldb-api :: lang/cpp/scope/TestCppScope.py
  lldb-api :: functionalities/data-formatter/var-in-aggregate-misuse/TestVarInAggregateMisuse.py
  lldb-api :: lang/cpp/modules-import/TestCXXModulesImport.py
  lldb-api :: lang/objc/radar-9691614/TestObjCMethodReturningBOOL.py
  lldb-api :: lang/cpp/namespace/TestNamespace.py
  lldb-api :: functionalities/thread/crash_during_step/TestCrashDuringStep.py
  lldb-api :: commands/expression/radar_8638051/Test8638051.py
  lldb-api :: lang/cpp/class-template-parameter-pack/TestClassTemplateParameterPack.py
  lldb-api :: lang/c/find_struct_type/TestFindStructTypes.py
  lldb-api :: lang/cpp/lambdas/TestLambdas.py
  lldb-api :: lang/cpp/template/TestTemplateArgs.py
  lldb-api :: commands/expression/fixits/TestFixIts.py
  lldb-api :: functionalities/data-formatter/data-formatter-objc/TestDataFormatterObjCNSDate.py
  lldb-api :: lang/objc/direct-dispatch-step/TestObjCDirectDispatchStepping.py
  lldb-api :: lang/c/conflicting-symbol/TestConflictingSymbol.py
  lldb-api :: functionalities/breakpoint/breakpoint_conditions/TestBreakpointConditions.py
  lldb-api :: lang/objc/self/TestObjCSelf.py
  lldb-api :: functionalities/data-formatter/data-formatter-python-synth/TestDataFormatterPythonSynth.py
  lldb-api :: commands/expression/persistent_ptr_update/TestPersistentPtrUpdate.py
  lldb-api :: lang/objc/global_ptrs/TestGlobalObjects.py
  lldb-api :: lang/objc/objc-optimized/TestObjcOptimized.py
  lldb-api :: functionalities/data-formatter/boolreference/TestFormattersBoolRefPtr.py
  lldb-api :: lang/cpp/global_operators/TestCppGlobalOperators.py
  lldb-api :: functionalities/thread/concurrent_events/TestConcurrentBreakpointOneDelayBreakpointThreads.py
  lldb-api :: lang/cpp/symbols/TestSymbols.py
  lldb-api :: functionalities/thread/jump/TestThreadJump.py
  lldb-api :: commands/expression/radar_9673664/TestExprHelpExamples.py
  lldb-api :: commands/expression/persistent_types/TestPersistentTypes.py
  lldb-api :: functionalities/data-formatter/data-formatter-stl/libcxx/list/TestDataFormatterLibcxxList.py
  lldb-api :: functionalities/data-formatter/language_category_updates/TestDataFormatterLanguageCategoryUpdates.py
  lldb-api :: commands/expression/import-std-module/vector-dbg-info-content/TestDbgInfoContentVectorFromStdModule.py
  lldb-api :: functionalities/thread/thread_exit/TestThreadExit.py
  lldb-api :: python_api/class_members/TestSBTypeClassMembers.py
  lldb-api :: functionalities/thread/create_after_attach/TestCreateAfterAttach.py
  lldb-api :: lang/cpp/incomplete-types/TestCppIncompleteTypes.py
  lldb-api :: lang/c/stepping/TestStepAndBreakpoints.py
  lldb-api :: functionalities/archives/TestBSDArchives.py
  lldb-api :: types/TestLongTypesExpr.py
  lldb-api :: lang/objc/objc-ivar-offsets/TestObjCIvarOffsets.py
  lldb-api :: types/TestIntegerTypeExpr.py
  lldb-api :: commands/expression/no-deadlock/TestExprDoesntBlock.py
  lldb-api :: functionalities/data-formatter/user-format-vs-summary/TestUserFormatVsSummary.py
  lldb-api :: lang/objc/forward-decl/TestForwardDecl.py
  lldb-api :: lang/cpp/namespace/TestNamespaceLookup.py
  lldb-api :: functionalities/avoids-fd-leak/TestFdLeak.py
  lldb-api :: types/TestFloatTypes.py
  lldb-api :: functionalities/data-formatter/nsdictionarysynth/TestNSDictionarySynthetic.py
  lldb-api :: functionalities/data-formatter/data-formatter-stl/libcxx/list/loop/TestDataFormatterLibcxxListLoop.py
  lldb-api :: commands/frame/var-scope/TestFrameVariableScope.py
  lldb-api :: commands/expression/context-object/TestContextObject.py
  lldb-api :: functionalities/inferior-crashing/recursive-inferior/TestRecursiveInferior.py
  lldb-api :: python_api/value_var_update/TestValueVarUpdate.py
  lldb-api :: functionalities/data-formatter/data-formatter-stl/libcxx/string/TestDataFormatterLibcxxString.py
  lldb-api :: lang/cpp/inlines/TestInlines.py
  lldb-api :: functionalities/data-formatter/stringprinter/TestStringPrinter.py
  lldb-api :: commands/frame/var/TestFrameVar.py
  lldb-api :: lang/objc/objc-ivar-stripped/TestObjCIvarStripped.py
  lldb-api :: commands/expression/test/TestExprs2.py
  lldb-api :: lang/objc/rdar-10967107/TestRdar10967107.py
  lldb-api :: python_api/thread/TestThreadAPI.py
  lldb-api :: commands/expression/pr35310/TestExprsBug35310.py
  lldb-api :: commands/frame/diagnose/dereference-this/TestDiagnoseDereferenceThis.py
  lldb-api :: commands/expression/entry-bp/TestExprEntryBP.py
  lldb-api :: functionalities/data-formatter/data-formatter-stl/libcxx/initializerlist/TestInitializerList.py
  lldb-api :: lang/objc/modules-cache/TestClangModulesCache.py
  lldb-api :: lang/cpp/overloaded-functions/TestOverloadedFunctions.py
  lldb-api :: functionalities/data-formatter/pyobjsynthprovider/TestPyObjSynthProvider.py
  lldb-api :: lang/c/inlines/TestRedefinitionsInInlines.py
  lldb-api :: commands/expression/ir-interpreter-phi-nodes/TestIRInterpreterPHINodes.py
  lldb-api :: functionalities/data-formatter/data-formatter-stl/libcxx/bitset/TestDataFormatterLibcxxBitset.py
  lldb-api :: functionalities/data-formatter/data-formatter-objc/nsstring/TestDataFormatterNSString.py
  lldb-api :: functionalities/data-formatter/data-formatter-ptr-to-array/TestPtrToArrayFormatting.py
  lldb-api :: lang/c/step_over_no_deadlock/TestStepOverDoesntBlock.py
  lldb-api :: functionalities/data-formatter/data-formatter-stl/libstdcpp/unique_ptr/invalid/TestDataFormatterInvalidStdUniquePtr.py
  lldb-api :: functionalities/data-formatter/summary-string-onfail/Test-rdar-9974002.py
  lldb-api :: lang/cpp/const_this/TestConstThis.py
  lldb-api :: lang/cpp/namespace_definitions/TestNamespaceDefinitions.py
  lldb-api :: functionalities/data-formatter/data-formatter-synth/TestDataFormatterSynth.py
  lldb-api :: types/TestRecursiveTypes.py
  lldb-api :: lang/objc/objc-ivar-protocols/TestIvarProtocols.py
  lldb-api :: lang/c/shared_lib/TestSharedLib.py
  lldb-api :: functionalities/data-formatter/data-formatter-stl/libcxx/queue/TestDataFormatterLibcxxQueue.py
  lldb-api :: functionalities/data-formatter/data-formatter-stl/libcxx/unique_ptr/TestDataFormatterLibcxxUniquePtr.py
  lldb-api :: python_api/formatters/TestFormattersSBAPI.py
  lldb-api :: lang/objc/foundation/TestObjCMethodsNSArray.py
  lldb-api :: functionalities/data-formatter/data-formatter-disabling/TestDataFormatterDisabling.py
  lldb-api :: lang/objc/objc-super/TestObjCSuper.py
  lldb-api :: functionalities/data-formatter/array_typedef/TestArrayTypedef.py
  lldb-api :: lang/cpp/signed_types/TestSignedTypes.py
  lldb-api :: commands/expression/ignore-artificial-constructors/TestIgnoreArtificialConstructors.py
  lldb-api :: functionalities/thread/concurrent_events/TestConcurrentSignalDelayBreak.py
  lldb-api :: commands/expression/class_template_specialization_empty_pack/TestClassTemplateSpecializationParametersHandling.py
  lldb-api :: lang/cpp/operator-overload/TestOperatorOverload.py
  lldb-api :: lang/cpp/dynamic-value-same-basename/TestDynamicValueSameBase.py
  lldb-api :: functionalities/ptr_refs/TestPtrRefs.py
  lldb-api :: lang/c/set_values/TestSetValues.py
  lldb-api :: functionalities/breakpoint/breakpoint_command/TestBreakpointCommand.py
  lldb-api :: commands/expression/expr-in-syscall/TestExpressionInSyscall.py
  lldb-api :: functionalities/data-formatter/data-formatter-stl/libcxx/atomic/TestLibCxxAtomic.py
  lldb-api :: commands/expression/argument_passing_restrictions/TestArgumentPassingRestrictions.py
  lldb-api :: commands/process/launch/TestProcessLaunch.py
  lldb-api :: functionalities/data-formatter/parray/TestPrintArray.py
  lldb-api :: functionalities/data-formatter/vector-types/TestVectorTypesFormatting.py
  lldb-api :: python_api/function_symbol/TestSymbolAPI.py
  lldb-api :: lang/objc/objc-struct-argument/TestObjCStructArgument.py
  lldb-api :: functionalities/memory-region/TestMemoryRegion.py
  lldb-api :: python_api/exprpath_synthetic/TestExprPathSynthetic.py
  lldb-api :: functionalities/unwind/sigtramp/TestSigtrampUnwind.py
  lldb-api :: types/TestShortType.py
  lldb-api :: functionalities/data-formatter/data-formatter-synthtype/TestDataFormatterSynthType.py
  lldb-api :: lang/objc/objc-new-syntax/TestObjCNewSyntaxDictionary.py
  lldb-api :: lang/cpp/std-function-step-into-callable/TestStdFunctionStepIntoCallable.py
  lldb-api :: lang/c/unions/TestUnionMembers.py
  lldb-api :: commands/frame/select/TestFrameSelect.py
  lldb-api :: functionalities/data-formatter/nssetsynth/TestNSSetSynthetic.py
  lldb-api :: tools/lldb-vscode/stackTrace/TestVSCode_stackTrace.py
  lldb-api :: macosx/duplicate-archive-members/TestDuplicateMembers.py
  lldb-api :: functionalities/data-formatter/data-formatter-enum-format/TestDataFormatterEnumFormat.py
  lldb-api :: commands/expression/call-function/TestCallStdStringFunction.py
  lldb-api :: commands/expression/import-std-module/deque-basic/TestDequeFromStdModule.py
  lldb-api :: commands/expression/completion-in-lambda-and-unnamed-class/TestCompletionInLambdaAndUnnamedClass.py
  lldb-api :: lang/objc/modules-auto-import/TestModulesAutoImport.py
  lldb-api :: macosx/indirect_symbol/TestIndirectSymbols.py
  lldb-api :: lang/objc/objc++/TestObjCXX.py
  lldb-api :: lang/objc/objc-checker/TestObjCCheckers.py
  lldb-api :: lang/cpp/dynamic-value/TestDynamicValue.py
  lldb-api :: commands/expression/persist_objc_pointeetype/TestPersistObjCPointeeType.py
  lldb-api :: lang/objc/foundation/TestObjCMethods2.py
  lldb-api :: functionalities/conditional_break/TestConditionalBreak.py
  lldb-api :: lang/objc/ptr_refs/TestPtrRefsObjC.py
  lldb-api :: commands/command/nested_alias/TestNestedAlias.py
  lldb-api :: functionalities/thread/concurrent_events/TestConcurrentCrashWithSignal.py
  lldb-api :: functionalities/data-formatter/data-formatter-script/TestDataFormatterScript.py
  lldb-api :: functionalities/data-formatter/data-formatter-objc/cmtime/TestDataFormatterCMTime.py
  lldb-api :: python_api/type/TestTypeList.py
  lldb-api :: functionalities/data-formatter/type_summary_list_script/TestTypeSummaryListScript.py
  lldb-api :: functionalities/inferior-assert/TestInferiorAssert.py
  lldb-api :: types/TestIntegerType.py
  lldb-api :: functionalities/data-formatter/poarray/TestPrintObjectArray.py
  lldb-api :: functionalities/breakpoint/breakpoint_command/TestBreakpointCommandsFromPython.py
  lldb-api :: python_api/process/io/TestProcessIO.py
  lldb-api :: lang/cpp/offsetof/TestOffsetofCpp.py
  lldb-api :: commands/expression/persistent_variables/TestPersistentVariables.py
  lldb-api :: lang/cpp/bool/TestCPPBool.py
  lldb-api :: tools/lldb-vscode/attach/TestVSCode_attach.py
  lldb-api :: functionalities/thread/exit_during_break/TestExitDuringBreak.py
  lldb-api :: commands/process/launch-with-shellexpand/TestLaunchWithShellExpand.py
  lldb-api :: functionalities/data-formatter/data-formatter-stl/libcxx/set/TestDataFormatterLibcxxSet.py
  lldb-api :: functionalities/thread/backtrace_limit/TestBacktraceLimit.py
  lldb-api :: lang/c/unicode/TestUnicodeSymbols.py
  lldb-api :: commands/disassemble/basic/TestFrameDisassemble.py
  lldb-api :: python_api/sbvalue_const_addrof/TestSBValueConstAddrOf.py
  lldb-api :: tools/lldb-vscode/variables/TestVSCode_variables.py
  lldb-api :: commands/expression/import-std-module/deque-dbg-info-content/TestDbgInfoContentDequeFromStdModule.py
  lldb-api :: lang/objc/ivar-IMP/TestObjCiVarIMP.py
  lldb-api :: driver/batch_mode/TestBatchMode.py
  lldb-api :: commands/frame/diagnose/inheritance/TestDiagnoseInheritance.py
  lldb-api :: functionalities/data-formatter/data-formatter-stl/libcxx/tuple/TestDataFormatterLibcxxTuple.py
  lldb-api :: lang/cpp/static_methods/TestCPPStaticMethods.py
  lldb-api :: lang/cpp/llvm-style/TestLLVMStyle.py
  lldb-api :: functionalities/exec/TestExec.py
  lldb-api :: commands/expression/import-std-module/weak_ptr-dbg-info-content/TestDbgInfoContentWeakPtrFromStdModule.py
  lldb-api :: functionalities/set-data/TestSetData.py
  lldb-api :: lang/objc/rdar-11355592/TestRdar11355592.py
  lldb-api :: lang/objc/orderedset/TestOrderedSet.py
  lldb-api :: lang/cpp/function_refs/TestFunctionRefs.py
  lldb-api :: functionalities/thread/backtrace_all/TestBacktraceAll.py
  lldb-api :: functionalities/inferior-crashing/recursive-inferior/TestRecursiveInferiorStep.py
  lldb-api :: functionalities/tail_call_frames/disambiguate_call_site/TestDisambiguateCallSite.py
  lldb-api :: functionalities/data-formatter/data-formatter-stl/libcxx/vbool/TestDataFormatterLibcxxVBool.py
  lldb-api :: functionalities/data-formatter/data-formatter-objc/TestDataFormatterObjCNSData.py
  lldb-api :: lang/cpp/limit-debug-info/TestWithLimitDebugInfo.py
  lldb-api :: lang/cpp/template-function/TestTemplateFunctions.py
  lldb-api :: commands/expression/xvalue/TestXValuePrinting.py
  lldb-api :: functionalities/data-formatter/setvaluefromcstring/TestSetValueFromCString.py
  lldb-api :: lang/objc/objc_direct-methods/TestObjCDirectMethods.py
  lldb-api :: lang/cpp/call-function/TestCallCPPFunction.py
  lldb-api :: functionalities/value_md5_crash/TestValueMD5Crash.py
  lldb-api :: functionalities/load_unload/TestLoadUnload.py
  lldb-api :: tools/lldb-vscode/launch/TestVSCode_launch.py
  lldb-api :: python_api/value/change_values/TestChangeValueAPI.py
  lldb-api :: commands/apropos/with-process/TestAproposWithProcess.py
  lldb-api :: functionalities/thread_plan/TestThreadPlanCommands.py
  lldb-api :: lang/cpp/dynamic-value/TestCppValueCast.py
  lldb-api :: lang/objcxx/hide-runtime-values/TestObjCXXHideRuntimeValues.py
  lldb-api :: functionalities/breakpoint/debugbreak/TestDebugBreak.py
  lldb-api :: python_api/get-value-32bit-int/TestGetValue32BitInt.py
  lldb-api :: functionalities/tail_call_frames/inlining_and_tail_calls/TestInliningAndTailCalls.py
  lldb-api :: lang/cpp/frame-var-anon-unions/TestFrameVariableAnonymousUnions.py
  lldb-api :: functionalities/breakpoint/breakpoint_language/TestBreakpointLanguage.py
  lldb-api :: functionalities/data-formatter/data-formatter-objc/TestDataFormatterObjCNSContainer.py
  lldb-api :: commands/expression/rdar42038760/TestScalarURem.py
  lldb-api :: lang/cpp/operators/TestCppOperators.py
  lldb-api :: lang/objc/exceptions/TestObjCExceptions.py
  lldb-api :: lang/cpp/virtual-overload/TestVirtualOverload.py
  lldb-api :: commands/expression/import-std-module/unique_ptr-dbg-info-content/TestUniquePtrDbgInfoContent.py
  lldb-api :: functionalities/thread/concurrent_events/TestConcurrentTwoBreakpointThreads.py
  lldb-api :: commands/expression/import-std-module/basic/TestImportStdModule.py
  lldb-api :: lang/cpp/global_variables/TestCPPGlobalVariables.py
  lldb-api :: commands/expression/test/TestExprs.py
  lldb-api :: python_api/lldbutil/frame/TestFrameUtils.py
  lldb-api :: commands/expression/char/TestExprsChar.py
  lldb-api :: tools/lldb-vscode/console/TestVSCode_console.py
  lldb-api :: lang/cpp/nested-class-other-compilation-unit/TestNestedClassWithParentInAnotherCU.py
  lldb-api :: lang/objc/objc-dyn-sbtype/TestObjCDynamicSBType.py
  lldb-api :: python_api/interpreter/TestCommandInterpreterAPI.py
  lldb-api :: lang/c/blocks/TestBlocks.py
  lldb-api :: macosx/thread_suspend/TestInternalThreadSuspension.py
  lldb-api :: commands/expression/timeout/TestCallWithTimeout.py
  lldb-api :: lang/cpp/function-qualifiers/TestCppFunctionQualifiers.py
  lldb-api :: lang/objc/blocks/TestObjCIvarsInBlocks.py
  lldb-api :: lang/cpp/unique-types/TestUniqueTypes.py
  lldb-api :: python_api/hello_world/TestHelloWorld.py
  lldb-api :: functionalities/data-formatter/data-formatter-objc/TestDataFormatterObjCCF.py
  lldb-api :: lang/objc/objc-property/TestObjCProperty.py
  lldb-api :: lang/objc/foundation/TestObjCMethodsString.py
  lldb-api :: python_api/target/TestTargetAPI.py
  lldb-api :: functionalities/breakpoint/breakpoint_locations/TestBreakpointLocations.py
  lldb-api :: functionalities/data-formatter/ptr_ref_typedef/TestPtrRef2Typedef.py
  lldb-api :: commands/expression/two-files/TestObjCTypeQueryFromOtherCompileUnit.py
  lldb-api :: commands/expression/import-std-module/list/TestListFromStdModule.py
  lldb-api :: functionalities/data-formatter/data-formatter-globals/TestDataFormatterGlobals.py
  lldb-api :: lang/cpp/covariant-return-types/TestCovariantReturnTypes.py
  lldb-api :: functionalities/thread/concurrent_events/TestConcurrentManyCrash.py
  lldb-api :: functionalities/breakpoint/breakpoint_by_line_and_column/TestBreakpointByLineAndColumn.py
  lldb-api :: lang/objc/objc-runtime-ivars/TestRuntimeIvars.py
  lldb-api :: commands/expression/options/TestExprOptions.py
  lldb-api :: commands/expression/import-std-module/sysroot/TestStdModuleSysroot.py
  lldb-api :: macosx/profile_vrs_detach/TestDetachVrsProfile.py
  lldb-api :: commands/expression/ir-interpreter/TestIRInterpreter.py
  lldb-api :: functionalities/unwind/zeroth_frame/TestZerothFrame.py
  lldb-api :: python_api/sbvalue_persist/TestSBValuePersist.py
  lldb-api :: functionalities/signal/TestSendSignal.py
  lldb-api :: functionalities/data-formatter/data-formatter-objc/TestDataFormatterObjCExpr.py
  lldb-api :: functionalities/data-formatter/data-formatter-stl/libcxx/multiset/TestDataFormatterLibcxxMultiSet.py
  lldb-api :: lang/objc/objc-struct-return/TestObjCStructReturn.py
  lldb-api :: lang/c/struct_types/TestStructTypes.py
  lldb-api :: commands/expression/unwind_expression/TestUnwindExpression.py
  lldb-api :: commands/expression/import-std-module/unique_ptr/TestUniquePtrFromStdModule.py
  lldb-api :: functionalities/type_lookup/TestTypeLookup.py
  lldb-api :: functionalities/data-formatter/frameformat_smallstruct/TestFrameFormatSmallStruct.py
  lldb-api :: commands/frame/diagnose/dereference-argument/TestDiagnoseDereferenceArgument.py
  lldb-api :: lang/objc/foundation/TestObjCMethodsNSError.py
  lldb-api :: lang/c/global_variables/TestGlobalVariables.py
  lldb-api :: lang/cpp/extern_c/TestExternCSymbols.py
  lldb-api :: python_api/frame/get-variables/TestGetVariables.py
  lldb-api :: functionalities/breakpoint/global_constructor/TestBreakpointInGlobalConstructor.py
  lldb-api :: functionalities/data-formatter/data-formatter-stl/libcxx/map/TestDataFormatterLibccMap.py
  lldb-api :: lang/objc/unicode-string/TestUnicodeString.py
  lldb-api :: functionalities/data-formatter/typedef_array/TestTypedefArray.py
  lldb-api :: lang/objc/objc-static-method-stripped/TestObjCStaticMethodStripped.py
  lldb-api :: commands/expression/unicode-in-variable/TestUnicodeInVariable.py
  lldb-api :: lang/c/bitfields/TestBitfields.py
  lldb-api :: source-manager/TestSourceManager.py
  lldb-api :: functionalities/memory/cache/TestMemoryCache.py
  lldb-api :: types/TestLongTypes.py
  lldb-api :: lang/cpp/enum_types/TestCPP11EnumTypes.py
  lldb-api :: lang/c/shared_lib_stripped_symbols/TestSharedLibStrippedSymbols.py
  lldb-api :: functionalities/breakpoint/step_over_breakpoint/TestStepOverBreakpoint.py
  lldb-api :: lang/cpp/class_static/TestStaticVariables.py
  lldb-api :: lang/c/vla/TestVLA.py
  lldb-api :: commands/expression/import-std-module/shared_ptr/TestSharedPtrFromStdModule.py
  lldb-api :: functionalities/tail_call_frames/sbapi_support/TestTailCallFrameSBAPI.py
  lldb-api :: functionalities/lazy-loading/TestLazyLoading.py
  lldb-api :: functionalities/data-formatter/data-formatter-cpp/TestDataFormatterCpp.py
  lldb-api :: functionalities/data-formatter/data-formatter-synthval/TestDataFormatterSynthVal.py
  lldb-api :: functionalities/breakpoint/breakpoint_ignore_count/TestBreakpointIgnoreCount.py
  lldb-api :: lang/objc/modules-non-objc-target/TestObjCModulesNonObjCTarget.py
  lldb-api :: commands/expression/import-std-module/no-std-module/TestMissingStdModule.py
  lldb-api :: lang/c/enum_types/TestEnumTypes.py
  lldb-api :: commands/source/info/TestSourceInfo.py
  lldb-api :: commands/expression/call-throws/TestCallThatThrows.py
  lldb-api :: lang/objcxx/objcxx-ivar-vector/TestIvarVector.py
  lldb-api :: functionalities/tail_call_frames/ambiguous_tail_call_seq1/TestAmbiguousTailCallSeq1.py
  lldb-api :: lang/objc/single-entry-dictionary/TestObjCSingleEntryDictionary.py
  lldb-api :: functionalities/tail_call_frames/cross_dso/TestCrossDSOTailCalls.py
  lldb-api :: lang/mixed/TestMixedLanguages.py
  lldb-api :: lang/cpp/diamond/TestDiamond.py
  lldb-api :: lang/cpp/namespace_conflicts/TestNamespaceConflicts.py
  lldb-api :: functionalities/thread/concurrent_events/TestConcurrentDelaySignalBreak.py
  lldb-api :: functionalities/data-formatter/data-formatter-stl/libcxx/variant/TestDataFormatterLibcxxVariant.py
  lldb-api :: functionalities/var_path/TestVarPath.py
  lldb-api :: commands/target/basic/TestTargetCommand.py
  lldb-api :: macosx/nslog/TestDarwinNSLogOutput.py
  lldb-api :: lang/objc/objc-stepping/TestObjCStepping.py
  lldb-api :: commands/expression/regression-access-function-template-in-record/TestRegressionAccessFunctionTemplateInRecord.py
  lldb-api :: functionalities/step_scripted/TestStepScripted.py
  lldb-api :: python_api/signals/TestSignalsAPI.py
  lldb-api :: commands/expression/import-std-module/empty-module/TestEmptyStdModule.py
  lldb-api :: python_api/symbol-context/two-files/TestSymbolContextTwoFiles.py
  lldb-api :: commands/expression/radar_9531204/TestPrintfAfterUp.py
  lldb-api :: lang/objc/real-definition/TestRealDefinition.py
  lldb-api :: functionalities/breakpoint/breakpoint_set_restart/TestBreakpointSetRestart.py
  lldb-api :: functionalities/data-formatter/data-formatter-objc/nsindexpath/TestDataFormatterNSIndexPath.py
  lldb-api :: commands/expression/issue_11588/Test11588.py
  lldb-api :: functionalities/plugins/python_os_plugin/stepping_plugin_threads/TestOSPluginStepping.py
  lldb-api :: functionalities/tail_call_frames/cross_object/TestCrossObjectTailCalls.py
  lldb-api :: functionalities/breakpoint/dummy_target_breakpoints/TestBreakpointsWithNoTargets.py
  lldb-api :: python_api/symbol-context/TestSymbolContext.py
  lldb-api :: commands/frame/diagnose/array/TestArray.py
  lldb-api :: commands/expression/po_verbosity/TestPoVerbosity.py
  lldb-api :: functionalities/thread/exit_during_step/TestExitDuringStep.py
  lldb-api :: commands/expression/import-std-module/forward_list-dbg-info-content/TestDbgInfoContentForwardListFromStdModule.py
  lldb-api :: python_api/sbtype_typeclass/TestSBTypeTypeClass.py
  lldb-api :: commands/expression/dollar-in-variable/TestDollarInVariable.py
  lldb-api :: commands/expression/cast_int_to_anonymous_enum/TestCastIntToAnonymousEnum.py
  lldb-api :: functionalities/data-formatter/data-formatter-proper-plurals/TestFormattersOneIsSingular.py
  lldb-api :: commands/expression/diagnostics/TestExprDiagnostics.py
  lldb-api :: functionalities/data-formatter/data-formatter-categories/TestDataFormatterCategories.py
  lldb-api :: commands/expression/import-std-module/conflicts/TestStdModuleWithConflicts.py
  lldb-api :: commands/expression/import-std-module/weak_ptr/TestWeakPtrFromStdModule.py
  lldb-api :: functionalities/data-formatter/data-formatter-objc/TestDataFormatterObjCNSBundle.py
  lldb-api :: lang/objc/modules/TestObjCModules.py
  lldb-api :: functionalities/breakpoint/breakpoint_options/TestBreakpointOptions.py
  lldb-api :: functionalities/data-formatter/data-formatter-stl/libcxx/function/TestLibCxxFunction.py
  lldb-api :: commands/expression/result_numbering/TestResultNumbering.py
  lldb-api :: lang/objc/objc-builtin-types/TestObjCBuiltinTypes.py
  lldb-api :: tools/lldb-vscode/step/TestVSCode_step.py
  lldb-api :: functionalities/thread/concurrent_events/TestConcurrentTwoBreakpointsOneSignal.py
  lldb-api :: macosx/find-dsym/deep-bundle/TestDeepBundle.py
  lldb-api :: lang/cpp/type_lookup/TestCppTypeLookup.py
  lldb-api :: commands/frame/diagnose/bad-reference/TestBadReference.py
  lldb-api :: commands/expression/import-std-module/vector-of-vectors/TestVectorOfVectorsFromStdModule.py
  lldb-api :: lang/objc/modules-inline-functions/TestModulesInlineFunctions.py
  lldb-api :: commands/frame/diagnose/dereference-function-return/TestDiagnoseDereferenceFunctionReturn.py
  lldb-api :: python_api/frame/TestFrames.py
  lldb-api :: lang/cpp/breakpoint-commands/TestCPPBreakpointCommands.py
  lldb-api :: lang/objc/print-obj/TestPrintObj.py
  lldb-api :: macosx/find-app-in-bundle/TestFindAppInBundle.py
  lldb-api :: lang/c/local_variables/TestLocalVariables.py
  lldb-api :: functionalities/data-formatter/refpointer-recursion/TestDataFormatterRefPtrRecursion.py
  lldb-api :: sample_test/TestSampleInlineTest.py
  lldb-api :: commands/expression/completion-crash-incomplete-record/TestCompletionCrashIncompleteRecord.py
  lldb-api :: types/TestDoubleTypesExpr.py
  lldb-api :: sample_test/TestSampleTest.py
  lldb-api :: functionalities/data-formatter/data-formatter-caching/TestDataFormatterCaching.py
  lldb-api :: python_api/objc_type/TestObjCType.py
  lldb-api :: lang/cpp/this/TestCPPThis.py
  lldb-api :: commands/expression/weak_symbols/TestWeakSymbols.py
  lldb-api :: commands/expression/rdar44436068/Test128BitsInteger.py
  lldb-api :: functionalities/data-formatter/data-formatter-objc/TestDataFormatterObjCKVO.py
  lldb-api :: commands/statistics/basic/TestStats.py
  lldb-api :: functionalities/thread/thread_specific_break/TestThreadSpecificBreakpoint.py
  lldb-api :: lang/objcxx/cxx-bridged-po/TestObjCXXBridgedPO.py
  lldb-api :: lang/objc/objc-new-syntax/TestObjCNewSyntaxArray.py
  lldb-api :: functionalities/breakpoint/inlined_breakpoints/TestInlinedBreakpoints.py
  lldb-api :: lang/cpp/constructors/TestCppConstructors.py
  lldb-api :: python_api/name_lookup/TestNameLookup.py
  lldb-api :: functionalities/thread/step_out/TestThreadStepOut.py
  lldb-api :: commands/expression/import-std-module/queue/TestQueueFromStdModule.py
  lldb-api :: functionalities/non-overlapping-index-variable-i/TestIndexVariable.py
  lldb-api :: functionalities/tail_call_frames/thread_step_out_or_return/TestSteppingOutWithArtificialFrames.py
  lldb-api :: functionalities/load_using_paths/TestLoadUsingPaths.py
  lldb-api :: commands/expression/inline-namespace/TestInlineNamespace.py
  lldb-api :: lang/cpp/auto/TestCPPAuto.py
  lldb-api :: functionalities/data-formatter/data-formatter-objc/TestDataFormatterObjCNSURL.py
  lldb-api :: python_api/value/empty_class/TestValueAPIEmptyClass.py
  lldb-api :: lang/c/array_types/TestArrayTypes.py
  lldb-api :: functionalities/inferior-changed/TestInferiorChanged.py
  lldb-api :: python_api/value/TestValueAPI.py
  lldb-api :: python_api/frame/inlines/TestInlinedFrame.py
  lldb-api :: macosx/DBGSourcePathRemapping/TestDSYMSourcePathRemapping.py
  lldb-api :: functionalities/process_crash_info/TestProcessCrashInfo.py
  lldb-api :: python_api/lldbutil/process/TestPrintStackTraces.py
  lldb-api :: lang/c/anonymous/TestAnonymous.py
  lldb-api :: lang/c/register_variables/TestRegisterVariables.py
  lldb-api :: functionalities/step-avoids-no-debug/TestStepNoDebug.py
  lldb-api :: lang/cpp/trivial_abi/TestTrivialABI.py
  lldb-api :: functionalities/memory/find/TestMemoryFind.py
  lldb-api :: commands/frame/diagnose/complicated-expression/TestComplicatedExpression.py
  lldb-api :: functionalities/data-formatter/synthcapping/TestSyntheticCapping.py
  lldb-api :: commands/expression/function_template_specialization_temp_args/TestFunctionTemplateSpecializationTempArgs.py
  lldb-api :: functionalities/breakpoint/breakpoint_hit_count/TestBreakpointHitCount.py
  lldb-api :: linux/builtin_trap/TestBuiltinTrap.py
  lldb-api :: functionalities/data-formatter/compactvectors/TestCompactVectors.py
  lldb-api :: commands/expression/call-function/TestCallStopAndContinue.py
  lldb-api :: commands/expression/import-std-module/forward_list/TestForwardListFromStdModule.py
  lldb-api :: functionalities/thread/concurrent_events/TestConcurrentTwoBreakpointsOneDelaySignal.py
  lldb-api :: lang/cpp/thread_local/TestThreadLocal.py
  lldb-api :: commands/expression/codegen-crash-typedefdecl-not-in_declcontext/TestCodegenCrashTypedefDeclNotInDeclContext.py
  lldb-api :: functionalities/tail_call_frames/thread_step_out_message/TestArtificialFrameStepOutMessage.py
  lldb-api :: functionalities/dynamic_value_child_count/TestDynamicValueChildCount.py
  lldb-api :: functionalities/signal/handle-abrt/TestHandleAbort.py
  lldb-api :: lang/objc/objc-class-method/TestObjCClassMethod.py
  lldb-api :: lang/objc/foundation/TestObjectDescriptionAPI.py
  lldb-api :: commands/expression/import-std-module/shared_ptr-dbg-info-content/TestSharedPtrDbgInfoContentFromStdModule.py
  lldb-api :: functionalities/thread/concurrent_events/TestConcurrentManyBreakpoints.py
  lldb-api :: lang/objc/conflicting-definition/TestConflictingDefinition.py
  lldb-api :: commands/expression/call-function/TestCallUserDefinedFunction.py
  lldb-api :: python_api/findvalue_duplist/TestSBFrameFindValue.py
  lldb-api :: functionalities/thread/concurrent_events/TestConcurrentBreakpointDelayBreakpointOneSignal.py
  lldb-api :: lang/objc/variadic_methods/TestVariadicMethods.py
  lldb-api :: commands/expression/anonymous-struct/TestCallUserAnonTypedef.py
  lldb-api :: api/check_public_api_headers/TestPublicAPIHeaders.py
  lldb-api :: lang/objcxx/class-name-clash/TestNameClash.py
  lldb-api :: functionalities/data-formatter/dump_dynamic/TestDumpDynamic.py
  lldb-api :: lang/c/const_variables/TestConstVariables.py
  lldb-api :: lang/cpp/bitfields/TestCppBitfields.py
  lldb-api :: macosx/add-dsym/TestAddDsymMidExecutionCommand.py
  lldb-api :: python_api/process/TestProcessAPI.py
  lldb-api :: functionalities/data-formatter/format-propagation/TestFormatPropagation.py
  lldb-api :: functionalities/tail_call_frames/disambiguate_paths_to_common_sink/TestDisambiguatePathsToCommonSink.py
  lldb-api :: types/TestShortTypeExpr.py
  lldb-api :: commands/frame/diagnose/local-variable/TestLocalVariable.py
  lldb-api :: commands/expression/formatters/TestFormatters.py
  lldb-api :: lang/c/stepping/TestThreadStepping.py
  lldb-api :: lang/cpp/class_types/TestClassTypesDisassembly.py
  lldb-api :: functionalities/breakpoint/cpp/TestCPPBreakpointLocations.py
  lldb-api :: lang/cpp/class_types/TestClassTypes.py
  lldb-api :: lang/cpp/member-and-local-vars-with-same-name/TestMembersAndLocalsWithSameName.py
  lldb-api :: tools/lldb-vscode/breakpoint-events/TestVSCode_breakpointEvents.py
  lldb-api :: functionalities/process_group/TestChangeProcessGroup.py
  lldb-api :: functionalities/thread/concurrent_events/TestConcurrentDelayedCrashWithBreakpointSignal.py
  lldb-api :: functionalities/return-value/TestReturnValue.py
  lldb-api :: lang/cpp/char8_t/TestCxxChar8_t.py
  lldb-api :: functionalities/thread/concurrent_events/TestConcurrentSignalBreak.py
  lldb-api :: functionalities/thread/concurrent_events/TestConcurrentCrashWithBreak.py
  lldb-api :: functionalities/inferior-crashing/TestInferiorCrashingStep.py
  lldb-api :: functionalities/data-formatter/data-formatter-stl/libcxx/forward_list/TestDataFormatterLibcxxForwardList.py
  lldb-api :: functionalities/tail_call_frames/ambiguous_tail_call_seq2/TestAmbiguousTailCallSeq2.py
  lldb-api :: lang/cpp/accelerator-table/TestCPPAccelerator.py
  lldb-api :: functionalities/recursion/TestValueObjectRecursion.py
  lldb-api :: functionalities/data-formatter/varscript_formatting/TestDataFormatterVarScriptFormatting.py
  lldb-api :: commands/expression/import-std-module/vector/TestVectorFromStdModule.py
  lldb-api :: commands/gui/basic/TestGuiBasic.py
  lldb-api :: functionalities/breakpoint/move_nearest/TestMoveNearest.py
  lldb-api :: functionalities/optimized_code/TestNoASanExceptionAfterEvalOP_piece.py
  lldb-api :: types/TestDoubleTypes.py
  lldb-api :: lang/cpp/rvalue-references/TestRvalueReferences.py
  lldb-api :: commands/expression/dont_allow_jit/TestAllowJIT.py
  lldb-api :: functionalities/data-formatter/data-formatter-stl/libcxx/vector/TestDataFormatterLibcxxVector.py
  lldb-api :: lang/objc/objc-foundation-dictionary-empty/TestNSDictionary0.py
  lldb-api :: types/TestFloatTypesExpr.py
  lldb-api :: commands/disassemble/basic/TestDisassembleBreakpoint.py
  lldb-api :: functionalities/data-formatter/synthupdate/TestSyntheticFilterRecompute.py
  lldb-api :: commands/settings/TestSettings.py
  lldb-api :: functionalities/type_completion/TestTypeCompletion.py
  lldb-api :: commands/command/script/TestCommandScript.py
  lldb-api :: commands/target/stop-hooks/TestStopHooks.py
  lldb-api :: functionalities/breakpoint/breakpoint_command/TestRegexpBreakCommand.py
  lldb-api :: functionalities/data-formatter/cstring-utf8-summary/TestCstringUnicode.py
  lldb-api :: lang/cpp/gmodules-templates/TestGModules.py
  lldb-api :: lang/objc/hidden-ivars/TestHiddenIvars.py
  lldb-api :: functionalities/thread/step_until/TestStepUntil.py
  lldb-api :: functionalities/data-formatter/nsarraysynth/TestNSArraySynthetic.py
  lldb-api :: lang/objc/objc-static-method/TestObjCStaticMethod.py


Testing Time: 808.71s
  Unsupported Tests  :  258
  Expected Passes    : 1208
  Expected Failures  :    5
  Individual Timeouts:    3
  Unexpected Failures:  518
FAILED: tools/lldb/test/CMakeFiles/check-lldb-lit 
cd /Users/buildslave/jenkins/workspace/lldb-cmake-matrix@2/lldb-build/tools/lldb/test && /usr/local/bin/python /Users/buildslave/jenkins/workspace/lldb-cmake-matrix@2/lldb-build/./bin/llvm-lit -v --time-tests --shuffle --xunit-xml-output=/Users/buildslave/jenkins/workspace/lldb-cmake-matrix@2/test/results.xml -v /Users/buildslave/jenkins/workspace/lldb-cmake-matrix@2/lldb-build/tools/lldb/test
ninja: build stopped: subcommand failed.
Command failed: Command '['/usr/bin/env', 'TERM=vt100', '/usr/local/bin/ninja', '-v', 'check-lldb']' returned non-zero exit status 1.
Command: ['/usr/bin/env', 'TERM=vt100', '/usr/local/bin/ninja', '-v', 'check-lldb']
+ set -e