Failed

Test DWARF4 / lldb-api.tools/lldb-server.TestGdbRemoteAttach.py (from lldb-api)

Failing for the past 2 builds (Since Unstable#1736 )
Took 3.3 sec.

Stacktrace

Script:
--
/usr/local/Frameworks/Python.framework/Versions/3.7/bin/python3.7 /Users/buildslave/jenkins/workspace/lldb-cmake-matrix/llvm-project/lldb/test/API/dotest.py --arch x86_64 -s /Users/buildslave/jenkins/workspace/lldb-cmake-matrix/lldb-build/lldb-test-traces -S nm -u CXXFLAGS -u CFLAGS --codesign-identity lldb_codesign --server /Users/buildslave/jenkins/workspace/lldb-cmake-matrix/lldb-build/./bin/debugserver --arch x86_64 --build-dir /Users/buildslave/jenkins/workspace/lldb-cmake-matrix/lldb-build/lldb-test-build.noindex -s=/Users/buildslave/jenkins/workspace/lldb-cmake-matrix/test/logs -t --env TERM=vt100 --skip-category gmodules --skip-category watchpoint --arch=x86_64 --dwarf-version=4 --env LLVM_LIBS_DIR=/Users/buildslave/jenkins/workspace/lldb-cmake-matrix/lldb-build/./lib --build-dir /Users/buildslave/jenkins/workspace/lldb-cmake-matrix/lldb-build/lldb-test-build.noindex --lldb-module-cache-dir /Users/buildslave/jenkins/workspace/lldb-cmake-matrix/lldb-build/lldb-test-build.noindex/module-cache-lldb/lldb-api --clang-module-cache-dir /Users/buildslave/jenkins/workspace/lldb-cmake-matrix/lldb-build/lldb-test-build.noindex/module-cache-clang/lldb-api --executable /Users/buildslave/jenkins/workspace/lldb-cmake-matrix/lldb-build/./bin/lldb --compiler /Users/buildslave/jenkins/workspace/lldb-cmake-matrix/lldb-build/./bin/clang --dsymutil /Users/buildslave/jenkins/workspace/lldb-cmake-matrix/lldb-build/./bin/dsymutil --filecheck /Users/buildslave/jenkins/workspace/lldb-cmake-matrix/lldb-build/./bin/FileCheck --lldb-libs-dir /Users/buildslave/jenkins/workspace/lldb-cmake-matrix/lldb-build/./lib /Users/buildslave/jenkins/workspace/lldb-cmake-matrix/llvm-project/lldb/test/API/tools/lldb-server -p TestGdbRemoteAttach.py
--
Exit Code: 1

Command Output (stdout):
--
lldb version 11.0.99
  clang revision f3b34466104877b024e168cac054bded6b9279a0
  llvm revision f3b34466104877b024e168cac054bded6b9279a0
LLDB library dir: /Users/buildslave/jenkins/workspace/lldb-cmake-matrix/lldb-build/bin
LLDB import library dir: /Users/buildslave/jenkins/workspace/lldb-cmake-matrix/lldb-build/./lib
libstdcxx tests will not be run because: Don't know how to build with libstdcxx on macosx
Skipping following debug info categories: ['dwo']

--
Command Output (stderr):
--

Session logs for test failures/errors/unexpected successes will go into directory '/Users/buildslave/jenkins/workspace/lldb-cmake-matrix/test/logs'
Change dir to: /Users/buildslave/jenkins/workspace/lldb-cmake-matrix/llvm-project/lldb/test/API/tools/lldb-server
runCmd: settings clear -all
output: 

runCmd: settings set symbols.enable-external-lookup false
output: 

runCmd: settings set target.auto-apply-fixits false
output: 

runCmd: settings set plugin.process.gdb-remote.packet-timeout 60
output: 

runCmd: settings set symbols.clang-modules-cache-path "/Users/buildslave/jenkins/workspace/lldb-cmake-matrix/lldb-build/lldb-test-build.noindex/module-cache-lldb/lldb-api"
output: 

runCmd: settings set use-color false
output: 

runCmd: setting set target.prefer-dynamic-value no-dynamic-values
output: 

Adding tearDown hook:         def shutdown_named_pipe():
            # Close the pipe.
            try:
                named_pipe.close()
            except:
                print("failed to close named pipe")
                None

            # Delete the pipe.
            try:
                os.remove(named_pipe_path)
            except:
                print("failed to delete named pipe: {}".format(named_pipe_path))
                None

            # Delete the temp directory.
            try:
                os.rmdir(temp_dir)
            except:
                print(
                    "failed to delete temp dir: {}, directory contents: '{}'".format(
                        temp_dir, os.listdir(temp_dir)))
                None


Adding tearDown hook:         def shutdown_process_for_attach():
            try:
                inferior.terminate()
            except:
                logger.warning(
                    "failed to terminate inferior process for attach: {}; ignoring".format(
                        sys.exc_info()[0]))


Adding tearDown hook:     def cleanupSubprocesses(self):
        # Ensure any subprocesses are cleaned up
        for p in self.subprocesses:
            p.terminate()
            del p
        del self.subprocesses[:]
        # Ensure any forked processes are cleaned up
        for pid in self.forkedProcessPids:
            try:
                os.kill(pid, signal.SIGTERM)
            except OSError:
                pass


Adding tearDown hook:             def shutdown_debug_monitor():
                try:
                    server.terminate()
                except:
                    logger.warning(
                        "failed to terminate server for debug monitor: {}; ignoring".format(
                            sys.exc_info()[0]))


Adding tearDown hook:         def shutdown_socket():
            if sock:
                try:
                    # send the kill packet so lldb-server shuts down gracefully
                    sock.sendall(GdbRemoteTestCaseBase._GDBREMOTE_KILL_PACKET)
                except:
                    logger.warning(
                        "failed to send kill packet to debug monitor: {}; ignoring".format(
                            sys.exc_info()[0]))

                try:
                    sock.close()
                except:
                    logger.warning(
                        "failed to close socket to debug monitor: {}; ignoring".format(
                            sys.exc_info()[0]))


FAIL: LLDB (/Users/buildslave/jenkins/workspace/lldb-cmake-matrix/lldb-build/bin/clang-11-x86_64) :: test_attach_with_vAttach_debugserver (TestGdbRemoteAttach.TestGdbRemoteAttach)
Executing tearDown hook:         def shutdown_socket():
            if sock:
                try:
                    # send the kill packet so lldb-server shuts down gracefully
                    sock.sendall(GdbRemoteTestCaseBase._GDBREMOTE_KILL_PACKET)
                except:
                    logger.warning(
                        "failed to send kill packet to debug monitor: {}; ignoring".format(
                            sys.exc_info()[0]))

                try:
                    sock.close()
                except:
                    logger.warning(
                        "failed to close socket to debug monitor: {}; ignoring".format(
                            sys.exc_info()[0]))


2020-07-01 01:03:57,103 WARNING  failed to send kill packet to debug monitor: <class 'TypeError'>; ignoring
Executing tearDown hook:             def shutdown_debug_monitor():
                try:
                    server.terminate()
                except:
                    logger.warning(
                        "failed to terminate server for debug monitor: {}; ignoring".format(
                            sys.exc_info()[0]))


Executing tearDown hook:     def cleanupSubprocesses(self):
        # Ensure any subprocesses are cleaned up
        for p in self.subprocesses:
            p.terminate()
            del p
        del self.subprocesses[:]
        # Ensure any forked processes are cleaned up
        for pid in self.forkedProcessPids:
            try:
                os.kill(pid, signal.SIGTERM)
            except OSError:
                pass


Executing tearDown hook:         def shutdown_process_for_attach():
            try:
                inferior.terminate()
            except:
                logger.warning(
                    "failed to terminate inferior process for attach: {}; ignoring".format(
                        sys.exc_info()[0]))


Executing tearDown hook:         def shutdown_named_pipe():
            # Close the pipe.
            try:
                named_pipe.close()
            except:
                print("failed to close named pipe")
                None

            # Delete the pipe.
            try:
                os.remove(named_pipe_path)
            except:
                print("failed to delete named pipe: {}".format(named_pipe_path))
                None

            # Delete the temp directory.
            try:
                os.rmdir(temp_dir)
            except:
                print(
                    "failed to delete temp dir: {}, directory contents: '{}'".format(
                        temp_dir, os.listdir(temp_dir)))
                None


runCmd: settings clear -all
output: 

runCmd: settings set symbols.enable-external-lookup false
output: 

runCmd: settings set target.auto-apply-fixits false
output: 

runCmd: settings set plugin.process.gdb-remote.packet-timeout 60
output: 

runCmd: settings set symbols.clang-modules-cache-path "/Users/buildslave/jenkins/workspace/lldb-cmake-matrix/lldb-build/lldb-test-build.noindex/module-cache-lldb/lldb-api"
output: 

runCmd: settings set use-color false
output: 

runCmd: setting set target.prefer-dynamic-value no-dynamic-values
output: 

UNSUPPORTED: LLDB (/Users/buildslave/jenkins/workspace/lldb-cmake-matrix/lldb-build/bin/clang-11-x86_64) :: test_attach_with_vAttach_llgs (TestGdbRemoteAttach.TestGdbRemoteAttach) (llgs tests) 
Restore dir to: /Users/buildslave/jenkins/workspace/lldb-cmake-matrix/lldb-build/tools/lldb/test
======================================================================
FAIL: test_attach_with_vAttach_debugserver (TestGdbRemoteAttach.TestGdbRemoteAttach)
----------------------------------------------------------------------
Traceback (most recent call last):
  File "/Users/buildslave/jenkins/workspace/lldb-cmake-matrix/llvm-project/lldb/packages/Python/lldbsuite/test/decorators.py", line 140, in wrapper
    func(*args, **kwargs)
  File "/Users/buildslave/jenkins/workspace/lldb-cmake-matrix/llvm-project/lldb/test/API/tools/lldb-server/TestGdbRemoteAttach.py", line 59, in test_attach_with_vAttach_debugserver
    self.attach_with_vAttach()
  File "/Users/buildslave/jenkins/workspace/lldb-cmake-matrix/llvm-project/lldb/test/API/tools/lldb-server/TestGdbRemoteAttach.py", line 45, in attach_with_vAttach
    process_info = self.parse_process_info_response(context)
  File "/Users/buildslave/jenkins/workspace/lldb-cmake-matrix/llvm-project/lldb/packages/Python/lldbsuite/test/tools/lldb-server/gdbremote_testcase.py", line 711, in parse_process_info_response
    self.assertTrue(key in self._KNOWN_PROCESS_INFO_KEYS)
AssertionError: False is not True
Config=x86_64-/Users/buildslave/jenkins/workspace/lldb-cmake-matrix/lldb-build/bin/clang-11
----------------------------------------------------------------------
Ran 2 tests in 2.808s

RESULT: FAILED (0 passes, 1 failures, 0 errors, 1 skipped, 0 expected failures, 0 unexpected successes)

--