UnstableConsole Output

Skipping 40,967 KB.. Full Log
read to stop at breakpoint, %d did."%(len(threads)))
AssertionError: False is not True : Expected 1 thread to stop at breakpoint, 0 did.
Config=x86_64-/Users/buildslave/jenkins/workspace/lldb-cmake-matrix/clang_701_build/bin/clang-7
----------------------------------------------------------------------
Ran 4 tests in 3.430s

Hide Details

RESULT: FAILED (0 passes, 1 failures, 1 errors, 2 skipped, 0 expected failures, 0 unexpected successes)

Hide Details

******************** FAIL: lldb-Suite :: macosx/function-starts/TestFunctionStarts.py (1690 of 1702) ******************** TEST 'lldb-Suite :: macosx/function-starts/TestFunctionStarts.py' FAILED ******************** lldb version 10.0.99 (http://labmaster3.local/git/llvm-project.git revision 1a3dd638c4a9173e53628b497a1aadc31c32eb50) clang revision daa79c5338228a746a7eba0cf2f2f356e1d45a5b llvm revision daa79c5338228a746a7eba0cf2f2f356e1d45a5b I wasn't stripped I wasn't stripped I wasn't stripped I wasn't stripped I wasn't stripped I wasn't stripped I wasn't stripped I wasn't stripped I wasn't stripped I wasn't stripped I wasn't stripped I wasn't stripped I wasn't stripped I wasn't stripped I wasn't stripped I wasn't stripped I wasn't stripped I wasn't stripped I wasn't stripped I wasn't stripped I wasn't stripped I wasn't stripped I wasn't stripped I wasn't stripped I wasn't stripped I wasn't stripped I wasn't stripped I wasn't stripped I wasn't stripped I wasn't stripped I wasn't stripped I wasn't stripped I wasn't stripped I wasn't stripped I wasn't stripped I wasn't stripped I wasn't stripped I wasn't stripped I wasn't stripped I wasn't stripped I wasn't stripped I wasn't stripped I wasn't stripped I wasn't stripped I wasn't stripped I wasn't stripped I wasn't stripped I wasn't stripped I wasn't stripped I wasn't stripped I wasn't stripped I wasn't stripped I wasn't stripped I wasn't stripped I wasn't stripped I wasn't stripped I wasn't stripped I wasn't stripped I wasn't stripped I wasn't stripped I wasn't stripped I wasn't stripped I wasn't stripped I wasn't stripped I wasn't stripped I wasn't stripped I wasn't stripped I wasn't stripped I wasn't stripped I wasn't stripped I wasn't stripped I wasn't stripped I wasn't stripped I wasn't stripped I wasn't stripped I wasn't stripped I wasn't stripped I wasn't stripped I wasn't stripped I wasn't stripped I wasn't stripped I wasn't stripped I wasn't stripped I wasn't stripped I wasn't stripped I wasn't stripped I wasn't stripped I wasn't stripped I wasn't stripped I wasn't stripped I wasn't stripped I wasn't stripped I wasn't stripped I wasn't stripped I wasn't stripped I wasn't stripped I wasn't stripped I wasn't stripped I wasn't stripped I wasn't stripped I wasn't stripped I wasn't stripped I wasn't stripped I wasn't stripped I wasn't stripped I wasn't stripped I wasn't stripped I wasn't stripped I wasn't stripped I wasn't stripped I wasn't stripped I wasn't stripped I wasn't stripped I wasn't stripped I wasn't stripped I wasn't stripped I wasn't stripped I wasn't stripped I wasn't stripped I wasn't stripped I wasn't stripped I wasn't stripped I wasn't stripped I wasn't stripped I wasn't stripped I wasn't stripped I wasn't stripped I wasn't stripped I wasn't stripped I wasn't stripped I wasn't stripped I wasn't stripped I wasn't stripped I wasn't stripped I wasn't stripped I wasn't stripped I wasn't stripped I wasn't stripped I wasn't stripped I wasn't stripped I wasn't stripped I wasn't stripped I wasn't stripped I wasn't stripped I wasn't stripped I wasn't stripped I wasn't stripped I wasn't stripped I wasn't stripped I wasn't stripped I wasn't stripped I wasn't stripped I wasn't stripped I wasn't stripped I wasn't stripped I wasn't stripped I wasn't stripped I wasn't stripped I wasn't stripped I wasn't stripped I wasn't stripped I wasn't stripped I wasn't stripped I wasn't stripped I wasn't stripped I wasn't stripped I wasn't stripped I wasn't stripped I wasn't stripped I wasn't stripped I wasn't stripped I wasn't stripped I wasn't stripped I wasn't stripped I wasn't stripped I wasn't stripped I wasn't stripped I wasn't stripped I wasn't stripped I wasn't stripped I wasn't stripped I wasn't stripped I wasn't stripped I wasn't stripped I wasn't stripped I wasn't stripped I wasn't stripped I wasn't stripped I wasn't stripped I wasn't stripped I wasn't stripped I wasn't stripped I wasn't stripped I wasn't stripped I wasn't stripped I wasn't stripped I wasn't stripped I wasn't stripped I wasn't stripped I wasn't stripped I wasn't stripped I wasn't stripped I wasn't stripped I wasn't stripped I wasn't stripped I wasn't stripped I wasn't stripped I wasn't stripped I wasn't stripped I wasn't stripped I wasn't stripped I wasn't stripped I wasn't stripped I wasn't stripped I wasn't stripped I wasn't stripped I wasn't stripped I wasn't stripped I wasn't stripped I wasn't stripped I wasn't stripped I wasn't stripped I wasn't stripped I wasn't stripped I wasn't stripped I wasn't stripped I wasn't stripped I wasn't stripped I wasn't stripped I wasn't stripped I wasn't stripped I wasn't stripped I wasn't stripped I wasn't stripped I wasn't stripped I wasn't stripped I wasn't stripped I wasn't stripped I wasn't stripped I wasn't stripped I wasn't stripped I wasn't stripped I wasn't stripped I wasn't stripped I wasn't stripped I wasn't stripped I wasn't stripped I wasn't stripped I wasn't stripped I wasn't stripped I wasn't stripped I wasn't stripped I wasn't stripped I wasn't stripped I wasn't stripped I wasn't stripped I wasn't stripped I wasn't stripped I wasn't stripped I wasn't stripped I wasn't stripped I wasn't stripped I wasn't stripped I wasn't stripped I wasn't stripped I wasn't stripped I wasn't stripped I wasn't stripped I wasn't stripped I wasn't stripped I wasn't stripped I wasn't stripped I wasn't stripped I wasn't stripped I wasn't stripped I wasn't stripped I wasn't stripped I wasn't stripped I wasn't stripped I wasn't stripped I wasn't stripped I wasn't stripped I wasn't stripped I wasn't stripped I wasn't stripped I wasn't stripped I wasn't stripped I wasn't stripped I wasn't stripped I wasn't stripped I wasn't stripped I wasn't stripped I wasn't stripped I wasn't stripped I wasn't stripped I wasn't stripped I wasn't stripped I wasn't stripped I wasn't stripped I wasn't stripped I wasn't stripped I wasn't stripped I wasn't stripped I wasn't stripped I wasn't stripped I wasn't stripped I wasn't stripped I wasn't stripped I wasn't stripped I wasn't stripped I wasn't stripped I wasn't stripped I wasn't stripped I wasn't stripped I wasn't stripped I wasn't stripped I wasn't stripped I wasn't stripped I wasn't stripped I wasn't stripped I wasn't stripped I wasn't stripped I wasn't stripped I wasn't stripped I wasn't stripped I wasn't stripped I wasn't stripped I wasn't stripped I wasn't stripped I wasn't stripped I wasn't stripped I wasn't stripped I wasn't stripped I wasn't stripped I wasn't stripped I wasn't stripped I wasn't stripped I wasn't stripped I wasn't stripped I wasn't stripped I wasn't stripped I wasn't stripped I wasn't stripped I wasn't stripped I wasn't stripped I wasn't stripped I wasn't stripped I wasn't stripped I wasn't stripped I wasn't stripped I wasn't stripped I wasn't stripped I wasn't stripped I wasn't stripped I wasn't stripped I wasn't stripped I wasn't stripped I wasn't stripped I wasn't stripped I wasn't stripped I wasn't stripped I wasn't stripped I wasn't stripped I wasn't stripped I wasn't stripped I wasn't stripped I wasn't stripped I wasn't stripped I wasn't stripped I wasn't stripped I wasn't stripped I wasn't stripped I wasn't stripped I wasn't stripped I wasn't stripped I wasn't stripped I wasn't stripped I wasn't stripped I wasn't stripped I wasn't stripped I wasn't stripped I wasn't stripped I wasn't stripped I wasn't stripped I wasn't stripped I wasn't stripped I wasn't stripped I wasn't stripped I wasn't stripped I wasn't stripped I wasn't stripped I wasn't stripped I wasn't stripped I wasn't stripped I wasn't stripped I wasn't stripped I wasn't stripped I wasn't stripped I wasn't stripped I wasn't stripped I wasn't stripped I wasn't stripped I wasn't stripped I wasn't stripped I wasn't stripped I wasn't stripped I wasn't stripped I wasn't stripped I wasn't stripped I wasn't stripped I wasn't stripped I wasn't stripped I wasn't stripped I wasn't stripped I wasn't stripped I wasn't stripped I wasn't stripped I wasn't stripped I wasn't stripped I wasn't stripped I wasn't stripped I wasn't stripped I wasn't stripped I wasn't stripped I wasn't stripped I wasn't stripped I wasn't stripped I wasn't stripped I wasn't stripped I wasn't stripped I wasn't stripped I wasn't stripped I wasn't stripped I wasn't stripped I wasn't stripped I wasn't stripped I wasn't stripped I wasn't stripped I wasn't stripped I wasn't stripped I wasn't stripped I wasn't stripped I wasn't stripped I wasn't stripped I wasn't stripped I wasn't stripped I wasn't stripped I wasn't stripped I wasn't stripped I wasn't stripped I wasn't stripped I wasn't stripped I wasn't stripped I wasn't stripped I wasn't stripped I wasn't stripped I wasn't stripped I wasn't stripped I wasn't stripped I wasn't stripped I wasn't stripped I wasn't stripped I wasn't stripped I wasn't stripped I wasn't stripped I wasn't stripped I wasn't stripped I wasn't stripped I wasn't stripped I wasn't stripped I wasn't stripped I wasn't stripped I wasn't stripped I wasn't stripped I wasn't stripped I wasn't stripped I wasn't stripped I wasn't stripped I wasn't stripped I wasn't stripped I wasn't stripped I wasn't stripped I wasn't stripped I wasn't stripped I wasn't stripped I wasn't stripped I wasn't stripped I wasn't stripped I wasn't stripped I wasn't stripped I wasn't stripped I wasn't stripped I wasn't stripped I wasn't stripped I wasn't stripped I wasn't stripped I wasn't stripped I wasn't stripped I wasn't stripped I wasn't stripped I wasn't stripped I wasn't stripped I wasn't stripped I wasn't stripped I wasn't stripped I wasn't stripped I wasn't stripped I wasn't stripped I wasn't stripped I wasn't stripped I wasn't stripped I wasn't stripped I wasn't stripped I wasn't stripped I wasn't stripped I wasn't stripped I wasn't stripped I wasn't stripped I wasn't stripped I wasn't stripped I wasn't stripped I wasn't stripped I wasn't stripped I wasn't stripped I wasn't stripped I wasn't stripped I wasn't stripped I wasn't stripped I wasn't stripped I wasn't stripped I wasn't stripped I wasn't stripped I wasn't stripped I wasn't stripped I wasn't stripped I wasn't stripped I wasn't stripped I wasn't stripped I wasn't stripped I wasn't stripped I wasn't stripped I wasn't stripped I wasn't stripped I wasn't stripped I wasn't stripped I wasn't stripped I wasn't stripped I wasn't stripped I wasn't stripped I wasn't stripped I wasn't stripped I wasn't stripped I wasn't stripped I wasn't stripped I wasn't stripped I wasn't stripped I wasn't stripped I wasn't stripped I wasn't stripped I wasn't stripped I wasn't stripped I wasn't stripped I wasn't stripped I wasn't stripped I wasn't stripped I wasn't stripped I wasn't stripped I wasn't stripped I wasn't stripped I wasn't stripped I wasn't stripped I wasn't stripped I wasn't stripped I wasn't stripped I wasn't stripped I wasn't stripped I wasn't stripped I wasn't stripped I wasn't stripped I wasn't stripped I wasn't stripped I wasn't stripped I wasn't stripped I wasn't stripped I wasn't stripped I wasn't stripped I wasn't stripped I wasn't stripped I wasn't stripped I wasn't stripped I wasn't stripped I wasn't stripped I wasn't stripped I wasn't stripped I wasn't stripped I wasn't stripped I wasn't stripped I wasn't stripped I wasn't stripped I wasn't stripped I wasn't stripped I wasn't stripped I wasn't stripped I wasn't stripped I wasn't stripped I wasn't stripped I wasn't stripped I wasn't stripped I wasn't stripped I wasn't stripped I wasn't stripped I wasn't stripped I wasn't stripped I wasn't stripped I wasn't stripped I wasn't stripped I wasn't stripped I wasn't stripped I wasn't stripped I wasn't stripped I wasn't stripped I wasn't stripped I wasn't stripped I wasn't stripped I wasn't stripped I wasn't stripped I wasn't stripped I wasn't stripped I wasn't stripped I wasn't stripped I wasn't stripped I wasn't stripped I wasn't stripped I wasn't stripped I wasn't stripped I wasn't stripped I wasn't stripped I wasn't stripped I wasn't stripped I wasn't stripped I wasn't stripped I wasn't stripped I wasn't stripped I wasn't stripped I wasn't stripped I wasn't stripped I wasn't stripped I wasn't stripped I wasn't stripped I wasn't stripped I wasn't stripped I wasn't stripped I wasn't stripped I wasn't stripped I wasn't stripped I wasn't stripped I wasn't stripped I wasn't stripped I wasn't stripped I wasn't stripped I wasn't stripped I wasn't stripped I wasn't stripped I wasn't stripped I wasn't stripped I wasn't stripped I wasn't stripped I wasn't stripped I wasn't stripped I wasn't stripped I wasn't stripped I wasn't stripped I wasn't stripped I wasn't stripped I wasn't stripped I wasn't stripped I wasn't stripped I wasn't stripped I wasn't stripped I wasn't stripped I wasn't stripped I wasn't stripped I wasn't stripped I wasn't stripped I wasn't stripped I wasn't stripped I wasn't stripped I wasn't stripped I wasn't stripped I wasn't stripped I wasn't stripped I wasn't stripped I wasn't stripped I wasn't stripped I wasn't stripped I wasn't stripped I wasn't stripped I wasn't stripped I wasn't stripped I wasn't stripped I wasn't stripped I wasn't stripped I wasn't stripped I wasn't stripped I wasn't stripped I wasn't stripped I wasn't stripped I wasn't stripped I wasn't stripped I wasn't stripped I wasn't stripped I wasn't stripped I wasn't stripped I wasn't stripped I wasn't stripped I wasn't stripped I wasn't stripped I wasn't stripped I wasn't stripped I wasn't stripped I wasn't stripped I wasn't stripped I wasn't stripped I wasn't stripped I wasn't stripped I wasn't stripped I wasn't stripped I wasn't stripped I wasn't stripped I wasn't stripped I wasn't stripped I wasn't stripped I wasn't stripped I wasn't stripped I wasn't stripped I wasn't stripped I wasn't stripped I wasn't stripped I wasn't stripped I wasn't stripped I wasn't stripped I wasn't stripped I wasn't stripped I wasn't stripped I wasn't stripped I wasn't stripped I wasn't stripped I wasn't stripped I wasn't stripped I wasn't stripped I wasn't stripped I wasn't stripped I wasn't stripped I wasn't stripped I wasn't stripped I wasn't stripped I wasn't stripped I wasn't stripped I wasn't stripped I wasn't stripped I wasn't stripped I wasn't stripped I wasn't stripped I wasn't stripped I wasn't stripped I wasn't stripped I wasn't stripped I wasn't stripped I wasn't stripped I wasn't stripped I wasn't stripped I wasn't stripped I wasn't stripped I wasn't stripped I wasn't stripped I wasn't stripped I wasn't stripped I wasn't stripped I wasn't stripped I wasn't stripped I wasn't stripped I wasn't stripped I wasn't stripped I wasn't stripped I wasn't stripped I wasn't stripped I wasn't stripped I wasn't stripped I wasn't stripped I wasn't stripped I wasn't stripped I wasn't stripped I wasn't stripped I wasn't stripped I wasn't stripped I wasn't stripped I wasn't stripped I wasn't stripped I wasn't stripped I wasn't stripped I wasn't stripped I wasn't stripped I wasn't stripped I wasn't stripped I wasn't stripped I wasn't stripped I wasn't stripped I wasn't stripped I wasn't stripped I wasn't stripped I wasn't stripped I wasn't stripped I wasn't stripped I wasn't stripped I wasn't stripped I wasn't stripped I wasn't stripped I wasn't stripped I wasn't stripped I wasn't stripped I wasn't stripped I wasn't stripped I wasn't stripped I wasn't stripped I wasn't stripped I wasn't stripped I wasn't stripped I wasn't stripped I wasn't stripped I wasn't stripped I wasn't stripped I wasn't stripped I wasn't stripped I wasn't stripped I wasn't stripped I wasn't stripped I wasn't stripped I wasn't stripped I wasn't stripped I wasn't stripped I wasn't stripped I wasn't stripped I wasn't stripped I wasn't stripped I wasn't stripped I wasn't stripped I wasn't stripped I wasn't stripped I wasn't stripped I wasn't stripped I wasn't stripped I wasn't stripped I wasn't stripped I wasn't stripped I wasn't stripped I wasn't stripped I wasn't stripped I wasn't stripped I wasn't stripped I wasn't stripped I wasn't stripped I wasn't stripped I wasn't stripped I wasn't stripped I wasn't stripped I wasn't stripped I wasn't stripped I wasn't stripped I wasn't stripped I wasn't stripped I wasn't stripped I wasn't stripped I wasn't stripped I wasn't stripped I wasn't stripped I wasn't stripped I wasn't stripped I wasn't stripped I wasn't stripped I wasn't stripped I wasn't stripped I wasn't stripped I wasn't stripped I wasn't stripped I wasn't stripped I wasn't stripped I wasn't stripped I wasn't stripped I wasn't stripped I wasn't stripped I wasn't stripped I wasn't stripped I wasn't stripped I wasn't stripped I wasn't stripped I wasn't stripped I wasn't stripped I wasn't stripped I wasn't stripped I wasn't stripped I wasn't stripped I wasn't stripped I wasn't stripped I wasn't stripped I wasn't stripped I wasn't stripped I wasn't stripped I wasn't stripped I wasn't stripped I wasn't stripped I waLLDB library dir: /Users/buildslave/jenkins/workspace/lldb-cmake-matrix/lldb-build/bin LLDB import library dir: /Users/buildslave/jenkins/workspace/lldb-cmake-matrix/lldb-build/bin libstdcxx tests will not be run because: Don't know how to build with libstdcxx on macosx Skipping following debug info categories: ['dwo']

Hide Details

Session logs for test failures/errors/unexpected successes will go into directory '/Users/buildslave/jenkins/workspace/lldb-cmake-matrix/test/logs' Command invoked: /Users/buildslave/jenkins/workspace/lldb-cmake-matrix/llvm-project/lldb/test/dotest.py --arch=x86_64 -s /Users/buildslave/jenkins/workspace/lldb-cmake-matrix/lldb-build/lldb-test-traces -S nm -u CXXFLAGS -u CFLAGS --executable /Users/buildslave/jenkins/workspace/lldb-cmake-matrix/lldb-build/./bin/lldb --dsymutil /Users/buildslave/jenkins/workspace/lldb-cmake-matrix/lldb-build/./bin/dsymutil --filecheck /Users/buildslave/jenkins/workspace/lldb-cmake-matrix/lldb-build/./bin/FileCheck -C /Users/buildslave/jenkins/workspace/lldb-cmake-matrix/clang_701_build/bin/clang --codesign-identity lldb_codesign --server /Users/buildslave/jenkins/workspace/lldb-cmake-matrix/lldb-build/./bin/debugserver --arch x86_64 --build-dir /Users/buildslave/jenkins/workspace/lldb-cmake-matrix/lldb-build/lldb-test-build.noindex -s=/Users/buildslave/jenkins/workspace/lldb-cmake-matrix/test/logs -t --env TERM=vt100 --skip-category gmodules --skip-category watchpoint --arch=x86_64 --env LLVM_LIBS_DIR=/Users/buildslave/jenkins/workspace/lldb-cmake-matrix/lldb-build/./lib --build-dir /Users/buildslave/jenkins/workspace/lldb-cmake-matrix/lldb-build/tools/lldb/lldb-test-build.noindex --module-cache-dir /Users/buildslave/jenkins/workspace/lldb-cmake-matrix/lldb-build/tools/lldb/lldb-test-build.noindex/module-cache-lldb /Users/buildslave/jenkins/workspace/lldb-cmake-matrix/llvm-project/lldb/packages/Python/lldbsuite/test/macosx/function-starts -p TestFunctionStarts.py Change dir to: /Users/buildslave/jenkins/workspace/lldb-cmake-matrix/llvm-project/lldb/packages/Python/lldbsuite/test/macosx/function-starts runCmd: settings set symbols.enable-external-lookup false output:

Hide Details

runCmd: settings set plugin.process.gdb-remote.packet-timeout 60 output:

Hide Details

runCmd: settings set symbols.clang-modules-cache-path "/Users/buildslave/jenkins/workspace/lldb-cmake-matrix/lldb-build/tools/lldb/lldb-test-build.noindex/module-cache-lldb" output:

Hide Details

runCmd: settings set use-color false output:

Hide Details

Adding tearDown hook: lambda: self.run_platform_command( "rm %s" % (pid_file_path)))

Hide Details

Hide Details

Adding tearDown hook: def cleanupSubprocesses(self): # Ensure any subprocesses are cleaned up for p in self.subprocesses: p.terminate() del p del self.subprocesses[:] # Ensure any forked processes are cleaned up for pid in self.forkedProcessPids: if os.path.exists("/proc/" + str(pid)): os.kill(pid, signal.SIGTERM)

Hide Details

Hide Details

FAIL: LLDB (/Users/buildslave/jenkins/workspace/lldb-cmake-matrix/clang_701_build/bin/clang-7-x86_64) :: test_function_starts_binary (TestFunctionStarts.FunctionStartsTestCase) <bound method SBProcess.Kill of <lldb.SBProcess; proxy of <Swig Object of type 'lldb::SBProcess *' at 0x10a3f3b70> >>: success

Hide Details

Executing tearDown hook: def cleanupSubprocesses(self): # Ensure any subprocesses are cleaned up for p in self.subprocesses: p.terminate() del p del self.subprocesses[:] # Ensure any forked processes are cleaned up for pid in self.forkedProcessPids: if os.path.exists("/proc/" + str(pid)): os.kill(pid, signal.SIGTERM)

Hide Details

Hide Details

Executing tearDown hook: lambda: self.run_platform_command( "rm %s" % (pid_file_path)))

Hide Details

Hide Details

runCmd: settings set symbols.enable-external-lookup false output:

Hide Details

runCmd: settings set plugin.process.gdb-remote.packet-timeout 60 output:

Hide Details

runCmd: settings set symbols.clang-modules-cache-path "/Users/buildslave/jenkins/workspace/lldb-cmake-matrix/lldb-build/tools/lldb/lldb-test-build.noindex/module-cache-lldb" output:

Hide Details

runCmd: settings set use-color false output:

Hide Details

Adding tearDown hook: lambda: self.run_platform_command( "rm %s" % (pid_file_path)))

Hide Details

Hide Details

Adding tearDown hook: def cleanupSubprocesses(self): # Ensure any subprocesses are cleaned up for p in self.subprocesses: p.terminate() del p del self.subprocesses[:] # Ensure any forked processes are cleaned up for pid in self.forkedProcessPids: if os.path.exists("/proc/" + str(pid)): os.kill(pid, signal.SIGTERM)

Hide Details

Hide Details

FAIL: LLDB (/Users/buildslave/jenkins/workspace/lldb-cmake-matrix/clang_701_build/bin/clang-7-x86_64) :: test_function_starts_no_binary (TestFunctionStarts.FunctionStartsTestCase) <bound method SBProcess.Kill of <lldb.SBProcess; proxy of <Swig Object of type 'lldb::SBProcess *' at 0x10a3e7d50> >>: success

Hide Details

Executing tearDown hook: def cleanupSubprocesses(self): # Ensure any subprocesses are cleaned up for p in self.subprocesses: p.terminate() del p del self.subprocesses[:] # Ensure any forked processes are cleaned up for pid in self.forkedProcessPids: if os.path.exists("/proc/" + str(pid)): os.kill(pid, signal.SIGTERM)

Hide Details

Hide Details

Executing tearDown hook: lambda: self.run_platform_command( "rm %s" % (pid_file_path)))

Hide Details

Hide Details

Restore dir to: /Users/buildslave/jenkins/workspace/lldb-cmake-matrix/lldb-build/tools/lldb/lit ====================================================================== FAIL: test_function_starts_binary (TestFunctionStarts.FunctionStartsTestCase) Test that we make synthetic symbols when we have the binary. ---------------------------------------------------------------------- Traceback (most recent call last): File "/Users/buildslave/jenkins/workspace/lldb-cmake-matrix/llvm-project/lldb/packages/Python/lldbsuite/test/decorators.py", line 141, in wrapper func(*args, **kwargs) File "/Users/buildslave/jenkins/workspace/lldb-cmake-matrix/llvm-project/lldb/packages/Python/lldbsuite/test/macosx/function-starts/TestFunctionStarts.py", line 26, in test_function_starts_binary self.do_function_starts(False) File "/Users/buildslave/jenkins/workspace/lldb-cmake-matrix/llvm-project/lldb/packages/Python/lldbsuite/test/macosx/function-starts/TestFunctionStarts.py", line 70, in do_function_starts self.assertTrue(error.Success(), "Didn't attach successfully to %d: %s"%(popen.pid, error.GetCString())) AssertionError: False is not True : Didn't attach successfully to 21194: Error 1 Config=x86_64-/Users/buildslave/jenkins/workspace/lldb-cmake-matrix/clang_701_build/bin/clang-7 ====================================================================== FAIL: test_function_starts_no_binary (TestFunctionStarts.FunctionStartsTestCase) Test that we make synthetic symbols when we don't have the binary ---------------------------------------------------------------------- Traceback (most recent call last): File "/Users/buildslave/jenkins/workspace/lldb-cmake-matrix/llvm-project/lldb/packages/Python/lldbsuite/test/decorators.py", line 141, in wrapper func(*args, **kwargs) File "/Users/buildslave/jenkins/workspace/lldb-cmake-matrix/llvm-project/lldb/packages/Python/lldbsuite/test/macosx/function-starts/TestFunctionStarts.py", line 33, in test_function_starts_no_binary self.do_function_starts(True) File "/Users/buildslave/jenkins/workspace/lldb-cmake-matrix/llvm-project/lldb/packages/Python/lldbsuite/test/macosx/function-starts/TestFunctionStarts.py", line 70, in do_function_starts self.assertTrue(error.Success(), "Didn't attach successfully to %d: %s"%(popen.pid, error.GetCString())) AssertionError: False is not True : Didn't attach successfully to 21418: Error 1 Config=x86_64-/Users/buildslave/jenkins/workspace/lldb-cmake-matrix/clang_701_build/bin/clang-7 ---------------------------------------------------------------------- Ran 2 tests in 4.907s

Hide Details

RESULT: FAILED (0 passes, 2 failures, 0 errors, 0 skipped, 0 expected failures, 0 unexpected successes)

Hide Details

******************** TIMEOUT: LLDB :: SymbolFile/sizeless-symbol.test (1691 of 1702) ******************** TEST 'LLDB :: SymbolFile/sizeless-symbol.test' FAILED ******************** Script: -- : 'RUN: at line 2'; /Users/buildslave/jenkins/workspace/lldb-cmake-matrix/lldb-build/bin/clang -isysroot /Applications/Xcode.app/Contents/Developer/Platforms/MacOSX.platform/Developer/SDKs/MacOSX.sdk -fmodules-cache-path=/Users/buildslave/jenkins/workspace/lldb-cmake-matrix/lldb-build/tools/lldb/lldb-test-build.noindex/module-cache-clang -target x86_64-unknown-unknown-elf /Users/buildslave/jenkins/workspace/lldb-cmake-matrix/llvm-project/lldb/lit/SymbolFile/Inputs/sizeless-symbol.s -c -o /Users/buildslave/jenkins/workspace/lldb-cmake-matrix/lldb-build/tools/lldb/lit/SymbolFile/Output/sizeless-symbol.test.tmp.o : 'RUN: at line 3'; /Users/buildslave/jenkins/workspace/lldb-cmake-matrix/lldb-build/bin/lldb --no-lldbinit -S /Users/buildslave/jenkins/workspace/lldb-cmake-matrix/lldb-build/tools/lldb/lit/lit-lldb-init /Users/buildslave/jenkins/workspace/lldb-cmake-matrix/lldb-build/tools/lldb/lit/SymbolFile/Output/sizeless-symbol.test.tmp.o -s /Users/buildslave/jenkins/workspace/lldb-cmake-matrix/llvm-project/lldb/lit/SymbolFile/sizeless-symbol.test -o quit | /Users/buildslave/jenkins/workspace/lldb-cmake-matrix/lldb-build/bin/FileCheck /Users/buildslave/jenkins/workspace/lldb-cmake-matrix/llvm-project/lldb/lit/SymbolFile/sizeless-symbol.test -- Exit Code: -9 Timeout: Reached timeout of 600 seconds

Hide Details

Command Output (stderr): -- clang-10: warning: argument unused during compilation: '-isysroot /Applications/Xcode.app/Contents/Developer/Platforms/MacOSX.platform/Developer/SDKs/MacOSX.sdk' [-Wunused-command-line-argument] clang-10: warning: argument unused during compilation: '-fmodules-cache-path=/Users/buildslave/jenkins/workspace/lldb-cmake-matrix/lldb-build/tools/lldb/lldb-test-build.noindex/module-cache-clang' [-Wunused-command-line-argument]

Hide Details

--

Hide Details

******************** PASS: lldb-Suite :: lang/objc/foundation/TestSymbolTable.py (1692 of 1702) FAIL: lldb-Suite :: python_api/module_section/TestModuleAndSection.py (1693 of 1702) ******************** TEST 'lldb-Suite :: python_api/module_section/TestModuleAndSection.py' FAILED ******************** lldb version 10.0.99 (http://labmaster3.local/git/llvm-project.git revision 1a3dd638c4a9173e53628b497a1aadc31c32eb50) clang revision daa79c5338228a746a7eba0cf2f2f356e1d45a5b llvm revision daa79c5338228a746a7eba0cf2f2f356e1d45a5b LLDB library dir: /Users/buildslave/jenkins/workspace/lldb-cmake-matrix/lldb-build/bin LLDB import library dir: /Users/buildslave/jenkins/workspace/lldb-cmake-matrix/lldb-build/bin libstdcxx tests will not be run because: Don't know how to build with libstdcxx on macosx Skipping following debug info categories: ['dwo'] Number of modules for the target: 39 (x86_64) /Users/buildslave/jenkins/workspace/lldb-cmake-matrix/lldb-build/tools/lldb/lldb-test-build.noindex/python_api/module_section/TestModuleAndSection.test_module_and_section_boundary_condition_dsym/a.out (x86_64) /usr/lib/dyld (x86_64) /usr/lib/libc++.1.dylib (x86_64) /usr/lib/libSystem.B.dylib (x86_64) /usr/lib/libc++abi.dylib (x86_64) /usr/lib/system/libcache.dylib (x86_64) /usr/lib/system/libcommonCrypto.dylib (x86_64) /usr/lib/system/libcompiler_rt.dylib (x86_64) /usr/lib/system/libcopyfile.dylib (x86_64) /usr/lib/system/libcorecrypto.dylib (x86_64) /usr/lib/system/libdispatch.dylib (x86_64) /usr/lib/system/libdyld.dylib (x86_64) /usr/lib/system/libkeymgr.dylib (x86_64) /usr/lib/system/liblaunch.dylib (x86_64) /usr/lib/system/libmacho.dylib (x86_64) /usr/lib/system/libquarantine.dylib (x86_64) /usr/lib/system/libremovefile.dylib (x86_64) /usr/lib/system/libsystem_asl.dylib (x86_64) /usr/lib/system/libsystem_blocks.dylib (x86_64) /usr/lib/system/libsystem_c.dylib (x86_64) /usr/lib/system/libsystem_configuration.dylib (x86_64) /usr/lib/system/libsystem_coreservices.dylib (x86_64) /usr/lib/system/libsystem_darwin.dylib (x86_64) /usr/lib/system/libsystem_dnssd.dylib (x86_64) /usr/lib/system/libsystem_info.dylib (x86_64) /usr/lib/system/libsystem_m.dylib (x86_64) /usr/lib/system/libsystem_malloc.dylib (x86_64) /usr/lib/system/libsystem_networkextension.dylib (x86_64) /usr/lib/system/libsystem_notify.dylib (x86_64) /usr/lib/system/libsystem_sandbox.dylib (x86_64) /usr/lib/system/libsystem_secinit.dylib (x86_64) /usr/lib/system/libsystem_kernel.dylib (x86_64) /usr/lib/system/libsystem_platform.dylib (x86_64) /usr/lib/system/libsystem_pthread.dylib (x86_64) /usr/lib/system/libsystem_symptoms.dylib (x86_64) /usr/lib/system/libsystem_trace.dylib (x86_64) /usr/lib/system/libunwind.dylib (x86_64) /usr/lib/system/libxpc.dylib (x86_64) /usr/lib/libobjc.A.dylib Exe module: (x86_64) /Users/buildslave/jenkins/workspace/lldb-cmake-matrix/lldb-build/tools/lldb/lldb-test-build.noindex/python_api/module_section/TestModuleAndSection.test_module_and_section_boundary_condition_dsym/a.out Number of sections: 5 [0x0000000100000000-0x0000000100004000) a.out.__TEXT Number of modules for the target: 39 (x86_64) /Users/buildslave/jenkins/workspace/lldb-cmake-matrix/lldb-build/tools/lldb/lldb-test-build.noindex/python_api/module_section/TestModuleAndSection.test_module_and_section_boundary_condition_dwarf/a.out (x86_64) /usr/lib/dyld (x86_64) /usr/lib/libc++.1.dylib (x86_64) /usr/lib/libSystem.B.dylib (x86_64) /usr/lib/libc++abi.dylib (x86_64) /usr/lib/system/libcache.dylib (x86_64) /usr/lib/system/libcommonCrypto.dylib (x86_64) /usr/lib/system/libcompiler_rt.dylib (x86_64) /usr/lib/system/libcopyfile.dylib (x86_64) /usr/lib/system/libcorecrypto.dylib (x86_64) /usr/lib/system/libdispatch.dylib (x86_64) /usr/lib/system/libdyld.dylib (x86_64) /usr/lib/system/libkeymgr.dylib (x86_64) /usr/lib/system/liblaunch.dylib (x86_64) /usr/lib/system/libmacho.dylib (x86_64) /usr/lib/system/libquarantine.dylib (x86_64) /usr/lib/system/libremovefile.dylib (x86_64) /usr/lib/system/libsystem_asl.dylib (x86_64) /usr/lib/system/libsystem_blocks.dylib (x86_64) /usr/lib/system/libsystem_c.dylib (x86_64) /usr/lib/system/libsystem_configuration.dylib (x86_64) /usr/lib/system/libsystem_coreservices.dylib (x86_64) /usr/lib/system/libsystem_darwin.dylib (x86_64) /usr/lib/system/libsystem_dnssd.dylib (x86_64) /usr/lib/system/libsystem_info.dylib (x86_64) /usr/lib/system/libsystem_m.dylib (x86_64) /usr/lib/system/libsystem_malloc.dylib (x86_64) /usr/lib/system/libsystem_networkextension.dylib (x86_64) /usr/lib/system/libsystem_notify.dylib (x86_64) /usr/lib/system/libsystem_sandbox.dylib (x86_64) /usr/lib/system/libsystem_secinit.dylib (x86_64) /usr/lib/system/libsystem_kernel.dylib (x86_64) /usr/lib/system/libsystem_platform.dylib (x86_64) /usr/lib/system/libsystem_pthread.dylib (x86_64) /usr/lib/system/libsystem_symptoms.dylib (x86_64) /usr/lib/system/libsystem_trace.dylib (x86_64) /usr/lib/system/libunwind.dylib (x86_64) /usr/lib/system/libxpc.dylib (x86_64) /usr/lib/libobjc.A.dylib Exe module: (x86_64) /Users/buildslave/jenkins/workspace/lldb-cmake-matrix/lldb-build/tools/lldb/lldb-test-build.noindex/python_api/module_section/TestModuleAndSection.test_module_and_section_boundary_condition_dwarf/a.out Number of sections: 4 [0x0000000100000000-0x0000000100004000) a.out.__TEXT Number of modules for the target: 39 (x86_64) /Users/buildslave/jenkins/workspace/lldb-cmake-matrix/lldb-build/tools/lldb/lldb-test-build.noindex/python_api/module_section/TestModuleAndSection.test_module_and_section_dsym/a.out (x86_64) /usr/lib/dyld (x86_64) /usr/lib/libc++.1.dylib (x86_64) /usr/lib/libSystem.B.dylib (x86_64) /usr/lib/libc++abi.dylib (x86_64) /usr/lib/system/libcache.dylib (x86_64) /usr/lib/system/libcommonCrypto.dylib (x86_64) /usr/lib/system/libcompiler_rt.dylib (x86_64) /usr/lib/system/libcopyfile.dylib (x86_64) /usr/lib/system/libcorecrypto.dylib (x86_64) /usr/lib/system/libdispatch.dylib (x86_64) /usr/lib/system/libdyld.dylib (x86_64) /usr/lib/system/libkeymgr.dylib (x86_64) /usr/lib/system/liblaunch.dylib (x86_64) /usr/lib/system/libmacho.dylib (x86_64) /usr/lib/system/libquarantine.dylib (x86_64) /usr/lib/system/libremovefile.dylib (x86_64) /usr/lib/system/libsystem_asl.dylib (x86_64) /usr/lib/system/libsystem_blocks.dylib (x86_64) /usr/lib/system/libsystem_c.dylib (x86_64) /usr/lib/system/libsystem_configuration.dylib (x86_64) /usr/lib/system/libsystem_coreservices.dylib (x86_64) /usr/lib/system/libsystem_darwin.dylib (x86_64) /usr/lib/system/libsystem_dnssd.dylib (x86_64) /usr/lib/system/libsystem_info.dylib (x86_64) /usr/lib/system/libsystem_m.dylib (x86_64) /usr/lib/system/libsystem_malloc.dylib (x86_64) /usr/lib/system/libsystem_networkextension.dylib (x86_64) /usr/lib/system/libsystem_notify.dylib (x86_64) /usr/lib/system/libsystem_sandbox.dylib (x86_64) /usr/lib/system/libsystem_secinit.dylib (x86_64) /usr/lib/system/libsystem_kernel.dylib (x86_64) /usr/lib/system/libsystem_platform.dylib (x86_64) /usr/lib/system/libsystem_pthread.dylib (x86_64) /usr/lib/system/libsystem_symptoms.dylib (x86_64) /usr/lib/system/libsystem_trace.dylib (x86_64) /usr/lib/system/libunwind.dylib (x86_64) /usr/lib/system/libxpc.dylib (x86_64) /usr/lib/libobjc.A.dylib Exe module: (x86_64) /Users/buildslave/jenkins/workspace/lldb-cmake-matrix/lldb-build/tools/lldb/lldb-test-build.noindex/python_api/module_section/TestModuleAndSection.test_module_and_section_dsym/a.out Number of sections: 5 Number of symbols: 83 [0x0000000000000000-0x0000000100000000) a.out.__PAGEZERO Number of subsections: 0 [0x0000000100000000-0x0000000100004000) a.out.__TEXT Number of subsections: 8 [0x0000000100001300-0x0000000100003c0d) a.out.__TEXT.__text id = {0x00000004}, range = [0x0000000100001300-0x00000001000013e0), name="mask_access(MaskAction, unsigned int)", mangled="_Z11mask_access10MaskActionj" symbol type: code id = {0x00000009}, range = [0x00000001000013e0-0x00000001000015c0), name="thread_func(void*)", mangled="_Z11thread_funcPv" symbol type: code id = {0x0000000f}, range = [0x00000001000015c0-0x00000001000015f0), name="std::__1::uniform_int_distribution<int>::uniform_int_distribution(int, int)", mangled="_ZNSt3__124uniform_int_distributionIiEC1Eii" symbol type: code id = {0x00000014}, range = [0x00000001000015f0-0x0000000100001630), name="int std::__1::uniform_int_distribution<int>::operator()<std::__1::linear_congruential_engine<unsigned int, 48271u, 0u, 2147483647u> >(std::__1::linear_congruential_engine<unsigned int, 48271u, 0u, 2147483647u>&)", mangled="_ZNSt3__124uniform_int_distributionIiEclINS_26linear_congruential_engineIjLj48271ELj0ELj2147483647EEEEEiRT_" symbol type: code id = {0x00000018}, range = [0x0000000100001630-0x0000000100001d70), name="void std::__1::this_thread::sleep_for<long long, std::__1::ratio<1l, 1000000l> >(std::__1::chrono::duration<long long, std::__1::ratio<1l, 1000000l> > const&)", mangled="_ZNSt3__111this_thread9sleep_forIxNS_5ratioILl1ELl1000000EEEEEvRKNS_6chrono8durationIT_T0_EE" symbol type: code id = {0x0000001d}, range = [0x0000000100001d70-0x00000001000021a0), name="main" symbol type: code id = {0x00000022}, range = [0x00000001000021a0-0x00000001000021d0), name="std::__1::thread::thread<void* (&)(void*), void*, void>(void* (&)(void*), void*&&)", mangled="_ZNSt3__16threadC1IRFPvS2_EJS2_EvEEOT_DpOT0_" symbol type: code id = {0x00000026}, range = [0x00000001000021d0-0x00000001000021e0), mangled="__clang_call_terminate" symbol type: code id = {0x0000002a}, range = [0x00000001000021e0-0x0000000100002210), name="std::__1::uniform_int_distribution<int>::uniform_int_distribution(int, int)", mangled="_ZNSt3__124uniform_int_distributionIiEC2Eii" symbol type: code id = {0x0000002e}, range = [0x0000000100002210-0x0000000100002240), name="std::__1::uniform_int_distribution<int>::param_type::param_type(int, int)", mangled="_ZNSt3__124uniform_int_distributionIiE10param_typeC1Eii" symbol type: code id = {0x00000032}, range = [0x0000000100002240-0x0000000100002260), name="std::__1::uniform_int_distribution<int>::param_type::param_type(int, int)", mangled="_ZNSt3__124uniform_int_distributionIiE10param_typeC2Eii" symbol type: code id = {0x00000036}, range = [0x0000000100002260-0x00000001000023b0), name="int std::__1::uniform_int_distribution<int>::operator()<std::__1::linear_congruential_engine<unsigned int, 48271u, 0u, 2147483647u> >(std::__1::linear_congruential_engine<unsigned int, 48271u, 0u, 2147483647u>&, std::__1::uniform_int_distribution<int>::param_type const&)", mangled="_ZNSt3__124uniform_int_distributionIiEclINS_26linear_congruential_engineIjLj48271ELj0ELj2147483647EEEEEiRT_RKNS1_10param_typeE" symbol type: code id = {0x0000003a}, range = [0x00000001000023b0-0x00000001000023d0), name="std::__1::uniform_int_distribution<int>::param_type::b() const", mangled="_ZNKSt3__124uniform_int_distributionIiE10param_type1bEv" symbol type: code id = {0x0000003e}, range = [0x00000001000023d0-0x00000001000023e0), name="std::__1::uniform_int_distribution<int>::param_type::a() const", mangled="_ZNKSt3__124uniform_int_distributionIiE10param_type1aEv" symbol type: code id = {0x00000042}, range = [0x00000001000023e0-0x0000000100002410), name="std::__1::__independent_bits_engine<std::__1::linear_congruential_engine<unsigned int, 48271u, 0u, 2147483647u>, unsigned int>::__independent_bits_engine(std::__1::linear_congruential_engine<unsigned int, 48271u, 0u, 2147483647u>&, unsigned long)", mangled="_ZNSt3__125__independent_bits_engineINS_26linear_congruential_engineIjLj48271ELj0ELj2147483647EEEjEC1ERS2_m" symbol type: code id = {0x00000046}, range = [0x0000000100002410-0x0000000100002430), name="std::__1::__independent_bits_engine<std::__1::linear_congruential_engine<unsigned int, 48271u, 0u, 2147483647u>, unsigned int>::operator()()", mangled="_ZNSt3__125__independent_bits_engineINS_26linear_congruential_engineIjLj48271ELj0ELj2147483647EEEjEclEv" symbol type: code id = {0x0000004a}, range = [0x0000000100002430-0x0000000100002680), name="std::__1::__independent_bits_engine<std::__1::linear_congruential_engine<unsigned int, 48271u, 0u, 2147483647u>, unsigned int>::__independent_bits_engine(std::__1::linear_congruential_engine<unsigned int, 48271u, 0u, 2147483647u>&, unsigned long)", mangled="_ZNSt3__125__independent_bits_engineINS_26linear_congruential_engineIjLj48271ELj0ELj2147483647EEEjEC2ERS2_m" symbol type: code id = {0x0000004e}, range = [0x0000000100002680-0x0000000100002900), name="std::__1::__independent_bits_engine<std::__1::linear_congruential_engine<unsigned int, 48271u, 0u, 2147483647u>, unsigned int>::__eval(std::__1::integral_constant<bool, true>)", mangled="_ZNSt3__125__independent_bits_engineINS_26linear_congruential_engineIjLj48271ELj0ELj2147483647EEEjE6__evalENS_17integral_constantIbLb1EEE" symbol type: code id = {0x00000052}, range = [0x0000000100002900-0x0000000100003470), name="std::__1::thread::thread<void* (&)(void*), void*, void>(void* (&)(void*), void*&&)", mangled="_ZNSt3__16threadC2IRFPvS2_EJS2_EvEEOT_DpOT0_" symbol type: code id = {0x00000059}, range = [0x0000000100003470-0x0000000100003900), name="void* std::__1::__thread_proxy<std::__1::tuple<std::__1::unique_ptr<std::__1::__thread_struct, std::__1::default_delete<std::__1::__thread_struct> >, void* (*)(void*), void*> >(void*)", mangled="_ZNSt3__114__thread_proxyINS_5tupleIJNS_10unique_ptrINS_15__thread_structENS_14default_deleteIS3_EEEEPFPvS7_ES7_EEEEES7_S7_" symbol type: code id = {0x0000005d}, range = [0x0000000100003900-0x0000000100003940), name="std::__1::__thread_specific_ptr<std::__1::__thread_struct>::set_pointer(std::__1::__thread_struct*)", mangled="_ZNSt3__121__thread_specific_ptrINS_15__thread_structEE11set_pointerEPS1_" symbol type: code id = {0x00000061}, range = [0x0000000100003940-0x0000000100003960), name="std::__1::tuple<std::__1::unique_ptr<std::__1::__thread_struct, std::__1::default_delete<std::__1::__thread_struct> >, void* (*)(void*), void*>::~tuple()", mangled="_ZNSt3__15tupleIJNS_10unique_ptrINS_15__thread_structENS_14default_deleteIS2_EEEEPFPvS6_ES6_EED1Ev" symbol type: code id = {0x00000065}, range = [0x0000000100003960-0x0000000100003980), name="std::__1::tuple<std::__1::unique_ptr<std::__1::__thread_struct, std::__1::default_delete<std::__1::__thread_struct> >, void* (*)(void*), void*>::~tuple()", mangled="_ZNSt3__15tupleIJNS_10unique_ptrINS_15__thread_structENS_14default_deleteIS2_EEEEPFPvS6_ES6_EED2Ev" symbol type: code id = {0x00000069}, range = [0x0000000100003980-0x00000001000039a0), name="std::__1::__tuple_impl<std::__1::__tuple_indices<0ul, 1ul, 2ul>, std::__1::unique_ptr<std::__1::__thread_struct, std::__1::default_delete<std::__1::__thread_struct> >, void* (*)(void*), void*>::~__tuple_impl()", mangled="_ZNSt3__112__tuple_implINS_15__tuple_indicesIJLm0ELm1ELm2EEEEJNS_10unique_ptrINS_15__thread_structENS_14default_deleteIS4_EEEEPFPvS8_ES8_EED1Ev" symbol type: code id = {0x0000006d}, range = [0x00000001000039a0-0x00000001000039c0), name="std::__1::__tuple_impl<std::__1::__tuple_indices<0ul, 1ul, 2ul>, std::__1::unique_ptr<std::__1::__thread_struct, std::__1::default_delete<std::__1::__thread_struct> >, void* (*)(void*), void*>::~__tuple_impl()", mangled="_ZNSt3__112__tuple_implINS_15__tuple_indicesIJLm0ELm1ELm2EEEEJNS_10unique_ptrINS_15__thread_structENS_14default_deleteIS4_EEEEPFPvS8_ES8_EED2Ev" symbol type: code id = {0x00000071}, range = [0x00000001000039c0-0x0000000100003a82), name="std::__1::__tuple_leaf<0ul, std::__1::unique_ptr<std::__1::__thread_struct, std::__1::default_delete<std::__1::__thread_struct> >, false>::~__tuple_leaf()", mangled="_ZNSt3__112__tuple_leafILm0ENS_10unique_ptrINS_15__thread_structENS_14default_deleteIS2_EEEELb0EED2Ev" symbol type: code id = {0x00000075}, range = [0x0000000100003a90-0x0000000100003ae0), mangled="__cxx_global_var_init" symbol type: code id = {0x00000079}, range = [0x0000000100003ae0-0x0000000100003b30), mangled="__cxx_global_var_init.1" symbol type: code id = {0x0000007d}, range = [0x0000000100003b30-0x0000000100003b80), mangled="__cxx_global_var_init.2" symbol type: code id = {0x00000081}, range = [0x0000000100003b80-0x0000000100003bc0), mangled="__cxx_global_var_init.3" symbol type: code id = {0x00000085}, range = [0x0000000100003bc0-0x0000000100003bda), mangled="_GLOBAL__sub_I_main.cpp" symbol type: code id = {0x00000094}, range = [0x0000000100003be0-0x0000000100003bf1), name="b_function(int)", mangled="_Z10b_functioni" symbol type: code id = {0x0000009c}, range = [0x0000000100003c00-0x0000000100003c0d), name="c_function(int)", mangled="_Z10c_functioni" symbol type: code [0x0000000100003c0e-0x0000000100003cc2) a.out.__TEXT.__stubs id = {0x000000c9}, range = [0x0000000100003c0e-0x0000000100003c14), mangled="_Unwind_Resume" symbol type: trampoline id = {0x000000ca}, range = [0x0000000100003c20-0x0000000100003c26), name="std::__1::this_thread::sleep_for(std::__1::chrono::duration<long long, std::__1::ratio<1l, 1000000000l> > const&)", mangled="_ZNSt3__111this_thread9sleep_forERKNS_6chrono8durationIxNS_5ratioILl1ELl1000000000EEEEE" symbol type: trampoline id = {0x000000cb}, range = [0x0000000100003c2c-0x0000000100003c32), name="std::__1::__thread_struct::__thread_struct()", mangled="_ZNSt3__115__thread_structC1Ev" symbol type: trampoline id = {0x000000cc}, range = [0x0000000100003c32-0x0000000100003c38), name="std::__1::__thread_struct::~__thread_struct()", mangled="_ZNSt3__115__thread_structD1Ev" symbol type: trampoline id = {0x000000cd}, range = [0x0000000100003c38-0x0000000100003c3e), name="std::__1::__thread_local_data()", mangled="_ZNSt3__119__thread_local_dataEv" symbol type: trampoline id = {0x000000ce}, range = [0x0000000100003c3e-0x0000000100003c44), name="std::__1::__throw_system_error(int, char const*)", mangled="_ZNSt3__120__throw_system_errorEiPKc" symbol type: trampoline id = {0x000000cf}, range = [0x0000000100003c62-0x0000000100003c68), name="std::__1::mutex::lock()", mangled="_ZNSt3__15mutex4lockEv" symbol type: trampoline id = {0x000000d0}, range = [0x0000000100003c68-0x0000000100003c6e), name="std::__1::mutex::unlock()", mangled="_ZNSt3__15mutex6unlockEv" symbol type: trampoline id = {0x000000d2}, range = [0x0000000100003c6e-0x0000000100003c74), name="std::__1::thread::join()", mangled="_ZNSt3__16thread4joinEv" symbol type: trampoline id = {0x000000d3}, range = [0x0000000100003c74-0x0000000100003c7a), name="std::__1::thread::~thread()", mangled="_ZNSt3__16threadD1Ev" symbol type: trampoline id = {0x000000d4}, range = [0x0000000100003c7a-0x0000000100003c80), name="std::terminate()", mangled="_ZSt9terminatev" symbol type: trampoline id = {0x000000d5}, range = [0x0000000100003c80-0x0000000100003c86), name="operator delete(void*)", mangled="_ZdlPv" symbol type: trampoline id = {0x000000d6}, range = [0x0000000100003c86-0x0000000100003c8c), name="operator new(unsigned long)", mangled="_Znwm" symbol type: trampoline id = {0x000000d7}, range = [0x0000000100003c8c-0x0000000100003c92), mangled="__cxa_atexit" symbol type: trampoline id = {0x000000d8}, range = [0x0000000100003c92-0x0000000100003c98), mangled="__cxa_begin_catch" symbol type: trampoline id = {0x000000da}, range = [0x0000000100003c98-0x0000000100003c9e), mangled="__stack_chk_fail" symbol type: trampoline id = {0x000000de}, range = [0x0000000100003c9e-0x0000000100003ca4), name="fflush" symbol type: trampoline id = {0x000000df}, range = [0x0000000100003ca4-0x0000000100003caa), name="fgets" symbol type: trampoline id = {0x000000e0}, range = [0x0000000100003caa-0x0000000100003cb0), name="printf" symbol type: trampoline id = {0x000000e1}, range = [0x0000000100003cb0-0x0000000100003cb6), name="pthread_create" symbol type: trampoline id = {0x000000e2}, range = [0x0000000100003cb6-0x0000000100003cbc), name="pthread_setspecific" symbol type: trampoline id = {0x000000e3}, range = [0x0000000100003cbc-0x0000000100003cc2), name="strtoul" symbol type: trampoline id = {0x000000e5}, range = [0x0000000100003c14-0x0000000100003c1a), name="std::__1::uniform_int_distribution<int>::param_type::a() const", mangled="_ZNKSt3__124uniform_int_distributionIiE10param_type1aEv" symbol type: trampoline id = {0x000000e6}, range = [0x0000000100003c1a-0x0000000100003c20), name="std::__1::uniform_int_distribution<int>::param_type::b() const", mangled="_ZNKSt3__124uniform_int_distributionIiE10param_type1bEv" symbol type: trampoline id = {0x000000e7}, range = [0x0000000100003c26-0x0000000100003c2c), name="void std::__1::this_thread::sleep_for<long long, std::__1::ratio<1l, 1000000l> >(std::__1::chrono::duration<long long, std::__1::ratio<1l, 1000000l> > const&)", mangled="_ZNSt3__111this_thread9sleep_forIxNS_5ratioILl1ELl1000000EEEEEvRKNS_6chrono8durationIT_T0_EE" symbol type: trampoline id = {0x000000e8}, range = [0x0000000100003c44-0x0000000100003c4a), name="std::__1::__thread_specific_ptr<std::__1::__thread_struct>::set_pointer(std::__1::__thread_struct*)", mangled="_ZNSt3__121__thread_specific_ptrINS_15__thread_structEE11set_pointerEPS1_" symbol type: trampoline id = {0x000000e9}, range = [0x0000000100003c4a-0x0000000100003c50), name="int std::__1::uniform_int_distribution<int>::operator()<std::__1::linear_congruential_engine<unsigned int, 48271u, 0u, 2147483647u> >(std::__1::linear_congruential_engine<unsigned int, 48271u, 0u, 2147483647u>&)", mangled="_ZNSt3__124uniform_int_distributionIiEclINS_26linear_congruential_engineIjLj48271ELj0ELj2147483647EEEEEiRT_" symbol type: trampoline id = {0x000000ea}, range = [0x0000000100003c50-0x0000000100003c56), name="int std::__1::uniform_int_distribution<int>::operator()<std::__1::linear_congruential_engine<unsigned int, 48271u, 0u, 2147483647u> >(std::__1::linear_congruential_engine<unsigned int, 48271u, 0u, 2147483647u>&, std::__1::uniform_int_distribution<int>::param_type const&)", mangled="_ZNSt3__124uniform_int_distributionIiEclINS_26linear_congruential_engineIjLj48271ELj0ELj2147483647EEEEEiRT_RKNS1_10param_typeE" symbol type: trampoline id = {0x000000eb}, range = [0x0000000100003c56-0x0000000100003c5c), name="std::__1::__independent_bits_engine<std::__1::linear_congruential_engine<unsigned int, 48271u, 0u, 2147483647u>, unsigned int>::__eval(std::__1::integral_constant<bool, true>)", mangled="_ZNSt3__125__independent_bits_engineINS_26linear_congruential_engineIjLj48271ELj0ELj2147483647EEEjE6__evalENS_17integral_constantIbLb1EEE" symbol type: trampoline id = {0x000000ec}, range = [0x0000000100003c5c-0x0000000100003c62), name="std::__1::__independent_bits_engine<std::__1::linear_congruential_engine<unsigned int, 48271u, 0u, 2147483647u>, unsigned int>::operator()()", mangled="_ZNSt3__125__independent_bits_engineINS_26linear_congruential_engineIjLj48271ELj0ELj2147483647EEEjEclEv" symbol type: trampoline [0x0000000100003cc4-0x0000000100003d9c) a.out.__TEXT.__stub_helper [0x0000000100003da0-0x0000000100003dc0) a.out.__TEXT.__const [0x0000000100003dc0-0x0000000100003df4) a.out.__TEXT.__gcc_except_tab id = {0x00000088}, range = [0x0000000100003dc0-0x0000000100003de0), name="GCC_except_table22" symbol type: data id = {0x00000089}, range = [0x0000000100003de0-0x0000000100003df4), name="GCC_except_table23" symbol type: data [0x0000000100003df4-0x0000000100003ef2) a.out.__TEXT.__cstring [0x0000000100003ef4-0x0000000100003f6c) a.out.__TEXT.__unwind_info [0x0000000100003f70-0x0000000100003ff8) a.out.__TEXT.__eh_frame [0x0000000100004000-0x0000000100005000) a.out.__DATA Number of subsections: 7 [0x0000000100004000-0x0000000100004010) a.out.__DATA.__nl_symbol_ptr [0x0000000100004010-0x0000000100004048) a.out.__DATA.__got [0x0000000100004048-0x0000000100004138) a.out.__DATA.__la_symbol_ptr [0x0000000100004138-0x0000000100004140) a.out.__DATA.__mod_init_func [0x0000000100004140-0x0000000100004180) a.out.__DATA.__data id = {0x0000008a}, range = [0x0000000100004140-0x0000000100004180), name="g_mask_mutex" symbol type: data [0x0000000100004180-0x0000000100004198) a.out.__DATA.__common id = {0x0000008b}, range = [0x0000000100004180-0x0000000100004188), name="g_thread_1" symbol type: data id = {0x0000008c}, range = [0x0000000100004188-0x0000000100004190), name="g_thread_2" symbol type: data id = {0x0000008d}, range = [0x0000000100004190-0x0000000100004198), name="g_thread_3" symbol type: data [0x0000000100004198-0x000000010000419c) a.out.__DATA.__bss id = {0x0000008e}, range = [0x0000000100004198-0x000000010000419c), name="mask_access(MaskAction, unsigned int)::g_mask", mangled="_ZZ11mask_access10MaskActionjE6g_mask" symbol type: data [0x0000000100005000-0x0000000100009000) a.out.__LINKEDIT Number of subsections: 0 [0x0000000100006000-0x0000000100025000) a.out.__DWARF Number of subsections: 12 [0x0000000100006000-0x0000000100007ad8) a.out.__DWARF.__debug_line [0x0000000100007ad8-0x0000000100008795) a.out.__DWARF.__debug_pubnames [0x0000000100008795-0x000000010000b6ef) a.out.__DWARF.__debug_pubtypes [0x000000010000b6ef-0x000000010000b90f) a.out.__DWARF.__debug_ranges [0x000000010000b90f-0x000000010000bb5f) a.out.__DWARF.__debug_aranges [0x000000010000bb5f-0x0000000100015334) a.out.__DWARF.__debug_info [0x0000000100015334-0x0000000100015a19) a.out.__DWARF.__debug_abbrev [0x0000000100015a19-0x00000001000212aa) a.out.__DWARF.__debug_str [0x00000001000212aa-0x0000000100022ca2) a.out.__DWARF.__apple_names [0x0000000100022ca2-0x0000000100022d4e) a.out.__DWARF.__apple_namespac [0x0000000100022d4e-0x0000000100024c96) a.out.__DWARF.__apple_types [0x0000000100024c96-0x0000000100024cba) a.out.__DWARF.__apple_objc Number of modules for the target: 39 (x86_64) /Users/buildslave/jenkins/workspace/lldb-cmake-matrix/lldb-build/tools/lldb/lldb-test-build.noindex/python_api/module_section/TestModuleAndSection.test_module_and_section_dwarf/a.out (x86_64) /usr/lib/dyld (x86_64) /usr/lib/libc++.1.dylib (x86_64) /usr/lib/libSystem.B.dylib (x86_64) /usr/lib/libc++abi.dylib (x86_64) /usr/lib/system/libcache.dylib (x86_64) /usr/lib/system/libcommonCrypto.dylib (x86_64) /usr/lib/system/libcompiler_rt.dylib (x86_64) /usr/lib/system/libcopyfile.dylib (x86_64) /usr/lib/system/libcorecrypto.dylib (x86_64) /usr/lib/system/libdispatch.dylib (x86_64) /usr/lib/system/libdyld.dylib (x86_64) /usr/lib/system/libkeymgr.dylib (x86_64) /usr/lib/system/liblaunch.dylib (x86_64) /usr/lib/system/libmacho.dylib (x86_64) /usr/lib/system/libquarantine.dylib (x86_64) /usr/lib/system/libremovefile.dylib (x86_64) /usr/lib/system/libsystem_asl.dylib (x86_64) /usr/lib/system/libsystem_blocks.dylib (x86_64) /usr/lib/system/libsystem_c.dylib (x86_64) /usr/lib/system/libsystem_configuration.dylib (x86_64) /usr/lib/system/libsystem_coreservices.dylib (x86_64) /usr/lib/system/libsystem_darwin.dylib (x86_64) /usr/lib/system/libsystem_dnssd.dylib (x86_64) /usr/lib/system/libsystem_info.dylib (x86_64) /usr/lib/system/libsystem_m.dylib (x86_64) /usr/lib/system/libsystem_malloc.dylib (x86_64) /usr/lib/system/libsystem_networkextension.dylib (x86_64) /usr/lib/system/libsystem_notify.dylib (x86_64) /usr/lib/system/libsystem_sandbox.dylib (x86_64) /usr/lib/system/libsystem_secinit.dylib (x86_64) /usr/lib/system/libsystem_kernel.dylib (x86_64) /usr/lib/system/libsystem_platform.dylib (x86_64) /usr/lib/system/libsystem_pthread.dylib (x86_64) /usr/lib/system/libsystem_symptoms.dylib (x86_64) /usr/lib/system/libsystem_trace.dylib (x86_64) /usr/lib/system/libunwind.dylib (x86_64) /usr/lib/system/libxpc.dylib (x86_64) /usr/lib/libobjc.A.dylib Exe module: (x86_64) /Users/buildslave/jenkins/workspace/lldb-cmake-matrix/lldb-build/tools/lldb/lldb-test-build.noindex/python_api/module_section/TestModuleAndSection.test_module_and_section_dwarf/a.out Number of sections: 4 Number of symbols: 83 [0x0000000000000000-0x0000000100000000) a.out.__PAGEZERO Number of subsections: 0 [0x0000000100000000-0x0000000100004000) a.out.__TEXT Number of subsections: 8 [0x0000000100001300-0x0000000100003c0d) a.out.__TEXT.__text id = {0x00000004}, range = [0x0000000100001300-0x00000001000013e0), name="mask_access(MaskAction, unsigned int)", mangled="_Z11mask_access10MaskActionj" symbol type: code id = {0x00000009}, range = [0x00000001000013e0-0x00000001000015c0), name="thread_func(void*)", mangled="_Z11thread_funcPv" symbol type: code id = {0x0000000f}, range = [0x00000001000015c0-0x00000001000015f0), name="std::__1::uniform_int_distribution<int>::uniform_int_distribution(int, int)", mangled="_ZNSt3__124uniform_int_distributionIiEC1Eii" symbol type: code id = {0x00000014}, range = [0x00000001000015f0-0x0000000100001630), name="int std::__1::uniform_int_distribution<int>::operator()<std::__1::linear_congruential_engine<unsigned int, 48271u, 0u, 2147483647u> >(std::__1::linear_congruential_engine<unsigned int, 48271u, 0u, 2147483647u>&)", mangled="_ZNSt3__124uniform_int_distributionIiEclINS_26linear_congruential_engineIjLj48271ELj0ELj2147483647EEEEEiRT_" symbol type: code id = {0x00000018}, range = [0x0000000100001630-0x0000000100001d70), name="void std::__1::this_thread::sleep_for<long long, std::__1::ratio<1l, 1000000l> >(std::__1::chrono::duration<long long, std::__1::ratio<1l, 1000000l> > const&)", mangled="_ZNSt3__111this_thread9sleep_forIxNS_5ratioILl1ELl1000000EEEEEvRKNS_6chrono8durationIT_T0_EE" symbol type: code id = {0x0000001d}, range = [0x0000000100001d70-0x00000001000021a0), name="main" symbol type: code id = {0x00000022}, range = [0x00000001000021a0-0x00000001000021d0), name="std::__1::thread::thread<void* (&)(void*), void*, void>(void* (&)(void*), void*&&)", mangled="_ZNSt3__16threadC1IRFPvS2_EJS2_EvEEOT_DpOT0_" symbol type: code id = {0x00000026}, range = [0x00000001000021d0-0x00000001000021e0), mangled="__clang_call_terminate" symbol type: code id = {0x0000002a}, range = [0x00000001000021e0-0x0000000100002210), name="std::__1::uniform_int_distribution<int>::uniform_int_distribution(int, int)", mangled="_ZNSt3__124uniform_int_distributionIiEC2Eii" symbol type: code id = {0x0000002e}, range = [0x0000000100002210-0x0000000100002240), name="std::__1::uniform_int_distribution<int>::param_type::param_type(int, int)", mangled="_ZNSt3__124uniform_int_distributionIiE10param_typeC1Eii" symbol type: code id = {0x00000032}, range = [0x0000000100002240-0x0000000100002260), name="std::__1::uniform_int_distribution<int>::param_type::param_type(int, int)", mangled="_ZNSt3__124uniform_int_distributionIiE10param_typeC2Eii" symbol type: code id = {0x00000036}, range = [0x0000000100002260-0x00000001000023b0), name="int std::__1::uniform_int_distribution<int>::operator()<std::__1::linear_congruential_engine<unsigned int, 48271u, 0u, 2147483647u> >(std::__1::linear_congruential_engine<unsigned int, 48271u, 0u, 2147483647u>&, std::__1::uniform_int_distribution<int>::param_type const&)", mangled="_ZNSt3__124uniform_int_distributionIiEclINS_26linear_congruential_engineIjLj48271ELj0ELj2147483647EEEEEiRT_RKNS1_10param_typeE" symbol type: code id = {0x0000003a}, range = [0x00000001000023b0-0x00000001000023d0), name="std::__1::uniform_int_distribution<int>::param_type::b() const", mangled="_ZNKSt3__124uniform_int_distributionIiE10param_type1bEv" symbol type: code id = {0x0000003e}, range = [0x00000001000023d0-0x00000001000023e0), name="std::__1::uniform_int_distribution<int>::param_type::a() const", mangled="_ZNKSt3__124uniform_int_distributionIiE10param_type1aEv" symbol type: code id = {0x00000042}, range = [0x00000001000023e0-0x0000000100002410), name="std::__1::__independent_bits_engine<std::__1::linear_congruential_engine<unsigned int, 48271u, 0u, 2147483647u>, unsigned int>::__independent_bits_engine(std::__1::linear_congruential_engine<unsigned int, 48271u, 0u, 2147483647u>&, unsigned long)", mangled="_ZNSt3__125__independent_bits_engineINS_26linear_congruential_engineIjLj48271ELj0ELj2147483647EEEjEC1ERS2_m" symbol type: code id = {0x00000046}, range = [0x0000000100002410-0x0000000100002430), name="std::__1::__independent_bits_engine<std::__1::linear_congruential_engine<unsigned int, 48271u, 0u, 2147483647u>, unsigned int>::operator()()", mangled="_ZNSt3__125__independent_bits_engineINS_26linear_congruential_engineIjLj48271ELj0ELj2147483647EEEjEclEv" symbol type: code id = {0x0000004a}, range = [0x0000000100002430-0x0000000100002680), name="std::__1::__independent_bits_engine<std::__1::linear_congruential_engine<unsigned int, 48271u, 0u, 2147483647u>, unsigned int>::__independent_bits_engine(std::__1::linear_congruential_engine<unsigned int, 48271u, 0u, 2147483647u>&, unsigned long)", mangled="_ZNSt3__125__independent_bits_engineINS_26linear_congruential_engineIjLj48271ELj0ELj2147483647EEEjEC2ERS2_m" symbol type: code id = {0x0000004e}, range = [0x0000000100002680-0x0000000100002900), name="std::__1::__independent_bits_engine<std::__1::linear_congruential_engine<unsigned int, 48271u, 0u, 2147483647u>, unsigned int>::__eval(std::__1::integral_constant<bool, true>)", mangled="_ZNSt3__125__independent_bits_engineINS_26linear_congruential_engineIjLj48271ELj0ELj2147483647EEEjE6__evalENS_17integral_constantIbLb1EEE" symbol type: code id = {0x00000052}, range = [0x0000000100002900-0x0000000100003470), name="std::__1::thread::thread<void* (&)(void*), void*, void>(void* (&)(void*), void*&&)", mangled="_ZNSt3__16threadC2IRFPvS2_EJS2_EvEEOT_DpOT0_" symbol type: code id = {0x00000059}, range = [0x0000000100003470-0x0000000100003900), name="void* std::__1::__thread_proxy<std::__1::tuple<std::__1::unique_ptr<std::__1::__thread_struct, std::__1::default_delete<std::__1::__thread_struct> >, void* (*)(void*), void*> >(void*)", mangled="_ZNSt3__114__thread_proxyINS_5tupleIJNS_10unique_ptrINS_15__thread_structENS_14default_deleteIS3_EEEEPFPvS7_ES7_EEEEES7_S7_" symbol type: code id = {0x0000005d}, range = [0x0000000100003900-0x0000000100003940), name="std::__1::__thread_specific_ptr<std::__1::__thread_struct>::set_pointer(std::__1::__thread_struct*)", mangled="_ZNSt3__121__thread_specific_ptrINS_15__thread_structEE11set_pointerEPS1_" symbol type: code id = {0x00000061}, range = [0x0000000100003940-0x0000000100003960), name="std::__1::tuple<std::__1::unique_ptr<std::__1::__thread_struct, std::__1::default_delete<std::__1::__thread_struct> >, void* (*)(void*), void*>::~tuple()", mangled="_ZNSt3__15tupleIJNS_10unique_ptrINS_15__thread_structENS_14default_deleteIS2_EEEEPFPvS6_ES6_EED1Ev" symbol type: code id = {0x00000065}, range = [0x0000000100003960-0x0000000100003980), name="std::__1::tuple<std::__1::unique_ptr<std::__1::__thread_struct, std::__1::default_delete<std::__1::__thread_struct> >, void* (*)(void*), void*>::~tuple()", mangled="_ZNSt3__15tupleIJNS_10unique_ptrINS_15__thread_structENS_14default_deleteIS2_EEEEPFPvS6_ES6_EED2Ev" symbol type: code id = {0x00000069}, range = [0x0000000100003980-0x00000001000039a0), name="std::__1::__tuple_impl<std::__1::__tuple_indices<0ul, 1ul, 2ul>, std::__1::unique_ptr<std::__1::__thread_struct, std::__1::default_delete<std::__1::__thread_struct> >, void* (*)(void*), void*>::~__tuple_impl()", mangled="_ZNSt3__112__tuple_implINS_15__tuple_indicesIJLm0ELm1ELm2EEEEJNS_10unique_ptrINS_15__thread_structENS_14default_deleteIS4_EEEEPFPvS8_ES8_EED1Ev" symbol type: code id = {0x0000006d}, range = [0x00000001000039a0-0x00000001000039c0), name="std::__1::__tuple_impl<std::__1::__tuple_indices<0ul, 1ul, 2ul>, std::__1::unique_ptr<std::__1::__thread_struct, std::__1::default_delete<std::__1::__thread_struct> >, void* (*)(void*), void*>::~__tuple_impl()", mangled="_ZNSt3__112__tuple_implINS_15__tuple_indicesIJLm0ELm1ELm2EEEEJNS_10unique_ptrINS_15__thread_structENS_14default_deleteIS4_EEEEPFPvS8_ES8_EED2Ev" symbol type: code id = {0x00000071}, range = [0x00000001000039c0-0x0000000100003a82), name="std::__1::__tuple_leaf<0ul, std::__1::unique_ptr<std::__1::__thread_struct, std::__1::default_delete<std::__1::__thread_struct> >, false>::~__tuple_leaf()", mangled="_ZNSt3__112__tuple_leafILm0ENS_10unique_ptrINS_15__thread_structENS_14default_deleteIS2_EEEELb0EED2Ev" symbol type: code id = {0x00000075}, range = [0x0000000100003a90-0x0000000100003ae0), mangled="__cxx_global_var_init" symbol type: code id = {0x00000079}, range = [0x0000000100003ae0-0x0000000100003b30), mangled="__cxx_global_var_init.1" symbol type: code id = {0x0000007d}, range = [0x0000000100003b30-0x0000000100003b80), mangled="__cxx_global_var_init.2" symbol type: code id = {0x00000081}, range = [0x0000000100003b80-0x0000000100003bc0), mangled="__cxx_global_var_init.3" symbol type: code id = {0x00000085}, range = [0x0000000100003bc0-0x0000000100003bda), mangled="_GLOBAL__sub_I_main.cpp" symbol type: code id = {0x00000094}, range = [0x0000000100003be0-0x0000000100003bf1), name="b_function(int)", mangled="_Z10b_functioni" symbol type: code id = {0x0000009c}, range = [0x0000000100003c00-0x0000000100003c0d), name="c_function(int)", mangled="_Z10c_functioni" symbol type: code [0x0000000100003c0e-0x0000000100003cc2) a.out.__TEXT.__stubs id = {0x000000c9}, range = [0x0000000100003c0e-0x0000000100003c14), mangled="_Unwind_Resume" symbol type: trampoline id = {0x000000ca}, range = [0x0000000100003c20-0x0000000100003c26), name="std::__1::this_thread::sleep_for(std::__1::chrono::duration<long long, std::__1::ratio<1l, 1000000000l> > const&)", mangled="_ZNSt3__111this_thread9sleep_forERKNS_6chrono8durationIxNS_5ratioILl1ELl1000000000EEEEE" symbol type: trampoline id = {0x000000cb}, range = [0x0000000100003c2c-0x0000000100003c32), name="std::__1::__thread_struct::__thread_struct()", mangled="_ZNSt3__115__thread_structC1Ev" symbol type: trampoline id = {0x000000cc}, range = [0x0000000100003c32-0x0000000100003c38), name="std::__1::__thread_struct::~__thread_struct()", mangled="_ZNSt3__115__thread_structD1Ev" symbol type: trampoline id = {0x000000cd}, range = [0x0000000100003c38-0x0000000100003c3e), name="std::__1::__thread_local_data()", mangled="_ZNSt3__119__thread_local_dataEv" symbol type: trampoline id = {0x000000ce}, range = [0x0000000100003c3e-0x0000000100003c44), name="std::__1::__throw_system_error(int, char const*)", mangled="_ZNSt3__120__throw_system_errorEiPKc" symbol type: trampoline id = {0x000000cf}, range = [0x0000000100003c62-0x0000000100003c68), name="std::__1::mutex::lock()", mangled="_ZNSt3__15mutex4lockEv" symbol type: trampoline id = {0x000000d0}, range = [0x0000000100003c68-0x0000000100003c6e), name="std::__1::mutex::unlock()", mangled="_ZNSt3__15mutex6unlockEv" symbol type: trampoline id = {0x000000d2}, range = [0x0000000100003c6e-0x0000000100003c74), name="std::__1::thread::join()", mangled="_ZNSt3__16thread4joinEv" symbol type: trampoline id = {0x000000d3}, range = [0x0000000100003c74-0x0000000100003c7a), name="std::__1::thread::~thread()", mangled="_ZNSt3__16threadD1Ev" symbol type: trampoline id = {0x000000d4}, range = [0x0000000100003c7a-0x0000000100003c80), name="std::terminate()", mangled="_ZSt9terminatev" symbol type: trampoline id = {0x000000d5}, range = [0x0000000100003c80-0x0000000100003c86), name="operator delete(void*)", mangled="_ZdlPv" symbol type: trampoline id = {0x000000d6}, range = [0x0000000100003c86-0x0000000100003c8c), name="operator new(unsigned long)", mangled="_Znwm" symbol type: trampoline id = {0x000000d7}, range = [0x0000000100003c8c-0x0000000100003c92), mangled="__cxa_atexit" symbol type: trampoline id = {0x000000d8}, range = [0x0000000100003c92-0x0000000100003c98), mangled="__cxa_begin_catch" symbol type: trampoline id = {0x000000da}, range = [0x0000000100003c98-0x0000000100003c9e), mangled="__stack_chk_fail" symbol type: trampoline id = {0x000000de}, range = [0x0000000100003c9e-0x0000000100003ca4), name="fflush" symbol type: trampoline id = {0x000000df}, range = [0x0000000100003ca4-0x0000000100003caa), name="fgets" symbol type: trampoline id = {0x000000e0}, range = [0x0000000100003caa-0x0000000100003cb0), name="printf" symbol type: trampoline id = {0x000000e1}, range = [0x0000000100003cb0-0x0000000100003cb6), name="pthread_create" symbol type: trampoline id = {0x000000e2}, range = [0x0000000100003cb6-0x0000000100003cbc), name="pthread_setspecific" symbol type: trampoline id = {0x000000e3}, range = [0x0000000100003cbc-0x0000000100003cc2), name="strtoul" symbol type: trampoline id = {0x000000e5}, range = [0x0000000100003c14-0x0000000100003c1a), name="std::__1::uniform_int_distribution<int>::param_type::a() const", mangled="_ZNKSt3__124uniform_int_distributionIiE10param_type1aEv" symbol type: trampoline id = {0x000000e6}, range = [0x0000000100003c1a-0x0000000100003c20), name="std::__1::uniform_int_distribution<int>::param_type::b() const", mangled="_ZNKSt3__124uniform_int_distributionIiE10param_type1bEv" symbol type: trampoline id = {0x000000e7}, range = [0x0000000100003c26-0x0000000100003c2c), name="void std::__1::this_thread::sleep_for<long long, std::__1::ratio<1l, 1000000l> >(std::__1::chrono::duration<long long, std::__1::ratio<1l, 1000000l> > const&)", mangled="_ZNSt3__111this_thread9sleep_forIxNS_5ratioILl1ELl1000000EEEEEvRKNS_6chrono8durationIT_T0_EE" symbol type: trampoline id = {0x000000e8}, range = [0x0000000100003c44-0x0000000100003c4a), name="std::__1::__thread_specific_ptr<std::__1::__thread_struct>::set_pointer(std::__1::__thread_struct*)", mangled="_ZNSt3__121__thread_specific_ptrINS_15__thread_structEE11set_pointerEPS1_" symbol type: trampoline id = {0x000000e9}, range = [0x0000000100003c4a-0x0000000100003c50), name="int std::__1::uniform_int_distribution<int>::operator()<std::__1::linear_congruential_engine<unsigned int, 48271u, 0u, 2147483647u> >(std::__1::linear_congruential_engine<unsigned int, 48271u, 0u, 2147483647u>&)", mangled="_ZNSt3__124uniform_int_distributionIiEclINS_26linear_congruential_engineIjLj48271ELj0ELj2147483647EEEEEiRT_" symbol type: trampoline id = {0x000000ea}, range = [0x0000000100003c50-0x0000000100003c56), name="int std::__1::uniform_int_distribution<int>::operator()<std::__1::linear_congruential_engine<unsigned int, 48271u, 0u, 2147483647u> >(std::__1::linear_congruential_engine<unsigned int, 48271u, 0u, 2147483647u>&, std::__1::uniform_int_distribution<int>::param_type const&)", mangled="_ZNSt3__124uniform_int_distributionIiEclINS_26linear_congruential_engineIjLj48271ELj0ELj2147483647EEEEEiRT_RKNS1_10param_typeE" symbol type: trampoline id = {0x000000eb}, range = [0x0000000100003c56-0x0000000100003c5c), name="std::__1::__independent_bits_engine<std::__1::linear_congruential_engine<unsigned int, 48271u, 0u, 2147483647u>, unsigned int>::__eval(std::__1::integral_constant<bool, true>)", mangled="_ZNSt3__125__independent_bits_engineINS_26linear_congruential_engineIjLj48271ELj0ELj2147483647EEEjE6__evalENS_17integral_constantIbLb1EEE" symbol type: trampoline id = {0x000000ec}, range = [0x0000000100003c5c-0x0000000100003c62), name="std::__1::__independent_bits_engine<std::__1::linear_congruential_engine<unsigned int, 48271u, 0u, 2147483647u>, unsigned int>::operator()()", mangled="_ZNSt3__125__independent_bits_engineINS_26linear_congruential_engineIjLj48271ELj0ELj2147483647EEEjEclEv" symbol type: trampoline [0x0000000100003cc4-0x0000000100003d9c) a.out.__TEXT.__stub_helper [0x0000000100003da0-0x0000000100003dc0) a.out.__TEXT.__const [0x0000000100003dc0-0x0000000100003df4) a.out.__TEXT.__gcc_except_tab id = {0x00000088}, range = [0x0000000100003dc0-0x0000000100003de0), name="GCC_except_table22" symbol type: data id = {0x00000089}, range = [0x0000000100003de0-0x0000000100003df4), name="GCC_except_table23" symbol type: data [0x0000000100003df4-0x0000000100003ef2) a.out.__TEXT.__cstring [0x0000000100003ef4-0x0000000100003f6c) a.out.__TEXT.__unwind_info [0x0000000100003f70-0x0000000100003ff8) a.out.__TEXT.__eh_frame [0x0000000100004000-0x0000000100005000) a.out.__DATA Number of subsections: 7 [0x0000000100004000-0x0000000100004010) a.out.__DATA.__nl_symbol_ptr [0x0000000100004010-0x0000000100004048) a.out.__DATA.__got [0x0000000100004048-0x0000000100004138) a.out.__DATA.__la_symbol_ptr [0x0000000100004138-0x0000000100004140) a.out.__DATA.__mod_init_func [0x0000000100004140-0x0000000100004180) a.out.__DATA.__data id = {0x0000008a}, range = [0x0000000100004140-0x0000000100004180), name="g_mask_mutex" symbol type: data [0x0000000100004180-0x0000000100004198) a.out.__DATA.__common id = {0x0000008b}, range = [0x0000000100004180-0x0000000100004188), name="g_thread_1" symbol type: data id = {0x0000008c}, range = [0x0000000100004188-0x0000000100004190), name="g_thread_2" symbol type: data id = {0x0000008d}, range = [0x0000000100004190-0x0000000100004198), name="g_thread_3" symbol type: data [0x0000000100004198-0x000000010000419c) a.out.__DATA.__bss id = {0x0000008e}, range = [0x0000000100004198-0x000000010000419c), name="mask_access(MaskAction, unsigned int)::g_mask", mangled="_ZZ11mask_access10MaskActionjE6g_mask" symbol type: data [0x0000000100005000-0x0000000100009000) a.out.__LINKEDIT Number of subsections: 0 Number of modules for the target: 39 (x86_64) /Users/buildslave/jenkins/workspace/lldb-cmake-matrix/lldb-build/tools/lldb/lldb-test-build.noindex/python_api/module_section/TestModuleAndSection.test_module_compile_unit_iter_dsym/a.out (x86_64) /usr/lib/dyld (x86_64) /usr/lib/libc++.1.dylib (x86_64) /usr/lib/libSystem.B.dylib (x86_64) /usr/lib/libc++abi.dylib (x86_64) /usr/lib/system/libcache.dylib (x86_64) /usr/lib/system/libcommonCrypto.dylib (x86_64) /usr/lib/system/libcompiler_rt.dylib (x86_64) /usr/lib/system/libcopyfile.dylib (x86_64) /usr/lib/system/libcorecrypto.dylib (x86_64) /usr/lib/system/libdispatch.dylib (x86_64) /usr/lib/system/libdyld.dylib (x86_64) /usr/lib/system/libkeymgr.dylib (x86_64) /usr/lib/system/liblaunch.dylib (x86_64) /usr/lib/system/libmacho.dylib (x86_64) /usr/lib/system/libquarantine.dylib (x86_64) /usr/lib/system/libremovefile.dylib (x86_64) /usr/lib/system/libsystem_asl.dylib (x86_64) /usr/lib/system/libsystem_blocks.dylib (x86_64) /usr/lib/system/libsystem_c.dylib (x86_64) /usr/lib/system/libsystem_configuration.dylib (x86_64) /usr/lib/system/libsystem_coreservices.dylib (x86_64) /usr/lib/system/libsystem_darwin.dylib (x86_64) /usr/lib/system/libsystem_dnssd.dylib (x86_64) /usr/lib/system/libsystem_info.dylib (x86_64) /usr/lib/system/libsystem_m.dylib (x86_64) /usr/lib/system/libsystem_malloc.dylib (x86_64) /usr/lib/system/libsystem_networkextension.dylib (x86_64) /usr/lib/system/libsystem_notify.dylib (x86_64) /usr/lib/system/libsystem_sandbox.dylib (x86_64) /usr/lib/system/libsystem_secinit.dylib (x86_64) /usr/lib/system/libsystem_kernel.dylib (x86_64) /usr/lib/system/libsystem_platform.dylib (x86_64) /usr/lib/system/libsystem_pthread.dylib (x86_64) /usr/lib/system/libsystem_symptoms.dylib (x86_64) /usr/lib/system/libsystem_trace.dylib (x86_64) /usr/lib/system/libunwind.dylib (x86_64) /usr/lib/system/libxpc.dylib (x86_64) /usr/lib/libobjc.A.dylib Exe module: (x86_64) /Users/buildslave/jenkins/workspace/lldb-cmake-matrix/lldb-build/tools/lldb/lldb-test-build.noindex/python_api/module_section/TestModuleAndSection.test_module_compile_unit_iter_dsym/a.out Number of compile units: 3 0x7f8285505498: CompileUnit{0x00000000}, language = "c++", file = '/Users/buildslave/jenkins/workspace/lldb-cmake-matrix/llvm-project/lldb/packages/Python/lldbsuite/test/python_api/module_section/main.cpp' 0x7f8285505588: CompileUnit{0x00000001}, language = "c++", file = '/Users/buildslave/jenkins/workspace/lldb-cmake-matrix/llvm-project/lldb/packages/Python/lldbsuite/test/python_api/module_section/b.cpp' 0x7f8285505678: CompileUnit{0x00000002}, language = "c++", file = '/Users/buildslave/jenkins/workspace/lldb-cmake-matrix/llvm-project/lldb/packages/Python/lldbsuite/test/python_api/module_section/c.cpp' Number of modules for the target: 39 (x86_64) /Users/buildslave/jenkins/workspace/lldb-cmake-matrix/lldb-build/tools/lldb/lldb-test-build.noindex/python_api/module_section/TestModuleAndSection.test_module_compile_unit_iter_dwarf/a.out (x86_64) /usr/lib/dyld (x86_64) /usr/lib/libc++.1.dylib (x86_64) /usr/lib/libSystem.B.dylib (x86_64) /usr/lib/libc++abi.dylib (x86_64) /usr/lib/system/libcache.dylib (x86_64) /usr/lib/system/libcommonCrypto.dylib (x86_64) /usr/lib/system/libcompiler_rt.dylib (x86_64) /usr/lib/system/libcopyfile.dylib (x86_64) /usr/lib/system/libcorecrypto.dylib (x86_64) /usr/lib/system/libdispatch.dylib (x86_64) /usr/lib/system/libdyld.dylib (x86_64) /usr/lib/system/libkeymgr.dylib (x86_64) /usr/lib/system/liblaunch.dylib (x86_64) /usr/lib/system/libmacho.dylib (x86_64) /usr/lib/system/libquarantine.dylib (x86_64) /usr/lib/system/libremovefile.dylib (x86_64) /usr/lib/system/libsystem_asl.dylib (x86_64) /usr/lib/system/libsystem_blocks.dylib (x86_64) /usr/lib/system/libsystem_c.dylib (x86_64) /usr/lib/system/libsystem_configuration.dylib (x86_64) /usr/lib/system/libsystem_coreservices.dylib (x86_64) /usr/lib/system/libsystem_darwin.dylib (x86_64) /usr/lib/system/libsystem_dnssd.dylib (x86_64) /usr/lib/system/libsystem_info.dylib (x86_64) /usr/lib/system/libsystem_m.dylib (x86_64) /usr/lib/system/libsystem_malloc.dylib (x86_64) /usr/lib/system/libsystem_networkextension.dylib (x86_64) /usr/lib/system/libsystem_notify.dylib (x86_64) /usr/lib/system/libsystem_sandbox.dylib (x86_64) /usr/lib/system/libsystem_secinit.dylib (x86_64) /usr/lib/system/libsystem_kernel.dylib (x86_64) /usr/lib/system/libsystem_platform.dylib (x86_64) /usr/lib/system/libsystem_pthread.dylib (x86_64) /usr/lib/system/libsystem_symptoms.dylib (x86_64) /usr/lib/system/libsystem_trace.dylib (x86_64) /usr/lib/system/libunwind.dylib (x86_64) /usr/lib/system/libxpc.dylib (x86_64) /usr/lib/libobjc.A.dylib Exe module: (x86_64) /Users/buildslave/jenkins/workspace/lldb-cmake-matrix/lldb-build/tools/lldb/lldb-test-build.noindex/python_api/module_section/TestModuleAndSection.test_module_compile_unit_iter_dwarf/a.out Number of compile units: 3 0x7f8285530028: CompileUnit{0x00000000}, language = "unknown", file = '/Users/buildslave/jenkins/workspace/lldb-cmake-matrix/llvm-project/lldb/packages/Python/lldbsuite/test/python_api/module_section/main.cpp' 0x7f82855308d8: CompileUnit{0x00000000}, language = "unknown", file = '/Users/buildslave/jenkins/workspace/lldb-cmake-matrix/llvm-project/lldb/packages/Python/lldbsuite/test/python_api/module_section/b.cpp' 0x7f8285530d68: CompileUnit{0x00000000}, language = "unknown", file = '/Users/buildslave/jenkins/workspace/lldb-cmake-matrix/llvm-project/lldb/packages/Python/lldbsuite/test/python_api/module_section/c.cpp'

Hide Details

Session logs for test failures/errors/unexpected successes will go into directory '/Users/buildslave/jenkins/workspace/lldb-cmake-matrix/test/logs' Command invoked: /Users/buildslave/jenkins/workspace/lldb-cmake-matrix/llvm-project/lldb/test/dotest.py --arch=x86_64 -s /Users/buildslave/jenkins/workspace/lldb-cmake-matrix/lldb-build/lldb-test-traces -S nm -u CXXFLAGS -u CFLAGS --executable /Users/buildslave/jenkins/workspace/lldb-cmake-matrix/lldb-build/./bin/lldb --dsymutil /Users/buildslave/jenkins/workspace/lldb-cmake-matrix/lldb-build/./bin/dsymutil --filecheck /Users/buildslave/jenkins/workspace/lldb-cmake-matrix/lldb-build/./bin/FileCheck -C /Users/buildslave/jenkins/workspace/lldb-cmake-matrix/clang_701_build/bin/clang --codesign-identity lldb_codesign --server /Users/buildslave/jenkins/workspace/lldb-cmake-matrix/lldb-build/./bin/debugserver --arch x86_64 --build-dir /Users/buildslave/jenkins/workspace/lldb-cmake-matrix/lldb-build/lldb-test-build.noindex -s=/Users/buildslave/jenkins/workspace/lldb-cmake-matrix/test/logs -t --env TERM=vt100 --skip-category gmodules --skip-category watchpoint --arch=x86_64 --env LLVM_LIBS_DIR=/Users/buildslave/jenkins/workspace/lldb-cmake-matrix/lldb-build/./lib --build-dir /Users/buildslave/jenkins/workspace/lldb-cmake-matrix/lldb-build/tools/lldb/lldb-test-build.noindex --module-cache-dir /Users/buildslave/jenkins/workspace/lldb-cmake-matrix/lldb-build/tools/lldb/lldb-test-build.noindex/module-cache-lldb /Users/buildslave/jenkins/workspace/lldb-cmake-matrix/llvm-project/lldb/packages/Python/lldbsuite/test/python_api/module_section -p TestModuleAndSection.py Change dir to: /Users/buildslave/jenkins/workspace/lldb-cmake-matrix/llvm-project/lldb/packages/Python/lldbsuite/test/python_api/module_section runCmd: settings set symbols.enable-external-lookup false output:

Hide Details

runCmd: settings set plugin.process.gdb-remote.packet-timeout 60 output:

Hide Details

runCmd: settings set symbols.clang-modules-cache-path "/Users/buildslave/jenkins/workspace/lldb-cmake-matrix/lldb-build/tools/lldb/lldb-test-build.noindex/module-cache-lldb" output:

Hide Details

runCmd: settings set use-color false output:

Hide Details

FAIL: LLDB (/Users/buildslave/jenkins/workspace/lldb-cmake-matrix/clang_701_build/bin/clang-7-x86_64) :: test_find_compile_units_dsym (TestModuleAndSection.ModuleAndSectionAPIsTestCase) runCmd: settings set symbols.enable-external-lookup false output:

Hide Details

runCmd: settings set plugin.process.gdb-remote.packet-timeout 60 output:

Hide Details

runCmd: settings set symbols.clang-modules-cache-path "/Users/buildslave/jenkins/workspace/lldb-cmake-matrix/lldb-build/tools/lldb/lldb-test-build.noindex/module-cache-lldb" output:

Hide Details

runCmd: settings set use-color false output:

Hide Details

PASS: LLDB (/Users/buildslave/jenkins/workspace/lldb-cmake-matrix/clang_701_build/bin/clang-7-x86_64) :: test_find_compile_units_dwarf (TestModuleAndSection.ModuleAndSectionAPIsTestCase) UNSUPPORTED: LLDB (/Users/buildslave/jenkins/workspace/lldb-cmake-matrix/clang_701_build/bin/clang-7-x86_64) :: test_find_compile_units_dwo (TestModuleAndSection.ModuleAndSectionAPIsTestCase) (test case does not fall in any category of interest for this run) UNSUPPORTED: LLDB (/Users/buildslave/jenkins/workspace/lldb-cmake-matrix/clang_701_build/bin/clang-7-x86_64) :: test_find_compile_units_gmodules (TestModuleAndSection.ModuleAndSectionAPIsTestCase) (test case does not fall in any category of interest for this run) runCmd: settings set symbols.enable-external-lookup false output:

Hide Details

runCmd: settings set plugin.process.gdb-remote.packet-timeout 60 output:

Hide Details

runCmd: settings set symbols.clang-modules-cache-path "/Users/buildslave/jenkins/workspace/lldb-cmake-matrix/lldb-build/tools/lldb/lldb-test-build.noindex/module-cache-lldb" output:

Hide Details

runCmd: settings set use-color false output:

Hide Details

PASS: LLDB (/Users/buildslave/jenkins/workspace/lldb-cmake-matrix/clang_701_build/bin/clang-7-x86_64) :: test_module_and_section_boundary_condition_dsym (TestModuleAndSection.ModuleAndSectionAPIsTestCase) runCmd: settings set symbols.enable-external-lookup false output:

Hide Details

runCmd: settings set plugin.process.gdb-remote.packet-timeout 60 output:

Hide Details

runCmd: settings set symbols.clang-modules-cache-path "/Users/buildslave/jenkins/workspace/lldb-cmake-matrix/lldb-build/tools/lldb/lldb-test-build.noindex/module-cache-lldb" output:

Hide Details

runCmd: settings set use-color false output:

Hide Details

PASS: LLDB (/Users/buildslave/jenkins/workspace/lldb-cmake-matrix/clang_701_build/bin/clang-7-x86_64) :: test_module_and_section_boundary_condition_dwarf (TestModuleAndSection.ModuleAndSectionAPIsTestCase) UNSUPPORTED: LLDB (/Users/buildslave/jenkins/workspace/lldb-cmake-matrix/clang_701_build/bin/clang-7-x86_64) :: test_module_and_section_boundary_condition_dwo (TestModuleAndSection.ModuleAndSectionAPIsTestCase) (test case does not fall in any category of interest for this run) UNSUPPORTED: LLDB (/Users/buildslave/jenkins/workspace/lldb-cmake-matrix/clang_701_build/bin/clang-7-x86_64) :: test_module_and_section_boundary_condition_gmodules (TestModuleAndSection.ModuleAndSectionAPIsTestCase) (test case does not fall in any category of interest for this run) runCmd: settings set symbols.enable-external-lookup false output:

Hide Details

runCmd: settings set plugin.process.gdb-remote.packet-timeout 60 output:

Hide Details

runCmd: settings set symbols.clang-modules-cache-path "/Users/buildslave/jenkins/workspace/lldb-cmake-matrix/lldb-build/tools/lldb/lldb-test-build.noindex/module-cache-lldb" output:

Hide Details

runCmd: settings set use-color false output:

Hide Details

PASS: LLDB (/Users/buildslave/jenkins/workspace/lldb-cmake-matrix/clang_701_build/bin/clang-7-x86_64) :: test_module_and_section_dsym (TestModuleAndSection.ModuleAndSectionAPIsTestCase) runCmd: settings set symbols.enable-external-lookup false output:

Hide Details

runCmd: settings set plugin.process.gdb-remote.packet-timeout 60 output:

Hide Details

runCmd: settings set symbols.clang-modules-cache-path "/Users/buildslave/jenkins/workspace/lldb-cmake-matrix/lldb-build/tools/lldb/lldb-test-build.noindex/module-cache-lldb" output:

Hide Details

runCmd: settings set use-color false output:

Hide Details

PASS: LLDB (/Users/buildslave/jenkins/workspace/lldb-cmake-matrix/clang_701_build/bin/clang-7-x86_64) :: test_module_and_section_dwarf (TestModuleAndSection.ModuleAndSectionAPIsTestCase) UNSUPPORTED: LLDB (/Users/buildslave/jenkins/workspace/lldb-cmake-matrix/clang_701_build/bin/clang-7-x86_64) :: test_module_and_section_dwo (TestModuleAndSection.ModuleAndSectionAPIsTestCase) (test case does not fall in any category of interest for this run) UNSUPPORTED: LLDB (/Users/buildslave/jenkins/workspace/lldb-cmake-matrix/clang_701_build/bin/clang-7-x86_64) :: test_module_and_section_gmodules (TestModuleAndSection.ModuleAndSectionAPIsTestCase) (test case does not fall in any category of interest for this run) runCmd: settings set symbols.enable-external-lookup false output:

Hide Details

runCmd: settings set plugin.process.gdb-remote.packet-timeout 60 output:

Hide Details

runCmd: settings set symbols.clang-modules-cache-path "/Users/buildslave/jenkins/workspace/lldb-cmake-matrix/lldb-build/tools/lldb/lldb-test-build.noindex/module-cache-lldb" output:

Hide Details

runCmd: settings set use-color false output:

Hide Details

PASS: LLDB (/Users/buildslave/jenkins/workspace/lldb-cmake-matrix/clang_701_build/bin/clang-7-x86_64) :: test_module_compile_unit_iter_dsym (TestModuleAndSection.ModuleAndSectionAPIsTestCase) runCmd: settings set symbols.enable-external-lookup false output:

Hide Details

runCmd: settings set plugin.process.gdb-remote.packet-timeout 60 output:

Hide Details

runCmd: settings set symbols.clang-modules-cache-path "/Users/buildslave/jenkins/workspace/lldb-cmake-matrix/lldb-build/tools/lldb/lldb-test-build.noindex/module-cache-lldb" output:

Hide Details

runCmd: settings set use-color false output:

Hide Details

PASS: LLDB (/Users/buildslave/jenkins/workspace/lldb-cmake-matrix/clang_701_build/bin/clang-7-x86_64) :: test_module_compile_unit_iter_dwarf (TestModuleAndSection.ModuleAndSectionAPIsTestCase) UNSUPPORTED: LLDB (/Users/buildslave/jenkins/workspace/lldb-cmake-matrix/clang_701_build/bin/clang-7-x86_64) :: test_module_compile_unit_iter_dwo (TestModuleAndSection.ModuleAndSectionAPIsTestCase) (test case does not fall in any category of interest for this run) UNSUPPORTED: LLDB (/Users/buildslave/jenkins/workspace/lldb-cmake-matrix/clang_701_build/bin/clang-7-x86_64) :: test_module_compile_unit_iter_gmodules (TestModuleAndSection.ModuleAndSectionAPIsTestCase) (test case does not fall in any category of interest for this run) Restore dir to: /Users/buildslave/jenkins/workspace/lldb-cmake-matrix/lldb-build/tools/lldb/lit ====================================================================== ERROR: test_find_compile_units_dsym (TestModuleAndSection.ModuleAndSectionAPIsTestCase) Exercise SBModule.FindCompileUnits() API. ---------------------------------------------------------------------- Error when building test subject.

Hide Details

Build Command: make VPATH=/Users/buildslave/jenkins/workspace/lldb-cmake-matrix/llvm-project/lldb/packages/Python/lldbsuite/test/python_api/module_section -C /Users/buildslave/jenkins/workspace/lldb-cmake-matrix/lldb-build/tools/lldb/lldb-test-build.noindex/python_api/module_section/TestModuleAndSection.test_find_compile_units_dsym -I /Users/buildslave/jenkins/workspace/lldb-cmake-matrix/llvm-project/lldb/packages/Python/lldbsuite/test/python_api/module_section -I /Users/buildslave/jenkins/workspace/lldb-cmake-matrix/llvm-project/lldb/packages/Python/lldbsuite/test/make -f /Users/buildslave/jenkins/workspace/lldb-cmake-matrix/llvm-project/lldb/packages/Python/lldbsuite/test/python_api/module_section/Makefile MAKE_DSYM=YES ARCH=x86_64 CC="/Users/buildslave/jenkins/workspace/lldb-cmake-matrix/clang_701_build/bin/clang-7" all EXE='b.out'

Hide Details

Build Command Output: /bin/sh: line 1: 19632 Killed: 9 /Users/buildslave/jenkins/workspace/lldb-cmake-matrix/clang_701_build/bin/clang-7 -M -std=c++11 -g -O0 -fno-builtin -isysroot "/Applications/Xcode.app/Contents/Developer/Platforms/MacOSX.platform/Developer/SDKs/MacOSX10.14.sdk" -arch x86_64 -I/Users/buildslave/jenkins/workspace/lldb-cmake-matrix/llvm-project/lldb/packages/Python/lldbsuite/test/make/../../../../../include -I/Users/buildslave/jenkins/workspace/lldb-cmake-matrix/llvm-project/lldb/packages/Python/lldbsuite/test/python_api/module_section -I/Users/buildslave/jenkins/workspace/lldb-cmake-matrix/llvm-project/lldb/packages/Python/lldbsuite/test/make -include /Users/buildslave/jenkins/workspace/lldb-cmake-matrix/llvm-project/lldb/packages/Python/lldbsuite/test/make/test_common.h -fno-limit-debug-info -D__STDC_LIMIT_MACROS --driver-mode=g++ /Users/buildslave/jenkins/workspace/lldb-cmake-matrix/llvm-project/lldb/packages/Python/lldbsuite/test/python_api/module_section/main.cpp > main.d.tmp clang-7: error: unable to execute command: Killed: 9 clang-7: error: clang frontend command failed due to signal (use -v to see invocation) clang version 7.0.1 Target: x86_64-apple-darwin18.0.0 Thread model: posix InstalledDir: /Users/buildslave/jenkins/workspace/lldb-cmake-matrix/clang_701_build/bin clang-7: note: diagnostic msg: PLEASE submit a bug report to https://bugs.llvm.org/ and include the crash backtrace, preprocessed source, and associated run script. clang-7: error: unable to execute command: Killed: 9 clang-7: note: diagnostic msg: Error generating preprocessed source(s). make: *** [main.o] Error 254

Hide Details

Test Directory: /Users/buildslave/jenkins/workspace/lldb-cmake-matrix/llvm-project/lldb/packages/Python/lldbsuite/test/python_api/module_section ---------------------------------------------------------------------- Ran 16 tests in 17.236s

Hide Details

RESULT: FAILED (7 passes, 0 failures, 1 errors, 8 skipped, 0 expected failures, 0 unexpected successes)

Hide Details

******************** TIMEOUT: LLDB :: SymbolFile/DWARF/debug-types-missing-signature.test (1694 of 1702) ******************** TEST 'LLDB :: SymbolFile/DWARF/debug-types-missing-signature.test' FAILED ******************** Script: -- : 'RUN: at line 3'; /Users/buildslave/jenkins/workspace/lldb-cmake-matrix/lldb-build/bin/clang --driver-mode=g++ -isysroot /Applications/Xcode.app/Contents/Developer/Platforms/MacOSX.platform/Developer/SDKs/MacOSX.sdk -fmodules-cache-path=/Users/buildslave/jenkins/workspace/lldb-cmake-matrix/lldb-build/tools/lldb/lldb-test-build.noindex/module-cache-clang -target x86_64-pc-linux /Users/buildslave/jenkins/workspace/lldb-cmake-matrix/llvm-project/lldb/lit/SymbolFile/DWARF/Inputs/debug-types-basic.cpp -g -gdwarf-4 -fdebug-types-section -c -o /Users/buildslave/jenkins/workspace/lldb-cmake-matrix/lldb-build/tools/lldb/lit/SymbolFile/DWARF/Output/debug-types-missing-signature.test.tmp.o : 'RUN: at line 5'; /Users/buildslave/jenkins/workspace/lldb-cmake-matrix/lldb-build/bin/llvm-objcopy --remove-section=.debug_types /Users/buildslave/jenkins/workspace/lldb-cmake-matrix/lldb-build/tools/lldb/lit/SymbolFile/DWARF/Output/debug-types-missing-signature.test.tmp.o /Users/buildslave/jenkins/workspace/lldb-cmake-matrix/lldb-build/tools/lldb/lit/SymbolFile/DWARF/Output/debug-types-missing-signature.test.tmp : 'RUN: at line 8'; /Users/buildslave/jenkins/workspace/lldb-cmake-matrix/lldb-build/bin/lldb --no-lldbinit -S /Users/buildslave/jenkins/workspace/lldb-cmake-matrix/lldb-build/tools/lldb/lit/lit-lldb-init /Users/buildslave/jenkins/workspace/lldb-cmake-matrix/lldb-build/tools/lldb/lit/SymbolFile/DWARF/Output/debug-types-missing-signature.test.tmp -b -o "type lookup A" | /Users/buildslave/jenkins/workspace/lldb-cmake-matrix/lldb-build/bin/FileCheck --check-prefix=LOOKUPA /Users/buildslave/jenkins/workspace/lldb-cmake-matrix/llvm-project/lldb/lit/SymbolFile/DWARF/debug-types-missing-signature.test : 'RUN: at line 11'; /Users/buildslave/jenkins/workspace/lldb-cmake-matrix/lldb-build/bin/lldb --no-lldbinit -S /Users/buildslave/jenkins/workspace/lldb-cmake-matrix/lldb-build/tools/lldb/lit/lit-lldb-init /Users/buildslave/jenkins/workspace/lldb-cmake-matrix/lldb-build/tools/lldb/lit/SymbolFile/DWARF/Output/debug-types-missing-signature.test.tmp -b -o "type lookup E" | /Users/buildslave/jenkins/workspace/lldb-cmake-matrix/lldb-build/bin/FileCheck --check-prefix=LOOKUPE /Users/buildslave/jenkins/workspace/lldb-cmake-matrix/llvm-project/lldb/lit/SymbolFile/DWARF/debug-types-missing-signature.test : 'RUN: at line 14'; /Users/buildslave/jenkins/workspace/lldb-cmake-matrix/lldb-build/bin/lldb --no-lldbinit -S /Users/buildslave/jenkins/workspace/lldb-cmake-matrix/lldb-build/tools/lldb/lit/lit-lldb-init /Users/buildslave/jenkins/workspace/lldb-cmake-matrix/lldb-build/tools/lldb/lit/SymbolFile/DWARF/Output/debug-types-missing-signature.test.tmp -b -o "type lookup EC" | /Users/buildslave/jenkins/workspace/lldb-cmake-matrix/lldb-build/bin/FileCheck --check-prefix=LOOKUPEC /Users/buildslave/jenkins/workspace/lldb-cmake-matrix/llvm-project/lldb/lit/SymbolFile/DWARF/debug-types-missing-signature.test : 'RUN: at line 17'; /Users/buildslave/jenkins/workspace/lldb-cmake-matrix/lldb-build/bin/lldb --no-lldbinit -S /Users/buildslave/jenkins/workspace/lldb-cmake-matrix/lldb-build/tools/lldb/lit/lit-lldb-init /Users/buildslave/jenkins/workspace/lldb-cmake-matrix/lldb-build/tools/lldb/lit/SymbolFile/DWARF/Output/debug-types-missing-signature.test.tmp -b -o "print (E) 1" 2>&1 | /Users/buildslave/jenkins/workspace/lldb-cmake-matrix/lldb-build/bin/FileCheck --check-prefix=PRINTE /Users/buildslave/jenkins/workspace/lldb-cmake-matrix/llvm-project/lldb/lit/SymbolFile/DWARF/debug-types-missing-signature.test : 'RUN: at line 20'; /Users/buildslave/jenkins/workspace/lldb-cmake-matrix/lldb-build/bin/lldb --no-lldbinit -S /Users/buildslave/jenkins/workspace/lldb-cmake-matrix/lldb-build/tools/lldb/lit/lit-lldb-init /Users/buildslave/jenkins/workspace/lldb-cmake-matrix/lldb-build/tools/lldb/lit/SymbolFile/DWARF/Output/debug-types-missing-signature.test.tmp -b -o "print (EC) 1" 2>&1 | /Users/buildslave/jenkins/workspace/lldb-cmake-matrix/lldb-build/bin/FileCheck --check-prefix=PRINTEC /Users/buildslave/jenkins/workspace/lldb-cmake-matrix/llvm-project/lldb/lit/SymbolFile/DWARF/debug-types-missing-signature.test : 'RUN: at line 23'; /Users/buildslave/jenkins/workspace/lldb-cmake-matrix/lldb-build/bin/lldb --no-lldbinit -S /Users/buildslave/jenkins/workspace/lldb-cmake-matrix/lldb-build/tools/lldb/lit/lit-lldb-init /Users/buildslave/jenkins/workspace/lldb-cmake-matrix/lldb-build/tools/lldb/lit/SymbolFile/DWARF/Output/debug-types-missing-signature.test.tmp -b -o "target variable a e ec" | /Users/buildslave/jenkins/workspace/lldb-cmake-matrix/lldb-build/bin/FileCheck --check-prefix=VARS /Users/buildslave/jenkins/workspace/lldb-cmake-matrix/llvm-project/lldb/lit/SymbolFile/DWARF/debug-types-missing-signature.test -- Exit Code: -9 Timeout: Reached timeout of 600 seconds

Hide Details

Command Output (stderr): -- clang-10: warning: argument unused during compilation: '-fmodules-cache-path=/Users/buildslave/jenkins/workspace/lldb-cmake-matrix/lldb-build/tools/lldb/lldb-test-build.noindex/module-cache-clang' [-Wunused-command-line-argument]

Hide Details

--

Hide Details

******************** TIMEOUT: LLDB :: Quit/TestQuitExitCodeNonInt.test (1695 of 1702) ******************** TEST 'LLDB :: Quit/TestQuitExitCodeNonInt.test' FAILED ******************** Script: -- : 'RUN: at line 2'; /Users/buildslave/jenkins/workspace/lldb-cmake-matrix/lldb-build/bin/lldb --no-lldbinit -S /Users/buildslave/jenkins/workspace/lldb-cmake-matrix/lldb-build/tools/lldb/lit/lit-lldb-init -b -s /Users/buildslave/jenkins/workspace/lldb-cmake-matrix/llvm-project/lldb/lit/Quit/TestQuitExitCodeNonInt.test 2>&1 | /Users/buildslave/jenkins/workspace/lldb-cmake-matrix/lldb-build/bin/FileCheck /Users/buildslave/jenkins/workspace/lldb-cmake-matrix/llvm-project/lldb/lit/Quit/TestQuitExitCodeNonInt.test -- Exit Code: -9 Timeout: Reached timeout of 600 seconds

Hide Details

Hide Details

******************** TIMEOUT: LLDB :: Driver/TestRepl.test (1696 of 1702) ******************** TEST 'LLDB :: Driver/TestRepl.test' FAILED ******************** Script: -- : 'RUN: at line 1'; echo ':quit' | /Users/buildslave/jenkins/workspace/lldb-cmake-matrix/lldb-build/bin/lldb --no-lldbinit -S /Users/buildslave/jenkins/workspace/lldb-cmake-matrix/lldb-build/tools/lldb/lit/lit-lldb-init -x --repl -O 'expr 42' -S /Users/buildslave/jenkins/workspace/lldb-cmake-matrix/llvm-project/lldb/lit/Driver/Inputs/Print2.in -o 'expr 999999' -s /Users/buildslave/jenkins/workspace/lldb-cmake-matrix/llvm-project/lldb/lit/Driver/TestRepl.test 2>&1 | /Users/buildslave/jenkins/workspace/lldb-cmake-matrix/lldb-build/bin/FileCheck /Users/buildslave/jenkins/workspace/lldb-cmake-matrix/llvm-project/lldb/lit/Driver/TestRepl.test -- Exit Code: -9 Timeout: Reached timeout of 600 seconds

Hide Details

Hide Details

******************** TIMEOUT: LLDB :: Driver/TestSingleQuote.test (1697 of 1702) ******************** TEST 'LLDB :: Driver/TestSingleQuote.test' FAILED ******************** Script: -- : 'RUN: at line 2'; /Users/buildslave/jenkins/workspace/lldb-cmake-matrix/lldb-build/bin/clang -isysroot /Applications/Xcode.app/Contents/Developer/Platforms/MacOSX.platform/Developer/SDKs/MacOSX.sdk -fmodules-cache-path=/Users/buildslave/jenkins/workspace/lldb-cmake-matrix/lldb-build/tools/lldb/lldb-test-build.noindex/module-cache-clang /Users/buildslave/jenkins/workspace/lldb-cmake-matrix/llvm-project/lldb/lit/Driver/Inputs/hello.c -g -o "/Users/buildslave/jenkins/workspace/lldb-cmake-matrix/lldb-build/tools/lldb/lit/Driver/Output/TestSingleQuote.test.tmp-'pat" : 'RUN: at line 3'; /Users/buildslave/jenkins/workspace/lldb-cmake-matrix/lldb-build/bin/lldb --no-lldbinit -S /Users/buildslave/jenkins/workspace/lldb-cmake-matrix/lldb-build/tools/lldb/lit/lit-lldb-init -s /Users/buildslave/jenkins/workspace/lldb-cmake-matrix/llvm-project/lldb/lit/Driver/TestSingleQuote.test "/Users/buildslave/jenkins/workspace/lldb-cmake-matrix/lldb-build/tools/lldb/lit/Driver/Output/TestSingleQuote.test.tmp-'pat" | /Users/buildslave/jenkins/workspace/lldb-cmake-matrix/lldb-build/bin/FileCheck /Users/buildslave/jenkins/workspace/lldb-cmake-matrix/llvm-project/lldb/lit/Driver/TestSingleQuote.test -- Exit Code: -9 Timeout: Reached timeout of 600 seconds

Hide Details

Command Output (stderr): -- clang-10: warning: argument unused during compilation: '-fmodules-cache-path=/Users/buildslave/jenkins/workspace/lldb-cmake-matrix/lldb-build/tools/lldb/lldb-test-build.noindex/module-cache-clang' [-Wunused-command-line-argument]

Hide Details

--

Hide Details

******************** TIMEOUT: lldb-Unit :: tools/lldb-server/tests/./LLDBServerTests/TestBase.DebugserverEnv (1698 of 1702) ******************** TEST 'lldb-Unit :: tools/lldb-server/tests/./LLDBServerTests/TestBase.DebugserverEnv' FAILED ******************** Reached timeout of 600 seconds ******************** TIMEOUT: LLDB :: SymbolFile/Breakpad/unwind-via-stack-win.test (1699 of 1702) ******************** TEST 'LLDB :: SymbolFile/Breakpad/unwind-via-stack-win.test' FAILED ******************** Script: -- : 'RUN: at line 1'; /Users/buildslave/jenkins/workspace/lldb-cmake-matrix/lldb-build/bin/yaml2obj /Users/buildslave/jenkins/workspace/lldb-cmake-matrix/llvm-project/lldb/lit/SymbolFile/Breakpad/Inputs/unwind-via-stack-win.yaml > /Users/buildslave/jenkins/workspace/lldb-cmake-matrix/lldb-build/tools/lldb/lit/SymbolFile/Breakpad/Output/unwind-via-stack-win.test.tmp : 'RUN: at line 2'; /Users/buildslave/jenkins/workspace/lldb-cmake-matrix/lldb-build/bin/lldb --no-lldbinit -S /Users/buildslave/jenkins/workspace/lldb-cmake-matrix/lldb-build/tools/lldb/lit/lit-lldb-init -c /Users/buildslave/jenkins/workspace/lldb-cmake-matrix/lldb-build/tools/lldb/lit/SymbolFile/Breakpad/Output/unwind-via-stack-win.test.tmp -o "target symbols add /Users/buildslave/jenkins/workspace/lldb-cmake-matrix/llvm-project/lldb/lit/SymbolFile/Breakpad/Inputs/unwind-via-stack-win.syms" -s /Users/buildslave/jenkins/workspace/lldb-cmake-matrix/llvm-project/lldb/lit/SymbolFile/Breakpad/unwind-via-stack-win.test -b | /Users/buildslave/jenkins/workspace/lldb-cmake-matrix/lldb-build/bin/FileCheck /Users/buildslave/jenkins/workspace/lldb-cmake-matrix/llvm-project/lldb/lit/SymbolFile/Breakpad/unwind-via-stack-win.test -- Exit Code: -9 Timeout: Reached timeout of 600 seconds

Hide Details

Hide Details

******************** PASS: lldb-Suite :: lang/objc/foundation/TestFoundationDisassembly.py (1700 of 1702) TIMEOUT: LLDB :: SymbolFile/DWARF/deterministic-build.cpp (1701 of 1702) ******************** TEST 'LLDB :: SymbolFile/DWARF/deterministic-build.cpp' FAILED ******************** Script: -- : 'RUN: at line 5'; /Users/buildslave/jenkins/workspace/lldb-cmake-matrix/lldb-build/bin/clang -isysroot /Applications/Xcode.app/Contents/Developer/Platforms/MacOSX.platform/Developer/SDKs/MacOSX.sdk -fmodules-cache-path=/Users/buildslave/jenkins/workspace/lldb-cmake-matrix/lldb-build/tools/lldb/lldb-test-build.noindex/module-cache-clang /Users/buildslave/jenkins/workspace/lldb-cmake-matrix/llvm-project/lldb/lit/SymbolFile/DWARF/deterministic-build.cpp -g -c -o /Users/buildslave/jenkins/workspace/lldb-cmake-matrix/lldb-build/tools/lldb/lit/SymbolFile/DWARF/Output/deterministic-build.cpp.tmp.o : 'RUN: at line 6'; ZERO_AR_DATE=1 /Users/buildslave/jenkins/workspace/lldb-cmake-matrix/lldb-build/bin/clang -isysroot /Applications/Xcode.app/Contents/Developer/Platforms/MacOSX.platform/Developer/SDKs/MacOSX.sdk -fmodules-cache-path=/Users/buildslave/jenkins/workspace/lldb-cmake-matrix/lldb-build/tools/lldb/lldb-test-build.noindex/module-cache-clang /Users/buildslave/jenkins/workspace/lldb-cmake-matrix/lldb-build/tools/lldb/lit/SymbolFile/DWARF/Output/deterministic-build.cpp.tmp.o -g -o /Users/buildslave/jenkins/workspace/lldb-cmake-matrix/lldb-build/tools/lldb/lit/SymbolFile/DWARF/Output/deterministic-build.cpp.tmp : 'RUN: at line 7'; /Users/buildslave/jenkins/workspace/lldb-cmake-matrix/lldb-build/bin/lldb --no-lldbinit -S /Users/buildslave/jenkins/workspace/lldb-cmake-matrix/lldb-build/tools/lldb/lit/lit-lldb-init /Users/buildslave/jenkins/workspace/lldb-cmake-matrix/lldb-build/tools/lldb/lit/SymbolFile/DWARF/Output/deterministic-build.cpp.tmp -o "breakpoint set -f /Users/buildslave/jenkins/workspace/lldb-cmake-matrix/llvm-project/lldb/lit/SymbolFile/DWARF/deterministic-build.cpp -l 11" -o run -o exit | /Users/buildslave/jenkins/workspace/lldb-cmake-matrix/lldb-build/bin/FileCheck /Users/buildslave/jenkins/workspace/lldb-cmake-matrix/llvm-project/lldb/lit/SymbolFile/DWARF/deterministic-build.cpp -- Exit Code: -9 Timeout: Reached timeout of 600 seconds

Hide Details

Command Output (stderr): -- clang-10: warning: argument unused during compilation: '-fmodules-cache-path=/Users/buildslave/jenkins/workspace/lldb-cmake-matrix/lldb-build/tools/lldb/lldb-test-build.noindex/module-cache-clang' [-Wunused-command-line-argument]

Hide Details

--

Hide Details

******************** TIMEOUT: LLDB :: Settings/TestSettingsSet.test (1702 of 1702) ******************** TEST 'LLDB :: Settings/TestSettingsSet.test' FAILED ******************** Script: -- : 'RUN: at line 4'; /Users/buildslave/jenkins/workspace/lldb-cmake-matrix/lldb-build/bin/lldb --no-lldbinit -S /Users/buildslave/jenkins/workspace/lldb-cmake-matrix/lldb-build/tools/lldb/lit/lit-lldb-init -b -s /Users/buildslave/jenkins/workspace/lldb-cmake-matrix/llvm-project/lldb/lit/Settings/TestSettingsSet.test 2>&1 | /Users/buildslave/jenkins/workspace/lldb-cmake-matrix/lldb-build/bin/FileCheck /Users/buildslave/jenkins/workspace/lldb-cmake-matrix/llvm-project/lldb/lit/Settings/TestSettingsSet.test -- Exit Code: -9 Timeout: Reached timeout of 600 seconds

Hide Details

Hide Details

******************** Testing Time: 1339.91s ******************** Failing Tests (358): lldb-Suite :: types/TestIntegerTypesExpr.py lldb-Suite :: types/TestIntegerTypes.py lldb-Suite :: tools/lldb-server/TestLldbGdbServer.py lldb-Suite :: lang/cpp/enum_types/TestCPP11EnumTypes.py lldb-Suite :: functionalities/data-formatter/data-formatter-objc/TestDataFormatterObjCNSDate.py lldb-Suite :: macosx/find-dsym/bundle-with-dot-in-filename/TestBundleWithDotInFilename.py lldb-Suite :: commands/target/basic/TestTargetCommand.py lldb-Suite :: functionalities/mtc/simple/TestMTCSimple.py LLDB :: Expr/TestIRMemoryMap.test lldb-Suite :: tools/lldb-server/TestGdbRemoteExitCode.py lldb-Suite :: lang/objc/objc-ivar-protocols/TestIvarProtocols.py lldb-Suite :: lang/objc/radar-9691614/TestObjCMethodReturningBOOL.py lldb-Suite :: lang/objcxx/hide-runtime-values/TestObjCXXHideRuntimeValues.py lldb-Suite :: commands/apropos/with-process/TestAproposWithProcess.py lldb-Suite :: functionalities/thread/concurrent_events/TestConcurrentDelaySignalBreak.py lldb-Suite :: commands/expression/context-object/TestContextObject.py LLDB :: Reproducer/TestDriverOptions.test lldb-Suite :: commands/frame/diagnose/dereference-this/TestDiagnoseDereferenceThis.py lldb-Suite :: lang/cpp/global_operators/TestCppGlobalOperators.py lldb-Suite :: lang/objc/objc-runtime-ivars/TestRuntimeIvars.py LLDB :: SymbolFile/Breakpad/line-table-edgecases.test lldb-Suite :: python_api/lldbutil/frame/TestFrameUtils.py lldb-Suite :: lang/objc/objc-static-method-stripped/TestObjCStaticMethodStripped.py lldb-Suite :: functionalities/data-formatter/type_summary_list_script/TestTypeSummaryListScript.py LLDB :: Modules/Breakpad/sections.test LLDB :: SymbolFile/DWARF/compilercontext.ll lldb-Unit :: Language/Highlighting/./HighlighterTests/HighlighterTest.HighlighterSelectionPath lldb-Suite :: python_api/signals/TestSignalsAPI.py lldb-Unit :: UnwindAssembly/x86/./UnwindAssemblyx86Tests/Testx86AssemblyInspectionEngine.TestAddESP lldb-Unit :: Host/./HostTests/MainLoopTest.Signal lldb-Unit :: Utility/./UtilityTests/CompletionRequest.Constructor lldb-Suite :: functionalities/memory/find/TestMemoryFind.py lldb-Unit :: Process/gdb-remote/./ProcessGdbRemoteTests/GDBRemoteCommunicationClientTest.SendGetDataPacket lldb-Suite :: python_api/interpreter/TestCommandInterpreterAPI.py LLDB :: Modules/ELF/section-permissions.yaml lldb-Suite :: functionalities/data-formatter/hexcaps/TestDataFormatterHexCaps.py lldb-Unit :: Expression/./ExpressionTests/ClangHostTest.MacOSX lldb-Suite :: functionalities/data-formatter/nsdictionarysynth/TestNSDictionarySynthetic.py lldb-Suite :: python_api/function_symbol/TestDisasmAPI.py lldb-Suite :: functionalities/data-formatter/data-formatter-objc/TestDataFormatterObjCPlain.py lldb-Unit :: Utility/./UtilityTests/NameMatchesTest.StartsWith LLDB :: Settings/TestEchoCommands.test lldb-Suite :: commands/breakpoint/basic/TestRegexpBreakCommand.py lldb-Suite :: functionalities/target-new-solib-notifications/TestModuleLoadedNotifys.py lldb-Suite :: functionalities/tsan/thread_numbers/TestTsanThreadNumbers.py lldb-Unit :: Utility/./UtilityTests/RangeTest.DoesAdjoinOrIntersect lldb-Suite :: lang/cpp/char1632_t/TestChar1632T.py lldb-Suite :: lang/c/bitfields/TestBitfields.py lldb-Suite :: lang/objc/objc++/TestObjCXX.py lldb-Unit :: UnwindAssembly/x86/./UnwindAssemblyx86Tests/Testx86AssemblyInspectionEngine.TestPushEAX lldb-Suite :: commands/frame/diagnose/array/TestArray.py lldb-Suite :: lang/cpp/auto/TestCPPAuto.py lldb-Unit :: Utility/./UtilityTests/StringListTest.InsertStringAtIndexMove lldb-Suite :: functionalities/thread/backtrace_all/TestBacktraceAll.py lldb-Suite :: functionalities/type_lookup/TestTypeLookup.py lldb-Suite :: lang/objc/objc-static-method/TestObjCStaticMethod.py LLDB :: Commands/CommandScriptImmediateOutput/CommandScriptImmediateOutputConsole.test lldb-Suite :: api/listeners/TestListener.py lldb-Suite :: functionalities/data-formatter/data-formatter-smart-array/TestDataFormatterSmartArray.py lldb-Suite :: lang/cpp/breakpoint-commands/TestCPPBreakpointCommands.py lldb-Suite :: functionalities/data-formatter/data-formatter-categories/TestDataFormatterCategories.py lldb-Suite :: types/TestFloatTypesExpr.py LLDB :: Reproducer/Functionalities/TestImageList.test lldb-Suite :: commands/frame/diagnose/inheritance/TestDiagnoseInheritance.py lldb-Suite :: python_api/process/io/TestProcessIO.py lldb-Suite :: commands/target/create-deps/TestTargetCreateDeps.py lldb-Suite :: commands/expression/no-deadlock/TestExprDoesntBlock.py lldb-Suite :: lang/objc/modules/TestObjCModules.py LLDB :: Modules/ELF/build-id-case.yaml lldb-Suite :: lang/c/forward/TestForwardDeclaration.py lldb-Suite :: commands/expression/persist_objc_pointeetype/TestPersistObjCPointeeType.py lldb-Suite :: lang/objc/variadic_methods/TestVariadicMethods.py lldb-Suite :: commands/expression/function_template_specialization_temp_args/TestFunctionTemplateSpecializationTempArgs.py lldb-Suite :: lang/cpp/namespace/TestNamespaceLookup.py lldb-Suite :: macosx/indirect_symbol/TestIndirectSymbols.py lldb-Suite :: lang/objc/unicode-string/TestUnicodeString.py lldb-Suite :: commands/expression/rdar44436068/Test128BitsInteger.py lldb-Suite :: commands/expression/completion-in-lambda-and-unnnamed-class/TestCompletionInLambdaAndUnnamedClass.py lldb-Suite :: functionalities/data-formatter/pyobjsynthprovider/TestPyObjSynthProvider.py lldb-Suite :: functionalities/data-formatter/ptr_ref_typedef/TestPtrRef2Typedef.py lldb-Unit :: Utility/./UtilityTests/AnsiTerminal.Incomplete lldb-Unit :: Process/gdb-remote/./ProcessGdbRemoteTests/GDBRemoteClientBaseTest.SendContinueAndLateInterrupt lldb-Unit :: UnwindAssembly/x86/./UnwindAssemblyx86Tests/Testx86AssemblyInspectionEngine.TestPush0 lldb-Suite :: lang/cpp/llvm-style/TestLLVMStyle.py lldb-Suite :: macosx/duplicate-archive-members/TestDuplicateMembers.py lldb-Unit :: Utility/./UtilityTests/LogChannelTest.Disable lldb-Unit :: SymbolFile/NativePDB/./SymbolFileNativePDBTests/PDBFPOProgramToDWARFExpressionTests.UnresolvedDependentCyclicRegisterAssignmentReference lldb-Unit :: Utility/./UtilityTests/UriParserTest.SchemeHostSeparator3 lldb-Suite :: lang/cpp/nsimport/TestCppNsImport.py lldb-Suite :: lang/objc/ptr_refs/TestPtrRefsObjC.py lldb-Unit :: Utility/./UtilityTests/ArgsTest.TestQuotedUnknownEscape lldb-Unit :: Utility/./UtilityTests/ScalarTest.GetBytes lldb-Suite :: commands/expression/completion/TestExprCompletion.py LLDB :: Modules/PECOFF/basic-info.yaml lldb-Suite :: commands/process/launch-with-shellexpand/TestLaunchWithShellExpand.py lldb-Suite :: functionalities/data-formatter/format-propagation/TestFormatPropagation.py LLDB :: Modules/ELF/section-types-edgecases.yaml lldb-Suite :: lang/objc/objc-property/TestObjCProperty.py lldb-Suite :: commands/expression/formatters/TestFormatters.py lldb-Suite :: commands/expression/dont_allow_jit/TestAllowJIT.py lldb-Unit :: UnwindAssembly/ARM64/./Arm64InstEmulationTests/TestArm64InstEmulation.TestRegisterSavedTwice lldb-Suite :: commands/expression/radar_9531204/TestPrintfAfterUp.py lldb-Suite :: functionalities/dead-strip/TestDeadStrip.py lldb-Suite :: lang/c/anonymous/TestAnonymous.py lldb-Unit :: tools/lldb-server/tests/./LLDBServerTests/StandardStartupTest.TestStopReplyContainsThreadPcs lldb-Suite :: lang/objc/objc-new-syntax/TestObjCNewSyntaxLiteral.py lldb-Suite :: commands/command/nested_alias/TestNestedAlias.py lldb-Suite :: functionalities/memory-region/TestMemoryRegion.py lldb-Suite :: functionalities/thread/create_after_attach/TestCreateAfterAttach.py lldb-Suite :: commands/expression/xvalue/TestXValuePrinting.py lldb-Suite :: functionalities/inferior-crashing/recursive-inferior/TestRecursiveInferior.py lldb-Suite :: commands/gui/basic/TestGuiBasic.py lldb-Suite :: functionalities/inline-stepping/TestInlineStepping.py lldb-Suite :: python_api/frame/get-variables/TestGetVariables.py lldb-Suite :: lang/cpp/const_this/TestConstThis.py lldb-Suite :: lang/objc/objc-foundation-dictionary-empty/TestNSDictionary0.py lldb-Suite :: commands/frame/diagnose/complicated-expression/TestComplicatedExpression.py lldb-Suite :: functionalities/data-formatter/var-in-aggregate-misuse/TestVarInAggregateMisuse.py lldb-Suite :: functionalities/thread/exit_during_step/TestExitDuringStep.py lldb-Suite :: functionalities/data-formatter/data-formatter-stl/libcxx/set/TestDataFormatterLibcxxSet.py lldb-Unit :: Utility/./UtilityTests/StreamTeeTest.AppendStream lldb-Suite :: functionalities/inferior-changed/TestInferiorChanged.py lldb-Suite :: commands/expression/context-object-objc/TestContextObjectObjc.py lldb-Suite :: lang/objc/objc-new-syntax/TestObjCNewSyntaxDictionary.py lldb-Suite :: lang/objc/objc-super/TestObjCSuper.py lldb-Suite :: python_api/value/change_values/TestChangeValueAPI.py lldb-Suite :: functionalities/data-formatter/data-formatter-stl/libcxx/atomic/TestLibCxxAtomic.py LLDB :: Modules/ELF/PT_LOAD-empty.yaml lldb-Suite :: functionalities/data-formatter/varscript_formatting/TestDataFormatterVarScriptFormatting.py lldb-Suite :: functionalities/thread/step_until/TestStepUntil.py lldb-Suite :: lang/mixed/TestMixedLanguages.py lldb-Suite :: types/TestDoubleTypesExpr.py lldb-Suite :: functionalities/target_var/TestTargetVar.py lldb-Suite :: functionalities/data-formatter/data-formatter-objc/TestDataFormatterObjNSException.py lldb-Suite :: functionalities/deleted-executable/TestDeletedExecutable.py lldb-Suite :: functionalities/thread/step_out/TestThreadStepOut.py lldb-Suite :: tools/lldb-server/register-reading/TestGdbRemoteGPacket.py lldb-Suite :: functionalities/data-formatter/data-formatter-stl/libcxx/unordered/TestDataFormatterUnordered.py lldb-Suite :: tools/lldb-server/TestGdbRemoteThreadsInStopReply.py LLDB :: Modules/ELF/netbsd-core-amd64.test LLDB :: Modules/Breakpad/breakpad-identification.test lldb-Suite :: commands/expression/call-overridden-method/TestCallOverriddenMethod.py lldb-Suite :: lang/cpp/class-template-parameter-pack/TestClassTemplateParameterPack.py LLDB :: Modules/ELF/PT_LOAD-overlap-PT_INTERP.yaml lldb-Unit :: Utility/./UtilityTests/NameMatchesTest.Ignore LLDB :: SymbolFile/DWARF/debug-types-dwarf5.s lldb-Unit :: Utility/./UtilityTests/ArgsTest.TestTrailingBackslash lldb-Unit :: Utility/./UtilityTests/StringExtractorTest.GetNameColonValueSuccess lldb-Unit :: Utility/./UtilityTests/StringLexerTest.PutBack lldb-Unit :: Utility/./UtilityTests/SerializationRountripTest.SerializeDeserializeObjectReference lldb-Unit :: Utility/./UtilityTests/LogChannelEnabledTest.LogVerboseThread LLDB :: Modules/ELF/duplicate-section.yaml LLDB :: Quit/TestQuitExitCodeHexA.test lldb-Unit :: UnwindAssembly/ARM64/./Arm64InstEmulationTests/TestArm64InstEmulation.TestSimpleDarwinFunction lldb-Unit :: ScriptInterpreter/Python/./ScriptInterpreterPythonTests/PythonDataObjectsTest.TestPythonIntegerToStr lldb-Unit :: Host/./HostTests/MainLoopTest.UnmonitoredSignal lldb-Unit :: Signals/./SignalsTests/UnixSignalsTest.VersionChange lldb-Unit :: Utility/./UtilityTests/OptionsWithRawTest.TerminatedQuote lldb-Unit :: Utility/./UtilityTests/BinaryStreamTest.PutSLEB128MaxValue lldb-Unit :: Symbol/./SymbolTests/TestClangASTContext.TestConvertAccessTypeToAccessSpecifier lldb-Unit :: Utility/./UtilityTests/StreamTest.ChangingByteOrder lldb-Unit :: UnwindAssembly/x86/./UnwindAssemblyx86Tests/Testx86AssemblyInspectionEngine.Test32bitFramelessSmallStackFrame lldb-Unit :: Utility/./UtilityTests/AnsiTerminal.Basic LLDB :: Settings/TestStopCommandSourceOnError.test lldb-Unit :: Expression/./ExpressionTests/DiagnosticManagerTest.PutString lldb-Unit :: Process/gdb-remote/./ProcessGdbRemoteTests/GDBRemoteClientBaseTest.SendContinueAndAsyncSignal LLDB :: SymbolFile/DWARF/childless-compile-unit.s lldb-Unit :: UnwindAssembly/x86/./UnwindAssemblyx86Tests/Testx86AssemblyInspectionEngine.TestSpillRegToStackViaMOVx86_64 lldb-Unit :: Symbol/./SymbolTests/SymbolsTest.TerminateLocateExecutableSymbolFileForUnknownExecutableAndUnknownSymbolFile lldb-Unit :: UnwindAssembly/x86/./UnwindAssemblyx86Tests/Testx86AssemblyInspectionEngine.TestPushEBX lldb-Unit :: Process/gdb-remote/./ProcessGdbRemoteTests/GDBRemoteClientBaseTest.InterruptNoResponse lldb-Unit :: ScriptInterpreter/Python/./ScriptInterpreterPythonTests/PythonDataObjectsTest.TestPythonStringToStr lldb-Unit :: ScriptInterpreter/Python/./ScriptInterpreterPythonTests/PythonDataObjectsTest.TestPythonBoolean lldb-Unit :: UnwindAssembly/x86/./UnwindAssemblyx86Tests/Testx86AssemblyInspectionEngine.TestMovRSPtoRBP lldb-Unit :: Utility/./UtilityTests/ArchSpecTest.MergeFrom LLDB :: Modules/MachO/subsections.yaml lldb-Unit :: Utility/./UtilityTests/StreamTest.PutRawBytesToMixedEndian lldb-Unit :: Utility/./UtilityTests/CompletionRequest.DuplicateFiltering lldb-Unit :: Utility/./UtilityTests/BinaryStreamTest.PutULEB128OneByte lldb-Unit :: SymbolFile/DWARF/./SymbolFileDWARFTests/SymbolFileDWARFTests.TestAbbrevValidAttrNullForm lldb-Unit :: Utility/./UtilityTests/StringListTest.CopyListSingle lldb-Unit :: Interpreter/./InterpreterTests/CompletionTest.FileCompletionAbsolute lldb-Unit :: UnwindAssembly/ARM64/./Arm64InstEmulationTests/TestArm64InstEmulation.TestMediumDarwinFunction lldb-Unit :: Utility/./UtilityTests/StringExtractorTest.GetNameColonValueNoSemicolon LLDB :: Driver/TestCore.test LLDB :: Breakpoint/debug_rnglistx_rlex.test lldb-Unit :: Utility/./UtilityTests/EventTest.DumpEventDataBytes LLDB :: Driver/TestCommands.test lldb-Unit :: UnwindAssembly/x86/./UnwindAssemblyx86Tests/Testx86AssemblyInspectionEngine.TestPopRBP lldb-Unit :: ScriptInterpreter/Python/./ScriptInterpreterPythonTests/PythonExceptionStateTest.TestAcquisitionSemantics lldb-Unit :: Utility/./UtilityTests/StreamTeeTest.CopyConstructor lldb-Unit :: Utility/./UtilityTests/FileSpecTest.EqualSeparator lldb-Unit :: Utility/./UtilityTests/RangeTest.ContainsAddr lldb-Unit :: Utility/./UtilityTests/UriParserTest.Minimal lldb-Unit :: Utility/./UtilityTests/RegularExpression.Invalid lldb-Unit :: Target/./TargetTests/ExecutionContextTest.GetByteOrder lldb-Unit :: Expression/./ExpressionTests/DiagnosticManagerTest.AddDiagnostic lldb-Unit :: Utility/./UtilityTests/StringListTest.Clear lldb-Unit :: Utility/./UtilityTests/ArgsTest.TestArgv lldb-Unit :: Utility/./UtilityTests/StringListTest.GetMaxStringLengthIncreasingSize lldb-Unit :: Utility/./UtilityTests/RegularExpression.Match LLDB :: BuildScript/modes.test lldb-Unit :: UnwindAssembly/x86/./UnwindAssemblyx86Tests/Testx86AssemblyInspectionEngine.TestPopRBPWithREX LLDB :: Modules/ELF/aarch64-relocations.yaml lldb-Unit :: Language/Highlighting/./HighlighterTests/HighlighterTest.Keywords lldb-Unit :: Utility/./UtilityTests/ScalarTest.Equality lldb-Unit :: Utility/./UtilityTests/ScalarTest.Comparison lldb-Unit :: Target/./TargetTests/PathMappingListTest.RelativeTests lldb-Unit :: Host/./HostTests/FileSystemTest.GetByteSize LLDB :: ExecControl/StopHook/stop-hook.test lldb-Unit :: Utility/./UtilityTests/StringListTest.InsertStringAtIndexEnd lldb-Unit :: UnwindAssembly/x86/./UnwindAssemblyx86Tests/Testx86AssemblyInspectionEngine.TestPushR12 lldb-Unit :: Utility/./UtilityTests/RangeTest.SizeTypes lldb-Unit :: Utility/./UtilityTests/StringExtractorTest.GetHexU8_Exact lldb-Unit :: UnwindAssembly/x86/./UnwindAssemblyx86Tests/Testx86AssemblyInspectionEngine.Test32BitOnlyInstruction lldb-Unit :: Utility/./UtilityTests/StringListTest.JoinThree lldb-Unit :: Utility/./UtilityTests/StreamTest.PutCharNull lldb-Unit :: UnwindAssembly/x86/./UnwindAssemblyx86Tests/Testx86AssemblyInspectionEngine.TestSimplex86_64Augmented lldb-Unit :: SymbolFile/DWARF/./SymbolFileDWARFTests/SymbolFileDWARFTests.TestAbbrevInvalidNULLTag lldb-Unit :: Host/./HostTests/ConnectionFileDescriptorTest.TCPGetURIv4 lldb-Unit :: SymbolFile/DWARF/./SymbolFileDWARFTests/DWARFASTParserClangTests.TestGetDIEForDeclContextReturnsOnlyMatchingEntries lldb-Unit :: Process/gdb-remote/./ProcessGdbRemoteTests/GDBRemoteCommunicationClientTest.SendGetMetaDataPacket lldb-Unit :: Utility/./UtilityTests/StringListTest.AppendList lldb-Unit :: Utility/./UtilityTests/FileSpecTest.RemoveLastPathComponent lldb-Unit :: Utility/./UtilityTests/StringExtractorTest.InitMisc lldb-Unit :: Utility/./UtilityTests/BinaryStreamTest.PutSLEB128SevenBytes lldb-Unit :: Utility/./UtilityTests/Flags.Clear lldb-Unit :: Utility/./UtilityTests/ProcessInstanceInfo.DumpTable lldb-Unit :: Utility/./UtilityTests/StreamTest.ShiftOperatorChars lldb-Unit :: Process/gdb-remote/./ProcessGdbRemoteTests/GDBRemoteClientBaseTest.SendContinueAndInterrupt lldb-Unit :: Utility/./UtilityTests/EnvironmentTest.EnvpConversion lldb-Unit :: Host/./HostTests/TaskPoolTest.RunTasks LLDB :: Quit/TestQuitExitCodeImplicit0.test LLDB :: SymbolFile/DWARF/split-dwarf-multiple-cu.ll lldb-Unit :: ScriptInterpreter/Python/./ScriptInterpreterPythonTests/PythonDataObjectsTest.TestObjectAttributes lldb-Unit :: Process/minidump/./LLDBMinidumpTests/MinidumpParserTest.FindMemoryRange lldb-Unit :: Process/gdb-remote/./ProcessGdbRemoteTests/GDBRemoteCommunicationClientTest.SendStartTracePacket lldb-Unit :: Utility/./UtilityTests/StringListTest.GetSize lldb-Unit :: UnwindAssembly/x86/./UnwindAssemblyx86Tests/Testx86AssemblyInspectionEngine.TestAddRSP LLDB :: Minidump/Windows/find-module.test lldb-Unit :: ScriptInterpreter/Python/./ScriptInterpreterPythonTests/PythonDataObjectsTest.TestPythonListValueEquality lldb-Unit :: Utility/./UtilityTests/RangeTest.DoesIntersect lldb-Unit :: Utility/./UtilityTests/StreamTeeTest.GetStreamAtIndexOutOfBoundsEmpty lldb-Unit :: UnwindAssembly/x86/./UnwindAssemblyx86Tests/Testx86AssemblyInspectionEngine.TestPopRBX lldb-Unit :: SymbolFile/NativePDB/./SymbolFileNativePDBTests/PDBFPOProgramToDWARFExpressionTests.UnresolvedRegisterAssignmentReference LLDB :: Modules/MachO/lc_build_version_notools.yaml lldb-Unit :: UnwindAssembly/x86/./UnwindAssemblyx86Tests/Testx86AssemblyInspectionEngine.TestPopR13 lldb-Unit :: Utility/./UtilityTests/VMRange.ContainsAddr LLDB :: SymbolFile/Breakpad/line-table-missing-file.test lldb-Unit :: Utility/./UtilityTests/ProcessInstanceInfo.DumpTable_invalidUID lldb-Unit :: Utility/./UtilityTests/StreamTest.PutStringAsRawHex8 lldb-Unit :: Utility/./UtilityTests/ScalarTest.APIntConstructor lldb-Unit :: Utility/./UtilityTests/StringListTest.ShiftStdString lldb-Unit :: ScriptInterpreter/Python/./ScriptInterpreterPythonTests/PythonDataObjectsTest.TestPythonInteger lldb-Unit :: SymbolFile/DWARF/./SymbolFileDWARFTests/SymbolFileDWARFTests.TestAbilitiesForDWARF lldb-Unit :: Host/./HostTests/SocketTest.TCPListen0ConnectAccept LLDB :: SymbolFile/Breakpad/stack-cfi-parsing.test LLDB :: Commands/CommandScriptImmediateOutput/CommandScriptImmediateOutputFile.test lldb-Unit :: Utility/./UtilityTests/StreamTest.PutHex8 LLDB :: SymbolFile/Breakpad/line-table.test lldb-Unit :: Core/./LLDBCoreTests/RichManglingContextTest.Basic LLDB :: Expr/TestMultilineExpr.test lldb-Unit :: Utility/./UtilityTests/AnsiTerminal.AtEnd lldb-Unit :: Utility/./UtilityTests/StringListTest.LongestCommonPrefixDuplicateElement LLDB :: Settings/TestModuleCacheSanity.test LLDB :: SymbolFile/DWARF/find-qualified-variable.cpp lldb-Unit :: Utility/./UtilityTests/OptionsWithRawTest.ArgsButNoDelimiter lldb-Unit :: Utility/./UtilityTests/ArgsTest.TestSingleArgWithQuotedSpace lldb-Unit :: Utility/./UtilityTests/StringListTest.PopBack lldb-Unit :: Utility/./UtilityTests/StatusTest.ErrorConstructor lldb-Unit :: Utility/./UtilityTests/RangeTest.Union LLDB :: Modules/PECOFF/sections-names.yaml lldb-Unit :: UnwindAssembly/ARM64/./Arm64InstEmulationTests/TestArm64InstEmulation.TestRegisterDoubleSpills lldb-Unit :: Utility/./UtilityTests/ArchSpecTest.OperatorBool lldb-Unit :: Utility/./UtilityTests/StreamTest.ShiftOperatorStrings lldb-Unit :: ScriptInterpreter/Python/./ScriptInterpreterPythonTests/PythonDataObjectsTest.TestPythonDictionaryManipulation lldb-Unit :: Language/CPlusPlus/./LanguageCPlusPlusTests/CPlusPlusLanguage.ExtractContextAndIdentifier LLDB :: Reproducer/TestFileRepro.test lldb-Unit :: Process/gdb-remote/./ProcessGdbRemoteTests/GDBRemoteCommunicationClientTest.SendStopTracePacket lldb-Unit :: ScriptInterpreter/Python/./ScriptInterpreterPythonTests/PythonDataObjectsTest.TestModuleNameResolutionNoDot lldb-Unit :: Language/CPlusPlus/./LanguageCPlusPlusTests/CPlusPlusLanguage.CPlusPlusNameParser lldb-Unit :: ScriptInterpreter/Python/./ScriptInterpreterPythonTests/PythonDataObjectsTest.TestTypeNameResolutionNoDot lldb-Unit :: Utility/./UtilityTests/ScalarTest.ComparisonFloat lldb-Unit :: Process/gdb-remote/./ProcessGdbRemoteTests/GDBRemoteClientBaseTest.SendContinueAndWait lldb-Unit :: Utility/./UtilityTests/Flags.AnySet LLDB :: Modules/MachO/lc_build_version.yaml lldb-Unit :: SymbolFile/NativePDB/./SymbolFileNativePDBTests/PDBFPOProgramToDWARFExpressionTests.MultipleDependentAssignments lldb-Unit :: Utility/./UtilityTests/UriParserTest.SchemeHostSeparator lldb-Unit :: Utility/./UtilityTests/StringExtractorTest.DecodeHexU8_Underflow lldb-Unit :: Utility/./UtilityTests/LogChannelEnabledTest.LLDB_LOG_ERROR lldb-Unit :: Host/./HostTests/SocketAddressTest.GetAddressInfo lldb-Unit :: Utility/./UtilityTests/StringExtractorTest.GetHexBytesAvail lldb-Unit :: Utility/./UtilityTests/ArgsTest.TestSingleArg lldb-Unit :: Utility/./UtilityTests/TimerTest.CategoryTimes2 lldb-Unit :: Utility/./UtilityTests/VMRange.Clear lldb-Unit :: Symbol/./SymbolTests/LineEntryTest.GetSameLineContiguousAddressRangeNestedInline lldb-Unit :: Utility/./UtilityTests/StringExtractorTest.DecodeHexU8_Extra lldb-Unit :: Utility/./UtilityTests/RangeTest.SlideZero lldb-Unit :: Host/./HostTests/NativeProcessProtocolTest.ReadCStringFromMemory lldb-Unit :: Utility/./UtilityTests/StringLexerTest.NextIfList lldb-Unit :: Process/gdb-remote/./ProcessGdbRemoteTests/GDBRemoteCommunicationServerTest.SendErrorResponse_ErrorNumber lldb-Unit :: Utility/./UtilityTests/BinaryStreamTest.PutULEB128One lldb-Unit :: Utility/./UtilityTests/StringExtractorTest.GetHexBytesAvail_FullString lldb-Unit :: Process/gdb-remote/./ProcessGdbRemoteTests/GDBRemoteClientBaseTest.SendContinueDelegateStructuredDataReceipt lldb-Unit :: Expression/./ExpressionTests/DiagnosticManagerTest.GetStringSeverityLabels lldb-Unit :: Utility/./UtilityTests/ArgsTest.GetArgumentArrayRef LLDB :: SymbolFile/Breakpad/line-table-discontinuous-file-ids.test LLDB :: BuildScript/compiler-full-path.test lldb-Unit :: Host/./HostTests/NativeProcessProtocolTest.SetBreakpointFailRead lldb-Unit :: Utility/./UtilityTests/StreamTest.ShiftOperatorUInts lldb-Unit :: Process/minidump/./LLDBMinidumpTests/MinidumpParserTest.GetThreadContext_x86_32 LLDB :: Modules/ELF/base-address.yaml lldb-Unit :: Symbol/./SymbolTests/TestClangASTContext.TestGetBasicTypeFromName lldb-Unit :: Utility/./UtilityTests/AnsiTerminal.Empty LLDB :: SymbolFile/DWARF/debug_ranges.s lldb-Unit :: Utility/./UtilityTests/StreamTest.PutCString LLDB :: SymbolFile/DWARF/forward-declarations.s lldb-Unit :: Symbol/./SymbolTests/Type.CompilerContextPattern lldb-Unit :: Host/./HostTests/TaskPoolTest.TaskMap lldb-Unit :: Utility/./UtilityTests/StringExtractorTest.GetHexBytes LLDB :: Reproducer/Functionalities/TestDataFormatter.test lldb-Unit :: Process/minidump/./LLDBMinidumpTests/MinidumpParserTest.GetArchitectureWindows lldb-Unit :: ScriptInterpreter/Python/./ScriptInterpreterPythonTests/PythonDataObjectsTest.TestResetting lldb-Unit :: Utility/./UtilityTests/BinaryStreamTest.PutULEB128SevenBytes lldb-Unit :: ScriptInterpreter/Python/./ScriptInterpreterPythonTests/PythonDataObjectsTest.TestPythonTupleSize lldb-Unit :: UnwindAssembly/x86/./UnwindAssemblyx86Tests/Testx86AssemblyInspectionEngine.TestLEAVE lldb-Unit :: UnwindAssembly/x86/./UnwindAssemblyx86Tests/Testx86AssemblyInspectionEngine.TestPushECX lldb-Unit :: Utility/./UtilityTests/StringListTest.AppendListCStringArrayEmpty lldb-Unit :: Utility/./UtilityTests/OptionsWithRawTest.SingleWhitespaceInput lldb-Suite :: functionalities/data-formatter/typedef_array/TestTypedefArray.py lldb-Unit :: ScriptInterpreter/Python/./ScriptInterpreterPythonTests/PythonDataObjectsTest.TestPythonTupleToStructuredList lldb-Suite :: functionalities/data-formatter/data-formatter-disabling/TestDataFormatterDisabling.py lldb-Suite :: lang/objc/objc-struct-argument/TestObjCStructArgument.py lldb-Suite :: sample_test/TestSampleTest.py lldb-Suite :: commands/expression/radar_8638051/Test8638051.py lldb-Suite :: functionalities/type_completion/TestTypeCompletion.py lldb-Suite :: commands/expression/unicode-in-variable/TestUnicodeInVariable.py lldb-Suite :: functionalities/data-formatter/stringprinter/TestStringPrinter.py lldb-Suite :: python_api/hello_world/TestHelloWorld.py lldb-Suite :: lang/cpp/overloaded-functions/TestOverloadedFunctions.py lldb-Suite :: tools/lldb-server/TestGdbRemote_qThreadStopInfo.py lldb-Suite :: lang/objc/exceptions/TestObjCExceptions.py LLDB :: Breakpoint/case-sensitive.test lldb-Suite :: functionalities/thread/num_threads/TestNumThreads.py lldb-Suite :: macosx/safe-to-func-call/TestSafeFuncCalls.py lldb-Suite :: commands/frame/diagnose/local-variable/TestLocalVariable.py lldb-Suite :: lang/cpp/incomplete-types/TestCppIncompleteTypes.py lldb-Suite :: lang/objc/foundation/TestObjCMethodsNSArray.py lldb-Suite :: commands/expression/char/TestExprsChar.py lldb-Suite :: lang/cpp/stl/TestStdCXXDisassembly.py lldb-Suite :: lang/cpp/unicode-literals/TestUnicodeLiterals.py lldb-Suite :: python_api/module_section/TestModuleAndSection.py lldb-Suite :: functionalities/data-formatter/synthcapping/TestSyntheticCapping.py lldb-Suite :: functionalities/data-formatter/data-formatter-skip-summary/TestDataFormatterSkipSummary.py lldb-Suite :: functionalities/data-formatter/data-formatter-stl/libcxx/variant/TestDataFormatterLibcxxVariant.py lldb-Suite :: functionalities/data-formatter/data-formatter-synthtype/TestDataFormatterSynthType.py lldb-Suite :: macosx/function-starts/TestFunctionStarts.py LLDB :: Breakpoint/debug_rnglist_offset_pair.test

Hide Details

******************** Unresolved Tests (171): lldb-Suite :: commands/expression/import-std-module/deque-basic/TestBasicDeque.py lldb-Suite :: python_api/interpreter/TestRunCommandInterpreterAPI.py lldb-Suite :: functionalities/data-formatter/data-formatter-stl/libcxx/iterator/TestDataFormatterLibccIterator.py lldb-Suite :: lang/cpp/stl/TestSTL.py lldb-Suite :: commands/command/history/TestCommandHistory.py lldb-Suite :: lang/objc/rdar-11355592/TestRdar11355592.py lldb-Suite :: functionalities/thread/concurrent_events/TestConcurrentTwoWatchpointsOneBreakpoint.py lldb-Suite :: lang/c/global_variables/TestGlobalVariables.py lldb-Suite :: lang/cpp/call-function/TestCallCPPFunction.py lldb-Suite :: commands/frame/diagnose/bad-reference/TestBadReference.py lldb-Suite :: lang/objc/rdar-12408181/TestRdar12408181.py lldb-Suite :: lang/objc/objc-ivar-offsets/TestObjCIvarOffsets.py lldb-Suite :: api/check_public_api_headers/TestPublicAPIHeaders.py lldb-Suite :: python_api/sbvalue_const_addrof/TestSBValueConstAddrOf.py lldb-Suite :: lang/objc/foundation/TestObjCMethodsNSError.py lldb-Suite :: lang/cpp/member-and-local-vars-with-same-name/TestMembersAndLocalsWithSameName.py lldb-Suite :: functionalities/thread/concurrent_events/TestConcurrentSignalNWatchNBreak.py lldb-Suite :: functionalities/gdb_remote_client/TestNoWatchpointSupportInfo.py lldb-Suite :: functionalities/tail_call_frames/inlining_and_tail_calls/TestInliningAndTailCalls.py lldb-Suite :: lang/cpp/class_static/TestStaticVariables.py lldb-Suite :: functionalities/tsan/cpp_global_location/TestTsanCPPGlobalLocation.py lldb-Suite :: functionalities/darwin_log/filter/regex/activity/TestDarwinLogFilterRegexActivity.py lldb-Suite :: python_api/sbdata/TestSBData.py lldb-Suite :: lang/cpp/limit-debug-info/TestWithLimitDebugInfo.py lldb-Suite :: lang/cpp/namespace_definitions/TestNamespaceDefinitions.py lldb-Suite :: tools/lldb-server/commandline/TestStubSetSID.py lldb-Suite :: functionalities/data-formatter/data-formatter-stl/libcxx/vector/TestDataFormatterLibcxxVector.py lldb-Suite :: functionalities/step_scripted/TestStepScripted.py lldb-Suite :: lang/objc/hidden-ivars/TestHiddenIvars.py lldb-Suite :: commands/expression/issue_11588/Test11588.py lldb-Suite :: tools/lldb-vscode/launch/TestVSCode_launch.py lldb-Suite :: functionalities/darwin_log/basic/TestDarwinLogBasic.py lldb-Suite :: commands/frame/language/TestGuessLanguage.py lldb-Suite :: commands/expression/ir-interpreter-phi-nodes/TestIRInterpreterPHINodes.py lldb-Suite :: commands/expression/radar_9673664/TestExprHelpExamples.py lldb-Suite :: functionalities/memory/read/TestMemoryRead.py lldb-Suite :: functionalities/data-formatter/data-formatter-objc/TestDataFormatterObjCNSData.py lldb-Suite :: lang/cpp/type_lookup/TestCppTypeLookup.py lldb-Suite :: lang/objc/objc-dyn-sbtype/TestObjCDynamicSBType.py lldb-Suite :: functionalities/thread/concurrent_events/TestConcurrentSignalBreak.py lldb-Suite :: lang/c/function_types/TestFunctionTypes.py lldb-Suite :: functionalities/data-formatter/data-formatter-objc/TestDataFormatterObjCKVO.py lldb-Suite :: python_api/value_var_update/TestValueVarUpdate.py lldb-Suite :: python_api/section/TestSectionAPI.py lldb-Suite :: functionalities/data-formatter/data-formatter-globals/TestDataFormatterGlobals.py lldb-Suite :: functionalities/thread/concurrent_events/TestConcurrentTwoBreakpointsOneWatchpoint.py lldb-Suite :: functionalities/data-formatter/data-formatter-stl/libcxx/list/loop/TestDataFormatterLibcxxListLoop.py lldb-Suite :: commands/expression/import-std-module/list-dbg-info-content/TestDbgInfoContentList.py lldb-Suite :: functionalities/inferior-crashing/recursive-inferior/TestRecursiveInferiorStep.py lldb-Suite :: commands/expression/call-throws/TestCallThatThrows.py lldb-Suite :: python_api/symbol-context/two-files/TestSymbolContextTwoFiles.py lldb-Suite :: types/TestFloatTypes.py lldb-Suite :: python_api/objc_type/TestObjCType.py lldb-Suite :: api/multiple-debuggers/TestMultipleDebuggers.py lldb-Suite :: commands/watchpoints/watchpoint_on_vectors/TestValueOfVectorVariable.py lldb-Suite :: python_api/watchpoint/TestSetWatchpoint.py lldb-Suite :: commands/frame/select/TestFrameSelect.py lldb-Suite :: python_api/target/TestTargetAPI.py lldb-Suite :: functionalities/thread/concurrent_events/TestConcurrentTwoBreakpointsOneSignal.py lldb-Suite :: linux/builtin_trap/TestBuiltinTrap.py lldb-Suite :: commands/frame/diagnose/dereference-argument/TestDiagnoseDereferenceArgument.py lldb-Suite :: functionalities/thread/concurrent_events/TestConcurrentTwoBreakpointsOneDelaySignal.py lldb-Suite :: functionalities/data-formatter/dump_dynamic/TestDumpDynamic.py lldb-Suite :: functionalities/data-formatter/data-formatter-objc/nsstring/TestDataFormatterNSString.py lldb-Suite :: python_api/value/empty_class/TestValueAPIEmptyClass.py lldb-Suite :: lang/cpp/gmodules-templates/TestGModules.py lldb-Suite :: functionalities/data-formatter/data-formatter-stl/libstdcpp/tuple/TestDataFormatterStdTuple.py lldb-Suite :: lang/cpp/inlines/TestInlines.py lldb-Suite :: lang/c/register_variables/TestRegisterVariables.py lldb-Suite :: lang/objcxx/class-name-clash/TestNameClash.py lldb-Suite :: lang/cpp/global_variables/TestCPPGlobalVariables.py lldb-Suite :: commands/expression/persistent_types/TestPersistentTypes.py lldb-Suite :: functionalities/data-formatter/language_category_updates/TestDataFormatterLanguageCategoryUpdates.py lldb-Suite :: functionalities/data-formatter/data-formatter-objc/TestDataFormatterObjCNSBundle.py lldb-Suite :: functionalities/gdb_remote_client/TestRestartBug.py lldb-Suite :: commands/expression/import-std-module/basic/TestImportStdModule.py lldb-Suite :: functionalities/pre_run_dylibs/TestPreRunDylibs.py lldb-Suite :: commands/expression/import-std-module/vector-of-vectors/TestVectorOfVectors.py lldb-Suite :: lang/c/unicode/TestUnicodeSymbols.py lldb-Suite :: commands/expression/vector_of_enums/TestVectorOfEnums.py lldb-Suite :: functionalities/fat_archives/TestFatArchives.py lldb-Suite :: commands/expression/call-restarts/TestCallThatRestarts.py lldb-Suite :: functionalities/jitloader_gdb/TestJITLoaderGDB.py lldb-Suite :: functionalities/signal/handle-segv/TestHandleSegv.py lldb-Suite :: lang/c/tls_globals/TestTlsGlobals.py lldb-Suite :: commands/expression/call-function/TestCallStopAndContinue.py lldb-Suite :: lang/cpp/breakpoint_in_member_func_w_non_primitive_params/TestBreakpointInMemberFuncWNonPrimitiveParams.py lldb-Suite :: functionalities/ubsan/user-expression/TestUbsanUserExpression.py lldb-Suite :: functionalities/thread/concurrent_events/TestConcurrentManySignals.py lldb-Suite :: lang/objc/foundation/TestRuntimeTypes.py lldb-Suite :: lang/cpp/signed_types/TestSignedTypes.py lldb-Suite :: lang/cpp/virtual/TestVirtual.py lldb-Suite :: lang/cpp/function-template-parameter-pack/TestFunctionTemplateParameterPack.py lldb-Suite :: functionalities/completion/TestCompletion.py lldb-Suite :: functionalities/ubsan/basic/TestUbsanBasic.py lldb-Suite :: functionalities/data-formatter/nsarraysynth/TestNSArraySynthetic.py lldb-Suite :: functionalities/darwin_log/filter/exact_match/message/TestDarwinLogFilterMatchMessage.py lldb-Suite :: functionalities/gdb_remote_client/TestStopPCs.py lldb-Suite :: lang/objc/objc-struct-return/TestObjCStructReturn.py lldb-Suite :: commands/watchpoints/multiple_threads/TestWatchpointMultipleThreads.py lldb-Suite :: macosx/thread-names/TestInterruptThreadNames.py lldb-Suite :: functionalities/data-formatter/data-formatter-cpp/TestDataFormatterCpp.py lldb-Suite :: commands/command/script/import/TestImport.py lldb-Suite :: functionalities/darwin_log/filter/exact_match/category/TestDarwinLogFilterMatchCategory.py lldb-Suite :: functionalities/data-formatter/compactvectors/TestCompactVectors.py lldb-Suite :: functionalities/data-formatter/nssetsynth/TestNSSetSynthetic.py lldb-Suite :: commands/watchpoints/watchpoint_commands/command/TestWatchpointCommandLLDB.py lldb-Suite :: lang/cpp/diamond/TestDiamond.py lldb-Suite :: macosx/version_zero/TestGetVersionZeroVersion.py lldb-Suite :: commands/disassemble/basic/TestDisassembleBreakpoint.py lldb-Suite :: lang/cpp/template-function/TestTemplateFunctions.py lldb-Suite :: commands/reproducer/invalid-args/TestInvalidArgsReproducer.py lldb-Suite :: python_api/function_symbol/TestSymbolAPI.py lldb-Suite :: benchmarks/continue/TestBenchmarkContinue.py lldb-Suite :: functionalities/inferior-crashing/TestInferiorCrashingStep.py lldb-Suite :: python_api/lldbutil/iter/TestLLDBIterator.py lldb-Suite :: functionalities/avoids-fd-leak/TestFdLeak.py lldb-Suite :: commands/expression/persistent_variables/TestPersistentVariables.py lldb-Suite :: commands/expression/completion-crash1/TestCompletionCrash1.py lldb-Suite :: functionalities/rerun/TestRerun.py lldb-Suite :: python_api/thread/TestThreadAPI.py lldb-Suite :: lang/c/local_variables/TestLocalVariables.py lldb-Suite :: commands/expression/invalid-args/TestInvalidArgsExpression.py lldb-Suite :: functionalities/postmortem/netbsd-core/TestNetBSDCore.py lldb-Suite :: commands/expression/anonymous-struct/TestCallUserAnonTypedef.py lldb-Suite :: commands/disassemble/basic/TestFrameDisassemble.py lldb-Suite :: lang/c/const_variables/TestConstVariables.py lldb-Suite :: functionalities/source-map/TestTargetSourceMap.py lldb-Suite :: lang/cpp/function_refs/TestFunctionRefs.py lldb-Suite :: lang/objc/blocks/TestObjCIvarsInBlocks.py lldb-Suite :: functionalities/data-formatter/data-formatter-stl/libstdcpp/unique_ptr/TestDataFormatterStdUniquePtr.py lldb-Suite :: macosx/queues/TestQueues.py lldb-Suite :: python_api/sbstructureddata/TestStructuredDataAPI.py lldb-Suite :: functionalities/data-formatter/data-formatter-stl/libcxx/optional/TestDataFormatterLibcxxOptional.py lldb-Suite :: commands/expression/namespace_local_var_same_name_obj_c/TestNamespaceLocalVarSameNameObjC.py lldb-Suite :: tools/lldb-vscode/breakpoint/TestVSCode_setFunctionBreakpoints.py lldb-Suite :: python_api/sblaunchinfo/TestSBLaunchInfo.py lldb-Suite :: lang/cpp/operators/TestCppOperators.py lldb-Suite :: commands/expression/unwind_expression/TestUnwindExpression.py lldb-Suite :: functionalities/tail_call_frames/sbapi_support/TestTailCallFrameSBAPI.py lldb-Suite :: lang/cpp/namespace/TestNamespace.py lldb-Suite :: functionalities/archives/TestBSDArchives.py lldb-Suite :: python_api/symbol-context/TestSymbolContext.py lldb-Suite :: functionalities/data-formatter/data-formatter-script/TestDataFormatterScript.py lldb-Suite :: python_api/watchpoint/watchlocation/TestSetWatchlocation.py lldb-Suite :: lang/c/array_types/TestArrayTypes.py lldb-Suite :: lang/cpp/static_members/TestCPPStaticMembers.py lldb-Suite :: functionalities/darwin_log/filter/regex/subsystem/TestDarwinLogFilterRegexSubsystem.py lldb-Suite :: linux/add-symbols/TestTargetSymbolsAddCommand.py lldb-Suite :: lang/objc/objc-builtin-types/TestObjCBuiltinTypes.py lldb-Suite :: commands/process/attach/TestProcessAttach.py lldb-Suite :: functionalities/return-value/TestReturnValue.py lldb-Suite :: commands/breakpoint/basic/TestBreakpointCommand.py lldb-Suite :: functionalities/tail_call_frames/unambiguous_sequence/TestUnambiguousTailCalls.py lldb-Suite :: functionalities/thread/crash_during_step/TestCrashDuringStep.py lldb-Suite :: functionalities/history/TestHistoryRecall.py lldb-Suite :: functionalities/data-formatter/data-formatter-objc/TestDataFormatterObjCNSContainer.py lldb-Suite :: functionalities/tsan/thread_leak/TestTsanThreadLeak.py lldb-Suite :: commands/expression/completion-crash2/TestCompletionCrash2.py lldb-Suite :: lang/cpp/scope/TestCppScope.py lldb-Suite :: functionalities/data-formatter/synthupdate/TestSyntheticFilterRecompute.py lldb-Suite :: functionalities/step-avoids-no-debug/TestStepNoDebug.py lldb-Suite :: functionalities/thread/thread_specific_break/TestThreadSpecificBreakpoint.py lldb-Suite :: commands/expression/dollar-in-variable/TestDollarInVariable.py lldb-Suite :: commands/command/source/TestCommandSource.py lldb-Suite :: python_api/name_lookup/TestNameLookup.py lldb-Suite :: lang/objc/ivar-IMP/TestObjCiVarIMP.py lldb-Suite :: functionalities/tsan/multiple/TestTsanMultiple.py lldb-Suite :: linux/sepdebugsymlink/TestTargetSymbolsSepDebugSymlink.py lldb-Suite :: functionalities/data-formatter/data-formatter-proper-plurals/TestFormattersOneIsSingular.py lldb-Suite :: functionalities/data-formatter/data-formatter-objc/TestDataFormatterObjCExpr.py

Hide Details

******************** Timed Out Tests (18): LLDB :: Reproducer/TestSynchronous.test LLDB :: SymbolFile/DWARF/debug_aranges-empty-section.s LLDB :: Register/x86-64-gp-read.test LLDB :: Driver/TestNoUseColor.test LLDB :: Reproducer/TestReuseDirectory.test LLDB :: Minidump/disassemble-no-module.yaml LLDB :: Commands/command-regex-unalias.test LLDB :: Process/TestEnvironment.test LLDB :: SymbolFile/DWARF/parallel-indexing-stress.s LLDB :: SymbolFile/sizeless-symbol.test LLDB :: SymbolFile/DWARF/debug-types-missing-signature.test LLDB :: Quit/TestQuitExitCodeNonInt.test LLDB :: Driver/TestRepl.test LLDB :: Driver/TestSingleQuote.test lldb-Unit :: tools/lldb-server/tests/./LLDBServerTests/TestBase.DebugserverEnv LLDB :: SymbolFile/Breakpad/unwind-via-stack-win.test LLDB :: SymbolFile/DWARF/deterministic-build.cpp LLDB :: Settings/TestSettingsSet.test

Hide Details

Hide Details

Slowest Tests: -------------------------------------------------------------------------- 71.80s: lldb-Suite :: types/TestIntegerTypesExpr.py 228.74s: lldb-Suite :: lang/objc/foundation/TestFoundationDisassembly.py 600.03s: lldb-Unit :: tools/lldb-server/tests/./LLDBServerTests/TestBase.DebugserverEnv 600.03s: LLDB :: Quit/TestQuitExitCodeNonInt.test 600.03s: LLDB :: Settings/TestSettingsSet.test 600.03s: LLDB :: SymbolFile/Breakpad/unwind-via-stack-win.test 600.04s: LLDB :: SymbolFile/DWARF/deterministic-build.cpp 600.04s: LLDB :: Commands/command-regex-unalias.test 600.04s: LLDB :: Minidump/disassemble-no-module.yaml 600.04s: LLDB :: SymbolFile/DWARF/debug_aranges-empty-section.s 600.04s: LLDB :: SymbolFile/sizeless-symbol.test 600.04s: LLDB :: Driver/TestRepl.test 600.04s: LLDB :: Driver/TestNoUseColor.test 600.05s: LLDB :: Reproducer/TestSynchronous.test 600.05s: LLDB :: Register/x86-64-gp-read.test 600.05s: LLDB :: Process/TestEnvironment.test 600.05s: LLDB :: SymbolFile/DWARF/parallel-indexing-stress.s 600.05s: LLDB :: Driver/TestSingleQuote.test 600.05s: LLDB :: SymbolFile/DWARF/debug-types-missing-signature.test 600.05s: LLDB :: Reproducer/TestReuseDirectory.test

Hide Details

Tests Times: -------------------------------------------------------------------------- [ Range ] :: [ Percentage ] :: [ Count ] -------------------------------------------------------------------------- [ 0s, 50s) :: [*************************************** ] :: [1678/1702] [ 50s,100s) :: [ ] :: [ 5/1702] [100s,150s) :: [ ] :: [ 0/1702] [150s,200s) :: [ ] :: [ 0/1702] [200s,250s) :: [ ] :: [ 1/1702] [250s,300s) :: [ ] :: [ 0/1702] [300s,350s) :: [ ] :: [ 0/1702] [350s,400s) :: [ ] :: [ 0/1702] [400s,450s) :: [ ] :: [ 0/1702] [450s,500s) :: [ ] :: [ 0/1702] [500s,550s) :: [ ] :: [ 0/1702] [550s,600s) :: [ ] :: [ 0/1702] [600s,650s) :: [ ] :: [ 18/1702] Expected Passes : 1061 Expected Failures : 5 Unsupported Tests : 89 Unresolved Tests : 171 Unexpected Failures: 358 Individual Timeouts: 18 FAILED: tools/lldb/lit/CMakeFiles/check-lldb-lit cd /Users/buildslave/jenkins/workspace/lldb-cmake-matrix/lldb-build/tools/lldb/lit && /usr/bin/python /Users/buildslave/jenkins/workspace/lldb-cmake-matrix/lldb-build/./bin/llvm-lit -v --time-tests --shuffle --xunit-xml-output=/Users/buildslave/jenkins/workspace/lldb-cmake-matrix/test/results.xml -v /Users/buildslave/jenkins/workspace/lldb-cmake-matrix/lldb-build/tools/lldb/lit ninja: build stopped: subcommand failed. Command failed Command: ['/usr/bin/env', 'TERM=vt100', '/usr/local/bin/ninja', '-v', 'check-lldb'] + set -e [Pipeline] } [Pipeline] // timeout [Pipeline] junit Recording test results [Pipeline] } [Pipeline] // stage [Pipeline] } [Pipeline] // withEnv [Pipeline] } [Pipeline] // node [Pipeline] End of Pipeline [BFA] Scanning build for known causes... [BFA] Found failure cause(s): [BFA] Regression test failed from category Test [BFA] Compile Error from category Compile [BFA] Ninja target failed from category Compile [BFA] Link error [BFA] Done. 8s Finished: UNSTABLE