Regression

Test Clang 7.0.1 / lldb-Suite.commands/target/basic.TestTargetCommand.py (from lldb-Suite)

Failing for the past 1 build (Since Unstable#270 )
Took 12 sec.

Stacktrace

lldb version 10.0.99 (http://labmaster3.local/git/llvm-project.git revision 1a3dd638c4a9173e53628b497a1aadc31c32eb50)
  clang revision daa79c5338228a746a7eba0cf2f2f356e1d45a5b
  llvm revision daa79c5338228a746a7eba0cf2f2f356e1d45a5b
LLDB library dir: /Users/buildslave/jenkins/workspace/lldb-cmake-matrix/lldb-build/bin
LLDB import library dir: /Users/buildslave/jenkins/workspace/lldb-cmake-matrix/lldb-build/bin
libstdcxx tests will not be run because: Don't know how to build with libstdcxx on macosx
Skipping following debug info categories: ['dwo']

Session logs for test failures/errors/unexpected successes will go into directory '/Users/buildslave/jenkins/workspace/lldb-cmake-matrix/test/logs'
Command invoked: /Users/buildslave/jenkins/workspace/lldb-cmake-matrix/llvm-project/lldb/test/dotest.py --arch=x86_64 -s /Users/buildslave/jenkins/workspace/lldb-cmake-matrix/lldb-build/lldb-test-traces -S nm -u CXXFLAGS -u CFLAGS --executable /Users/buildslave/jenkins/workspace/lldb-cmake-matrix/lldb-build/./bin/lldb --dsymutil /Users/buildslave/jenkins/workspace/lldb-cmake-matrix/lldb-build/./bin/dsymutil --filecheck /Users/buildslave/jenkins/workspace/lldb-cmake-matrix/lldb-build/./bin/FileCheck -C /Users/buildslave/jenkins/workspace/lldb-cmake-matrix/clang_701_build/bin/clang --codesign-identity lldb_codesign --server /Users/buildslave/jenkins/workspace/lldb-cmake-matrix/lldb-build/./bin/debugserver --arch x86_64 --build-dir /Users/buildslave/jenkins/workspace/lldb-cmake-matrix/lldb-build/lldb-test-build.noindex -s=/Users/buildslave/jenkins/workspace/lldb-cmake-matrix/test/logs -t --env TERM=vt100 --skip-category gmodules --skip-category watchpoint --arch=x86_64 --env LLVM_LIBS_DIR=/Users/buildslave/jenkins/workspace/lldb-cmake-matrix/lldb-build/./lib --build-dir /Users/buildslave/jenkins/workspace/lldb-cmake-matrix/lldb-build/tools/lldb/lldb-test-build.noindex --module-cache-dir /Users/buildslave/jenkins/workspace/lldb-cmake-matrix/lldb-build/tools/lldb/lldb-test-build.noindex/module-cache-lldb /Users/buildslave/jenkins/workspace/lldb-cmake-matrix/llvm-project/lldb/packages/Python/lldbsuite/test/commands/target/basic -p TestTargetCommand.py
Change dir to: /Users/buildslave/jenkins/workspace/lldb-cmake-matrix/llvm-project/lldb/packages/Python/lldbsuite/test/commands/target/basic
runCmd: settings set symbols.enable-external-lookup false
output: 

runCmd: settings set plugin.process.gdb-remote.packet-timeout 60
output: 

runCmd: settings set symbols.clang-modules-cache-path "/Users/buildslave/jenkins/workspace/lldb-cmake-matrix/lldb-build/tools/lldb/lldb-test-build.noindex/module-cache-lldb"
output: 

runCmd: settings set use-color false
output: 

runCmd: target list
output: No targets.


runCmd: file /Users/buildslave/jenkins/workspace/lldb-cmake-matrix/lldb-build/tools/lldb/lldb-test-build.noindex/commands/target/basic/TestTargetCommand.test_target_command_dsym/a.out
output: Current executable set to '/Users/buildslave/jenkins/workspace/lldb-cmake-matrix/lldb-build/tools/lldb/lldb-test-build.noindex/commands/target/basic/TestTargetCommand.test_target_command_dsym/a.out' (x86_64).


runCmd: run
output: Process 89273 stopped
* thread #1, queue = 'com.apple.main-thread', stop reason = EXC_BAD_ACCESS (code=1, address=0x0)
    frame #0: 0x0000000100000f49 a.out`main(argc=1, argv=0x00007ffeefbff558) at a.c:14:30
   11  	{
   12  	    int *null_ptr = 0;
   13  	    printf("Hello, segfault!\n");
-> 14  	    printf("Now crash %d\n", *null_ptr); // Crash here.
    	                             ^
   15  	}
Likely cause: null_ptr accessed 0x0

Process 89273 launched: '/Users/buildslave/jenkins/workspace/lldb-cmake-matrix/lldb-build/tools/lldb/lldb-test-build.noindex/commands/target/basic/TestTargetCommand.test_target_command_dsym/a.out' (x86_64)


runCmd: file /Users/buildslave/jenkins/workspace/lldb-cmake-matrix/lldb-build/tools/lldb/lldb-test-build.noindex/commands/target/basic/TestTargetCommand.test_target_command_dsym/b.out
output: Current executable set to '/Users/buildslave/jenkins/workspace/lldb-cmake-matrix/lldb-build/tools/lldb/lldb-test-build.noindex/commands/target/basic/TestTargetCommand.test_target_command_dsym/b.out' (x86_64).


runCmd: breakpoint set -f "b.c" -l 11
output: Breakpoint 1: where = b.out`main + 20 at b.c:11:5, address = 0x0000000100000fb4


Expecting pattern: ^Breakpoint (?P<bpno>[0-9]+): (?P<num_locations>[0-9]+) locations\.$
Not matched

Expecting pattern: ^Breakpoint (?P<bpno>[0-9]+): (?P<num_locations>no) locations \(pending\)\.
Not matched

Expecting pattern: ^Breakpoint (?P<bpno>[0-9]+): where = (?P<module>.*)`(?P<symbol>[+\-]{0,1}[^+]+)( \+ (?P<offset>[0-9]+)){0,1}( \[inlined\] (?P<inline_symbol>.*)){0,1} at (?P<file>[^:]+):(?P<line_no>[0-9]+)(?P<column>(:[0-9]+)?), address = (?P<address>0x[0-9a-fA-F]+)$
Matched

runCmd: run
output: Process 89448 stopped
* thread #1, queue = 'com.apple.main-thread', stop reason = breakpoint 1.1
    frame #0: 0x0000000100000fb4 b.out`main(argc=1, argv=0x00007ffeefbff558) at b.c:11:5
   8   	
   9   	int main (int argc, char const *argv[])
   10  	{
-> 11  	    return 0; // Set break point at this line.
    	    ^
   12  	}

Process 89448 launched: '/Users/buildslave/jenkins/workspace/lldb-cmake-matrix/lldb-build/tools/lldb/lldb-test-build.noindex/commands/target/basic/TestTargetCommand.test_target_command_dsym/b.out' (x86_64)


runCmd: file /Users/buildslave/jenkins/workspace/lldb-cmake-matrix/lldb-build/tools/lldb/lldb-test-build.noindex/commands/target/basic/TestTargetCommand.test_target_command_dsym/c.out
output: Current executable set to '/Users/buildslave/jenkins/workspace/lldb-cmake-matrix/lldb-build/tools/lldb/lldb-test-build.noindex/commands/target/basic/TestTargetCommand.test_target_command_dsym/c.out' (x86_64).


runCmd: breakpoint set -f "c.c" -l 27
output: Breakpoint 1: where = c.out`main + 75 at c.c:27:5, address = 0x0000000100000f7b


Expecting pattern: ^Breakpoint (?P<bpno>[0-9]+): (?P<num_locations>[0-9]+) locations\.$
Not matched

Expecting pattern: ^Breakpoint (?P<bpno>[0-9]+): (?P<num_locations>no) locations \(pending\)\.
Not matched

Expecting pattern: ^Breakpoint (?P<bpno>[0-9]+): where = (?P<module>.*)`(?P<symbol>[+\-]{0,1}[^+]+)( \+ (?P<offset>[0-9]+)){0,1}( \[inlined\] (?P<inline_symbol>.*)){0,1} at (?P<file>[^:]+):(?P<line_no>[0-9]+)(?P<column>(:[0-9]+)?), address = (?P<address>0x[0-9a-fA-F]+)$
Matched

runCmd: run
output: Process 89564 stopped
* thread #1, queue = 'com.apple.main-thread', stop reason = breakpoint 1.1
    frame #0: 0x0000000100000f7b c.out`main(argc=1, argv=0x00007ffeefbff558) at c.c:27:5
   24  	    {
   25  	        printf("day as int is %i\n", (int)day);
   26  	    }
-> 27  	    return 0; // Set break point at this line.
    	    ^
   28  	}

Process 89564 launched: '/Users/buildslave/jenkins/workspace/lldb-cmake-matrix/lldb-build/tools/lldb/lldb-test-build.noindex/commands/target/basic/TestTargetCommand.test_target_command_dsym/c.out' (x86_64)


runCmd: target list
output: Current targets:
  target #0: /Users/buildslave/jenkins/workspace/lldb-cmake-matrix/lldb-build/tools/lldb/lldb-test-build.noindex/commands/target/basic/TestTargetCommand.test_target_command_dsym/a.out ( arch=x86_64-apple-macosx10.14.0, platform=host, pid=89273, state=stopped )
  target #1: /Users/buildslave/jenkins/workspace/lldb-cmake-matrix/lldb-build/tools/lldb/lldb-test-build.noindex/commands/target/basic/TestTargetCommand.test_target_command_dsym/b.out ( arch=x86_64-apple-macosx10.14.0, platform=host, pid=89448, state=stopped )
* target #2: /Users/buildslave/jenkins/workspace/lldb-cmake-matrix/lldb-build/tools/lldb/lldb-test-build.noindex/commands/target/basic/TestTargetCommand.test_target_command_dsym/c.out ( arch=x86_64-apple-macosx10.14.0, platform=host, pid=89564, state=stopped )


runCmd: target select 0
output: Current targets:
* target #0: /Users/buildslave/jenkins/workspace/lldb-cmake-matrix/lldb-build/tools/lldb/lldb-test-build.noindex/commands/target/basic/TestTargetCommand.test_target_command_dsym/a.out ( arch=x86_64-apple-macosx10.14.0, platform=host, pid=89273, state=stopped )
  target #1: /Users/buildslave/jenkins/workspace/lldb-cmake-matrix/lldb-build/tools/lldb/lldb-test-build.noindex/commands/target/basic/TestTargetCommand.test_target_command_dsym/b.out ( arch=x86_64-apple-macosx10.14.0, platform=host, pid=89448, state=stopped )
  target #2: /Users/buildslave/jenkins/workspace/lldb-cmake-matrix/lldb-build/tools/lldb/lldb-test-build.noindex/commands/target/basic/TestTargetCommand.test_target_command_dsym/c.out ( arch=x86_64-apple-macosx10.14.0, platform=host, pid=89564, state=stopped )


runCmd: thread backtrace
output: * thread #1, queue = 'com.apple.main-thread', stop reason = EXC_BAD_ACCESS (code=1, address=0x0)
  * frame #0: 0x0000000100000f49 a.out`main(argc=1, argv=0x00007ffeefbff558) at a.c:14:30
    frame #1: 0x00007fff726a0085 libdyld.dylib`start + 1
    frame #2: 0x00007fff726a0085 libdyld.dylib`start + 1


runCmd: target select 2
output: Current targets:
  target #0: /Users/buildslave/jenkins/workspace/lldb-cmake-matrix/lldb-build/tools/lldb/lldb-test-build.noindex/commands/target/basic/TestTargetCommand.test_target_command_dsym/a.out ( arch=x86_64-apple-macosx10.14.0, platform=host, pid=89273, state=stopped )
  target #1: /Users/buildslave/jenkins/workspace/lldb-cmake-matrix/lldb-build/tools/lldb/lldb-test-build.noindex/commands/target/basic/TestTargetCommand.test_target_command_dsym/b.out ( arch=x86_64-apple-macosx10.14.0, platform=host, pid=89448, state=stopped )
* target #2: /Users/buildslave/jenkins/workspace/lldb-cmake-matrix/lldb-build/tools/lldb/lldb-test-build.noindex/commands/target/basic/TestTargetCommand.test_target_command_dsym/c.out ( arch=x86_64-apple-macosx10.14.0, platform=host, pid=89564, state=stopped )


runCmd: thread backtrace
output: * thread #1, queue = 'com.apple.main-thread', stop reason = breakpoint 1.1
  * frame #0: 0x0000000100000f7b c.out`main(argc=1, argv=0x00007ffeefbff558) at c.c:27:5
    frame #1: 0x00007fff726a0085 libdyld.dylib`start + 1
    frame #2: 0x00007fff726a0085 libdyld.dylib`start + 1


Expecting sub string: c.c:27
Matched

Expecting sub string: stop reason = breakpoint
Matched

runCmd: target select 1
output: Current targets:
  target #0: /Users/buildslave/jenkins/workspace/lldb-cmake-matrix/lldb-build/tools/lldb/lldb-test-build.noindex/commands/target/basic/TestTargetCommand.test_target_command_dsym/a.out ( arch=x86_64-apple-macosx10.14.0, platform=host, pid=89273, state=stopped )
* target #1: /Users/buildslave/jenkins/workspace/lldb-cmake-matrix/lldb-build/tools/lldb/lldb-test-build.noindex/commands/target/basic/TestTargetCommand.test_target_command_dsym/b.out ( arch=x86_64-apple-macosx10.14.0, platform=host, pid=89448, state=stopped )
  target #2: /Users/buildslave/jenkins/workspace/lldb-cmake-matrix/lldb-build/tools/lldb/lldb-test-build.noindex/commands/target/basic/TestTargetCommand.test_target_command_dsym/c.out ( arch=x86_64-apple-macosx10.14.0, platform=host, pid=89564, state=stopped )


runCmd: thread backtrace
output: * thread #1, queue = 'com.apple.main-thread', stop reason = breakpoint 1.1
  * frame #0: 0x0000000100000fb4 b.out`main(argc=1, argv=0x00007ffeefbff558) at b.c:11:5
    frame #1: 0x00007fff726a0085 libdyld.dylib`start + 1
    frame #2: 0x00007fff726a0085 libdyld.dylib`start + 1


Expecting sub string: b.c:11
Matched

Expecting sub string: stop reason = breakpoint
Matched

runCmd: target list
output: Current targets:
  target #0: /Users/buildslave/jenkins/workspace/lldb-cmake-matrix/lldb-build/tools/lldb/lldb-test-build.noindex/commands/target/basic/TestTargetCommand.test_target_command_dsym/a.out ( arch=x86_64-apple-macosx10.14.0, platform=host, pid=89273, state=stopped )
* target #1: /Users/buildslave/jenkins/workspace/lldb-cmake-matrix/lldb-build/tools/lldb/lldb-test-build.noindex/commands/target/basic/TestTargetCommand.test_target_command_dsym/b.out ( arch=x86_64-apple-macosx10.14.0, platform=host, pid=89448, state=stopped )
  target #2: /Users/buildslave/jenkins/workspace/lldb-cmake-matrix/lldb-build/tools/lldb/lldb-test-build.noindex/commands/target/basic/TestTargetCommand.test_target_command_dsym/c.out ( arch=x86_64-apple-macosx10.14.0, platform=host, pid=89564, state=stopped )


<bound method SBProcess.Kill of <lldb.SBProcess; proxy of <Swig Object of type 'lldb::SBProcess *' at 0x112162ba0> >>: success

<bound method SBProcess.Kill of <lldb.SBProcess; proxy of <Swig Object of type 'lldb::SBProcess *' at 0x1122cc660> >>: success

<bound method SBProcess.Kill of <lldb.SBProcess; proxy of <Swig Object of type 'lldb::SBProcess *' at 0x1122cec90> >>: success

PASS: LLDB (/Users/buildslave/jenkins/workspace/lldb-cmake-matrix/clang_701_build/bin/clang-7-x86_64) :: test_target_command_dsym (TestTargetCommand.targetCommandTestCase)
runCmd: settings set symbols.enable-external-lookup false
output: 

runCmd: settings set plugin.process.gdb-remote.packet-timeout 60
output: 

runCmd: settings set symbols.clang-modules-cache-path "/Users/buildslave/jenkins/workspace/lldb-cmake-matrix/lldb-build/tools/lldb/lldb-test-build.noindex/module-cache-lldb"
output: 

runCmd: settings set use-color false
output: 

runCmd: target list
output: No targets.


runCmd: file /Users/buildslave/jenkins/workspace/lldb-cmake-matrix/lldb-build/tools/lldb/lldb-test-build.noindex/commands/target/basic/TestTargetCommand.test_target_command_dwarf/a.out
output: Current executable set to '/Users/buildslave/jenkins/workspace/lldb-cmake-matrix/lldb-build/tools/lldb/lldb-test-build.noindex/commands/target/basic/TestTargetCommand.test_target_command_dwarf/a.out' (x86_64).


runCmd: run
output: Process 90401 stopped
* thread #1, queue = 'com.apple.main-thread', stop reason = EXC_BAD_ACCESS (code=1, address=0x0)
    frame #0: 0x0000000100000f49 a.out`main(argc=1, argv=0x00007ffeefbff558) at a.c:14:30
   11  	{
   12  	    int *null_ptr = 0;
   13  	    printf("Hello, segfault!\n");
-> 14  	    printf("Now crash %d\n", *null_ptr); // Crash here.
    	                             ^
   15  	}
Likely cause: null_ptr accessed 0x0

Process 90401 launched: '/Users/buildslave/jenkins/workspace/lldb-cmake-matrix/lldb-build/tools/lldb/lldb-test-build.noindex/commands/target/basic/TestTargetCommand.test_target_command_dwarf/a.out' (x86_64)


runCmd: file /Users/buildslave/jenkins/workspace/lldb-cmake-matrix/lldb-build/tools/lldb/lldb-test-build.noindex/commands/target/basic/TestTargetCommand.test_target_command_dwarf/b.out
output: Current executable set to '/Users/buildslave/jenkins/workspace/lldb-cmake-matrix/lldb-build/tools/lldb/lldb-test-build.noindex/commands/target/basic/TestTargetCommand.test_target_command_dwarf/b.out' (x86_64).


runCmd: breakpoint set -f "b.c" -l 11
output: Breakpoint 1: where = b.out`main + 20 at b.c:11:5, address = 0x0000000100000fb4


Expecting pattern: ^Breakpoint (?P<bpno>[0-9]+): (?P<num_locations>[0-9]+) locations\.$
Not matched

Expecting pattern: ^Breakpoint (?P<bpno>[0-9]+): (?P<num_locations>no) locations \(pending\)\.
Not matched

Expecting pattern: ^Breakpoint (?P<bpno>[0-9]+): where = (?P<module>.*)`(?P<symbol>[+\-]{0,1}[^+]+)( \+ (?P<offset>[0-9]+)){0,1}( \[inlined\] (?P<inline_symbol>.*)){0,1} at (?P<file>[^:]+):(?P<line_no>[0-9]+)(?P<column>(:[0-9]+)?), address = (?P<address>0x[0-9a-fA-F]+)$
Matched

runCmd: run
output: Process 90585 stopped
* thread #1, queue = 'com.apple.main-thread', stop reason = breakpoint 1.1
    frame #0: 0x0000000100000fb4 b.out`main(argc=1, argv=0x00007ffeefbff558) at b.c:11:5
   8   	
   9   	int main (int argc, char const *argv[])
   10  	{
-> 11  	    return 0; // Set break point at this line.
    	    ^
   12  	}

Process 90585 launched: '/Users/buildslave/jenkins/workspace/lldb-cmake-matrix/lldb-build/tools/lldb/lldb-test-build.noindex/commands/target/basic/TestTargetCommand.test_target_command_dwarf/b.out' (x86_64)


runCmd: file /Users/buildslave/jenkins/workspace/lldb-cmake-matrix/lldb-build/tools/lldb/lldb-test-build.noindex/commands/target/basic/TestTargetCommand.test_target_command_dwarf/c.out
output: Current executable set to '/Users/buildslave/jenkins/workspace/lldb-cmake-matrix/lldb-build/tools/lldb/lldb-test-build.noindex/commands/target/basic/TestTargetCommand.test_target_command_dwarf/c.out' (x86_64).


runCmd: breakpoint set -f "c.c" -l 27
output: Breakpoint 1: where = c.out`main + 75 at c.c:27:5, address = 0x0000000100000f7b


Expecting pattern: ^Breakpoint (?P<bpno>[0-9]+): (?P<num_locations>[0-9]+) locations\.$
Not matched

Expecting pattern: ^Breakpoint (?P<bpno>[0-9]+): (?P<num_locations>no) locations \(pending\)\.
Not matched

Expecting pattern: ^Breakpoint (?P<bpno>[0-9]+): where = (?P<module>.*)`(?P<symbol>[+\-]{0,1}[^+]+)( \+ (?P<offset>[0-9]+)){0,1}( \[inlined\] (?P<inline_symbol>.*)){0,1} at (?P<file>[^:]+):(?P<line_no>[0-9]+)(?P<column>(:[0-9]+)?), address = (?P<address>0x[0-9a-fA-F]+)$
Matched

runCmd: run
output: Process 90893 stopped
* thread #1, queue = 'com.apple.main-thread', stop reason = breakpoint 1.1
    frame #0: 0x0000000100000f7b c.out`main(argc=1, argv=0x00007ffeefbff558) at c.c:27:5
   24  	    {
   25  	        printf("day as int is %i\n", (int)day);
   26  	    }
-> 27  	    return 0; // Set break point at this line.
    	    ^
   28  	}

Process 90893 launched: '/Users/buildslave/jenkins/workspace/lldb-cmake-matrix/lldb-build/tools/lldb/lldb-test-build.noindex/commands/target/basic/TestTargetCommand.test_target_command_dwarf/c.out' (x86_64)


runCmd: target list
output: Current targets:
  target #0: /Users/buildslave/jenkins/workspace/lldb-cmake-matrix/lldb-build/tools/lldb/lldb-test-build.noindex/commands/target/basic/TestTargetCommand.test_target_command_dwarf/a.out ( arch=x86_64-apple-macosx10.14.0, platform=host, pid=90401, state=stopped )
  target #1: /Users/buildslave/jenkins/workspace/lldb-cmake-matrix/lldb-build/tools/lldb/lldb-test-build.noindex/commands/target/basic/TestTargetCommand.test_target_command_dwarf/b.out ( arch=x86_64-apple-macosx10.14.0, platform=host, pid=90585, state=stopped )
* target #2: /Users/buildslave/jenkins/workspace/lldb-cmake-matrix/lldb-build/tools/lldb/lldb-test-build.noindex/commands/target/basic/TestTargetCommand.test_target_command_dwarf/c.out ( arch=x86_64-apple-macosx10.14.0, platform=host, pid=90893, state=stopped )


runCmd: target select 0
output: Current targets:
* target #0: /Users/buildslave/jenkins/workspace/lldb-cmake-matrix/lldb-build/tools/lldb/lldb-test-build.noindex/commands/target/basic/TestTargetCommand.test_target_command_dwarf/a.out ( arch=x86_64-apple-macosx10.14.0, platform=host, pid=90401, state=stopped )
  target #1: /Users/buildslave/jenkins/workspace/lldb-cmake-matrix/lldb-build/tools/lldb/lldb-test-build.noindex/commands/target/basic/TestTargetCommand.test_target_command_dwarf/b.out ( arch=x86_64-apple-macosx10.14.0, platform=host, pid=90585, state=stopped )
  target #2: /Users/buildslave/jenkins/workspace/lldb-cmake-matrix/lldb-build/tools/lldb/lldb-test-build.noindex/commands/target/basic/TestTargetCommand.test_target_command_dwarf/c.out ( arch=x86_64-apple-macosx10.14.0, platform=host, pid=90893, state=stopped )


runCmd: thread backtrace
output: * thread #1, queue = 'com.apple.main-thread', stop reason = EXC_BAD_ACCESS (code=1, address=0x0)
  * frame #0: 0x0000000100000f49 a.out`main(argc=1, argv=0x00007ffeefbff558) at a.c:14:30
    frame #1: 0x00007fff726a0085 libdyld.dylib`start + 1
    frame #2: 0x00007fff726a0085 libdyld.dylib`start + 1


runCmd: target select 2
output: Current targets:
  target #0: /Users/buildslave/jenkins/workspace/lldb-cmake-matrix/lldb-build/tools/lldb/lldb-test-build.noindex/commands/target/basic/TestTargetCommand.test_target_command_dwarf/a.out ( arch=x86_64-apple-macosx10.14.0, platform=host, pid=90401, state=stopped )
  target #1: /Users/buildslave/jenkins/workspace/lldb-cmake-matrix/lldb-build/tools/lldb/lldb-test-build.noindex/commands/target/basic/TestTargetCommand.test_target_command_dwarf/b.out ( arch=x86_64-apple-macosx10.14.0, platform=host, pid=90585, state=stopped )
* target #2: /Users/buildslave/jenkins/workspace/lldb-cmake-matrix/lldb-build/tools/lldb/lldb-test-build.noindex/commands/target/basic/TestTargetCommand.test_target_command_dwarf/c.out ( arch=x86_64-apple-macosx10.14.0, platform=host, pid=90893, state=stopped )


runCmd: thread backtrace
output: * thread #1, queue = 'com.apple.main-thread', stop reason = breakpoint 1.1
  * frame #0: 0x0000000100000f7b c.out`main(argc=1, argv=0x00007ffeefbff558) at c.c:27:5
    frame #1: 0x00007fff726a0085 libdyld.dylib`start + 1
    frame #2: 0x00007fff726a0085 libdyld.dylib`start + 1


Expecting sub string: c.c:27
Matched

Expecting sub string: stop reason = breakpoint
Matched

runCmd: target select 1
output: Current targets:
  target #0: /Users/buildslave/jenkins/workspace/lldb-cmake-matrix/lldb-build/tools/lldb/lldb-test-build.noindex/commands/target/basic/TestTargetCommand.test_target_command_dwarf/a.out ( arch=x86_64-apple-macosx10.14.0, platform=host, pid=90401, state=stopped )
* target #1: /Users/buildslave/jenkins/workspace/lldb-cmake-matrix/lldb-build/tools/lldb/lldb-test-build.noindex/commands/target/basic/TestTargetCommand.test_target_command_dwarf/b.out ( arch=x86_64-apple-macosx10.14.0, platform=host, pid=90585, state=stopped )
  target #2: /Users/buildslave/jenkins/workspace/lldb-cmake-matrix/lldb-build/tools/lldb/lldb-test-build.noindex/commands/target/basic/TestTargetCommand.test_target_command_dwarf/c.out ( arch=x86_64-apple-macosx10.14.0, platform=host, pid=90893, state=stopped )


runCmd: thread backtrace
output: * thread #1, queue = 'com.apple.main-thread', stop reason = breakpoint 1.1
  * frame #0: 0x0000000100000fb4 b.out`main(argc=1, argv=0x00007ffeefbff558) at b.c:11:5
    frame #1: 0x00007fff726a0085 libdyld.dylib`start + 1
    frame #2: 0x00007fff726a0085 libdyld.dylib`start + 1


Expecting sub string: b.c:11
Matched

Expecting sub string: stop reason = breakpoint
Matched

runCmd: target list
output: Current targets:
  target #0: /Users/buildslave/jenkins/workspace/lldb-cmake-matrix/lldb-build/tools/lldb/lldb-test-build.noindex/commands/target/basic/TestTargetCommand.test_target_command_dwarf/a.out ( arch=x86_64-apple-macosx10.14.0, platform=host, pid=90401, state=stopped )
* target #1: /Users/buildslave/jenkins/workspace/lldb-cmake-matrix/lldb-build/tools/lldb/lldb-test-build.noindex/commands/target/basic/TestTargetCommand.test_target_command_dwarf/b.out ( arch=x86_64-apple-macosx10.14.0, platform=host, pid=90585, state=stopped )
  target #2: /Users/buildslave/jenkins/workspace/lldb-cmake-matrix/lldb-build/tools/lldb/lldb-test-build.noindex/commands/target/basic/TestTargetCommand.test_target_command_dwarf/c.out ( arch=x86_64-apple-macosx10.14.0, platform=host, pid=90893, state=stopped )


<bound method SBProcess.Kill of <lldb.SBProcess; proxy of <Swig Object of type 'lldb::SBProcess *' at 0x112162a50> >>: success

<bound method SBProcess.Kill of <lldb.SBProcess; proxy of <Swig Object of type 'lldb::SBProcess *' at 0x1122cec90> >>: success

<bound method SBProcess.Kill of <lldb.SBProcess; proxy of <Swig Object of type 'lldb::SBProcess *' at 0x1122cecf0> >>: success

PASS: LLDB (/Users/buildslave/jenkins/workspace/lldb-cmake-matrix/clang_701_build/bin/clang-7-x86_64) :: test_target_command_dwarf (TestTargetCommand.targetCommandTestCase)
UNSUPPORTED: LLDB (/Users/buildslave/jenkins/workspace/lldb-cmake-matrix/clang_701_build/bin/clang-7-x86_64) :: test_target_command_dwo (TestTargetCommand.targetCommandTestCase) (test case does not fall in any category of interest for this run) 
UNSUPPORTED: LLDB (/Users/buildslave/jenkins/workspace/lldb-cmake-matrix/clang_701_build/bin/clang-7-x86_64) :: test_target_command_gmodules (TestTargetCommand.targetCommandTestCase) (test case does not fall in any category of interest for this run) 
runCmd: settings set symbols.enable-external-lookup false
output: 

runCmd: settings set plugin.process.gdb-remote.packet-timeout 60
output: 

runCmd: settings set symbols.clang-modules-cache-path "/Users/buildslave/jenkins/workspace/lldb-cmake-matrix/lldb-build/tools/lldb/lldb-test-build.noindex/module-cache-lldb"
output: 

runCmd: settings set use-color false
output: 

runCmd: file -c '/Users/buildslave/jenkins/workspace/lldb-cmake-matrix/llvm-project/lldb/packages/Python/lldbsuite/test/commands/target/basic/invalid_core_file'
check of return status not required
runCmd failed!
error: Unable to find process plug-in for core file '/Users/buildslave/jenkins/workspace/lldb-cmake-matrix/llvm-project/lldb/packages/Python/lldbsuite/test/commands/target/basic/invalid_core_file'


Expecting sub string: Unable to find process plug-in for core file '
Matched

PASS: LLDB (/Users/buildslave/jenkins/workspace/lldb-cmake-matrix/clang_701_build/bin/clang-7-x86_64) :: test_target_create_invalid_core_file (TestTargetCommand.targetCommandTestCase)
runCmd: settings set symbols.enable-external-lookup false
output: 

runCmd: settings set plugin.process.gdb-remote.packet-timeout 60
output: 

runCmd: settings set symbols.clang-modules-cache-path "/Users/buildslave/jenkins/workspace/lldb-cmake-matrix/lldb-build/tools/lldb/lldb-test-build.noindex/module-cache-lldb"
output: 

runCmd: settings set use-color false
output: 

runCmd: file a b
check of return status not required
runCmd failed!
error: 'target create' takes exactly one executable path argument, or use the --core option.


Expecting sub string: 'target create' takes exactly one executable path
Matched

PASS: LLDB (/Users/buildslave/jenkins/workspace/lldb-cmake-matrix/clang_701_build/bin/clang-7-x86_64) :: test_target_create_multiple_args (TestTargetCommand.targetCommandTestCase)
runCmd: settings set symbols.enable-external-lookup false
output: 

runCmd: settings set plugin.process.gdb-remote.packet-timeout 60
output: 

runCmd: settings set symbols.clang-modules-cache-path "/Users/buildslave/jenkins/workspace/lldb-cmake-matrix/lldb-build/tools/lldb/lldb-test-build.noindex/module-cache-lldb"
output: 

runCmd: settings set use-color false
output: 

runCmd: file -c doesntexist
check of return status not required
runCmd failed!
error: core file 'doesntexist' doesn't exist


Expecting sub string: core file 'doesntexist' doesn't exist
Matched

PASS: LLDB (/Users/buildslave/jenkins/workspace/lldb-cmake-matrix/clang_701_build/bin/clang-7-x86_64) :: test_target_create_nonexistent_core_file (TestTargetCommand.targetCommandTestCase)
runCmd: settings set symbols.enable-external-lookup false
output: 

runCmd: settings set plugin.process.gdb-remote.packet-timeout 60
output: 

runCmd: settings set symbols.clang-modules-cache-path "/Users/buildslave/jenkins/workspace/lldb-cmake-matrix/lldb-build/tools/lldb/lldb-test-build.noindex/module-cache-lldb"
output: 

runCmd: settings set use-color false
output: 

runCmd: file -s doesntexist doesntexisteither
check of return status not required
runCmd failed!
error: invalid symbol file path 'doesntexist'


Expecting sub string: invalid symbol file path 'doesntexist'
Matched

PASS: LLDB (/Users/buildslave/jenkins/workspace/lldb-cmake-matrix/clang_701_build/bin/clang-7-x86_64) :: test_target_create_nonexistent_sym_file (TestTargetCommand.targetCommandTestCase)
runCmd: settings set symbols.enable-external-lookup false
output: 

runCmd: settings set plugin.process.gdb-remote.packet-timeout 60
output: 

runCmd: settings set symbols.clang-modules-cache-path "/Users/buildslave/jenkins/workspace/lldb-cmake-matrix/lldb-build/tools/lldb/lldb-test-build.noindex/module-cache-lldb"
output: 

runCmd: settings set use-color false
output: 

runCmd: file -c '/var/folders/09/r4vw4v8n5kb67jl66zvlbljw0000gn/T/lit_tmp_bT7Zaw/tmpWos76U'
check of return status not required
runCmd failed!
error: core file '/var/folders/09/r4vw4v8n5kb67jl66zvlbljw0000gn/T/lit_tmp_bT7Zaw/tmpWos76U' is not readable


Expecting sub string: core file '
Matched

Expecting sub string: ' is not readable
Matched

PASS: LLDB (/Users/buildslave/jenkins/workspace/lldb-cmake-matrix/clang_701_build/bin/clang-7-x86_64) :: test_target_create_unreadable_core_file (TestTargetCommand.targetCommandTestCase)
runCmd: settings set symbols.enable-external-lookup false
output: 

runCmd: settings set plugin.process.gdb-remote.packet-timeout 60
output: 

runCmd: settings set symbols.clang-modules-cache-path "/Users/buildslave/jenkins/workspace/lldb-cmake-matrix/lldb-build/tools/lldb/lldb-test-build.noindex/module-cache-lldb"
output: 

runCmd: settings set use-color false
output: 

runCmd: file -s '/var/folders/09/r4vw4v8n5kb67jl66zvlbljw0000gn/T/lit_tmp_bT7Zaw/tmp6SukkB' no_exe
check of return status not required
runCmd failed!
error: symbol file '/var/folders/09/r4vw4v8n5kb67jl66zvlbljw0000gn/T/lit_tmp_bT7Zaw/tmp6SukkB' is not readable


Expecting sub string: symbol file '
Matched

Expecting sub string: ' is not readable
Matched

PASS: LLDB (/Users/buildslave/jenkins/workspace/lldb-cmake-matrix/clang_701_build/bin/clang-7-x86_64) :: test_target_create_unreadable_sym_file (TestTargetCommand.targetCommandTestCase)
runCmd: settings set symbols.enable-external-lookup false
output: 

runCmd: settings set plugin.process.gdb-remote.packet-timeout 60
output: 

runCmd: settings set symbols.clang-modules-cache-path "/Users/buildslave/jenkins/workspace/lldb-cmake-matrix/lldb-build/tools/lldb/lldb-test-build.noindex/module-cache-lldb"
output: 

runCmd: settings set use-color false
output: 

FAIL: LLDB (/Users/buildslave/jenkins/workspace/lldb-cmake-matrix/clang_701_build/bin/clang-7-x86_64) :: test_target_delete_all (TestTargetCommand.targetCommandTestCase)
runCmd: settings set symbols.enable-external-lookup false
output: 

runCmd: settings set plugin.process.gdb-remote.packet-timeout 60
output: 

runCmd: settings set symbols.clang-modules-cache-path "/Users/buildslave/jenkins/workspace/lldb-cmake-matrix/lldb-build/tools/lldb/lldb-test-build.noindex/module-cache-lldb"
output: 

runCmd: settings set use-color false
output: 

FAIL: LLDB (/Users/buildslave/jenkins/workspace/lldb-cmake-matrix/clang_701_build/bin/clang-7-x86_64) :: test_target_delete_by_index (TestTargetCommand.targetCommandTestCase)
runCmd: settings set symbols.enable-external-lookup false
output: 

runCmd: settings set plugin.process.gdb-remote.packet-timeout 60
output: 

runCmd: settings set symbols.clang-modules-cache-path "/Users/buildslave/jenkins/workspace/lldb-cmake-matrix/lldb-build/tools/lldb/lldb-test-build.noindex/module-cache-lldb"
output: 

runCmd: settings set use-color false
output: 

FAIL: LLDB (/Users/buildslave/jenkins/workspace/lldb-cmake-matrix/clang_701_build/bin/clang-7-x86_64) :: test_target_delete_by_index_multiple (TestTargetCommand.targetCommandTestCase)
runCmd: settings set symbols.enable-external-lookup false
output: 

runCmd: settings set plugin.process.gdb-remote.packet-timeout 60
output: 

runCmd: settings set symbols.clang-modules-cache-path "/Users/buildslave/jenkins/workspace/lldb-cmake-matrix/lldb-build/tools/lldb/lldb-test-build.noindex/module-cache-lldb"
output: 

runCmd: settings set use-color false
output: 

FAIL: LLDB (/Users/buildslave/jenkins/workspace/lldb-cmake-matrix/clang_701_build/bin/clang-7-x86_64) :: test_target_delete_selected (TestTargetCommand.targetCommandTestCase)
runCmd: settings set symbols.enable-external-lookup false
output: 

runCmd: settings set plugin.process.gdb-remote.packet-timeout 60
output: 

runCmd: settings set symbols.clang-modules-cache-path "/Users/buildslave/jenkins/workspace/lldb-cmake-matrix/lldb-build/tools/lldb/lldb-test-build.noindex/module-cache-lldb"
output: 

runCmd: settings set use-color false
output: 

runCmd: target list blub
check of return status not required
runCmd failed!
error: the 'target list' command takes no arguments



Expecting sub string: the 'target list' command takes no arguments
Matched

PASS: LLDB (/Users/buildslave/jenkins/workspace/lldb-cmake-matrix/clang_701_build/bin/clang-7-x86_64) :: test_target_list_args (TestTargetCommand.targetCommandTestCase)
runCmd: settings set symbols.enable-external-lookup false
output: 

runCmd: settings set plugin.process.gdb-remote.packet-timeout 60
output: 

runCmd: settings set symbols.clang-modules-cache-path "/Users/buildslave/jenkins/workspace/lldb-cmake-matrix/lldb-build/tools/lldb/lldb-test-build.noindex/module-cache-lldb"
output: 

runCmd: settings set use-color false
output: 

FAIL: LLDB (/Users/buildslave/jenkins/workspace/lldb-cmake-matrix/clang_701_build/bin/clang-7-x86_64) :: test_target_modules_search_paths_clear (TestTargetCommand.targetCommandTestCase)
runCmd: settings set symbols.enable-external-lookup false
output: 

runCmd: settings set plugin.process.gdb-remote.packet-timeout 60
output: 

runCmd: settings set symbols.clang-modules-cache-path "/Users/buildslave/jenkins/workspace/lldb-cmake-matrix/lldb-build/tools/lldb/lldb-test-build.noindex/module-cache-lldb"
output: 

runCmd: settings set use-color false
output: 

runCmd: file /Users/buildslave/jenkins/workspace/lldb-cmake-matrix/lldb-build/tools/lldb/lldb-test-build.noindex/commands/target/basic/TestTargetCommand.test_target_modules_search_paths_query/b.out
output: Current executable set to '/Users/buildslave/jenkins/workspace/lldb-cmake-matrix/lldb-build/tools/lldb/lldb-test-build.noindex/commands/target/basic/TestTargetCommand.test_target_modules_search_paths_query/b.out' (x86_64).


runCmd: target modules search-paths add foo bar
output: 

runCmd: target modules search-paths query foo
output: bar


Expecting sub string: bar
Matched

runCmd: target modules search-paths query faz
output: faz


Expecting sub string: faz
Matched

runCmd: target modules search-paths query faz baz
check of return status not required
runCmd failed!
error: query requires one argument



Expecting sub string: query requires one argument
Matched

PASS: LLDB (/Users/buildslave/jenkins/workspace/lldb-cmake-matrix/clang_701_build/bin/clang-7-x86_64) :: test_target_modules_search_paths_query (TestTargetCommand.targetCommandTestCase)
runCmd: settings set symbols.enable-external-lookup false
output: 

runCmd: settings set plugin.process.gdb-remote.packet-timeout 60
output: 

runCmd: settings set symbols.clang-modules-cache-path "/Users/buildslave/jenkins/workspace/lldb-cmake-matrix/lldb-build/tools/lldb/lldb-test-build.noindex/module-cache-lldb"
output: 

runCmd: settings set use-color false
output: 

runCmd: target delete --all
output: 0 targets deleted.


runCmd: target select 0
check of return status not required
runCmd failed!
error: index 0 is out of range since there are no active targets


Expecting sub string: index 0 is out of range since there are no active targets
Matched

FAIL: LLDB (/Users/buildslave/jenkins/workspace/lldb-cmake-matrix/clang_701_build/bin/clang-7-x86_64) :: test_target_select_invalid_index (TestTargetCommand.targetCommandTestCase)
runCmd: settings set symbols.enable-external-lookup false
output: 

runCmd: settings set plugin.process.gdb-remote.packet-timeout 60
output: 

runCmd: settings set symbols.clang-modules-cache-path "/Users/buildslave/jenkins/workspace/lldb-cmake-matrix/lldb-build/tools/lldb/lldb-test-build.noindex/module-cache-lldb"
output: 

runCmd: settings set use-color false
output: 

runCmd: target select
check of return status not required
runCmd failed!
error: 'target select' takes a single argument: a target index



Expecting sub string: 'target select' takes a single argument: a target index
Matched

PASS: LLDB (/Users/buildslave/jenkins/workspace/lldb-cmake-matrix/clang_701_build/bin/clang-7-x86_64) :: test_target_select_no_index (TestTargetCommand.targetCommandTestCase)
runCmd: settings set symbols.enable-external-lookup false
output: 

runCmd: settings set plugin.process.gdb-remote.packet-timeout 60
output: 

runCmd: settings set symbols.clang-modules-cache-path "/Users/buildslave/jenkins/workspace/lldb-cmake-matrix/lldb-build/tools/lldb/lldb-test-build.noindex/module-cache-lldb"
output: 

runCmd: settings set use-color false
output: 

FAIL: LLDB (/Users/buildslave/jenkins/workspace/lldb-cmake-matrix/clang_701_build/bin/clang-7-x86_64) :: test_target_stop_hook_delete (TestTargetCommand.targetCommandTestCase)
runCmd: settings set symbols.enable-external-lookup false
output: 

runCmd: settings set plugin.process.gdb-remote.packet-timeout 60
output: 

runCmd: settings set symbols.clang-modules-cache-path "/Users/buildslave/jenkins/workspace/lldb-cmake-matrix/lldb-build/tools/lldb/lldb-test-build.noindex/module-cache-lldb"
output: 

runCmd: settings set use-color false
output: 

runCmd: file /Users/buildslave/jenkins/workspace/lldb-cmake-matrix/lldb-build/tools/lldb/lldb-test-build.noindex/commands/target/basic/TestTargetCommand.test_target_stop_hook_disable_enable/b.out
output: Current executable set to '/Users/buildslave/jenkins/workspace/lldb-cmake-matrix/lldb-build/tools/lldb/lldb-test-build.noindex/commands/target/basic/TestTargetCommand.test_target_stop_hook_disable_enable/b.out' (x86_64).


runCmd: target stop-hook disable 1
check of return status not required
runCmd failed!
error: unknown stop hook id: "1".


Expecting sub string: unknown stop hook id: "1"
Matched

runCmd: target stop-hook disable blub
check of return status not required
runCmd failed!
error: invalid stop hook id: "blub".


Expecting sub string: invalid stop hook id: "blub"
Matched

runCmd: target stop-hook enable 1
check of return status not required
runCmd failed!
error: unknown stop hook id: "1".


Expecting sub string: unknown stop hook id: "1"
Matched

runCmd: target stop-hook enable blub
check of return status not required
runCmd failed!
error: invalid stop hook id: "blub".


Expecting sub string: invalid stop hook id: "blub"
Matched

PASS: LLDB (/Users/buildslave/jenkins/workspace/lldb-cmake-matrix/clang_701_build/bin/clang-7-x86_64) :: test_target_stop_hook_disable_enable (TestTargetCommand.targetCommandTestCase)
runCmd: settings set symbols.enable-external-lookup false
output: 

runCmd: settings set plugin.process.gdb-remote.packet-timeout 60
output: 

runCmd: settings set symbols.clang-modules-cache-path "/Users/buildslave/jenkins/workspace/lldb-cmake-matrix/lldb-build/tools/lldb/lldb-test-build.noindex/module-cache-lldb"
output: 

runCmd: settings set use-color false
output: 

FAIL: LLDB (/Users/buildslave/jenkins/workspace/lldb-cmake-matrix/clang_701_build/bin/clang-7-x86_64) :: test_target_variable_command_dsym (TestTargetCommand.targetCommandTestCase)
runCmd: settings set symbols.enable-external-lookup false
output: 

runCmd: settings set plugin.process.gdb-remote.packet-timeout 60
output: 

runCmd: settings set symbols.clang-modules-cache-path "/Users/buildslave/jenkins/workspace/lldb-cmake-matrix/lldb-build/tools/lldb/lldb-test-build.noindex/module-cache-lldb"
output: 

runCmd: settings set use-color false
output: 

FAIL: LLDB (/Users/buildslave/jenkins/workspace/lldb-cmake-matrix/clang_701_build/bin/clang-7-x86_64) :: test_target_variable_command_dwarf (TestTargetCommand.targetCommandTestCase)
UNSUPPORTED: LLDB (/Users/buildslave/jenkins/workspace/lldb-cmake-matrix/clang_701_build/bin/clang-7-x86_64) :: test_target_variable_command_dwo (TestTargetCommand.targetCommandTestCase) (test case does not fall in any category of interest for this run) 
UNSUPPORTED: LLDB (/Users/buildslave/jenkins/workspace/lldb-cmake-matrix/clang_701_build/bin/clang-7-x86_64) :: test_target_variable_command_gmodules (TestTargetCommand.targetCommandTestCase) (test case does not fall in any category of interest for this run) 
runCmd: settings set symbols.enable-external-lookup false
output: 

runCmd: settings set plugin.process.gdb-remote.packet-timeout 60
output: 

runCmd: settings set symbols.clang-modules-cache-path "/Users/buildslave/jenkins/workspace/lldb-cmake-matrix/lldb-build/tools/lldb/lldb-test-build.noindex/module-cache-lldb"
output: 

runCmd: settings set use-color false
output: 

runCmd: file /Users/buildslave/jenkins/workspace/lldb-cmake-matrix/lldb-build/tools/lldb/lldb-test-build.noindex/commands/target/basic/TestTargetCommand.test_target_variable_command_no_fail_dsym/globals
output: Current executable set to '/Users/buildslave/jenkins/workspace/lldb-cmake-matrix/lldb-build/tools/lldb/lldb-test-build.noindex/commands/target/basic/TestTargetCommand.test_target_variable_command_no_fail_dsym/globals' (x86_64).


runCmd: target variable my_global_char
output: (char) my_global_char = 'X'


Expecting sub string: my_global_char
Matched

Expecting sub string: 'X'
Matched

runCmd: target variable my_global_str
output: (const char *) my_global_str = 0x0000000100000f6e "abc"


Expecting sub string: my_global_str
Matched

Expecting sub string: "abc"
Matched

runCmd: target variable my_static_int
output: (int) my_static_int = 228


Expecting sub string: my_static_int
Matched

Expecting sub string: 228
Matched

runCmd: target variable my_global_str_ptr
output: (const char **) my_global_str_ptr = 0x0000000100001020


Not expecting sub string: "abc"
Not matched

runCmd: target variable *my_global_str_ptr
output: (const char *) *my_global_str_ptr = 0x0000000100000f6e "abc"


Expecting sub string: "abc"
Matched

runCmd: target variable *my_global_str
output: (const char) *my_global_str = 'a'


Expecting sub string: a
Matched

runCmd: b main
output: Breakpoint 1: where = globals`main + 22 at globals.c:17:33, address = 0x0000000100000ef6


runCmd: run
runCmd failed!
error: process exited with status -1 (Error 1)


Command 'run' failed!

FAIL: LLDB (/Users/buildslave/jenkins/workspace/lldb-cmake-matrix/clang_701_build/bin/clang-7-x86_64) :: test_target_variable_command_no_fail_dsym (TestTargetCommand.targetCommandTestCase)
<bound method SBProcess.Kill of <lldb.SBProcess; proxy of <Swig Object of type 'lldb::SBProcess *' at 0x112359210> >>: success

runCmd: settings set symbols.enable-external-lookup false
output: 

runCmd: settings set plugin.process.gdb-remote.packet-timeout 60
output: 

runCmd: settings set symbols.clang-modules-cache-path "/Users/buildslave/jenkins/workspace/lldb-cmake-matrix/lldb-build/tools/lldb/lldb-test-build.noindex/module-cache-lldb"
output: 

runCmd: settings set use-color false
output: 

runCmd: file /Users/buildslave/jenkins/workspace/lldb-cmake-matrix/lldb-build/tools/lldb/lldb-test-build.noindex/commands/target/basic/TestTargetCommand.test_target_variable_command_no_fail_dwarf/globals
output: Current executable set to '/Users/buildslave/jenkins/workspace/lldb-cmake-matrix/lldb-build/tools/lldb/lldb-test-build.noindex/commands/target/basic/TestTargetCommand.test_target_variable_command_no_fail_dwarf/globals' (x86_64).


runCmd: target variable my_global_char
output: (char) my_global_char = 'X'


Expecting sub string: my_global_char
Matched

Expecting sub string: 'X'
Matched

runCmd: target variable my_global_str
output: (const char *) my_global_str = 0x0000000100000f6e "abc"


Expecting sub string: my_global_str
Matched

Expecting sub string: "abc"
Matched

runCmd: target variable my_static_int
output: (int) my_static_int = 228


Expecting sub string: my_static_int
Matched

Expecting sub string: 228
Matched

runCmd: target variable my_global_str_ptr
output: (const char **) my_global_str_ptr = 0x0000000100001020


Not expecting sub string: "abc"
Not matched

runCmd: target variable *my_global_str_ptr
output: (const char *) *my_global_str_ptr = 0x0000000100000f6e "abc"


Expecting sub string: "abc"
Matched

runCmd: target variable *my_global_str
output: (const char) *my_global_str = 'a'


Expecting sub string: a
Matched

runCmd: b main
output: Breakpoint 1: where = globals`main + 22 at globals.c:17:33, address = 0x0000000100000ef6


runCmd: run
runCmd failed!
error: process exited with status -1 (Error 1)


Command 'run' failed!

FAIL: LLDB (/Users/buildslave/jenkins/workspace/lldb-cmake-matrix/clang_701_build/bin/clang-7-x86_64) :: test_target_variable_command_no_fail_dwarf (TestTargetCommand.targetCommandTestCase)
<bound method SBProcess.Kill of <lldb.SBProcess; proxy of <Swig Object of type 'lldb::SBProcess *' at 0x1123595d0> >>: success

UNSUPPORTED: LLDB (/Users/buildslave/jenkins/workspace/lldb-cmake-matrix/clang_701_build/bin/clang-7-x86_64) :: test_target_variable_command_no_fail_dwo (TestTargetCommand.targetCommandTestCase) (test case does not fall in any category of interest for this run) 
UNSUPPORTED: LLDB (/Users/buildslave/jenkins/workspace/lldb-cmake-matrix/clang_701_build/bin/clang-7-x86_64) :: test_target_variable_command_no_fail_gmodules (TestTargetCommand.targetCommandTestCase) (test case does not fall in any category of interest for this run) 
Restore dir to: /Users/buildslave/jenkins/workspace/lldb-cmake-matrix/lldb-build/tools/lldb/lit
======================================================================
ERROR: test_target_delete_all (TestTargetCommand.targetCommandTestCase)
----------------------------------------------------------------------
Error when building test subject.

Build Command:
make VPATH=/Users/buildslave/jenkins/workspace/lldb-cmake-matrix/llvm-project/lldb/packages/Python/lldbsuite/test/commands/target/basic -C /Users/buildslave/jenkins/workspace/lldb-cmake-matrix/lldb-build/tools/lldb/lldb-test-build.noindex/commands/target/basic/TestTargetCommand.test_target_delete_all -I /Users/buildslave/jenkins/workspace/lldb-cmake-matrix/llvm-project/lldb/packages/Python/lldbsuite/test/commands/target/basic -I /Users/buildslave/jenkins/workspace/lldb-cmake-matrix/llvm-project/lldb/packages/Python/lldbsuite/test/make -f /Users/buildslave/jenkins/workspace/lldb-cmake-matrix/llvm-project/lldb/packages/Python/lldbsuite/test/commands/target/basic/Makefile all ARCH=x86_64 CC="/Users/buildslave/jenkins/workspace/lldb-cmake-matrix/clang_701_build/bin/clang-7" EXE='/Users/buildslave/jenkins/workspace/lldb-cmake-matrix/lldb-build/tools/lldb/lldb-test-build.noindex/commands/target/basic/TestTargetCommand.test_target_delete_all/b.out' C_SOURCES='b.c'

Build Command Output:
clang-7: error: unable to execute command: Killed: 9
clang-7: error: clang frontend command failed due to signal (use -v to see invocation)
clang version 7.0.1 
Target: x86_64-apple-darwin18.0.0
Thread model: posix
InstalledDir: /Users/buildslave/jenkins/workspace/lldb-cmake-matrix/clang_701_build/bin
clang-7: note: diagnostic msg: PLEASE submit a bug report to https://bugs.llvm.org/ and include the crash backtrace, preprocessed source, and associated run script.
clang-7: error: unable to execute command: Killed: 9
clang-7: note: diagnostic msg: Error generating preprocessed source(s).
make: *** [b.o] Error 254

Test Directory:
/Users/buildslave/jenkins/workspace/lldb-cmake-matrix/llvm-project/lldb/packages/Python/lldbsuite/test/commands/target/basic
======================================================================
ERROR: test_target_delete_by_index (TestTargetCommand.targetCommandTestCase)
----------------------------------------------------------------------
Error when building test subject.

Build Command:
make VPATH=/Users/buildslave/jenkins/workspace/lldb-cmake-matrix/llvm-project/lldb/packages/Python/lldbsuite/test/commands/target/basic -C /Users/buildslave/jenkins/workspace/lldb-cmake-matrix/lldb-build/tools/lldb/lldb-test-build.noindex/commands/target/basic/TestTargetCommand.test_target_delete_by_index -I /Users/buildslave/jenkins/workspace/lldb-cmake-matrix/llvm-project/lldb/packages/Python/lldbsuite/test/commands/target/basic -I /Users/buildslave/jenkins/workspace/lldb-cmake-matrix/llvm-project/lldb/packages/Python/lldbsuite/test/make -f /Users/buildslave/jenkins/workspace/lldb-cmake-matrix/llvm-project/lldb/packages/Python/lldbsuite/test/commands/target/basic/Makefile all ARCH=x86_64 CC="/Users/buildslave/jenkins/workspace/lldb-cmake-matrix/clang_701_build/bin/clang-7" EXE='/Users/buildslave/jenkins/workspace/lldb-cmake-matrix/lldb-build/tools/lldb/lldb-test-build.noindex/commands/target/basic/TestTargetCommand.test_target_delete_by_index/a.out' C_SOURCES='a.c'

Build Command Output:
make: *** [/Users/buildslave/jenkins/workspace/lldb-cmake-matrix/lldb-build/tools/lldb/lldb-test-build.noindex/commands/target/basic/TestTargetCommand.test_target_delete_by_index/a.out] Killed: 9

Test Directory:
/Users/buildslave/jenkins/workspace/lldb-cmake-matrix/llvm-project/lldb/packages/Python/lldbsuite/test/commands/target/basic
======================================================================
ERROR: test_target_delete_by_index_multiple (TestTargetCommand.targetCommandTestCase)
----------------------------------------------------------------------
Error when building test subject.

Build Command:
make VPATH=/Users/buildslave/jenkins/workspace/lldb-cmake-matrix/llvm-project/lldb/packages/Python/lldbsuite/test/commands/target/basic -C /Users/buildslave/jenkins/workspace/lldb-cmake-matrix/lldb-build/tools/lldb/lldb-test-build.noindex/commands/target/basic/TestTargetCommand.test_target_delete_by_index_multiple -I /Users/buildslave/jenkins/workspace/lldb-cmake-matrix/llvm-project/lldb/packages/Python/lldbsuite/test/commands/target/basic -I /Users/buildslave/jenkins/workspace/lldb-cmake-matrix/llvm-project/lldb/packages/Python/lldbsuite/test/make -f /Users/buildslave/jenkins/workspace/lldb-cmake-matrix/llvm-project/lldb/packages/Python/lldbsuite/test/commands/target/basic/Makefile all ARCH=x86_64 CC="/Users/buildslave/jenkins/workspace/lldb-cmake-matrix/clang_701_build/bin/clang-7" EXE='/Users/buildslave/jenkins/workspace/lldb-cmake-matrix/lldb-build/tools/lldb/lldb-test-build.noindex/commands/target/basic/TestTargetCommand.test_target_delete_by_index_multiple/b.out' C_SOURCES='b.c'

Build Command Output:
make: *** [/Users/buildslave/jenkins/workspace/lldb-cmake-matrix/lldb-build/tools/lldb/lldb-test-build.noindex/commands/target/basic/TestTargetCommand.test_target_delete_by_index_multiple/b.out] Killed: 9

Test Directory:
/Users/buildslave/jenkins/workspace/lldb-cmake-matrix/llvm-project/lldb/packages/Python/lldbsuite/test/commands/target/basic
======================================================================
ERROR: test_target_delete_selected (TestTargetCommand.targetCommandTestCase)
----------------------------------------------------------------------
Error when building test subject.

Build Command:
make VPATH=/Users/buildslave/jenkins/workspace/lldb-cmake-matrix/llvm-project/lldb/packages/Python/lldbsuite/test/commands/target/basic -C /Users/buildslave/jenkins/workspace/lldb-cmake-matrix/lldb-build/tools/lldb/lldb-test-build.noindex/commands/target/basic/TestTargetCommand.test_target_delete_selected -I /Users/buildslave/jenkins/workspace/lldb-cmake-matrix/llvm-project/lldb/packages/Python/lldbsuite/test/commands/target/basic -I /Users/buildslave/jenkins/workspace/lldb-cmake-matrix/llvm-project/lldb/packages/Python/lldbsuite/test/make -f /Users/buildslave/jenkins/workspace/lldb-cmake-matrix/llvm-project/lldb/packages/Python/lldbsuite/test/commands/target/basic/Makefile all ARCH=x86_64 CC="/Users/buildslave/jenkins/workspace/lldb-cmake-matrix/clang_701_build/bin/clang-7" EXE='/Users/buildslave/jenkins/workspace/lldb-cmake-matrix/lldb-build/tools/lldb/lldb-test-build.noindex/commands/target/basic/TestTargetCommand.test_target_delete_selected/a.out' C_SOURCES='a.c'

Build Command Output:
clang-7: error: unable to execute command: Killed: 9
clang-7: error: clang frontend command failed due to signal (use -v to see invocation)
clang version 7.0.1 
Target: x86_64-apple-darwin18.0.0
Thread model: posix
InstalledDir: /Users/buildslave/jenkins/workspace/lldb-cmake-matrix/clang_701_build/bin
clang-7: note: diagnostic msg: PLEASE submit a bug report to https://bugs.llvm.org/ and include the crash backtrace, preprocessed source, and associated run script.
clang-7: error: unable to execute command: Killed: 9
clang-7: note: diagnostic msg: Error generating preprocessed source(s).
make: *** [a.o] Error 254

Test Directory:
/Users/buildslave/jenkins/workspace/lldb-cmake-matrix/llvm-project/lldb/packages/Python/lldbsuite/test/commands/target/basic
======================================================================
ERROR: test_target_modules_search_paths_clear (TestTargetCommand.targetCommandTestCase)
----------------------------------------------------------------------
Error when building test subject.

Build Command:
make VPATH=/Users/buildslave/jenkins/workspace/lldb-cmake-matrix/llvm-project/lldb/packages/Python/lldbsuite/test/commands/target/basic -C /Users/buildslave/jenkins/workspace/lldb-cmake-matrix/lldb-build/tools/lldb/lldb-test-build.noindex/commands/target/basic/TestTargetCommand.test_target_modules_search_paths_clear -I /Users/buildslave/jenkins/workspace/lldb-cmake-matrix/llvm-project/lldb/packages/Python/lldbsuite/test/commands/target/basic -I /Users/buildslave/jenkins/workspace/lldb-cmake-matrix/llvm-project/lldb/packages/Python/lldbsuite/test/make -f /Users/buildslave/jenkins/workspace/lldb-cmake-matrix/llvm-project/lldb/packages/Python/lldbsuite/test/commands/target/basic/Makefile all ARCH=x86_64 CC="/Users/buildslave/jenkins/workspace/lldb-cmake-matrix/clang_701_build/bin/clang-7" EXE='/Users/buildslave/jenkins/workspace/lldb-cmake-matrix/lldb-build/tools/lldb/lldb-test-build.noindex/commands/target/basic/TestTargetCommand.test_target_modules_search_paths_clear/b.out' C_SOURCES='b.c'

Build Command Output:
make: *** [/Users/buildslave/jenkins/workspace/lldb-cmake-matrix/lldb-build/tools/lldb/lldb-test-build.noindex/commands/target/basic/TestTargetCommand.test_target_modules_search_paths_clear/b.out] Killed: 9

Test Directory:
/Users/buildslave/jenkins/workspace/lldb-cmake-matrix/llvm-project/lldb/packages/Python/lldbsuite/test/commands/target/basic
======================================================================
ERROR: test_target_select_invalid_index (TestTargetCommand.targetCommandTestCase)
----------------------------------------------------------------------
Error when building test subject.

Build Command:
make VPATH=/Users/buildslave/jenkins/workspace/lldb-cmake-matrix/llvm-project/lldb/packages/Python/lldbsuite/test/commands/target/basic -C /Users/buildslave/jenkins/workspace/lldb-cmake-matrix/lldb-build/tools/lldb/lldb-test-build.noindex/commands/target/basic/TestTargetCommand.test_target_select_invalid_index -I /Users/buildslave/jenkins/workspace/lldb-cmake-matrix/llvm-project/lldb/packages/Python/lldbsuite/test/commands/target/basic -I /Users/buildslave/jenkins/workspace/lldb-cmake-matrix/llvm-project/lldb/packages/Python/lldbsuite/test/make -f /Users/buildslave/jenkins/workspace/lldb-cmake-matrix/llvm-project/lldb/packages/Python/lldbsuite/test/commands/target/basic/Makefile all ARCH=x86_64 CC="/Users/buildslave/jenkins/workspace/lldb-cmake-matrix/clang_701_build/bin/clang-7" EXE='/Users/buildslave/jenkins/workspace/lldb-cmake-matrix/lldb-build/tools/lldb/lldb-test-build.noindex/commands/target/basic/TestTargetCommand.test_target_select_invalid_index/b.out' C_SOURCES='b.c'

Build Command Output:
clang-7: error: unable to execute command: Killed: 9
clang-7: error: clang frontend command failed due to signal (use -v to see invocation)
clang version 7.0.1 
Target: x86_64-apple-darwin18.0.0
Thread model: posix
InstalledDir: /Users/buildslave/jenkins/workspace/lldb-cmake-matrix/clang_701_build/bin
clang-7: note: diagnostic msg: PLEASE submit a bug report to https://bugs.llvm.org/ and include the crash backtrace, preprocessed source, and associated run script.
clang-7: note: diagnostic msg: 
********************

PLEASE ATTACH THE FOLLOWING FILES TO THE BUG REPORT:
Preprocessed source(s) and associated run script(s) are located at:
clang-7: note: diagnostic msg: /var/folders/09/r4vw4v8n5kb67jl66zvlbljw0000gn/T/lit_tmp_bT7Zaw/b-0dbcb3.c
clang-7: note: diagnostic msg: /var/folders/09/r4vw4v8n5kb67jl66zvlbljw0000gn/T/lit_tmp_bT7Zaw/b-0dbcb3.sh
clang-7: note: diagnostic msg: Crash backtrace is located in
clang-7: note: diagnostic msg: /Users/buildslave/Library/Logs/DiagnosticReports/clang-7_<YYYY-MM-DD-HHMMSS>_<hostname>.crash
clang-7: note: diagnostic msg: (choose the .crash file that corresponds to your crash)
clang-7: note: diagnostic msg: 

********************
make: *** [b.o] Error 254

Test Directory:
/Users/buildslave/jenkins/workspace/lldb-cmake-matrix/llvm-project/lldb/packages/Python/lldbsuite/test/commands/target/basic
======================================================================
ERROR: test_target_stop_hook_delete (TestTargetCommand.targetCommandTestCase)
----------------------------------------------------------------------
Error when building test subject.

Build Command:
make VPATH=/Users/buildslave/jenkins/workspace/lldb-cmake-matrix/llvm-project/lldb/packages/Python/lldbsuite/test/commands/target/basic -C /Users/buildslave/jenkins/workspace/lldb-cmake-matrix/lldb-build/tools/lldb/lldb-test-build.noindex/commands/target/basic/TestTargetCommand.test_target_stop_hook_delete -I /Users/buildslave/jenkins/workspace/lldb-cmake-matrix/llvm-project/lldb/packages/Python/lldbsuite/test/commands/target/basic -I /Users/buildslave/jenkins/workspace/lldb-cmake-matrix/llvm-project/lldb/packages/Python/lldbsuite/test/make -f /Users/buildslave/jenkins/workspace/lldb-cmake-matrix/llvm-project/lldb/packages/Python/lldbsuite/test/commands/target/basic/Makefile all ARCH=x86_64 CC="/Users/buildslave/jenkins/workspace/lldb-cmake-matrix/clang_701_build/bin/clang-7" EXE='/Users/buildslave/jenkins/workspace/lldb-cmake-matrix/lldb-build/tools/lldb/lldb-test-build.noindex/commands/target/basic/TestTargetCommand.test_target_stop_hook_delete/b.out' C_SOURCES='b.c'

Build Command Output:
clang-7: error: unable to execute command: Killed: 9
clang-7: error: clang frontend command failed due to signal (use -v to see invocation)
clang version 7.0.1 
Target: x86_64-apple-darwin18.0.0
Thread model: posix
InstalledDir: /Users/buildslave/jenkins/workspace/lldb-cmake-matrix/clang_701_build/bin
clang-7: note: diagnostic msg: PLEASE submit a bug report to https://bugs.llvm.org/ and include the crash backtrace, preprocessed source, and associated run script.
clang-7: note: diagnostic msg: 
********************

PLEASE ATTACH THE FOLLOWING FILES TO THE BUG REPORT:
Preprocessed source(s) and associated run script(s) are located at:
clang-7: note: diagnostic msg: /var/folders/09/r4vw4v8n5kb67jl66zvlbljw0000gn/T/lit_tmp_bT7Zaw/b-e6707d.c
clang-7: note: diagnostic msg: /var/folders/09/r4vw4v8n5kb67jl66zvlbljw0000gn/T/lit_tmp_bT7Zaw/b-e6707d.sh
clang-7: note: diagnostic msg: Crash backtrace is located in
clang-7: note: diagnostic msg: /Users/buildslave/Library/Logs/DiagnosticReports/clang-7_<YYYY-MM-DD-HHMMSS>_<hostname>.crash
clang-7: note: diagnostic msg: (choose the .crash file that corresponds to your crash)
clang-7: note: diagnostic msg: 

********************
make: *** [b.o] Error 254

Test Directory:
/Users/buildslave/jenkins/workspace/lldb-cmake-matrix/llvm-project/lldb/packages/Python/lldbsuite/test/commands/target/basic
======================================================================
ERROR: test_target_variable_command_dsym (TestTargetCommand.targetCommandTestCase)
    Test 'target variable' command before and after starting the inferior.
----------------------------------------------------------------------
Error when building test subject.

Build Command:
make VPATH=/Users/buildslave/jenkins/workspace/lldb-cmake-matrix/llvm-project/lldb/packages/Python/lldbsuite/test/commands/target/basic -C /Users/buildslave/jenkins/workspace/lldb-cmake-matrix/lldb-build/tools/lldb/lldb-test-build.noindex/commands/target/basic/TestTargetCommand.test_target_variable_command_dsym -I /Users/buildslave/jenkins/workspace/lldb-cmake-matrix/llvm-project/lldb/packages/Python/lldbsuite/test/commands/target/basic -I /Users/buildslave/jenkins/workspace/lldb-cmake-matrix/llvm-project/lldb/packages/Python/lldbsuite/test/make -f /Users/buildslave/jenkins/workspace/lldb-cmake-matrix/llvm-project/lldb/packages/Python/lldbsuite/test/commands/target/basic/Makefile MAKE_DSYM=YES ARCH=x86_64 CC="/Users/buildslave/jenkins/workspace/lldb-cmake-matrix/clang_701_build/bin/clang-7" all EXE='/Users/buildslave/jenkins/workspace/lldb-cmake-matrix/lldb-build/tools/lldb/lldb-test-build.noindex/commands/target/basic/TestTargetCommand.test_target_variable_command_dsym/globals' C_SOURCES='globals.c'

Build Command Output:
/bin/sh: line 1: 93343 Killed: 9               /Users/buildslave/jenkins/workspace/lldb-cmake-matrix/clang_701_build/bin/clang-7 -M -g -O0 -fno-builtin -isysroot "/Applications/Xcode.app/Contents/Developer/Platforms/MacOSX.platform/Developer/SDKs/MacOSX10.14.sdk" -arch x86_64 -I/Users/buildslave/jenkins/workspace/lldb-cmake-matrix/llvm-project/lldb/packages/Python/lldbsuite/test/make/../../../../../include -I/Users/buildslave/jenkins/workspace/lldb-cmake-matrix/llvm-project/lldb/packages/Python/lldbsuite/test/commands/target/basic -I/Users/buildslave/jenkins/workspace/lldb-cmake-matrix/llvm-project/lldb/packages/Python/lldbsuite/test/make -include /Users/buildslave/jenkins/workspace/lldb-cmake-matrix/llvm-project/lldb/packages/Python/lldbsuite/test/make/test_common.h -fno-limit-debug-info /Users/buildslave/jenkins/workspace/lldb-cmake-matrix/llvm-project/lldb/packages/Python/lldbsuite/test/commands/target/basic/globals.c > globals.d.tmp
make: *** [globals.o] Killed: 9

Test Directory:
/Users/buildslave/jenkins/workspace/lldb-cmake-matrix/llvm-project/lldb/packages/Python/lldbsuite/test/commands/target/basic
======================================================================
ERROR: test_target_variable_command_dwarf (TestTargetCommand.targetCommandTestCase)
    Test 'target variable' command before and after starting the inferior.
----------------------------------------------------------------------
Error when building test subject.

Build Command:
make VPATH=/Users/buildslave/jenkins/workspace/lldb-cmake-matrix/llvm-project/lldb/packages/Python/lldbsuite/test/commands/target/basic -C /Users/buildslave/jenkins/workspace/lldb-cmake-matrix/lldb-build/tools/lldb/lldb-test-build.noindex/commands/target/basic/TestTargetCommand.test_target_variable_command_dwarf -I /Users/buildslave/jenkins/workspace/lldb-cmake-matrix/llvm-project/lldb/packages/Python/lldbsuite/test/commands/target/basic -I /Users/buildslave/jenkins/workspace/lldb-cmake-matrix/llvm-project/lldb/packages/Python/lldbsuite/test/make -f /Users/buildslave/jenkins/workspace/lldb-cmake-matrix/llvm-project/lldb/packages/Python/lldbsuite/test/commands/target/basic/Makefile MAKE_DSYM=NO ARCH=x86_64 CC="/Users/buildslave/jenkins/workspace/lldb-cmake-matrix/clang_701_build/bin/clang-7" EXE='/Users/buildslave/jenkins/workspace/lldb-cmake-matrix/lldb-build/tools/lldb/lldb-test-build.noindex/commands/target/basic/TestTargetCommand.test_target_variable_command_dwarf/globals' C_SOURCES='globals.c'

Build Command Output:
make: *** [globals.o] Killed: 9

Test Directory:
/Users/buildslave/jenkins/workspace/lldb-cmake-matrix/llvm-project/lldb/packages/Python/lldbsuite/test/commands/target/basic
======================================================================
FAIL: test_target_variable_command_no_fail_dsym (TestTargetCommand.targetCommandTestCase)
    Test 'target variable' command before and after starting the inferior.
----------------------------------------------------------------------
Traceback (most recent call last):
  File "/Users/buildslave/jenkins/workspace/lldb-cmake-matrix/llvm-project/lldb/packages/Python/lldbsuite/test/lldbtest.py", line 1748, in test_method
    return attrvalue(self)
  File "/Users/buildslave/jenkins/workspace/lldb-cmake-matrix/llvm-project/lldb/packages/Python/lldbsuite/test/commands/target/basic/TestTargetCommand.py", line 62, in test_target_variable_command_no_fail
    self.do_target_variable_command_no_fail('globals')
  File "/Users/buildslave/jenkins/workspace/lldb-cmake-matrix/llvm-project/lldb/packages/Python/lldbsuite/test/commands/target/basic/TestTargetCommand.py", line 243, in do_target_variable_command_no_fail
    self.runCmd("run")
  File "/Users/buildslave/jenkins/workspace/lldb-cmake-matrix/llvm-project/lldb/packages/Python/lldbsuite/test/lldbtest.py", line 2068, in runCmd
    msg if (msg) else CMD_MSG(cmd))
AssertionError: False is not True : Command 'run
Error output:
error: process exited with status -1 (Error 1)
' returns successfully
Config=x86_64-/Users/buildslave/jenkins/workspace/lldb-cmake-matrix/clang_701_build/bin/clang-7
======================================================================
FAIL: test_target_variable_command_no_fail_dwarf (TestTargetCommand.targetCommandTestCase)
    Test 'target variable' command before and after starting the inferior.
----------------------------------------------------------------------
Traceback (most recent call last):
  File "/Users/buildslave/jenkins/workspace/lldb-cmake-matrix/llvm-project/lldb/packages/Python/lldbsuite/test/lldbtest.py", line 1748, in test_method
    return attrvalue(self)
  File "/Users/buildslave/jenkins/workspace/lldb-cmake-matrix/llvm-project/lldb/packages/Python/lldbsuite/test/commands/target/basic/TestTargetCommand.py", line 62, in test_target_variable_command_no_fail
    self.do_target_variable_command_no_fail('globals')
  File "/Users/buildslave/jenkins/workspace/lldb-cmake-matrix/llvm-project/lldb/packages/Python/lldbsuite/test/commands/target/basic/TestTargetCommand.py", line 243, in do_target_variable_command_no_fail
    self.runCmd("run")
  File "/Users/buildslave/jenkins/workspace/lldb-cmake-matrix/llvm-project/lldb/packages/Python/lldbsuite/test/lldbtest.py", line 2068, in runCmd
    msg if (msg) else CMD_MSG(cmd))
AssertionError: False is not True : Command 'run
Error output:
error: process exited with status -1 (Error 1)
' returns successfully
Config=x86_64-/Users/buildslave/jenkins/workspace/lldb-cmake-matrix/clang_701_build/bin/clang-7
----------------------------------------------------------------------
Ran 29 tests in 12.116s

RESULT: FAILED (12 passes, 2 failures, 9 errors, 6 skipped, 0 expected failures, 0 unexpected successes)