Regression

Test Clang 7.0.1 / lldb-Suite.commands/target/create-deps.TestTargetCreateDeps.py (from lldb-Suite)

Failing for the past 1 build (Since Unstable#270 )
Took 5 sec.

Stacktrace

LLDB library dir: /Users/buildslave/jenkins/workspace/lldb-cmake-matrix/lldb-build/bin
LLDB import library dir: /Users/buildslave/jenkins/workspace/lldb-cmake-matrix/lldb-build/bin
libstdcxx tests will not be run because: Don't know how to build with libstdcxx on macosx
Skipping following debug info categories: ['dwo']

Session logs for test failures/errors/unexpected successes will go into directory '/Users/buildslave/jenkins/workspace/lldb-cmake-matrix/test/logs'
Command invoked: /Users/buildslave/jenkins/workspace/lldb-cmake-matrix/llvm-project/lldb/test/dotest.py --arch=x86_64 -s /Users/buildslave/jenkins/workspace/lldb-cmake-matrix/lldb-build/lldb-test-traces -S nm -u CXXFLAGS -u CFLAGS --executable /Users/buildslave/jenkins/workspace/lldb-cmake-matrix/lldb-build/./bin/lldb --dsymutil /Users/buildslave/jenkins/workspace/lldb-cmake-matrix/lldb-build/./bin/dsymutil --filecheck /Users/buildslave/jenkins/workspace/lldb-cmake-matrix/lldb-build/./bin/FileCheck -C /Users/buildslave/jenkins/workspace/lldb-cmake-matrix/clang_701_build/bin/clang --codesign-identity lldb_codesign --server /Users/buildslave/jenkins/workspace/lldb-cmake-matrix/lldb-build/./bin/debugserver --arch x86_64 --build-dir /Users/buildslave/jenkins/workspace/lldb-cmake-matrix/lldb-build/lldb-test-build.noindex -s=/Users/buildslave/jenkins/workspace/lldb-cmake-matrix/test/logs -t --env TERM=vt100 --skip-category gmodules --skip-category watchpoint --arch=x86_64 --env LLVM_LIBS_DIR=/Users/buildslave/jenkins/workspace/lldb-cmake-matrix/lldb-build/./lib --build-dir /Users/buildslave/jenkins/workspace/lldb-cmake-matrix/lldb-build/tools/lldb/lldb-test-build.noindex --module-cache-dir /Users/buildslave/jenkins/workspace/lldb-cmake-matrix/lldb-build/tools/lldb/lldb-test-build.noindex/module-cache-lldb /Users/buildslave/jenkins/workspace/lldb-cmake-matrix/llvm-project/lldb/packages/Python/lldbsuite/test/commands/target/create-deps -p TestTargetCreateDeps.py
Change dir to: /Users/buildslave/jenkins/workspace/lldb-cmake-matrix/llvm-project/lldb/packages/Python/lldbsuite/test/commands/target/create-deps
runCmd: settings set symbols.enable-external-lookup false
output: 

runCmd: settings set plugin.process.gdb-remote.packet-timeout 60
output: 

runCmd: settings set symbols.clang-modules-cache-path "/Users/buildslave/jenkins/workspace/lldb-cmake-matrix/lldb-build/tools/lldb/lldb-test-build.noindex/module-cache-lldb"
output: 

runCmd: settings set use-color false
output: 

FAIL: LLDB (/Users/buildslave/jenkins/workspace/lldb-cmake-matrix/clang_701_build/bin/clang-7-x86_64) :: test_dependents_explicit_default_exe (TestTargetCreateDeps.TargetDependentsTestCase)
runCmd: settings set symbols.enable-external-lookup false
output: 

runCmd: settings set plugin.process.gdb-remote.packet-timeout 60
output: 

runCmd: settings set symbols.clang-modules-cache-path "/Users/buildslave/jenkins/workspace/lldb-cmake-matrix/lldb-build/tools/lldb/lldb-test-build.noindex/module-cache-lldb"
output: 

runCmd: settings set use-color false
output: 

FAIL: LLDB (/Users/buildslave/jenkins/workspace/lldb-cmake-matrix/clang_701_build/bin/clang-7-x86_64) :: test_dependents_explicit_default_lib (TestTargetCreateDeps.TargetDependentsTestCase)
runCmd: settings set symbols.enable-external-lookup false
output: 

runCmd: settings set plugin.process.gdb-remote.packet-timeout 60
output: 

runCmd: settings set symbols.clang-modules-cache-path "/Users/buildslave/jenkins/workspace/lldb-cmake-matrix/lldb-build/tools/lldb/lldb-test-build.noindex/module-cache-lldb"
output: 

runCmd: settings set use-color false
output: 

runCmd: file -dfalse /Users/buildslave/jenkins/workspace/lldb-cmake-matrix/lldb-build/tools/lldb/lldb-test-build.noindex/commands/target/create-deps/TestTargetCreateDeps.test_dependents_explicit_false_exe/a.out
output: Current executable set to '/Users/buildslave/jenkins/workspace/lldb-cmake-matrix/lldb-build/tools/lldb/lldb-test-build.noindex/commands/target/create-deps/TestTargetCreateDeps.test_dependents_explicit_false_exe/a.out' (x86_64).


runCmd: image list
output: [  0] C23CBA2C-85E7-3B6C-9679-2BFFDB526528 0x0000000100000000 /Users/buildslave/jenkins/workspace/lldb-cmake-matrix/lldb-build/tools/lldb/lldb-test-build.noindex/commands/target/create-deps/TestTargetCreateDeps.test_dependents_explicit_false_exe/a.out 
      /Users/buildslave/jenkins/workspace/lldb-cmake-matrix/lldb-build/tools/lldb/lldb-test-build.noindex/commands/target/create-deps/TestTargetCreateDeps.test_dependents_explicit_false_exe/a.out.dSYM/Contents/Resources/DWARF/a.out
[  1] D6387150-2FB8-3066-868D-72E1B1C43982 0x0000000000000000 /usr/lib/dyld 
[  2] D4AB366F-48A9-3C7D-91BD-41198F69DD57 0x0000000000000000 /usr/lib/libc++.1.dylib 
[  3] D5133811-9D66-3DEB-9521-0A67347C9A54 0x0000000000000000 /usr/lib/libSystem.B.dylib 
[  4] B4FBB4ED-6D26-35B2-BEED-D88C224F570B 0x0000000000000000 /Users/buildslave/jenkins/workspace/lldb-cmake-matrix/lldb-build/tools/lldb/lldb-test-build.noindex/commands/target/create-deps/TestTargetCreateDeps.test_dependents_explicit_false_exe/libload_a.dylib 
      /Users/buildslave/jenkins/workspace/lldb-cmake-matrix/lldb-build/tools/lldb/lldb-test-build.noindex/commands/target/create-deps/TestTargetCreateDeps.test_dependents_explicit_false_exe/libload_a.dylib.dSYM/Contents/Resources/DWARF/libload_a.dylib
[  5] BA948A32-9024-3E55-98D4-18E31F6AED25 0x0000000000000000 /usr/lib/libc++abi.dylib 
[  6] FE21A7E9-DBEB-33AC-836B-785AD036ACF4 0x0000000000000000 /usr/lib/system/libcache.dylib 
[  7] 78093D4F-91DB-35C8-981A-13375778B2E7 0x0000000000000000 /usr/lib/system/libcommonCrypto.dylib 
[  8] A4D9CF37-D076-3CE9-95F1-DA89DA1601B6 0x0000000000000000 /usr/lib/system/libcompiler_rt.dylib 
[  9] 4BCDADBF-79F5-3829-B47D-64DA0D44BCBF 0x0000000000000000 /usr/lib/system/libcopyfile.dylib 
[ 10] 7AEC5B72-0B92-37E8-808B-6732DB714139 0x0000000000000000 /usr/lib/system/libcorecrypto.dylib 
[ 11] B8962879-AD55-3CF0-9B0A-5F1D57D1E14B 0x0000000000000000 /usr/lib/system/libdispatch.dylib 
[ 12] 4B16C209-83D4-3817-9B62-C2F7FFB23755 0x0000000000000000 /usr/lib/system/libdyld.dylib 
[ 13] A73AA788-C35C-3284-BFCA-95B1BBDF0CF3 0x0000000000000000 /usr/lib/system/libkeymgr.dylib 
[ 14] 43E6698E-155E-3EAE-BAFF-CA5FCB35325C 0x0000000000000000 /usr/lib/system/liblaunch.dylib 
[ 15] 17BF7038-9C70-3EE1-9E96-3AE10D49669E 0x0000000000000000 /usr/lib/system/libmacho.dylib 
[ 16] C70DA995-0D6E-302C-A15E-F7F03A3857B4 0x0000000000000000 /usr/lib/system/libquarantine.dylib 
[ 17] D74A307B-3DC7-3992-B16C-DACB8207BE13 0x0000000000000000 /usr/lib/system/libremovefile.dylib 
[ 18] EC9D8AD4-E5CB-3765-804A-9E1E9DC045D2 0x0000000000000000 /usr/lib/system/libsystem_asl.dylib 
[ 19] 26419398-C30C-30F1-B656-A92AFA9560F6 0x0000000000000000 /usr/lib/system/libsystem_blocks.dylib 
[ 20] 3DEEE96E-6DF6-35AD-8654-D69AC26B907B 0x0000000000000000 /usr/lib/system/libsystem_c.dylib 
[ 21] 02CC3996-B34E-333C-8806-AE2699D34424 0x0000000000000000 /usr/lib/system/libsystem_configuration.dylib 
[ 22] 254B6849-2C8F-302C-8616-B8324A11AB30 0x0000000000000000 /usr/lib/system/libsystem_coreservices.dylib 
[ 23] 974E9EF7-DE72-34B7-B056-0A81C10DF8EB 0x0000000000000000 /usr/lib/system/libsystem_darwin.dylib 
[ 24] FFC665AA-B257-35AD-BD8B-32FD42C2EEC1 0x0000000000000000 /usr/lib/system/libsystem_dnssd.dylib 
[ 25] 0707C387-D7DE-372E-8FF1-3DE5C91932D6 0x0000000000000000 /usr/lib/system/libsystem_info.dylib 
[ 26] 43D1796B-954F-37D6-B1AC-9D80DF0655A2 0x0000000000000000 /usr/lib/system/libsystem_m.dylib 
[ 27] 846F6898-117C-3427-A8FB-3772FFC2410B 0x0000000000000000 /usr/lib/system/libsystem_malloc.dylib 
[ 28] F84D5474-4DC1-3E1A-AE00-8CE9593278B4 0x0000000000000000 /usr/lib/system/libsystem_networkextension.dylib 
[ 29] BCCB222F-DC64-3954-A836-DCCE6659CA5A 0x0000000000000000 /usr/lib/system/libsystem_notify.dylib 
[ 30] FBA7E09B-F10F-3424-90EA-B4999B7FB461 0x0000000000000000 /usr/lib/system/libsystem_sandbox.dylib 
[ 31] CBEAB62B-F0A0-342F-9878-CADC14A3CB0D 0x0000000000000000 /usr/lib/system/libsystem_secinit.dylib 
[ 32] 45FAA4C0-D553-34FD-ADF8-884886AE0D2A 0x0000000000000000 /usr/lib/system/libsystem_kernel.dylib 
[ 33] B75B04AD-69FE-3ADE-84D2-C17972FC8F49 0x0000000000000000 /usr/lib/system/libsystem_platform.dylib 
[ 34] 87A6B136-E423-3B6D-A58A-137F392D7D9D 0x0000000000000000 /usr/lib/system/libsystem_pthread.dylib 
[ 35] B6E22FA8-0F7B-36FD-9D99-284056D3CB47 0x0000000000000000 /usr/lib/system/libsystem_symptoms.dylib 
[ 36] 7983ED77-18B5-39A5-BE19-AE4F2832ADEA 0x0000000000000000 /usr/lib/system/libsystem_trace.dylib 
[ 37] 41222EF6-2233-3CF4-947A-15D48CB8C030 0x0000000000000000 /usr/lib/system/libunwind.dylib 
[ 38] 0A8747D1-33AA-37E1-B97A-BA9B95FE4E8C 0x0000000000000000 /usr/lib/system/libxpc.dylib 
[ 39] 9D7111F2-BDC7-3572-B987-79309B9AE957 0x0000000000000000 /usr/lib/libobjc.A.dylib 


Expecting sub string: [  0]
Matched

runCmd: image list
output: [  0] C23CBA2C-85E7-3B6C-9679-2BFFDB526528 0x0000000100000000 /Users/buildslave/jenkins/workspace/lldb-cmake-matrix/lldb-build/tools/lldb/lldb-test-build.noindex/commands/target/create-deps/TestTargetCreateDeps.test_dependents_explicit_false_exe/a.out 
      /Users/buildslave/jenkins/workspace/lldb-cmake-matrix/lldb-build/tools/lldb/lldb-test-build.noindex/commands/target/create-deps/TestTargetCreateDeps.test_dependents_explicit_false_exe/a.out.dSYM/Contents/Resources/DWARF/a.out
[  1] D6387150-2FB8-3066-868D-72E1B1C43982 0x0000000000000000 /usr/lib/dyld 
[  2] D4AB366F-48A9-3C7D-91BD-41198F69DD57 0x0000000000000000 /usr/lib/libc++.1.dylib 
[  3] D5133811-9D66-3DEB-9521-0A67347C9A54 0x0000000000000000 /usr/lib/libSystem.B.dylib 
[  4] B4FBB4ED-6D26-35B2-BEED-D88C224F570B 0x0000000000000000 /Users/buildslave/jenkins/workspace/lldb-cmake-matrix/lldb-build/tools/lldb/lldb-test-build.noindex/commands/target/create-deps/TestTargetCreateDeps.test_dependents_explicit_false_exe/libload_a.dylib 
      /Users/buildslave/jenkins/workspace/lldb-cmake-matrix/lldb-build/tools/lldb/lldb-test-build.noindex/commands/target/create-deps/TestTargetCreateDeps.test_dependents_explicit_false_exe/libload_a.dylib.dSYM/Contents/Resources/DWARF/libload_a.dylib
[  5] BA948A32-9024-3E55-98D4-18E31F6AED25 0x0000000000000000 /usr/lib/libc++abi.dylib 
[  6] FE21A7E9-DBEB-33AC-836B-785AD036ACF4 0x0000000000000000 /usr/lib/system/libcache.dylib 
[  7] 78093D4F-91DB-35C8-981A-13375778B2E7 0x0000000000000000 /usr/lib/system/libcommonCrypto.dylib 
[  8] A4D9CF37-D076-3CE9-95F1-DA89DA1601B6 0x0000000000000000 /usr/lib/system/libcompiler_rt.dylib 
[  9] 4BCDADBF-79F5-3829-B47D-64DA0D44BCBF 0x0000000000000000 /usr/lib/system/libcopyfile.dylib 
[ 10] 7AEC5B72-0B92-37E8-808B-6732DB714139 0x0000000000000000 /usr/lib/system/libcorecrypto.dylib 
[ 11] B8962879-AD55-3CF0-9B0A-5F1D57D1E14B 0x0000000000000000 /usr/lib/system/libdispatch.dylib 
[ 12] 4B16C209-83D4-3817-9B62-C2F7FFB23755 0x0000000000000000 /usr/lib/system/libdyld.dylib 
[ 13] A73AA788-C35C-3284-BFCA-95B1BBDF0CF3 0x0000000000000000 /usr/lib/system/libkeymgr.dylib 
[ 14] 43E6698E-155E-3EAE-BAFF-CA5FCB35325C 0x0000000000000000 /usr/lib/system/liblaunch.dylib 
[ 15] 17BF7038-9C70-3EE1-9E96-3AE10D49669E 0x0000000000000000 /usr/lib/system/libmacho.dylib 
[ 16] C70DA995-0D6E-302C-A15E-F7F03A3857B4 0x0000000000000000 /usr/lib/system/libquarantine.dylib 
[ 17] D74A307B-3DC7-3992-B16C-DACB8207BE13 0x0000000000000000 /usr/lib/system/libremovefile.dylib 
[ 18] EC9D8AD4-E5CB-3765-804A-9E1E9DC045D2 0x0000000000000000 /usr/lib/system/libsystem_asl.dylib 
[ 19] 26419398-C30C-30F1-B656-A92AFA9560F6 0x0000000000000000 /usr/lib/system/libsystem_blocks.dylib 
[ 20] 3DEEE96E-6DF6-35AD-8654-D69AC26B907B 0x0000000000000000 /usr/lib/system/libsystem_c.dylib 
[ 21] 02CC3996-B34E-333C-8806-AE2699D34424 0x0000000000000000 /usr/lib/system/libsystem_configuration.dylib 
[ 22] 254B6849-2C8F-302C-8616-B8324A11AB30 0x0000000000000000 /usr/lib/system/libsystem_coreservices.dylib 
[ 23] 974E9EF7-DE72-34B7-B056-0A81C10DF8EB 0x0000000000000000 /usr/lib/system/libsystem_darwin.dylib 
[ 24] FFC665AA-B257-35AD-BD8B-32FD42C2EEC1 0x0000000000000000 /usr/lib/system/libsystem_dnssd.dylib 
[ 25] 0707C387-D7DE-372E-8FF1-3DE5C91932D6 0x0000000000000000 /usr/lib/system/libsystem_info.dylib 
[ 26] 43D1796B-954F-37D6-B1AC-9D80DF0655A2 0x0000000000000000 /usr/lib/system/libsystem_m.dylib 
[ 27] 846F6898-117C-3427-A8FB-3772FFC2410B 0x0000000000000000 /usr/lib/system/libsystem_malloc.dylib 
[ 28] F84D5474-4DC1-3E1A-AE00-8CE9593278B4 0x0000000000000000 /usr/lib/system/libsystem_networkextension.dylib 
[ 29] BCCB222F-DC64-3954-A836-DCCE6659CA5A 0x0000000000000000 /usr/lib/system/libsystem_notify.dylib 
[ 30] FBA7E09B-F10F-3424-90EA-B4999B7FB461 0x0000000000000000 /usr/lib/system/libsystem_sandbox.dylib 
[ 31] CBEAB62B-F0A0-342F-9878-CADC14A3CB0D 0x0000000000000000 /usr/lib/system/libsystem_secinit.dylib 
[ 32] 45FAA4C0-D553-34FD-ADF8-884886AE0D2A 0x0000000000000000 /usr/lib/system/libsystem_kernel.dylib 
[ 33] B75B04AD-69FE-3ADE-84D2-C17972FC8F49 0x0000000000000000 /usr/lib/system/libsystem_platform.dylib 
[ 34] 87A6B136-E423-3B6D-A58A-137F392D7D9D 0x0000000000000000 /usr/lib/system/libsystem_pthread.dylib 
[ 35] B6E22FA8-0F7B-36FD-9D99-284056D3CB47 0x0000000000000000 /usr/lib/system/libsystem_symptoms.dylib 
[ 36] 7983ED77-18B5-39A5-BE19-AE4F2832ADEA 0x0000000000000000 /usr/lib/system/libsystem_trace.dylib 
[ 37] 41222EF6-2233-3CF4-947A-15D48CB8C030 0x0000000000000000 /usr/lib/system/libunwind.dylib 
[ 38] 0A8747D1-33AA-37E1-B97A-BA9B95FE4E8C 0x0000000000000000 /usr/lib/system/libxpc.dylib 
[ 39] 9D7111F2-BDC7-3572-B987-79309B9AE957 0x0000000000000000 /usr/lib/libobjc.A.dylib 


Expecting sub string: [  1]
Matched

PASS: LLDB (/Users/buildslave/jenkins/workspace/lldb-cmake-matrix/clang_701_build/bin/clang-7-x86_64) :: test_dependents_explicit_false_exe (TestTargetCreateDeps.TargetDependentsTestCase)
runCmd: settings set symbols.enable-external-lookup false
output: 

runCmd: settings set plugin.process.gdb-remote.packet-timeout 60
output: 

runCmd: settings set symbols.clang-modules-cache-path "/Users/buildslave/jenkins/workspace/lldb-cmake-matrix/lldb-build/tools/lldb/lldb-test-build.noindex/module-cache-lldb"
output: 

runCmd: settings set use-color false
output: 

FAIL: LLDB (/Users/buildslave/jenkins/workspace/lldb-cmake-matrix/clang_701_build/bin/clang-7-x86_64) :: test_dependents_explicit_false_lib (TestTargetCreateDeps.TargetDependentsTestCase)
runCmd: settings set symbols.enable-external-lookup false
output: 

runCmd: settings set plugin.process.gdb-remote.packet-timeout 60
output: 

runCmd: settings set symbols.clang-modules-cache-path "/Users/buildslave/jenkins/workspace/lldb-cmake-matrix/lldb-build/tools/lldb/lldb-test-build.noindex/module-cache-lldb"
output: 

runCmd: settings set use-color false
output: 

runCmd: file -dtrue /Users/buildslave/jenkins/workspace/lldb-cmake-matrix/lldb-build/tools/lldb/lldb-test-build.noindex/commands/target/create-deps/TestTargetCreateDeps.test_dependents_explicit_true_exe/a.out
output: Current executable set to '/Users/buildslave/jenkins/workspace/lldb-cmake-matrix/lldb-build/tools/lldb/lldb-test-build.noindex/commands/target/create-deps/TestTargetCreateDeps.test_dependents_explicit_true_exe/a.out' (x86_64).


runCmd: image list
output: [  0] D6C0A5E0-6A1A-3565-A89C-A1BDF3849A49 0x0000000100000000 /Users/buildslave/jenkins/workspace/lldb-cmake-matrix/lldb-build/tools/lldb/lldb-test-build.noindex/commands/target/create-deps/TestTargetCreateDeps.test_dependents_explicit_true_exe/a.out 
      /Users/buildslave/jenkins/workspace/lldb-cmake-matrix/lldb-build/tools/lldb/lldb-test-build.noindex/commands/target/create-deps/TestTargetCreateDeps.test_dependents_explicit_true_exe/a.out.dSYM/Contents/Resources/DWARF/a.out


Expecting sub string: [  0]
Matched

runCmd: image list
output: [  0] D6C0A5E0-6A1A-3565-A89C-A1BDF3849A49 0x0000000100000000 /Users/buildslave/jenkins/workspace/lldb-cmake-matrix/lldb-build/tools/lldb/lldb-test-build.noindex/commands/target/create-deps/TestTargetCreateDeps.test_dependents_explicit_true_exe/a.out 
      /Users/buildslave/jenkins/workspace/lldb-cmake-matrix/lldb-build/tools/lldb/lldb-test-build.noindex/commands/target/create-deps/TestTargetCreateDeps.test_dependents_explicit_true_exe/a.out.dSYM/Contents/Resources/DWARF/a.out


Not expecting sub string: [  1]
Not matched

PASS: LLDB (/Users/buildslave/jenkins/workspace/lldb-cmake-matrix/clang_701_build/bin/clang-7-x86_64) :: test_dependents_explicit_true_exe (TestTargetCreateDeps.TargetDependentsTestCase)
runCmd: settings set symbols.enable-external-lookup false
output: 

runCmd: settings set plugin.process.gdb-remote.packet-timeout 60
output: 

runCmd: settings set symbols.clang-modules-cache-path "/Users/buildslave/jenkins/workspace/lldb-cmake-matrix/lldb-build/tools/lldb/lldb-test-build.noindex/module-cache-lldb"
output: 

runCmd: settings set use-color false
output: 

runCmd: file -dtrue /Users/buildslave/jenkins/workspace/lldb-cmake-matrix/lldb-build/tools/lldb/lldb-test-build.noindex/commands/target/create-deps/TestTargetCreateDeps.test_dependents_explicit_true_lib/libload_a.dylib
output: Current executable set to '/Users/buildslave/jenkins/workspace/lldb-cmake-matrix/lldb-build/tools/lldb/lldb-test-build.noindex/commands/target/create-deps/TestTargetCreateDeps.test_dependents_explicit_true_lib/libload_a.dylib' (x86_64).


runCmd: image list
output: [  0] A65A11B5-1E96-341C-9975-FC7952197269 0x0000000000000000 /Users/buildslave/jenkins/workspace/lldb-cmake-matrix/lldb-build/tools/lldb/lldb-test-build.noindex/commands/target/create-deps/TestTargetCreateDeps.test_dependents_explicit_true_lib/libload_a.dylib 
      /Users/buildslave/jenkins/workspace/lldb-cmake-matrix/lldb-build/tools/lldb/lldb-test-build.noindex/commands/target/create-deps/TestTargetCreateDeps.test_dependents_explicit_true_lib/libload_a.dylib.dSYM/Contents/Resources/DWARF/libload_a.dylib


Expecting sub string: [  0]
Matched

runCmd: image list
output: [  0] A65A11B5-1E96-341C-9975-FC7952197269 0x0000000000000000 /Users/buildslave/jenkins/workspace/lldb-cmake-matrix/lldb-build/tools/lldb/lldb-test-build.noindex/commands/target/create-deps/TestTargetCreateDeps.test_dependents_explicit_true_lib/libload_a.dylib 
      /Users/buildslave/jenkins/workspace/lldb-cmake-matrix/lldb-build/tools/lldb/lldb-test-build.noindex/commands/target/create-deps/TestTargetCreateDeps.test_dependents_explicit_true_lib/libload_a.dylib.dSYM/Contents/Resources/DWARF/libload_a.dylib


Not expecting sub string: [  1]
Not matched

PASS: LLDB (/Users/buildslave/jenkins/workspace/lldb-cmake-matrix/clang_701_build/bin/clang-7-x86_64) :: test_dependents_explicit_true_lib (TestTargetCreateDeps.TargetDependentsTestCase)
runCmd: settings set symbols.enable-external-lookup false
output: 

runCmd: settings set plugin.process.gdb-remote.packet-timeout 60
output: 

runCmd: settings set symbols.clang-modules-cache-path "/Users/buildslave/jenkins/workspace/lldb-cmake-matrix/lldb-build/tools/lldb/lldb-test-build.noindex/module-cache-lldb"
output: 

runCmd: settings set use-color false
output: 

FAIL: LLDB (/Users/buildslave/jenkins/workspace/lldb-cmake-matrix/clang_701_build/bin/clang-7-x86_64) :: test_dependents_implicit_default_exe (TestTargetCreateDeps.TargetDependentsTestCase)
runCmd: settings set symbols.enable-external-lookup false
output: 

runCmd: settings set plugin.process.gdb-remote.packet-timeout 60
output: 

runCmd: settings set symbols.clang-modules-cache-path "/Users/buildslave/jenkins/workspace/lldb-cmake-matrix/lldb-build/tools/lldb/lldb-test-build.noindex/module-cache-lldb"
output: 

runCmd: settings set use-color false
output: 

runCmd: file /Users/buildslave/jenkins/workspace/lldb-cmake-matrix/lldb-build/tools/lldb/lldb-test-build.noindex/commands/target/create-deps/TestTargetCreateDeps.test_dependents_implicit_default_lib/libload_a.dylib
output: Current executable set to '/Users/buildslave/jenkins/workspace/lldb-cmake-matrix/lldb-build/tools/lldb/lldb-test-build.noindex/commands/target/create-deps/TestTargetCreateDeps.test_dependents_implicit_default_lib/libload_a.dylib' (x86_64).


runCmd: image list
output: [  0] 56CA2428-9B56-3402-9D6B-8F34D3C8EA0A 0x0000000000000000 /Users/buildslave/jenkins/workspace/lldb-cmake-matrix/lldb-build/tools/lldb/lldb-test-build.noindex/commands/target/create-deps/TestTargetCreateDeps.test_dependents_implicit_default_lib/libload_a.dylib 
      /Users/buildslave/jenkins/workspace/lldb-cmake-matrix/lldb-build/tools/lldb/lldb-test-build.noindex/commands/target/create-deps/TestTargetCreateDeps.test_dependents_implicit_default_lib/libload_a.dylib.dSYM/Contents/Resources/DWARF/libload_a.dylib


Expecting sub string: [  0]
Matched

runCmd: image list
output: [  0] 56CA2428-9B56-3402-9D6B-8F34D3C8EA0A 0x0000000000000000 /Users/buildslave/jenkins/workspace/lldb-cmake-matrix/lldb-build/tools/lldb/lldb-test-build.noindex/commands/target/create-deps/TestTargetCreateDeps.test_dependents_implicit_default_lib/libload_a.dylib 
      /Users/buildslave/jenkins/workspace/lldb-cmake-matrix/lldb-build/tools/lldb/lldb-test-build.noindex/commands/target/create-deps/TestTargetCreateDeps.test_dependents_implicit_default_lib/libload_a.dylib.dSYM/Contents/Resources/DWARF/libload_a.dylib


Not expecting sub string: [  1]
Not matched

PASS: LLDB (/Users/buildslave/jenkins/workspace/lldb-cmake-matrix/clang_701_build/bin/clang-7-x86_64) :: test_dependents_implicit_default_lib (TestTargetCreateDeps.TargetDependentsTestCase)
runCmd: settings set symbols.enable-external-lookup false
output: 

runCmd: settings set plugin.process.gdb-remote.packet-timeout 60
output: 

runCmd: settings set symbols.clang-modules-cache-path "/Users/buildslave/jenkins/workspace/lldb-cmake-matrix/lldb-build/tools/lldb/lldb-test-build.noindex/module-cache-lldb"
output: 

runCmd: settings set use-color false
output: 

FAIL: LLDB (/Users/buildslave/jenkins/workspace/lldb-cmake-matrix/clang_701_build/bin/clang-7-x86_64) :: test_dependents_implicit_false_exe (TestTargetCreateDeps.TargetDependentsTestCase)
runCmd: settings set symbols.enable-external-lookup false
output: 

runCmd: settings set plugin.process.gdb-remote.packet-timeout 60
output: 

runCmd: settings set symbols.clang-modules-cache-path "/Users/buildslave/jenkins/workspace/lldb-cmake-matrix/lldb-build/tools/lldb/lldb-test-build.noindex/module-cache-lldb"
output: 

runCmd: settings set use-color false
output: 

FAIL: LLDB (/Users/buildslave/jenkins/workspace/lldb-cmake-matrix/clang_701_build/bin/clang-7-x86_64) :: test_dependents_implicit_false_lib (TestTargetCreateDeps.TargetDependentsTestCase)
Restore dir to: /Users/buildslave/jenkins/workspace/lldb-cmake-matrix/lldb-build/tools/lldb/lit
======================================================================
ERROR: test_dependents_explicit_default_exe (TestTargetCreateDeps.TargetDependentsTestCase)
    Test default behavior
----------------------------------------------------------------------
Error when building test subject.

Build Command:
make VPATH=/Users/buildslave/jenkins/workspace/lldb-cmake-matrix/llvm-project/lldb/packages/Python/lldbsuite/test/commands/target/create-deps -C /Users/buildslave/jenkins/workspace/lldb-cmake-matrix/lldb-build/tools/lldb/lldb-test-build.noindex/commands/target/create-deps/TestTargetCreateDeps.test_dependents_explicit_default_exe -I /Users/buildslave/jenkins/workspace/lldb-cmake-matrix/llvm-project/lldb/packages/Python/lldbsuite/test/commands/target/create-deps -I /Users/buildslave/jenkins/workspace/lldb-cmake-matrix/llvm-project/lldb/packages/Python/lldbsuite/test/make -f /Users/buildslave/jenkins/workspace/lldb-cmake-matrix/llvm-project/lldb/packages/Python/lldbsuite/test/commands/target/create-deps/Makefile all ARCH=x86_64 CC="/Users/buildslave/jenkins/workspace/lldb-cmake-matrix/clang_701_build/bin/clang-7" 

Build Command Output:
make: *** [a.out] Killed: 9

Test Directory:
/Users/buildslave/jenkins/workspace/lldb-cmake-matrix/llvm-project/lldb/packages/Python/lldbsuite/test/commands/target/create-deps
======================================================================
ERROR: test_dependents_explicit_default_lib (TestTargetCreateDeps.TargetDependentsTestCase)
----------------------------------------------------------------------
Error when building test subject.

Build Command:
make VPATH=/Users/buildslave/jenkins/workspace/lldb-cmake-matrix/llvm-project/lldb/packages/Python/lldbsuite/test/commands/target/create-deps -C /Users/buildslave/jenkins/workspace/lldb-cmake-matrix/lldb-build/tools/lldb/lldb-test-build.noindex/commands/target/create-deps/TestTargetCreateDeps.test_dependents_explicit_default_lib -I /Users/buildslave/jenkins/workspace/lldb-cmake-matrix/llvm-project/lldb/packages/Python/lldbsuite/test/commands/target/create-deps -I /Users/buildslave/jenkins/workspace/lldb-cmake-matrix/llvm-project/lldb/packages/Python/lldbsuite/test/make -f /Users/buildslave/jenkins/workspace/lldb-cmake-matrix/llvm-project/lldb/packages/Python/lldbsuite/test/commands/target/create-deps/Makefile all ARCH=x86_64 CC="/Users/buildslave/jenkins/workspace/lldb-cmake-matrix/clang_701_build/bin/clang-7" 

Build Command Output:
clang-7: error: unable to execute command: Killed: 9
clang-7: error: clang frontend command failed due to signal (use -v to see invocation)
clang version 7.0.1 
Target: x86_64-apple-darwin18.0.0
Thread model: posix
InstalledDir: /Users/buildslave/jenkins/workspace/lldb-cmake-matrix/clang_701_build/bin
clang-7: note: diagnostic msg: PLEASE submit a bug report to https://bugs.llvm.org/ and include the crash backtrace, preprocessed source, and associated run script.
clang-7: note: diagnostic msg: 
********************

PLEASE ATTACH THE FOLLOWING FILES TO THE BUG REPORT:
Preprocessed source(s) and associated run script(s) are located at:
clang-7: note: diagnostic msg: /var/folders/09/r4vw4v8n5kb67jl66zvlbljw0000gn/T/lit_tmp_bT7Zaw/a-e60f67.cpp
clang-7: note: diagnostic msg: /var/folders/09/r4vw4v8n5kb67jl66zvlbljw0000gn/T/lit_tmp_bT7Zaw/a-e60f67.sh
clang-7: note: diagnostic msg: Crash backtrace is located in
clang-7: note: diagnostic msg: /Users/buildslave/Library/Logs/DiagnosticReports/clang-7_<YYYY-MM-DD-HHMMSS>_<hostname>.crash
clang-7: note: diagnostic msg: (choose the .crash file that corresponds to your crash)
clang-7: note: diagnostic msg: 

********************
make[1]: *** [a.o] Error 254
make: *** [lib_a] Error 2

Test Directory:
/Users/buildslave/jenkins/workspace/lldb-cmake-matrix/llvm-project/lldb/packages/Python/lldbsuite/test/commands/target/create-deps
======================================================================
ERROR: test_dependents_explicit_false_lib (TestTargetCreateDeps.TargetDependentsTestCase)
----------------------------------------------------------------------
Error when building test subject.

Build Command:
make VPATH=/Users/buildslave/jenkins/workspace/lldb-cmake-matrix/llvm-project/lldb/packages/Python/lldbsuite/test/commands/target/create-deps -C /Users/buildslave/jenkins/workspace/lldb-cmake-matrix/lldb-build/tools/lldb/lldb-test-build.noindex/commands/target/create-deps/TestTargetCreateDeps.test_dependents_explicit_false_lib -I /Users/buildslave/jenkins/workspace/lldb-cmake-matrix/llvm-project/lldb/packages/Python/lldbsuite/test/commands/target/create-deps -I /Users/buildslave/jenkins/workspace/lldb-cmake-matrix/llvm-project/lldb/packages/Python/lldbsuite/test/make -f /Users/buildslave/jenkins/workspace/lldb-cmake-matrix/llvm-project/lldb/packages/Python/lldbsuite/test/commands/target/create-deps/Makefile all ARCH=x86_64 CC="/Users/buildslave/jenkins/workspace/lldb-cmake-matrix/clang_701_build/bin/clang-7" 

Build Command Output:
clang-7: error: unable to execute command: Killed: 9
clang-7: error: clang frontend command failed due to signal (use -v to see invocation)
clang version 7.0.1 
Target: x86_64-apple-darwin18.0.0
Thread model: posix
InstalledDir: /Users/buildslave/jenkins/workspace/lldb-cmake-matrix/clang_701_build/bin
clang-7: note: diagnostic msg: PLEASE submit a bug report to https://bugs.llvm.org/ and include the crash backtrace, preprocessed source, and associated run script.
clang-7: note: diagnostic msg: 
********************

PLEASE ATTACH THE FOLLOWING FILES TO THE BUG REPORT:
Preprocessed source(s) and associated run script(s) are located at:
clang-7: note: diagnostic msg: /var/folders/09/r4vw4v8n5kb67jl66zvlbljw0000gn/T/lit_tmp_bT7Zaw/main-ca7ebb.d
clang-7: note: diagnostic msg: /var/folders/09/r4vw4v8n5kb67jl66zvlbljw0000gn/T/lit_tmp_bT7Zaw/main-ca7ebb.sh
clang-7: note: diagnostic msg: Crash backtrace is located in
clang-7: note: diagnostic msg: /Users/buildslave/Library/Logs/DiagnosticReports/clang-7_<YYYY-MM-DD-HHMMSS>_<hostname>.crash
clang-7: note: diagnostic msg: (choose the .crash file that corresponds to your crash)
clang-7: note: diagnostic msg: 

********************
clang-7: error: unable to execute command: Killed: 9
clang-7: error: clang frontend command failed due to signal (use -v to see invocation)
clang version 7.0.1 
Target: x86_64-apple-darwin18.0.0
Thread model: posix
InstalledDir: /Users/buildslave/jenkins/workspace/lldb-cmake-matrix/clang_701_build/bin
clang-7: note: diagnostic msg: PLEASE submit a bug report to https://bugs.llvm.org/ and include the crash backtrace, preprocessed source, and associated run script.
clang-7: note: diagnostic msg: 
********************

PLEASE ATTACH THE FOLLOWING FILES TO THE BUG REPORT:
Preprocessed source(s) and associated run script(s) are located at:
clang-7: note: diagnostic msg: /var/folders/09/r4vw4v8n5kb67jl66zvlbljw0000gn/T/lit_tmp_bT7Zaw/main-144bd6.cpp
clang-7: note: diagnostic msg: /var/folders/09/r4vw4v8n5kb67jl66zvlbljw0000gn/T/lit_tmp_bT7Zaw/main-144bd6.sh
clang-7: note: diagnostic msg: Crash backtrace is located in
clang-7: note: diagnostic msg: /Users/buildslave/Library/Logs/DiagnosticReports/clang-7_<YYYY-MM-DD-HHMMSS>_<hostname>.crash
clang-7: note: diagnostic msg: (choose the .crash file that corresponds to your crash)
clang-7: note: diagnostic msg: 

********************
make: *** [main.o] Error 254

Test Directory:
/Users/buildslave/jenkins/workspace/lldb-cmake-matrix/llvm-project/lldb/packages/Python/lldbsuite/test/commands/target/create-deps
======================================================================
ERROR: test_dependents_implicit_default_exe (TestTargetCreateDeps.TargetDependentsTestCase)
    Test default behavior
----------------------------------------------------------------------
Error when building test subject.

Build Command:
make VPATH=/Users/buildslave/jenkins/workspace/lldb-cmake-matrix/llvm-project/lldb/packages/Python/lldbsuite/test/commands/target/create-deps -C /Users/buildslave/jenkins/workspace/lldb-cmake-matrix/lldb-build/tools/lldb/lldb-test-build.noindex/commands/target/create-deps/TestTargetCreateDeps.test_dependents_implicit_default_exe -I /Users/buildslave/jenkins/workspace/lldb-cmake-matrix/llvm-project/lldb/packages/Python/lldbsuite/test/commands/target/create-deps -I /Users/buildslave/jenkins/workspace/lldb-cmake-matrix/llvm-project/lldb/packages/Python/lldbsuite/test/make -f /Users/buildslave/jenkins/workspace/lldb-cmake-matrix/llvm-project/lldb/packages/Python/lldbsuite/test/commands/target/create-deps/Makefile all ARCH=x86_64 CC="/Users/buildslave/jenkins/workspace/lldb-cmake-matrix/clang_701_build/bin/clang-7" 

Build Command Output:
make[1]: *** [libload_a.dylib.dSYM] Killed: 9
make: *** [lib_a] Error 2

Test Directory:
/Users/buildslave/jenkins/workspace/lldb-cmake-matrix/llvm-project/lldb/packages/Python/lldbsuite/test/commands/target/create-deps
======================================================================
ERROR: test_dependents_implicit_false_exe (TestTargetCreateDeps.TargetDependentsTestCase)
    Test default behavior
----------------------------------------------------------------------
Error when building test subject.

Build Command:
make VPATH=/Users/buildslave/jenkins/workspace/lldb-cmake-matrix/llvm-project/lldb/packages/Python/lldbsuite/test/commands/target/create-deps -C /Users/buildslave/jenkins/workspace/lldb-cmake-matrix/lldb-build/tools/lldb/lldb-test-build.noindex/commands/target/create-deps/TestTargetCreateDeps.test_dependents_implicit_false_exe -I /Users/buildslave/jenkins/workspace/lldb-cmake-matrix/llvm-project/lldb/packages/Python/lldbsuite/test/commands/target/create-deps -I /Users/buildslave/jenkins/workspace/lldb-cmake-matrix/llvm-project/lldb/packages/Python/lldbsuite/test/make -f /Users/buildslave/jenkins/workspace/lldb-cmake-matrix/llvm-project/lldb/packages/Python/lldbsuite/test/commands/target/create-deps/Makefile all ARCH=x86_64 CC="/Users/buildslave/jenkins/workspace/lldb-cmake-matrix/clang_701_build/bin/clang-7" 

Build Command Output:
make: *** [a.out] Killed: 9

Test Directory:
/Users/buildslave/jenkins/workspace/lldb-cmake-matrix/llvm-project/lldb/packages/Python/lldbsuite/test/commands/target/create-deps
======================================================================
ERROR: test_dependents_implicit_false_lib (TestTargetCreateDeps.TargetDependentsTestCase)
----------------------------------------------------------------------
Error when building test subject.

Build Command:
make VPATH=/Users/buildslave/jenkins/workspace/lldb-cmake-matrix/llvm-project/lldb/packages/Python/lldbsuite/test/commands/target/create-deps -C /Users/buildslave/jenkins/workspace/lldb-cmake-matrix/lldb-build/tools/lldb/lldb-test-build.noindex/commands/target/create-deps/TestTargetCreateDeps.test_dependents_implicit_false_lib -I /Users/buildslave/jenkins/workspace/lldb-cmake-matrix/llvm-project/lldb/packages/Python/lldbsuite/test/commands/target/create-deps -I /Users/buildslave/jenkins/workspace/lldb-cmake-matrix/llvm-project/lldb/packages/Python/lldbsuite/test/make -f /Users/buildslave/jenkins/workspace/lldb-cmake-matrix/llvm-project/lldb/packages/Python/lldbsuite/test/commands/target/create-deps/Makefile all ARCH=x86_64 CC="/Users/buildslave/jenkins/workspace/lldb-cmake-matrix/clang_701_build/bin/clang-7" 

Build Command Output:
clang-7: error: unable to execute command: Killed: 9
clang-7: error: clang frontend command failed due to signal (use -v to see invocation)
clang version 7.0.1 
Target: x86_64-apple-darwin18.0.0
Thread model: posix
InstalledDir: /Users/buildslave/jenkins/workspace/lldb-cmake-matrix/clang_701_build/bin
clang-7: note: diagnostic msg: PLEASE submit a bug report to https://bugs.llvm.org/ and include the crash backtrace, preprocessed source, and associated run script.
clang-7: error: unable to execute command: Killed: 9
clang-7: note: diagnostic msg: Error generating preprocessed source(s).
make[1]: *** [a.o] Error 254
make: *** [lib_a] Error 2

Test Directory:
/Users/buildslave/jenkins/workspace/lldb-cmake-matrix/llvm-project/lldb/packages/Python/lldbsuite/test/commands/target/create-deps
----------------------------------------------------------------------
Ran 10 tests in 4.539s

RESULT: FAILED (4 passes, 0 failures, 6 errors, 0 skipped, 0 expected failures, 0 unexpected successes)