Regression

Test Clang 7.0.1 / lldb-Suite.functionalities/inferior-crashing/recursive-inferior.TestRecursiveInferior.py (from lldb-Suite)

Failing for the past 1 build (Since Unstable#270 )
Took 7.4 sec.

Stacktrace

lldb version 10.0.99 (http://labmaster3.local/git/llvm-project.git revision 1a3dd638c4a9173e53628b497a1aadc31c32eb50)
  clang revision daa79c5338228a746a7eba0cf2f2f356e1d45a5b
  llvm revision daa79c5338228a746a7eba0cf2f2f356e1d45a5b
LLDB library dir: /Users/buildslave/jenkins/workspace/lldb-cmake-matrix/lldb-build/bin
LLDB import library dir: /Users/buildslave/jenkins/workspace/lldb-cmake-matrix/lldb-build/bin
libstdcxx tests will not be run because: Don't know how to build with libstdcxx on macosx
Skipping following debug info categories: ['dwo']

Session logs for test failures/errors/unexpected successes will go into directory '/Users/buildslave/jenkins/workspace/lldb-cmake-matrix/test/logs'
Command invoked: /Users/buildslave/jenkins/workspace/lldb-cmake-matrix/llvm-project/lldb/test/dotest.py --arch=x86_64 -s /Users/buildslave/jenkins/workspace/lldb-cmake-matrix/lldb-build/lldb-test-traces -S nm -u CXXFLAGS -u CFLAGS --executable /Users/buildslave/jenkins/workspace/lldb-cmake-matrix/lldb-build/./bin/lldb --dsymutil /Users/buildslave/jenkins/workspace/lldb-cmake-matrix/lldb-build/./bin/dsymutil --filecheck /Users/buildslave/jenkins/workspace/lldb-cmake-matrix/lldb-build/./bin/FileCheck -C /Users/buildslave/jenkins/workspace/lldb-cmake-matrix/clang_701_build/bin/clang --codesign-identity lldb_codesign --server /Users/buildslave/jenkins/workspace/lldb-cmake-matrix/lldb-build/./bin/debugserver --arch x86_64 --build-dir /Users/buildslave/jenkins/workspace/lldb-cmake-matrix/lldb-build/lldb-test-build.noindex -s=/Users/buildslave/jenkins/workspace/lldb-cmake-matrix/test/logs -t --env TERM=vt100 --skip-category gmodules --skip-category watchpoint --arch=x86_64 --env LLVM_LIBS_DIR=/Users/buildslave/jenkins/workspace/lldb-cmake-matrix/lldb-build/./lib --build-dir /Users/buildslave/jenkins/workspace/lldb-cmake-matrix/lldb-build/tools/lldb/lldb-test-build.noindex --module-cache-dir /Users/buildslave/jenkins/workspace/lldb-cmake-matrix/lldb-build/tools/lldb/lldb-test-build.noindex/module-cache-lldb /Users/buildslave/jenkins/workspace/lldb-cmake-matrix/llvm-project/lldb/packages/Python/lldbsuite/test/functionalities/inferior-crashing/recursive-inferior -p TestRecursiveInferior.py
Change dir to: /Users/buildslave/jenkins/workspace/lldb-cmake-matrix/llvm-project/lldb/packages/Python/lldbsuite/test/functionalities/inferior-crashing/recursive-inferior
runCmd: settings set symbols.enable-external-lookup false
output: 

runCmd: settings set plugin.process.gdb-remote.packet-timeout 60
output: 

runCmd: settings set symbols.clang-modules-cache-path "/Users/buildslave/jenkins/workspace/lldb-cmake-matrix/lldb-build/tools/lldb/lldb-test-build.noindex/module-cache-lldb"
output: 

runCmd: settings set use-color false
output: 

FAIL: LLDB (/Users/buildslave/jenkins/workspace/lldb-cmake-matrix/clang_701_build/bin/clang-7-x86_64) :: test_recursive_inferior_crashing_dsym (TestRecursiveInferior.CrashingRecursiveInferiorTestCase)
runCmd: settings set symbols.enable-external-lookup false
output: 

runCmd: settings set plugin.process.gdb-remote.packet-timeout 60
output: 

runCmd: settings set symbols.clang-modules-cache-path "/Users/buildslave/jenkins/workspace/lldb-cmake-matrix/lldb-build/tools/lldb/lldb-test-build.noindex/module-cache-lldb"
output: 

runCmd: settings set use-color false
output: 

FAIL: LLDB (/Users/buildslave/jenkins/workspace/lldb-cmake-matrix/clang_701_build/bin/clang-7-x86_64) :: test_recursive_inferior_crashing_dwarf (TestRecursiveInferior.CrashingRecursiveInferiorTestCase)
UNSUPPORTED: LLDB (/Users/buildslave/jenkins/workspace/lldb-cmake-matrix/clang_701_build/bin/clang-7-x86_64) :: test_recursive_inferior_crashing_dwo (TestRecursiveInferior.CrashingRecursiveInferiorTestCase) (test case does not fall in any category of interest for this run) 
runCmd: settings set symbols.enable-external-lookup false
output: 

runCmd: settings set plugin.process.gdb-remote.packet-timeout 60
output: 

runCmd: settings set symbols.clang-modules-cache-path "/Users/buildslave/jenkins/workspace/lldb-cmake-matrix/lldb-build/tools/lldb/lldb-test-build.noindex/module-cache-lldb"
output: 

runCmd: settings set use-color false
output: 

runCmd: file /Users/buildslave/jenkins/workspace/lldb-cmake-matrix/lldb-build/tools/lldb/lldb-test-build.noindex/functionalities/inferior-crashing/recursive-inferior/TestRecursiveInferior.test_recursive_inferior_crashing_expr_dsym/a.out
output: Current executable set to '/Users/buildslave/jenkins/workspace/lldb-cmake-matrix/lldb-build/tools/lldb/lldb-test-build.noindex/functionalities/inferior-crashing/recursive-inferior/TestRecursiveInferior.test_recursive_inferior_crashing_expr_dsym/a.out' (x86_64).


runCmd: run
runCmd failed!
error: process exited with status -1 (Error 1)


Command 'run' failed!

FAIL: LLDB (/Users/buildslave/jenkins/workspace/lldb-cmake-matrix/clang_701_build/bin/clang-7-x86_64) :: test_recursive_inferior_crashing_expr_dsym (TestRecursiveInferior.CrashingRecursiveInferiorTestCase)
<bound method SBProcess.Kill of <lldb.SBProcess; proxy of <Swig Object of type 'lldb::SBProcess *' at 0x1114ad780> >>: success

runCmd: settings set symbols.enable-external-lookup false
output: 

runCmd: settings set plugin.process.gdb-remote.packet-timeout 60
output: 

runCmd: settings set symbols.clang-modules-cache-path "/Users/buildslave/jenkins/workspace/lldb-cmake-matrix/lldb-build/tools/lldb/lldb-test-build.noindex/module-cache-lldb"
output: 

runCmd: settings set use-color false
output: 

runCmd: file /Users/buildslave/jenkins/workspace/lldb-cmake-matrix/lldb-build/tools/lldb/lldb-test-build.noindex/functionalities/inferior-crashing/recursive-inferior/TestRecursiveInferior.test_recursive_inferior_crashing_expr_dwarf/a.out
output: Current executable set to '/Users/buildslave/jenkins/workspace/lldb-cmake-matrix/lldb-build/tools/lldb/lldb-test-build.noindex/functionalities/inferior-crashing/recursive-inferior/TestRecursiveInferior.test_recursive_inferior_crashing_expr_dwarf/a.out' (x86_64).


runCmd: run
runCmd failed!
error: process exited with status -1 (Error 1)


Command 'run' failed!

FAIL: LLDB (/Users/buildslave/jenkins/workspace/lldb-cmake-matrix/clang_701_build/bin/clang-7-x86_64) :: test_recursive_inferior_crashing_expr_dwarf (TestRecursiveInferior.CrashingRecursiveInferiorTestCase)
<bound method SBProcess.Kill of <lldb.SBProcess; proxy of <Swig Object of type 'lldb::SBProcess *' at 0x1114606f0> >>: success

UNSUPPORTED: LLDB (/Users/buildslave/jenkins/workspace/lldb-cmake-matrix/clang_701_build/bin/clang-7-x86_64) :: test_recursive_inferior_crashing_expr_dwo (TestRecursiveInferior.CrashingRecursiveInferiorTestCase) (test case does not fall in any category of interest for this run) 
UNSUPPORTED: LLDB (/Users/buildslave/jenkins/workspace/lldb-cmake-matrix/clang_701_build/bin/clang-7-x86_64) :: test_recursive_inferior_crashing_expr_gmodules (TestRecursiveInferior.CrashingRecursiveInferiorTestCase) (test case does not fall in any category of interest for this run) 
UNSUPPORTED: LLDB (/Users/buildslave/jenkins/workspace/lldb-cmake-matrix/clang_701_build/bin/clang-7-x86_64) :: test_recursive_inferior_crashing_gmodules (TestRecursiveInferior.CrashingRecursiveInferiorTestCase) (test case does not fall in any category of interest for this run) 
runCmd: settings set symbols.enable-external-lookup false
output: 

runCmd: settings set plugin.process.gdb-remote.packet-timeout 60
output: 

runCmd: settings set symbols.clang-modules-cache-path "/Users/buildslave/jenkins/workspace/lldb-cmake-matrix/lldb-build/tools/lldb/lldb-test-build.noindex/module-cache-lldb"
output: 

runCmd: settings set use-color false
output: 

FAIL: LLDB (/Users/buildslave/jenkins/workspace/lldb-cmake-matrix/clang_701_build/bin/clang-7-x86_64) :: test_recursive_inferior_crashing_python_dsym (TestRecursiveInferior.CrashingRecursiveInferiorTestCase)
<bound method SBProcess.Kill of <lldb.SBProcess; proxy of <Swig Object of type 'lldb::SBProcess *' at 0x11144ff30> >>: success

runCmd: settings set symbols.enable-external-lookup false
output: 

runCmd: settings set plugin.process.gdb-remote.packet-timeout 60
output: 

runCmd: settings set symbols.clang-modules-cache-path "/Users/buildslave/jenkins/workspace/lldb-cmake-matrix/lldb-build/tools/lldb/lldb-test-build.noindex/module-cache-lldb"
output: 

runCmd: settings set use-color false
output: 

FAIL: LLDB (/Users/buildslave/jenkins/workspace/lldb-cmake-matrix/clang_701_build/bin/clang-7-x86_64) :: test_recursive_inferior_crashing_python_dwarf (TestRecursiveInferior.CrashingRecursiveInferiorTestCase)
<bound method SBProcess.Kill of <lldb.SBProcess; proxy of <Swig Object of type 'lldb::SBProcess *' at 0x1114ad630> >>: success

UNSUPPORTED: LLDB (/Users/buildslave/jenkins/workspace/lldb-cmake-matrix/clang_701_build/bin/clang-7-x86_64) :: test_recursive_inferior_crashing_python_dwo (TestRecursiveInferior.CrashingRecursiveInferiorTestCase) (test case does not fall in any category of interest for this run) 
UNSUPPORTED: LLDB (/Users/buildslave/jenkins/workspace/lldb-cmake-matrix/clang_701_build/bin/clang-7-x86_64) :: test_recursive_inferior_crashing_python_gmodules (TestRecursiveInferior.CrashingRecursiveInferiorTestCase) (test case does not fall in any category of interest for this run) 
runCmd: settings set symbols.enable-external-lookup false
output: 

runCmd: settings set plugin.process.gdb-remote.packet-timeout 60
output: 

runCmd: settings set symbols.clang-modules-cache-path "/Users/buildslave/jenkins/workspace/lldb-cmake-matrix/lldb-build/tools/lldb/lldb-test-build.noindex/module-cache-lldb"
output: 

runCmd: settings set use-color false
output: 

runCmd: file /Users/buildslave/jenkins/workspace/lldb-cmake-matrix/lldb-build/tools/lldb/lldb-test-build.noindex/functionalities/inferior-crashing/recursive-inferior/TestRecursiveInferior.test_recursive_inferior_crashing_register_dsym/a.out
output: Current executable set to '/Users/buildslave/jenkins/workspace/lldb-cmake-matrix/lldb-build/tools/lldb/lldb-test-build.noindex/functionalities/inferior-crashing/recursive-inferior/TestRecursiveInferior.test_recursive_inferior_crashing_register_dsym/a.out' (x86_64).


runCmd: run
runCmd failed!
error: process exited with status -1 (Error 1)


Command 'run' failed!

FAIL: LLDB (/Users/buildslave/jenkins/workspace/lldb-cmake-matrix/clang_701_build/bin/clang-7-x86_64) :: test_recursive_inferior_crashing_register_dsym (TestRecursiveInferior.CrashingRecursiveInferiorTestCase)
<bound method SBProcess.Kill of <lldb.SBProcess; proxy of <Swig Object of type 'lldb::SBProcess *' at 0x1114606f0> >>: success

runCmd: settings set symbols.enable-external-lookup false
output: 

runCmd: settings set plugin.process.gdb-remote.packet-timeout 60
output: 

runCmd: settings set symbols.clang-modules-cache-path "/Users/buildslave/jenkins/workspace/lldb-cmake-matrix/lldb-build/tools/lldb/lldb-test-build.noindex/module-cache-lldb"
output: 

runCmd: settings set use-color false
output: 

FAIL: LLDB (/Users/buildslave/jenkins/workspace/lldb-cmake-matrix/clang_701_build/bin/clang-7-x86_64) :: test_recursive_inferior_crashing_register_dwarf (TestRecursiveInferior.CrashingRecursiveInferiorTestCase)
UNSUPPORTED: LLDB (/Users/buildslave/jenkins/workspace/lldb-cmake-matrix/clang_701_build/bin/clang-7-x86_64) :: test_recursive_inferior_crashing_register_dwo (TestRecursiveInferior.CrashingRecursiveInferiorTestCase) (test case does not fall in any category of interest for this run) 
UNSUPPORTED: LLDB (/Users/buildslave/jenkins/workspace/lldb-cmake-matrix/clang_701_build/bin/clang-7-x86_64) :: test_recursive_inferior_crashing_register_gmodules (TestRecursiveInferior.CrashingRecursiveInferiorTestCase) (test case does not fall in any category of interest for this run) 
Restore dir to: /Users/buildslave/jenkins/workspace/lldb-cmake-matrix/lldb-build/tools/lldb/lit
======================================================================
ERROR: test_recursive_inferior_crashing_dsym (TestRecursiveInferior.CrashingRecursiveInferiorTestCase)
    Test that lldb reliably catches the inferior crashing (command).
----------------------------------------------------------------------
Error when building test subject.

Build Command:
make VPATH=/Users/buildslave/jenkins/workspace/lldb-cmake-matrix/llvm-project/lldb/packages/Python/lldbsuite/test/functionalities/inferior-crashing/recursive-inferior -C /Users/buildslave/jenkins/workspace/lldb-cmake-matrix/lldb-build/tools/lldb/lldb-test-build.noindex/functionalities/inferior-crashing/recursive-inferior/TestRecursiveInferior.test_recursive_inferior_crashing_dsym -I /Users/buildslave/jenkins/workspace/lldb-cmake-matrix/llvm-project/lldb/packages/Python/lldbsuite/test/functionalities/inferior-crashing/recursive-inferior -I /Users/buildslave/jenkins/workspace/lldb-cmake-matrix/llvm-project/lldb/packages/Python/lldbsuite/test/make -f /Users/buildslave/jenkins/workspace/lldb-cmake-matrix/llvm-project/lldb/packages/Python/lldbsuite/test/functionalities/inferior-crashing/recursive-inferior/Makefile MAKE_DSYM=YES ARCH=x86_64 CC="/Users/buildslave/jenkins/workspace/lldb-cmake-matrix/clang_701_build/bin/clang-7" all 

Build Command Output:
make: *** [a.out.dSYM] Killed: 9

Test Directory:
/Users/buildslave/jenkins/workspace/lldb-cmake-matrix/llvm-project/lldb/packages/Python/lldbsuite/test/functionalities/inferior-crashing/recursive-inferior
======================================================================
ERROR: test_recursive_inferior_crashing_dwarf (TestRecursiveInferior.CrashingRecursiveInferiorTestCase)
    Test that lldb reliably catches the inferior crashing (command).
----------------------------------------------------------------------
Error when building test subject.

Build Command:
make VPATH=/Users/buildslave/jenkins/workspace/lldb-cmake-matrix/llvm-project/lldb/packages/Python/lldbsuite/test/functionalities/inferior-crashing/recursive-inferior -C /Users/buildslave/jenkins/workspace/lldb-cmake-matrix/lldb-build/tools/lldb/lldb-test-build.noindex/functionalities/inferior-crashing/recursive-inferior/TestRecursiveInferior.test_recursive_inferior_crashing_dwarf -I /Users/buildslave/jenkins/workspace/lldb-cmake-matrix/llvm-project/lldb/packages/Python/lldbsuite/test/functionalities/inferior-crashing/recursive-inferior -I /Users/buildslave/jenkins/workspace/lldb-cmake-matrix/llvm-project/lldb/packages/Python/lldbsuite/test/make -f /Users/buildslave/jenkins/workspace/lldb-cmake-matrix/llvm-project/lldb/packages/Python/lldbsuite/test/functionalities/inferior-crashing/recursive-inferior/Makefile MAKE_DSYM=NO ARCH=x86_64 CC="/Users/buildslave/jenkins/workspace/lldb-cmake-matrix/clang_701_build/bin/clang-7" 

Build Command Output:
clang-7: error: unable to execute command: Killed: 9
clang-7: error: clang frontend command failed due to signal (use -v to see invocation)
clang version 7.0.1 
Target: x86_64-apple-darwin18.0.0
Thread model: posix
InstalledDir: /Users/buildslave/jenkins/workspace/lldb-cmake-matrix/clang_701_build/bin
clang-7: note: diagnostic msg: PLEASE submit a bug report to https://bugs.llvm.org/ and include the crash backtrace, preprocessed source, and associated run script.
clang-7: note: diagnostic msg: 
********************

PLEASE ATTACH THE FOLLOWING FILES TO THE BUG REPORT:
Preprocessed source(s) and associated run script(s) are located at:
clang-7: note: diagnostic msg: /var/folders/09/r4vw4v8n5kb67jl66zvlbljw0000gn/T/lit_tmp_bT7Zaw/main-30ac93.c
clang-7: note: diagnostic msg: /var/folders/09/r4vw4v8n5kb67jl66zvlbljw0000gn/T/lit_tmp_bT7Zaw/main-30ac93.sh
clang-7: note: diagnostic msg: Crash backtrace is located in
clang-7: note: diagnostic msg: /Users/buildslave/Library/Logs/DiagnosticReports/clang-7_<YYYY-MM-DD-HHMMSS>_<hostname>.crash
clang-7: note: diagnostic msg: (choose the .crash file that corresponds to your crash)
clang-7: note: diagnostic msg: 

********************
make: *** [main.o] Error 254

Test Directory:
/Users/buildslave/jenkins/workspace/lldb-cmake-matrix/llvm-project/lldb/packages/Python/lldbsuite/test/functionalities/inferior-crashing/recursive-inferior
======================================================================
ERROR: test_recursive_inferior_crashing_register_dwarf (TestRecursiveInferior.CrashingRecursiveInferiorTestCase)
    Test that lldb reliably reads registers from the inferior after crashing (command).
----------------------------------------------------------------------
Error when building test subject.

Build Command:
make VPATH=/Users/buildslave/jenkins/workspace/lldb-cmake-matrix/llvm-project/lldb/packages/Python/lldbsuite/test/functionalities/inferior-crashing/recursive-inferior -C /Users/buildslave/jenkins/workspace/lldb-cmake-matrix/lldb-build/tools/lldb/lldb-test-build.noindex/functionalities/inferior-crashing/recursive-inferior/TestRecursiveInferior.test_recursive_inferior_crashing_register_dwarf -I /Users/buildslave/jenkins/workspace/lldb-cmake-matrix/llvm-project/lldb/packages/Python/lldbsuite/test/functionalities/inferior-crashing/recursive-inferior -I /Users/buildslave/jenkins/workspace/lldb-cmake-matrix/llvm-project/lldb/packages/Python/lldbsuite/test/make -f /Users/buildslave/jenkins/workspace/lldb-cmake-matrix/llvm-project/lldb/packages/Python/lldbsuite/test/functionalities/inferior-crashing/recursive-inferior/Makefile MAKE_DSYM=NO ARCH=x86_64 CC="/Users/buildslave/jenkins/workspace/lldb-cmake-matrix/clang_701_build/bin/clang-7" 

Build Command Output:
/bin/sh: line 1:  8263 Killed: 9               /Users/buildslave/jenkins/workspace/lldb-cmake-matrix/clang_701_build/bin/clang-7 -M -g -O0 -fno-builtin -isysroot "/Applications/Xcode.app/Contents/Developer/Platforms/MacOSX.platform/Developer/SDKs/MacOSX10.14.sdk" -arch x86_64 -I/Users/buildslave/jenkins/workspace/lldb-cmake-matrix/llvm-project/lldb/packages/Python/lldbsuite/test/make/../../../../../include -I/Users/buildslave/jenkins/workspace/lldb-cmake-matrix/llvm-project/lldb/packages/Python/lldbsuite/test/functionalities/inferior-crashing/recursive-inferior -I/Users/buildslave/jenkins/workspace/lldb-cmake-matrix/llvm-project/lldb/packages/Python/lldbsuite/test/make -include /Users/buildslave/jenkins/workspace/lldb-cmake-matrix/llvm-project/lldb/packages/Python/lldbsuite/test/make/test_common.h -fno-limit-debug-info -fomit-frame-pointer /Users/buildslave/jenkins/workspace/lldb-cmake-matrix/llvm-project/lldb/packages/Python/lldbsuite/test/functionalities/inferior-crashing/recursive-inferior/main.c > main.d.tmp
make: *** [a.out] Killed: 9

Test Directory:
/Users/buildslave/jenkins/workspace/lldb-cmake-matrix/llvm-project/lldb/packages/Python/lldbsuite/test/functionalities/inferior-crashing/recursive-inferior
======================================================================
FAIL: test_recursive_inferior_crashing_expr_dsym (TestRecursiveInferior.CrashingRecursiveInferiorTestCase)
    Test that the lldb expression interpreter can read from the inferior after crashing (command).
----------------------------------------------------------------------
Traceback (most recent call last):
  File "/Users/buildslave/jenkins/workspace/lldb-cmake-matrix/llvm-project/lldb/packages/Python/lldbsuite/test/lldbtest.py", line 1748, in test_method
    return attrvalue(self)
  File "/Users/buildslave/jenkins/workspace/lldb-cmake-matrix/llvm-project/lldb/packages/Python/lldbsuite/test/functionalities/inferior-crashing/recursive-inferior/TestRecursiveInferior.py", line 39, in test_recursive_inferior_crashing_expr
    self.recursive_inferior_crashing_expr()
  File "/Users/buildslave/jenkins/workspace/lldb-cmake-matrix/llvm-project/lldb/packages/Python/lldbsuite/test/functionalities/inferior-crashing/recursive-inferior/TestRecursiveInferior.py", line 135, in recursive_inferior_crashing_expr
    self.runCmd("run", RUN_SUCCEEDED)
  File "/Users/buildslave/jenkins/workspace/lldb-cmake-matrix/llvm-project/lldb/packages/Python/lldbsuite/test/lldbtest.py", line 2068, in runCmd
    msg if (msg) else CMD_MSG(cmd))
AssertionError: False is not True : Process is launched successfully
Error output:
error: process exited with status -1 (Error 1)

Config=x86_64-/Users/buildslave/jenkins/workspace/lldb-cmake-matrix/clang_701_build/bin/clang-7
======================================================================
FAIL: test_recursive_inferior_crashing_expr_dwarf (TestRecursiveInferior.CrashingRecursiveInferiorTestCase)
    Test that the lldb expression interpreter can read from the inferior after crashing (command).
----------------------------------------------------------------------
Traceback (most recent call last):
  File "/Users/buildslave/jenkins/workspace/lldb-cmake-matrix/llvm-project/lldb/packages/Python/lldbsuite/test/lldbtest.py", line 1748, in test_method
    return attrvalue(self)
  File "/Users/buildslave/jenkins/workspace/lldb-cmake-matrix/llvm-project/lldb/packages/Python/lldbsuite/test/functionalities/inferior-crashing/recursive-inferior/TestRecursiveInferior.py", line 39, in test_recursive_inferior_crashing_expr
    self.recursive_inferior_crashing_expr()
  File "/Users/buildslave/jenkins/workspace/lldb-cmake-matrix/llvm-project/lldb/packages/Python/lldbsuite/test/functionalities/inferior-crashing/recursive-inferior/TestRecursiveInferior.py", line 135, in recursive_inferior_crashing_expr
    self.runCmd("run", RUN_SUCCEEDED)
  File "/Users/buildslave/jenkins/workspace/lldb-cmake-matrix/llvm-project/lldb/packages/Python/lldbsuite/test/lldbtest.py", line 2068, in runCmd
    msg if (msg) else CMD_MSG(cmd))
AssertionError: False is not True : Process is launched successfully
Error output:
error: process exited with status -1 (Error 1)

Config=x86_64-/Users/buildslave/jenkins/workspace/lldb-cmake-matrix/clang_701_build/bin/clang-7
======================================================================
FAIL: test_recursive_inferior_crashing_python_dsym (TestRecursiveInferior.CrashingRecursiveInferiorTestCase)
    Test that lldb reliably catches the inferior crashing (Python API).
----------------------------------------------------------------------
Traceback (most recent call last):
  File "/Users/buildslave/jenkins/workspace/lldb-cmake-matrix/llvm-project/lldb/packages/Python/lldbsuite/test/lldbtest.py", line 1748, in test_method
    return attrvalue(self)
  File "/Users/buildslave/jenkins/workspace/lldb-cmake-matrix/llvm-project/lldb/packages/Python/lldbsuite/test/functionalities/inferior-crashing/recursive-inferior/TestRecursiveInferior.py", line 34, in test_recursive_inferior_crashing_python
    self.recursive_inferior_crashing_python()
  File "/Users/buildslave/jenkins/workspace/lldb-cmake-matrix/llvm-project/lldb/packages/Python/lldbsuite/test/functionalities/inferior-crashing/recursive-inferior/TestRecursiveInferior.py", line 107, in recursive_inferior_crashing_python
    lldbutil.state_type_to_str(process.GetState()))
AssertionError: Process should be in the 'stopped' state, instead the actual state is: 'exited'
Config=x86_64-/Users/buildslave/jenkins/workspace/lldb-cmake-matrix/clang_701_build/bin/clang-7
======================================================================
FAIL: test_recursive_inferior_crashing_python_dwarf (TestRecursiveInferior.CrashingRecursiveInferiorTestCase)
    Test that lldb reliably catches the inferior crashing (Python API).
----------------------------------------------------------------------
Traceback (most recent call last):
  File "/Users/buildslave/jenkins/workspace/lldb-cmake-matrix/llvm-project/lldb/packages/Python/lldbsuite/test/lldbtest.py", line 1748, in test_method
    return attrvalue(self)
  File "/Users/buildslave/jenkins/workspace/lldb-cmake-matrix/llvm-project/lldb/packages/Python/lldbsuite/test/functionalities/inferior-crashing/recursive-inferior/TestRecursiveInferior.py", line 34, in test_recursive_inferior_crashing_python
    self.recursive_inferior_crashing_python()
  File "/Users/buildslave/jenkins/workspace/lldb-cmake-matrix/llvm-project/lldb/packages/Python/lldbsuite/test/functionalities/inferior-crashing/recursive-inferior/TestRecursiveInferior.py", line 107, in recursive_inferior_crashing_python
    lldbutil.state_type_to_str(process.GetState()))
AssertionError: Process should be in the 'stopped' state, instead the actual state is: 'exited'
Config=x86_64-/Users/buildslave/jenkins/workspace/lldb-cmake-matrix/clang_701_build/bin/clang-7
======================================================================
FAIL: test_recursive_inferior_crashing_register_dsym (TestRecursiveInferior.CrashingRecursiveInferiorTestCase)
    Test that lldb reliably reads registers from the inferior after crashing (command).
----------------------------------------------------------------------
Traceback (most recent call last):
  File "/Users/buildslave/jenkins/workspace/lldb-cmake-matrix/llvm-project/lldb/packages/Python/lldbsuite/test/lldbtest.py", line 1748, in test_method
    return attrvalue(self)
  File "/Users/buildslave/jenkins/workspace/lldb-cmake-matrix/llvm-project/lldb/packages/Python/lldbsuite/test/decorators.py", line 111, in wrapper
    func(*args, **kwargs)
  File "/Users/buildslave/jenkins/workspace/lldb-cmake-matrix/llvm-project/lldb/packages/Python/lldbsuite/test/functionalities/inferior-crashing/recursive-inferior/TestRecursiveInferior.py", line 28, in test_recursive_inferior_crashing_register
    self.recursive_inferior_crashing_registers()
  File "/Users/buildslave/jenkins/workspace/lldb-cmake-matrix/llvm-project/lldb/packages/Python/lldbsuite/test/functionalities/inferior-crashing/recursive-inferior/TestRecursiveInferior.py", line 123, in recursive_inferior_crashing_registers
    self.runCmd("run", RUN_SUCCEEDED)
  File "/Users/buildslave/jenkins/workspace/lldb-cmake-matrix/llvm-project/lldb/packages/Python/lldbsuite/test/lldbtest.py", line 2068, in runCmd
    msg if (msg) else CMD_MSG(cmd))
AssertionError: False is not True : Process is launched successfully
Error output:
error: process exited with status -1 (Error 1)

Config=x86_64-/Users/buildslave/jenkins/workspace/lldb-cmake-matrix/clang_701_build/bin/clang-7
----------------------------------------------------------------------
Ran 16 tests in 6.905s

RESULT: FAILED (0 passes, 5 failures, 3 errors, 8 skipped, 0 expected failures, 0 unexpected successes)