Regression

Test Clang 7.0.1 / lldb-Suite.functionalities/target-new-solib-notifications.TestModuleLoadedNotifys.py (from lldb-Suite)

Failing for the past 1 build (Since Unstable#270 )
Took 1.1 sec.

Stacktrace

LLDB library dir: /Users/buildslave/jenkins/workspace/lldb-cmake-matrix/lldb-build/bin
LLDB import library dir: /Users/buildslave/jenkins/workspace/lldb-cmake-matrix/lldb-build/bin
libstdcxx tests will not be run because: Don't know how to build with libstdcxx on macosx
Skipping following debug info categories: ['dwo']

Session logs for test failures/errors/unexpected successes will go into directory '/Users/buildslave/jenkins/workspace/lldb-cmake-matrix/test/logs'
Command invoked: /Users/buildslave/jenkins/workspace/lldb-cmake-matrix/llvm-project/lldb/test/dotest.py --arch=x86_64 -s /Users/buildslave/jenkins/workspace/lldb-cmake-matrix/lldb-build/lldb-test-traces -S nm -u CXXFLAGS -u CFLAGS --executable /Users/buildslave/jenkins/workspace/lldb-cmake-matrix/lldb-build/./bin/lldb --dsymutil /Users/buildslave/jenkins/workspace/lldb-cmake-matrix/lldb-build/./bin/dsymutil --filecheck /Users/buildslave/jenkins/workspace/lldb-cmake-matrix/lldb-build/./bin/FileCheck -C /Users/buildslave/jenkins/workspace/lldb-cmake-matrix/clang_701_build/bin/clang --codesign-identity lldb_codesign --server /Users/buildslave/jenkins/workspace/lldb-cmake-matrix/lldb-build/./bin/debugserver --arch x86_64 --build-dir /Users/buildslave/jenkins/workspace/lldb-cmake-matrix/lldb-build/lldb-test-build.noindex -s=/Users/buildslave/jenkins/workspace/lldb-cmake-matrix/test/logs -t --env TERM=vt100 --skip-category gmodules --skip-category watchpoint --arch=x86_64 --env LLVM_LIBS_DIR=/Users/buildslave/jenkins/workspace/lldb-cmake-matrix/lldb-build/./lib --build-dir /Users/buildslave/jenkins/workspace/lldb-cmake-matrix/lldb-build/tools/lldb/lldb-test-build.noindex --module-cache-dir /Users/buildslave/jenkins/workspace/lldb-cmake-matrix/lldb-build/tools/lldb/lldb-test-build.noindex/module-cache-lldb /Users/buildslave/jenkins/workspace/lldb-cmake-matrix/llvm-project/lldb/packages/Python/lldbsuite/test/functionalities/target-new-solib-notifications -p TestModuleLoadedNotifys.py
Change dir to: /Users/buildslave/jenkins/workspace/lldb-cmake-matrix/llvm-project/lldb/packages/Python/lldbsuite/test/functionalities/target-new-solib-notifications
runCmd: settings set symbols.enable-external-lookup false
output: 

runCmd: settings set plugin.process.gdb-remote.packet-timeout 60
output: 

runCmd: settings set symbols.clang-modules-cache-path "/Users/buildslave/jenkins/workspace/lldb-cmake-matrix/lldb-build/tools/lldb/lldb-test-build.noindex/module-cache-lldb"
output: 

runCmd: settings set use-color false
output: 

FAIL: LLDB (/Users/buildslave/jenkins/workspace/lldb-cmake-matrix/clang_701_build/bin/clang-7-x86_64) :: test_launch_notifications (TestModuleLoadedNotifys.ModuleLoadedNotifysTestCase)
<bound method SBProcess.Kill of <lldb.SBProcess; proxy of <Swig Object of type 'lldb::SBProcess *' at 0x10e101e10> >>: success

Restore dir to: /Users/buildslave/jenkins/workspace/lldb-cmake-matrix/lldb-build/tools/lldb/lit
======================================================================
FAIL: test_launch_notifications (TestModuleLoadedNotifys.ModuleLoadedNotifysTestCase)
   Test that lldb broadcasts newly loaded libraries in batches.
----------------------------------------------------------------------
Traceback (most recent call last):
  File "/Users/buildslave/jenkins/workspace/lldb-cmake-matrix/llvm-project/lldb/packages/Python/lldbsuite/test/functionalities/target-new-solib-notifications/TestModuleLoadedNotifys.py", line 68, in test_launch_notifications
    PROCESS_STOPPED)
AssertionError: False is not True : Process status should be stopped
Config=x86_64-/Users/buildslave/jenkins/workspace/lldb-cmake-matrix/clang_701_build/bin/clang-7
----------------------------------------------------------------------
Ran 1 test in 0.612s

RESULT: FAILED (0 passes, 1 failures, 0 errors, 0 skipped, 0 expected failures, 0 unexpected successes)