Regression

Test Clang 7.0.1 / lldb-Suite.functionalities/thread/step_out.TestThreadStepOut.py (from lldb-Suite)

Failing for the past 1 build (Since Unstable#270 )
Took 18 sec.

Stacktrace

lldb version 10.0.99 (http://labmaster3.local/git/llvm-project.git revision 1a3dd638c4a9173e53628b497a1aadc31c32eb50)
  clang revision daa79c5338228a746a7eba0cf2f2f356e1d45a5b
  llvm revision daa79c5338228a746a7eba0cf2f2f356e1d45a5b
LLDB library dir: /Users/buildslave/jenkins/workspace/lldb-cmake-matrix/lldb-build/bin
LLDB import library dir: /Users/buildslave/jenkins/workspace/lldb-cmake-matrix/lldb-build/bin
libstdcxx tests will not be run because: Don't know how to build with libstdcxx on macosx
Skipping following debug info categories: ['dwo']

Session logs for test failures/errors/unexpected successes will go into directory '/Users/buildslave/jenkins/workspace/lldb-cmake-matrix/test/logs'
Command invoked: /Users/buildslave/jenkins/workspace/lldb-cmake-matrix/llvm-project/lldb/test/dotest.py --arch=x86_64 -s /Users/buildslave/jenkins/workspace/lldb-cmake-matrix/lldb-build/lldb-test-traces -S nm -u CXXFLAGS -u CFLAGS --executable /Users/buildslave/jenkins/workspace/lldb-cmake-matrix/lldb-build/./bin/lldb --dsymutil /Users/buildslave/jenkins/workspace/lldb-cmake-matrix/lldb-build/./bin/dsymutil --filecheck /Users/buildslave/jenkins/workspace/lldb-cmake-matrix/lldb-build/./bin/FileCheck -C /Users/buildslave/jenkins/workspace/lldb-cmake-matrix/clang_701_build/bin/clang --codesign-identity lldb_codesign --server /Users/buildslave/jenkins/workspace/lldb-cmake-matrix/lldb-build/./bin/debugserver --arch x86_64 --build-dir /Users/buildslave/jenkins/workspace/lldb-cmake-matrix/lldb-build/lldb-test-build.noindex -s=/Users/buildslave/jenkins/workspace/lldb-cmake-matrix/test/logs -t --env TERM=vt100 --skip-category gmodules --skip-category watchpoint --arch=x86_64 --env LLVM_LIBS_DIR=/Users/buildslave/jenkins/workspace/lldb-cmake-matrix/lldb-build/./lib --build-dir /Users/buildslave/jenkins/workspace/lldb-cmake-matrix/lldb-build/tools/lldb/lldb-test-build.noindex --module-cache-dir /Users/buildslave/jenkins/workspace/lldb-cmake-matrix/lldb-build/tools/lldb/lldb-test-build.noindex/module-cache-lldb /Users/buildslave/jenkins/workspace/lldb-cmake-matrix/llvm-project/lldb/packages/Python/lldbsuite/test/functionalities/thread/step_out -p TestThreadStepOut.py
Change dir to: /Users/buildslave/jenkins/workspace/lldb-cmake-matrix/llvm-project/lldb/packages/Python/lldbsuite/test/functionalities/thread/step_out
runCmd: settings set symbols.enable-external-lookup false
output: 

runCmd: settings set plugin.process.gdb-remote.packet-timeout 60
output: 

runCmd: settings set symbols.clang-modules-cache-path "/Users/buildslave/jenkins/workspace/lldb-cmake-matrix/lldb-build/tools/lldb/lldb-test-build.noindex/module-cache-lldb"
output: 

runCmd: settings set use-color false
output: 

runCmd: file /Users/buildslave/jenkins/workspace/lldb-cmake-matrix/lldb-build/tools/lldb/lldb-test-build.noindex/functionalities/thread/step_out/TestThreadStepOut.test_python_dsym/a.out
output: Current executable set to '/Users/buildslave/jenkins/workspace/lldb-cmake-matrix/lldb-build/tools/lldb/lldb-test-build.noindex/functionalities/thread/step_out/TestThreadStepOut.test_python_dsym/a.out' (x86_64).


runCmd: breakpoint set -f "main.cpp" -l 20
output: Breakpoint 1: where = a.out`step_out_of_here() + 4 at main.cpp:20:10, address = 0x0000000100000a84


Expecting pattern: ^Breakpoint (?P<bpno>[0-9]+): (?P<num_locations>[0-9]+) locations\.$
Not matched

Expecting pattern: ^Breakpoint (?P<bpno>[0-9]+): (?P<num_locations>no) locations \(pending\)\.
Not matched

Expecting pattern: ^Breakpoint (?P<bpno>[0-9]+): where = (?P<module>.*)`(?P<symbol>[+\-]{0,1}[^+]+)( \+ (?P<offset>[0-9]+)){0,1}( \[inlined\] (?P<inline_symbol>.*)){0,1} at (?P<file>[^:]+):(?P<line_no>[0-9]+)(?P<column>(:[0-9]+)?), address = (?P<address>0x[0-9a-fA-F]+)$
Matched

runCmd: breakpoint list -f
output: Current breakpoints:
1: file = 'main.cpp', line = 20, exact_match = 0, locations = 1
  1.1: where = a.out`step_out_of_here() + 4 at main.cpp:20:10, address = a.out[0x0000000100000a84], unresolved, hit count = 0 



Expecting sub string: 1: file = 'main.cpp', line = 20, exact_match = 0, locations = 1
Matched

runCmd: run
runCmd failed!
error: process exited with status -1 (Error 1)


Command 'run' failed!

FAIL: LLDB (/Users/buildslave/jenkins/workspace/lldb-cmake-matrix/clang_701_build/bin/clang-7-x86_64) :: test_python_dsym (TestThreadStepOut.ThreadStepOutTestCase)
<bound method SBProcess.Kill of <lldb.SBProcess; proxy of <Swig Object of type 'lldb::SBProcess *' at 0x10eefa030> >>: success

runCmd: settings set symbols.enable-external-lookup false
output: 

runCmd: settings set plugin.process.gdb-remote.packet-timeout 60
output: 

runCmd: settings set symbols.clang-modules-cache-path "/Users/buildslave/jenkins/workspace/lldb-cmake-matrix/lldb-build/tools/lldb/lldb-test-build.noindex/module-cache-lldb"
output: 

runCmd: settings set use-color false
output: 

runCmd: file /Users/buildslave/jenkins/workspace/lldb-cmake-matrix/lldb-build/tools/lldb/lldb-test-build.noindex/functionalities/thread/step_out/TestThreadStepOut.test_python_dwarf/a.out
output: Current executable set to '/Users/buildslave/jenkins/workspace/lldb-cmake-matrix/lldb-build/tools/lldb/lldb-test-build.noindex/functionalities/thread/step_out/TestThreadStepOut.test_python_dwarf/a.out' (x86_64).


runCmd: breakpoint set -f "main.cpp" -l 20
output: Breakpoint 1: where = a.out`step_out_of_here() + 4 at main.cpp:20:10, address = 0x0000000100000a84


Expecting pattern: ^Breakpoint (?P<bpno>[0-9]+): (?P<num_locations>[0-9]+) locations\.$
Not matched

Expecting pattern: ^Breakpoint (?P<bpno>[0-9]+): (?P<num_locations>no) locations \(pending\)\.
Not matched

Expecting pattern: ^Breakpoint (?P<bpno>[0-9]+): where = (?P<module>.*)`(?P<symbol>[+\-]{0,1}[^+]+)( \+ (?P<offset>[0-9]+)){0,1}( \[inlined\] (?P<inline_symbol>.*)){0,1} at (?P<file>[^:]+):(?P<line_no>[0-9]+)(?P<column>(:[0-9]+)?), address = (?P<address>0x[0-9a-fA-F]+)$
Matched

runCmd: breakpoint list -f
output: Current breakpoints:
1: file = 'main.cpp', line = 20, exact_match = 0, locations = 1
  1.1: where = a.out`step_out_of_here() + 4 at main.cpp:20:10, address = a.out[0x0000000100000a84], unresolved, hit count = 0 



Expecting sub string: 1: file = 'main.cpp', line = 20, exact_match = 0, locations = 1
Matched

runCmd: run
runCmd failed!
error: process exited with status -1 (Error 1)


Command 'run' failed!

FAIL: LLDB (/Users/buildslave/jenkins/workspace/lldb-cmake-matrix/clang_701_build/bin/clang-7-x86_64) :: test_python_dwarf (TestThreadStepOut.ThreadStepOutTestCase)
<bound method SBProcess.Kill of <lldb.SBProcess; proxy of <Swig Object of type 'lldb::SBProcess *' at 0x10eee3ea0> >>: success

UNSUPPORTED: LLDB (/Users/buildslave/jenkins/workspace/lldb-cmake-matrix/clang_701_build/bin/clang-7-x86_64) :: test_python_dwo (TestThreadStepOut.ThreadStepOutTestCase) (test case does not fall in any category of interest for this run) 
UNSUPPORTED: LLDB (/Users/buildslave/jenkins/workspace/lldb-cmake-matrix/clang_701_build/bin/clang-7-x86_64) :: test_python_gmodules (TestThreadStepOut.ThreadStepOutTestCase) (test case does not fall in any category of interest for this run) 
runCmd: settings set symbols.enable-external-lookup false
output: 

runCmd: settings set plugin.process.gdb-remote.packet-timeout 60
output: 

runCmd: settings set symbols.clang-modules-cache-path "/Users/buildslave/jenkins/workspace/lldb-cmake-matrix/lldb-build/tools/lldb/lldb-test-build.noindex/module-cache-lldb"
output: 

runCmd: settings set use-color false
output: 

runCmd: file /Users/buildslave/jenkins/workspace/lldb-cmake-matrix/lldb-build/tools/lldb/lldb-test-build.noindex/functionalities/thread/step_out/TestThreadStepOut.test_step_all_threads_dsym/a.out
output: Current executable set to '/Users/buildslave/jenkins/workspace/lldb-cmake-matrix/lldb-build/tools/lldb/lldb-test-build.noindex/functionalities/thread/step_out/TestThreadStepOut.test_step_all_threads_dsym/a.out' (x86_64).


runCmd: breakpoint set -f "main.cpp" -l 20
output: Breakpoint 1: where = a.out`step_out_of_here() + 4 at main.cpp:20:10, address = 0x0000000100000a84


Expecting pattern: ^Breakpoint (?P<bpno>[0-9]+): (?P<num_locations>[0-9]+) locations\.$
Not matched

Expecting pattern: ^Breakpoint (?P<bpno>[0-9]+): (?P<num_locations>no) locations \(pending\)\.
Not matched

Expecting pattern: ^Breakpoint (?P<bpno>[0-9]+): where = (?P<module>.*)`(?P<symbol>[+\-]{0,1}[^+]+)( \+ (?P<offset>[0-9]+)){0,1}( \[inlined\] (?P<inline_symbol>.*)){0,1} at (?P<file>[^:]+):(?P<line_no>[0-9]+)(?P<column>(:[0-9]+)?), address = (?P<address>0x[0-9a-fA-F]+)$
Matched

runCmd: breakpoint list -f
output: Current breakpoints:
1: file = 'main.cpp', line = 20, exact_match = 0, locations = 1
  1.1: where = a.out`step_out_of_here() + 4 at main.cpp:20:10, address = a.out[0x0000000100000a84], unresolved, hit count = 0 



Expecting sub string: 1: file = 'main.cpp', line = 20, exact_match = 0, locations = 1
Matched

runCmd: run
runCmd failed!
error: process exited with status -1 (Error 1)


Command 'run' failed!

FAIL: LLDB (/Users/buildslave/jenkins/workspace/lldb-cmake-matrix/clang_701_build/bin/clang-7-x86_64) :: test_step_all_threads_dsym (TestThreadStepOut.ThreadStepOutTestCase)
<bound method SBProcess.Kill of <lldb.SBProcess; proxy of <Swig Object of type 'lldb::SBProcess *' at 0x10eefa060> >>: success

runCmd: settings set symbols.enable-external-lookup false
output: 

runCmd: settings set plugin.process.gdb-remote.packet-timeout 60
output: 

runCmd: settings set symbols.clang-modules-cache-path "/Users/buildslave/jenkins/workspace/lldb-cmake-matrix/lldb-build/tools/lldb/lldb-test-build.noindex/module-cache-lldb"
output: 

runCmd: settings set use-color false
output: 

runCmd: file /Users/buildslave/jenkins/workspace/lldb-cmake-matrix/lldb-build/tools/lldb/lldb-test-build.noindex/functionalities/thread/step_out/TestThreadStepOut.test_step_all_threads_dwarf/a.out
output: Current executable set to '/Users/buildslave/jenkins/workspace/lldb-cmake-matrix/lldb-build/tools/lldb/lldb-test-build.noindex/functionalities/thread/step_out/TestThreadStepOut.test_step_all_threads_dwarf/a.out' (x86_64).


runCmd: breakpoint set -f "main.cpp" -l 20
output: Breakpoint 1: where = a.out`step_out_of_here() + 4 at main.cpp:20:10, address = 0x0000000100000a84


Expecting pattern: ^Breakpoint (?P<bpno>[0-9]+): (?P<num_locations>[0-9]+) locations\.$
Not matched

Expecting pattern: ^Breakpoint (?P<bpno>[0-9]+): (?P<num_locations>no) locations \(pending\)\.
Not matched

Expecting pattern: ^Breakpoint (?P<bpno>[0-9]+): where = (?P<module>.*)`(?P<symbol>[+\-]{0,1}[^+]+)( \+ (?P<offset>[0-9]+)){0,1}( \[inlined\] (?P<inline_symbol>.*)){0,1} at (?P<file>[^:]+):(?P<line_no>[0-9]+)(?P<column>(:[0-9]+)?), address = (?P<address>0x[0-9a-fA-F]+)$
Matched

runCmd: breakpoint list -f
output: Current breakpoints:
1: file = 'main.cpp', line = 20, exact_match = 0, locations = 1
  1.1: where = a.out`step_out_of_here() + 4 at main.cpp:20:10, address = a.out[0x0000000100000a84], unresolved, hit count = 0 



Expecting sub string: 1: file = 'main.cpp', line = 20, exact_match = 0, locations = 1
Matched

runCmd: run
runCmd failed!
error: process exited with status -1 (Error 1)


Command 'run' failed!

FAIL: LLDB (/Users/buildslave/jenkins/workspace/lldb-cmake-matrix/clang_701_build/bin/clang-7-x86_64) :: test_step_all_threads_dwarf (TestThreadStepOut.ThreadStepOutTestCase)
<bound method SBProcess.Kill of <lldb.SBProcess; proxy of <Swig Object of type 'lldb::SBProcess *' at 0x10eee3e70> >>: success

UNSUPPORTED: LLDB (/Users/buildslave/jenkins/workspace/lldb-cmake-matrix/clang_701_build/bin/clang-7-x86_64) :: test_step_all_threads_dwo (TestThreadStepOut.ThreadStepOutTestCase) (test case does not fall in any category of interest for this run) 
UNSUPPORTED: LLDB (/Users/buildslave/jenkins/workspace/lldb-cmake-matrix/clang_701_build/bin/clang-7-x86_64) :: test_step_all_threads_gmodules (TestThreadStepOut.ThreadStepOutTestCase) (test case does not fall in any category of interest for this run) 
runCmd: settings set symbols.enable-external-lookup false
output: 

runCmd: settings set plugin.process.gdb-remote.packet-timeout 60
output: 

runCmd: settings set symbols.clang-modules-cache-path "/Users/buildslave/jenkins/workspace/lldb-cmake-matrix/lldb-build/tools/lldb/lldb-test-build.noindex/module-cache-lldb"
output: 

runCmd: settings set use-color false
output: 

runCmd: file /Users/buildslave/jenkins/workspace/lldb-cmake-matrix/lldb-build/tools/lldb/lldb-test-build.noindex/functionalities/thread/step_out/TestThreadStepOut.test_step_single_thread_dsym/a.out
output: Current executable set to '/Users/buildslave/jenkins/workspace/lldb-cmake-matrix/lldb-build/tools/lldb/lldb-test-build.noindex/functionalities/thread/step_out/TestThreadStepOut.test_step_single_thread_dsym/a.out' (x86_64).


runCmd: breakpoint set -f "main.cpp" -l 20
output: Breakpoint 1: where = a.out`step_out_of_here() + 4 at main.cpp:20:10, address = 0x0000000100000a84


Expecting pattern: ^Breakpoint (?P<bpno>[0-9]+): (?P<num_locations>[0-9]+) locations\.$
Not matched

Expecting pattern: ^Breakpoint (?P<bpno>[0-9]+): (?P<num_locations>no) locations \(pending\)\.
Not matched

Expecting pattern: ^Breakpoint (?P<bpno>[0-9]+): where = (?P<module>.*)`(?P<symbol>[+\-]{0,1}[^+]+)( \+ (?P<offset>[0-9]+)){0,1}( \[inlined\] (?P<inline_symbol>.*)){0,1} at (?P<file>[^:]+):(?P<line_no>[0-9]+)(?P<column>(:[0-9]+)?), address = (?P<address>0x[0-9a-fA-F]+)$
Matched

runCmd: breakpoint list -f
output: Current breakpoints:
1: file = 'main.cpp', line = 20, exact_match = 0, locations = 1
  1.1: where = a.out`step_out_of_here() + 4 at main.cpp:20:10, address = a.out[0x0000000100000a84], unresolved, hit count = 0 



Expecting sub string: 1: file = 'main.cpp', line = 20, exact_match = 0, locations = 1
Matched

runCmd: run
runCmd failed!
error: process exited with status -1 (Error 1)


Command 'run' failed!

FAIL: LLDB (/Users/buildslave/jenkins/workspace/lldb-cmake-matrix/clang_701_build/bin/clang-7-x86_64) :: test_step_single_thread_dsym (TestThreadStepOut.ThreadStepOutTestCase)
<bound method SBProcess.Kill of <lldb.SBProcess; proxy of <Swig Object of type 'lldb::SBProcess *' at 0x10eefa060> >>: success

runCmd: settings set symbols.enable-external-lookup false
output: 

runCmd: settings set plugin.process.gdb-remote.packet-timeout 60
output: 

runCmd: settings set symbols.clang-modules-cache-path "/Users/buildslave/jenkins/workspace/lldb-cmake-matrix/lldb-build/tools/lldb/lldb-test-build.noindex/module-cache-lldb"
output: 

runCmd: settings set use-color false
output: 

runCmd: file /Users/buildslave/jenkins/workspace/lldb-cmake-matrix/lldb-build/tools/lldb/lldb-test-build.noindex/functionalities/thread/step_out/TestThreadStepOut.test_step_single_thread_dwarf/a.out
output: Current executable set to '/Users/buildslave/jenkins/workspace/lldb-cmake-matrix/lldb-build/tools/lldb/lldb-test-build.noindex/functionalities/thread/step_out/TestThreadStepOut.test_step_single_thread_dwarf/a.out' (x86_64).


runCmd: breakpoint set -f "main.cpp" -l 20
output: Breakpoint 1: where = a.out`step_out_of_here() + 4 at main.cpp:20:10, address = 0x0000000100000a84


Expecting pattern: ^Breakpoint (?P<bpno>[0-9]+): (?P<num_locations>[0-9]+) locations\.$
Not matched

Expecting pattern: ^Breakpoint (?P<bpno>[0-9]+): (?P<num_locations>no) locations \(pending\)\.
Not matched

Expecting pattern: ^Breakpoint (?P<bpno>[0-9]+): where = (?P<module>.*)`(?P<symbol>[+\-]{0,1}[^+]+)( \+ (?P<offset>[0-9]+)){0,1}( \[inlined\] (?P<inline_symbol>.*)){0,1} at (?P<file>[^:]+):(?P<line_no>[0-9]+)(?P<column>(:[0-9]+)?), address = (?P<address>0x[0-9a-fA-F]+)$
Matched

runCmd: breakpoint list -f
output: Current breakpoints:
1: file = 'main.cpp', line = 20, exact_match = 0, locations = 1
  1.1: where = a.out`step_out_of_here() + 4 at main.cpp:20:10, address = a.out[0x0000000100000a84], unresolved, hit count = 0 



Expecting sub string: 1: file = 'main.cpp', line = 20, exact_match = 0, locations = 1
Matched

runCmd: run
runCmd failed!
error: process exited with status -1 (Error 1)


Command 'run' failed!

FAIL: LLDB (/Users/buildslave/jenkins/workspace/lldb-cmake-matrix/clang_701_build/bin/clang-7-x86_64) :: test_step_single_thread_dwarf (TestThreadStepOut.ThreadStepOutTestCase)
<bound method SBProcess.Kill of <lldb.SBProcess; proxy of <Swig Object of type 'lldb::SBProcess *' at 0x10f0cff00> >>: success

UNSUPPORTED: LLDB (/Users/buildslave/jenkins/workspace/lldb-cmake-matrix/clang_701_build/bin/clang-7-x86_64) :: test_step_single_thread_dwo (TestThreadStepOut.ThreadStepOutTestCase) (test case does not fall in any category of interest for this run) 
UNSUPPORTED: LLDB (/Users/buildslave/jenkins/workspace/lldb-cmake-matrix/clang_701_build/bin/clang-7-x86_64) :: test_step_single_thread_gmodules (TestThreadStepOut.ThreadStepOutTestCase) (test case does not fall in any category of interest for this run) 
Restore dir to: /Users/buildslave/jenkins/workspace/lldb-cmake-matrix/lldb-build/tools/lldb/lit
======================================================================
FAIL: test_python_dsym (TestThreadStepOut.ThreadStepOutTestCase)
    Test thread step out on one thread via Python API (dwarf).
----------------------------------------------------------------------
Traceback (most recent call last):
  File "/Users/buildslave/jenkins/workspace/lldb-cmake-matrix/llvm-project/lldb/packages/Python/lldbsuite/test/lldbtest.py", line 1748, in test_method
    return attrvalue(self)
  File "/Users/buildslave/jenkins/workspace/lldb-cmake-matrix/llvm-project/lldb/packages/Python/lldbsuite/test/decorators.py", line 111, in wrapper
    func(*args, **kwargs)
  File "/Users/buildslave/jenkins/workspace/lldb-cmake-matrix/llvm-project/lldb/packages/Python/lldbsuite/test/decorators.py", line 111, in wrapper
    func(*args, **kwargs)
  File "/Users/buildslave/jenkins/workspace/lldb-cmake-matrix/llvm-project/lldb/packages/Python/lldbsuite/test/decorators.py", line 111, in wrapper
    func(*args, **kwargs)
  File "/Users/buildslave/jenkins/workspace/lldb-cmake-matrix/llvm-project/lldb/packages/Python/lldbsuite/test/decorators.py", line 111, in wrapper
    func(*args, **kwargs)
  File "/Users/buildslave/jenkins/workspace/lldb-cmake-matrix/llvm-project/lldb/packages/Python/lldbsuite/test/functionalities/thread/step_out/TestThreadStepOut.py", line 65, in test_python
    self.step_out_test(self.step_out_with_python)
  File "/Users/buildslave/jenkins/workspace/lldb-cmake-matrix/llvm-project/lldb/packages/Python/lldbsuite/test/functionalities/thread/step_out/TestThreadStepOut.py", line 148, in step_out_test
    self.runCmd("run", RUN_SUCCEEDED)
  File "/Users/buildslave/jenkins/workspace/lldb-cmake-matrix/llvm-project/lldb/packages/Python/lldbsuite/test/lldbtest.py", line 2068, in runCmd
    msg if (msg) else CMD_MSG(cmd))
AssertionError: False is not True : Process is launched successfully
Error output:
error: process exited with status -1 (Error 1)

Config=x86_64-/Users/buildslave/jenkins/workspace/lldb-cmake-matrix/clang_701_build/bin/clang-7
======================================================================
FAIL: test_python_dwarf (TestThreadStepOut.ThreadStepOutTestCase)
    Test thread step out on one thread via Python API (dwarf).
----------------------------------------------------------------------
Traceback (most recent call last):
  File "/Users/buildslave/jenkins/workspace/lldb-cmake-matrix/llvm-project/lldb/packages/Python/lldbsuite/test/lldbtest.py", line 1748, in test_method
    return attrvalue(self)
  File "/Users/buildslave/jenkins/workspace/lldb-cmake-matrix/llvm-project/lldb/packages/Python/lldbsuite/test/decorators.py", line 111, in wrapper
    func(*args, **kwargs)
  File "/Users/buildslave/jenkins/workspace/lldb-cmake-matrix/llvm-project/lldb/packages/Python/lldbsuite/test/decorators.py", line 111, in wrapper
    func(*args, **kwargs)
  File "/Users/buildslave/jenkins/workspace/lldb-cmake-matrix/llvm-project/lldb/packages/Python/lldbsuite/test/decorators.py", line 111, in wrapper
    func(*args, **kwargs)
  File "/Users/buildslave/jenkins/workspace/lldb-cmake-matrix/llvm-project/lldb/packages/Python/lldbsuite/test/decorators.py", line 111, in wrapper
    func(*args, **kwargs)
  File "/Users/buildslave/jenkins/workspace/lldb-cmake-matrix/llvm-project/lldb/packages/Python/lldbsuite/test/functionalities/thread/step_out/TestThreadStepOut.py", line 65, in test_python
    self.step_out_test(self.step_out_with_python)
  File "/Users/buildslave/jenkins/workspace/lldb-cmake-matrix/llvm-project/lldb/packages/Python/lldbsuite/test/functionalities/thread/step_out/TestThreadStepOut.py", line 148, in step_out_test
    self.runCmd("run", RUN_SUCCEEDED)
  File "/Users/buildslave/jenkins/workspace/lldb-cmake-matrix/llvm-project/lldb/packages/Python/lldbsuite/test/lldbtest.py", line 2068, in runCmd
    msg if (msg) else CMD_MSG(cmd))
AssertionError: False is not True : Process is launched successfully
Error output:
error: process exited with status -1 (Error 1)

Config=x86_64-/Users/buildslave/jenkins/workspace/lldb-cmake-matrix/clang_701_build/bin/clang-7
======================================================================
FAIL: test_step_all_threads_dsym (TestThreadStepOut.ThreadStepOutTestCase)
    Test thread step out on all threads via command interpreter.
----------------------------------------------------------------------
Traceback (most recent call last):
  File "/Users/buildslave/jenkins/workspace/lldb-cmake-matrix/llvm-project/lldb/packages/Python/lldbsuite/test/lldbtest.py", line 1748, in test_method
    return attrvalue(self)
  File "/Users/buildslave/jenkins/workspace/lldb-cmake-matrix/llvm-project/lldb/packages/Python/lldbsuite/test/decorators.py", line 111, in wrapper
    func(*args, **kwargs)
  File "/Users/buildslave/jenkins/workspace/lldb-cmake-matrix/llvm-project/lldb/packages/Python/lldbsuite/test/decorators.py", line 111, in wrapper
    func(*args, **kwargs)
  File "/Users/buildslave/jenkins/workspace/lldb-cmake-matrix/llvm-project/lldb/packages/Python/lldbsuite/test/decorators.py", line 111, in wrapper
    func(*args, **kwargs)
  File "/Users/buildslave/jenkins/workspace/lldb-cmake-matrix/llvm-project/lldb/packages/Python/lldbsuite/test/decorators.py", line 111, in wrapper
    func(*args, **kwargs)
  File "/Users/buildslave/jenkins/workspace/lldb-cmake-matrix/llvm-project/lldb/packages/Python/lldbsuite/test/decorators.py", line 111, in wrapper
    func(*args, **kwargs)
  File "/Users/buildslave/jenkins/workspace/lldb-cmake-matrix/llvm-project/lldb/packages/Python/lldbsuite/test/functionalities/thread/step_out/TestThreadStepOut.py", line 49, in test_step_all_threads
    self.step_out_test(self.step_out_all_threads_with_cmd)
  File "/Users/buildslave/jenkins/workspace/lldb-cmake-matrix/llvm-project/lldb/packages/Python/lldbsuite/test/functionalities/thread/step_out/TestThreadStepOut.py", line 148, in step_out_test
    self.runCmd("run", RUN_SUCCEEDED)
  File "/Users/buildslave/jenkins/workspace/lldb-cmake-matrix/llvm-project/lldb/packages/Python/lldbsuite/test/lldbtest.py", line 2068, in runCmd
    msg if (msg) else CMD_MSG(cmd))
AssertionError: False is not True : Process is launched successfully
Error output:
error: process exited with status -1 (Error 1)

Config=x86_64-/Users/buildslave/jenkins/workspace/lldb-cmake-matrix/clang_701_build/bin/clang-7
======================================================================
FAIL: test_step_all_threads_dwarf (TestThreadStepOut.ThreadStepOutTestCase)
    Test thread step out on all threads via command interpreter.
----------------------------------------------------------------------
Traceback (most recent call last):
  File "/Users/buildslave/jenkins/workspace/lldb-cmake-matrix/llvm-project/lldb/packages/Python/lldbsuite/test/lldbtest.py", line 1748, in test_method
    return attrvalue(self)
  File "/Users/buildslave/jenkins/workspace/lldb-cmake-matrix/llvm-project/lldb/packages/Python/lldbsuite/test/decorators.py", line 111, in wrapper
    func(*args, **kwargs)
  File "/Users/buildslave/jenkins/workspace/lldb-cmake-matrix/llvm-project/lldb/packages/Python/lldbsuite/test/decorators.py", line 111, in wrapper
    func(*args, **kwargs)
  File "/Users/buildslave/jenkins/workspace/lldb-cmake-matrix/llvm-project/lldb/packages/Python/lldbsuite/test/decorators.py", line 111, in wrapper
    func(*args, **kwargs)
  File "/Users/buildslave/jenkins/workspace/lldb-cmake-matrix/llvm-project/lldb/packages/Python/lldbsuite/test/decorators.py", line 111, in wrapper
    func(*args, **kwargs)
  File "/Users/buildslave/jenkins/workspace/lldb-cmake-matrix/llvm-project/lldb/packages/Python/lldbsuite/test/decorators.py", line 111, in wrapper
    func(*args, **kwargs)
  File "/Users/buildslave/jenkins/workspace/lldb-cmake-matrix/llvm-project/lldb/packages/Python/lldbsuite/test/functionalities/thread/step_out/TestThreadStepOut.py", line 49, in test_step_all_threads
    self.step_out_test(self.step_out_all_threads_with_cmd)
  File "/Users/buildslave/jenkins/workspace/lldb-cmake-matrix/llvm-project/lldb/packages/Python/lldbsuite/test/functionalities/thread/step_out/TestThreadStepOut.py", line 148, in step_out_test
    self.runCmd("run", RUN_SUCCEEDED)
  File "/Users/buildslave/jenkins/workspace/lldb-cmake-matrix/llvm-project/lldb/packages/Python/lldbsuite/test/lldbtest.py", line 2068, in runCmd
    msg if (msg) else CMD_MSG(cmd))
AssertionError: False is not True : Process is launched successfully
Error output:
error: process exited with status -1 (Error 1)

Config=x86_64-/Users/buildslave/jenkins/workspace/lldb-cmake-matrix/clang_701_build/bin/clang-7
======================================================================
FAIL: test_step_single_thread_dsym (TestThreadStepOut.ThreadStepOutTestCase)
    Test thread step out on one thread via command interpreter.
----------------------------------------------------------------------
Traceback (most recent call last):
  File "/Users/buildslave/jenkins/workspace/lldb-cmake-matrix/llvm-project/lldb/packages/Python/lldbsuite/test/lldbtest.py", line 1748, in test_method
    return attrvalue(self)
  File "/Users/buildslave/jenkins/workspace/lldb-cmake-matrix/llvm-project/lldb/packages/Python/lldbsuite/test/decorators.py", line 111, in wrapper
    func(*args, **kwargs)
  File "/Users/buildslave/jenkins/workspace/lldb-cmake-matrix/llvm-project/lldb/packages/Python/lldbsuite/test/decorators.py", line 111, in wrapper
    func(*args, **kwargs)
  File "/Users/buildslave/jenkins/workspace/lldb-cmake-matrix/llvm-project/lldb/packages/Python/lldbsuite/test/decorators.py", line 111, in wrapper
    func(*args, **kwargs)
  File "/Users/buildslave/jenkins/workspace/lldb-cmake-matrix/llvm-project/lldb/packages/Python/lldbsuite/test/decorators.py", line 111, in wrapper
    func(*args, **kwargs)
  File "/Users/buildslave/jenkins/workspace/lldb-cmake-matrix/llvm-project/lldb/packages/Python/lldbsuite/test/functionalities/thread/step_out/TestThreadStepOut.py", line 32, in test_step_single_thread
    self.step_out_test(self.step_out_single_thread_with_cmd)
  File "/Users/buildslave/jenkins/workspace/lldb-cmake-matrix/llvm-project/lldb/packages/Python/lldbsuite/test/functionalities/thread/step_out/TestThreadStepOut.py", line 148, in step_out_test
    self.runCmd("run", RUN_SUCCEEDED)
  File "/Users/buildslave/jenkins/workspace/lldb-cmake-matrix/llvm-project/lldb/packages/Python/lldbsuite/test/lldbtest.py", line 2068, in runCmd
    msg if (msg) else CMD_MSG(cmd))
AssertionError: False is not True : Process is launched successfully
Error output:
error: process exited with status -1 (Error 1)

Config=x86_64-/Users/buildslave/jenkins/workspace/lldb-cmake-matrix/clang_701_build/bin/clang-7
======================================================================
FAIL: test_step_single_thread_dwarf (TestThreadStepOut.ThreadStepOutTestCase)
    Test thread step out on one thread via command interpreter.
----------------------------------------------------------------------
Traceback (most recent call last):
  File "/Users/buildslave/jenkins/workspace/lldb-cmake-matrix/llvm-project/lldb/packages/Python/lldbsuite/test/lldbtest.py", line 1748, in test_method
    return attrvalue(self)
  File "/Users/buildslave/jenkins/workspace/lldb-cmake-matrix/llvm-project/lldb/packages/Python/lldbsuite/test/decorators.py", line 111, in wrapper
    func(*args, **kwargs)
  File "/Users/buildslave/jenkins/workspace/lldb-cmake-matrix/llvm-project/lldb/packages/Python/lldbsuite/test/decorators.py", line 111, in wrapper
    func(*args, **kwargs)
  File "/Users/buildslave/jenkins/workspace/lldb-cmake-matrix/llvm-project/lldb/packages/Python/lldbsuite/test/decorators.py", line 111, in wrapper
    func(*args, **kwargs)
  File "/Users/buildslave/jenkins/workspace/lldb-cmake-matrix/llvm-project/lldb/packages/Python/lldbsuite/test/decorators.py", line 111, in wrapper
    func(*args, **kwargs)
  File "/Users/buildslave/jenkins/workspace/lldb-cmake-matrix/llvm-project/lldb/packages/Python/lldbsuite/test/functionalities/thread/step_out/TestThreadStepOut.py", line 32, in test_step_single_thread
    self.step_out_test(self.step_out_single_thread_with_cmd)
  File "/Users/buildslave/jenkins/workspace/lldb-cmake-matrix/llvm-project/lldb/packages/Python/lldbsuite/test/functionalities/thread/step_out/TestThreadStepOut.py", line 148, in step_out_test
    self.runCmd("run", RUN_SUCCEEDED)
  File "/Users/buildslave/jenkins/workspace/lldb-cmake-matrix/llvm-project/lldb/packages/Python/lldbsuite/test/lldbtest.py", line 2068, in runCmd
    msg if (msg) else CMD_MSG(cmd))
AssertionError: False is not True : Process is launched successfully
Error output:
error: process exited with status -1 (Error 1)

Config=x86_64-/Users/buildslave/jenkins/workspace/lldb-cmake-matrix/clang_701_build/bin/clang-7
----------------------------------------------------------------------
Ran 12 tests in 17.803s

RESULT: FAILED (0 passes, 6 failures, 0 errors, 6 skipped, 0 expected failures, 0 unexpected successes)