Regression

Test Clang 7.0.1 / lldb-Suite.functionalities/thread/step_until.TestStepUntil.py (from lldb-Suite)

Failing for the past 1 build (Since Unstable#270 )
Took 5 sec.

Stacktrace

lldb version 10.0.99 (http://labmaster3.local/git/llvm-project.git revision 1a3dd638c4a9173e53628b497a1aadc31c32eb50)
  clang revision daa79c5338228a746a7eba0cf2f2f356e1d45a5b
  llvm revision daa79c5338228a746a7eba0cf2f2f356e1d45a5b
LLDB library dir: /Users/buildslave/jenkins/workspace/lldb-cmake-matrix/lldb-build/bin
LLDB import library dir: /Users/buildslave/jenkins/workspace/lldb-cmake-matrix/lldb-build/bin
libstdcxx tests will not be run because: Don't know how to build with libstdcxx on macosx
Skipping following debug info categories: ['dwo']

Session logs for test failures/errors/unexpected successes will go into directory '/Users/buildslave/jenkins/workspace/lldb-cmake-matrix/test/logs'
Command invoked: /Users/buildslave/jenkins/workspace/lldb-cmake-matrix/llvm-project/lldb/test/dotest.py --arch=x86_64 -s /Users/buildslave/jenkins/workspace/lldb-cmake-matrix/lldb-build/lldb-test-traces -S nm -u CXXFLAGS -u CFLAGS --executable /Users/buildslave/jenkins/workspace/lldb-cmake-matrix/lldb-build/./bin/lldb --dsymutil /Users/buildslave/jenkins/workspace/lldb-cmake-matrix/lldb-build/./bin/dsymutil --filecheck /Users/buildslave/jenkins/workspace/lldb-cmake-matrix/lldb-build/./bin/FileCheck -C /Users/buildslave/jenkins/workspace/lldb-cmake-matrix/clang_701_build/bin/clang --codesign-identity lldb_codesign --server /Users/buildslave/jenkins/workspace/lldb-cmake-matrix/lldb-build/./bin/debugserver --arch x86_64 --build-dir /Users/buildslave/jenkins/workspace/lldb-cmake-matrix/lldb-build/lldb-test-build.noindex -s=/Users/buildslave/jenkins/workspace/lldb-cmake-matrix/test/logs -t --env TERM=vt100 --skip-category gmodules --skip-category watchpoint --arch=x86_64 --env LLVM_LIBS_DIR=/Users/buildslave/jenkins/workspace/lldb-cmake-matrix/lldb-build/./lib --build-dir /Users/buildslave/jenkins/workspace/lldb-cmake-matrix/lldb-build/tools/lldb/lldb-test-build.noindex --module-cache-dir /Users/buildslave/jenkins/workspace/lldb-cmake-matrix/lldb-build/tools/lldb/lldb-test-build.noindex/module-cache-lldb /Users/buildslave/jenkins/workspace/lldb-cmake-matrix/llvm-project/lldb/packages/Python/lldbsuite/test/functionalities/thread/step_until -p TestStepUntil.py
Change dir to: /Users/buildslave/jenkins/workspace/lldb-cmake-matrix/llvm-project/lldb/packages/Python/lldbsuite/test/functionalities/thread/step_until
runCmd: settings set symbols.enable-external-lookup false
output: 

runCmd: settings set plugin.process.gdb-remote.packet-timeout 60
output: 

runCmd: settings set symbols.clang-modules-cache-path "/Users/buildslave/jenkins/workspace/lldb-cmake-matrix/lldb-build/tools/lldb/lldb-test-build.noindex/module-cache-lldb"
output: 

runCmd: settings set use-color false
output: 

FAIL: LLDB (/Users/buildslave/jenkins/workspace/lldb-cmake-matrix/clang_701_build/bin/clang-7-x86_64) :: test_hitting_one_dsym (TestStepUntil.StepUntilTestCase)
<bound method SBProcess.Kill of <lldb.SBProcess; proxy of <Swig Object of type 'lldb::SBProcess *' at 0x10cbacf30> >>: success

runCmd: settings set symbols.enable-external-lookup false
output: 

runCmd: settings set plugin.process.gdb-remote.packet-timeout 60
output: 

runCmd: settings set symbols.clang-modules-cache-path "/Users/buildslave/jenkins/workspace/lldb-cmake-matrix/lldb-build/tools/lldb/lldb-test-build.noindex/module-cache-lldb"
output: 

runCmd: settings set use-color false
output: 

FAIL: LLDB (/Users/buildslave/jenkins/workspace/lldb-cmake-matrix/clang_701_build/bin/clang-7-x86_64) :: test_hitting_one_dwarf (TestStepUntil.StepUntilTestCase)
<bound method SBProcess.Kill of <lldb.SBProcess; proxy of <Swig Object of type 'lldb::SBProcess *' at 0x10cbacf90> >>: success

UNSUPPORTED: LLDB (/Users/buildslave/jenkins/workspace/lldb-cmake-matrix/clang_701_build/bin/clang-7-x86_64) :: test_hitting_one_dwo (TestStepUntil.StepUntilTestCase) (test case does not fall in any category of interest for this run) 
UNSUPPORTED: LLDB (/Users/buildslave/jenkins/workspace/lldb-cmake-matrix/clang_701_build/bin/clang-7-x86_64) :: test_hitting_one_gmodules (TestStepUntil.StepUntilTestCase) (test case does not fall in any category of interest for this run) 
runCmd: settings set symbols.enable-external-lookup false
output: 

runCmd: settings set plugin.process.gdb-remote.packet-timeout 60
output: 

runCmd: settings set symbols.clang-modules-cache-path "/Users/buildslave/jenkins/workspace/lldb-cmake-matrix/lldb-build/tools/lldb/lldb-test-build.noindex/module-cache-lldb"
output: 

runCmd: settings set use-color false
output: 

FAIL: LLDB (/Users/buildslave/jenkins/workspace/lldb-cmake-matrix/clang_701_build/bin/clang-7-x86_64) :: test_missing_one_dsym (TestStepUntil.StepUntilTestCase)
runCmd: settings set symbols.enable-external-lookup false
output: 

runCmd: settings set plugin.process.gdb-remote.packet-timeout 60
output: 

runCmd: settings set symbols.clang-modules-cache-path "/Users/buildslave/jenkins/workspace/lldb-cmake-matrix/lldb-build/tools/lldb/lldb-test-build.noindex/module-cache-lldb"
output: 

runCmd: settings set use-color false
output: 

FAIL: LLDB (/Users/buildslave/jenkins/workspace/lldb-cmake-matrix/clang_701_build/bin/clang-7-x86_64) :: test_missing_one_dwarf (TestStepUntil.StepUntilTestCase)
<bound method SBProcess.Kill of <lldb.SBProcess; proxy of <Swig Object of type 'lldb::SBProcess *' at 0x10cbacdb0> >>: success

UNSUPPORTED: LLDB (/Users/buildslave/jenkins/workspace/lldb-cmake-matrix/clang_701_build/bin/clang-7-x86_64) :: test_missing_one_dwo (TestStepUntil.StepUntilTestCase) (test case does not fall in any category of interest for this run) 
UNSUPPORTED: LLDB (/Users/buildslave/jenkins/workspace/lldb-cmake-matrix/clang_701_build/bin/clang-7-x86_64) :: test_missing_one_gmodules (TestStepUntil.StepUntilTestCase) (test case does not fall in any category of interest for this run) 
runCmd: settings set symbols.enable-external-lookup false
output: 

runCmd: settings set plugin.process.gdb-remote.packet-timeout 60
output: 

runCmd: settings set symbols.clang-modules-cache-path "/Users/buildslave/jenkins/workspace/lldb-cmake-matrix/lldb-build/tools/lldb/lldb-test-build.noindex/module-cache-lldb"
output: 

runCmd: settings set use-color false
output: 

FAIL: LLDB (/Users/buildslave/jenkins/workspace/lldb-cmake-matrix/clang_701_build/bin/clang-7-x86_64) :: test_targetting_two_hitting_first_dsym (TestStepUntil.StepUntilTestCase)
<bound method SBProcess.Kill of <lldb.SBProcess; proxy of <Swig Object of type 'lldb::SBProcess *' at 0x10cbacf30> >>: success

runCmd: settings set symbols.enable-external-lookup false
output: 

runCmd: settings set plugin.process.gdb-remote.packet-timeout 60
output: 

runCmd: settings set symbols.clang-modules-cache-path "/Users/buildslave/jenkins/workspace/lldb-cmake-matrix/lldb-build/tools/lldb/lldb-test-build.noindex/module-cache-lldb"
output: 

runCmd: settings set use-color false
output: 

FAIL: LLDB (/Users/buildslave/jenkins/workspace/lldb-cmake-matrix/clang_701_build/bin/clang-7-x86_64) :: test_targetting_two_hitting_first_dwarf (TestStepUntil.StepUntilTestCase)
<bound method SBProcess.Kill of <lldb.SBProcess; proxy of <Swig Object of type 'lldb::SBProcess *' at 0x10cbacdb0> >>: success

UNSUPPORTED: LLDB (/Users/buildslave/jenkins/workspace/lldb-cmake-matrix/clang_701_build/bin/clang-7-x86_64) :: test_targetting_two_hitting_first_dwo (TestStepUntil.StepUntilTestCase) (test case does not fall in any category of interest for this run) 
UNSUPPORTED: LLDB (/Users/buildslave/jenkins/workspace/lldb-cmake-matrix/clang_701_build/bin/clang-7-x86_64) :: test_targetting_two_hitting_first_gmodules (TestStepUntil.StepUntilTestCase) (test case does not fall in any category of interest for this run) 
runCmd: settings set symbols.enable-external-lookup false
output: 

runCmd: settings set plugin.process.gdb-remote.packet-timeout 60
output: 

runCmd: settings set symbols.clang-modules-cache-path "/Users/buildslave/jenkins/workspace/lldb-cmake-matrix/lldb-build/tools/lldb/lldb-test-build.noindex/module-cache-lldb"
output: 

runCmd: settings set use-color false
output: 

FAIL: LLDB (/Users/buildslave/jenkins/workspace/lldb-cmake-matrix/clang_701_build/bin/clang-7-x86_64) :: test_targetting_two_hitting_second_dsym (TestStepUntil.StepUntilTestCase)
<bound method SBProcess.Kill of <lldb.SBProcess; proxy of <Swig Object of type 'lldb::SBProcess *' at 0x10cbacf30> >>: success

runCmd: settings set symbols.enable-external-lookup false
output: 

runCmd: settings set plugin.process.gdb-remote.packet-timeout 60
output: 

runCmd: settings set symbols.clang-modules-cache-path "/Users/buildslave/jenkins/workspace/lldb-cmake-matrix/lldb-build/tools/lldb/lldb-test-build.noindex/module-cache-lldb"
output: 

runCmd: settings set use-color false
output: 

FAIL: LLDB (/Users/buildslave/jenkins/workspace/lldb-cmake-matrix/clang_701_build/bin/clang-7-x86_64) :: test_targetting_two_hitting_second_dwarf (TestStepUntil.StepUntilTestCase)
UNSUPPORTED: LLDB (/Users/buildslave/jenkins/workspace/lldb-cmake-matrix/clang_701_build/bin/clang-7-x86_64) :: test_targetting_two_hitting_second_dwo (TestStepUntil.StepUntilTestCase) (test case does not fall in any category of interest for this run) 
UNSUPPORTED: LLDB (/Users/buildslave/jenkins/workspace/lldb-cmake-matrix/clang_701_build/bin/clang-7-x86_64) :: test_targetting_two_hitting_second_gmodules (TestStepUntil.StepUntilTestCase) (test case does not fall in any category of interest for this run) 
Restore dir to: /Users/buildslave/jenkins/workspace/lldb-cmake-matrix/lldb-build/tools/lldb/lit
======================================================================
ERROR: test_missing_one_dsym (TestStepUntil.StepUntilTestCase)
    Test thread step until - targeting one line and missing it.
----------------------------------------------------------------------
Error when building test subject.

Build Command:
make VPATH=/Users/buildslave/jenkins/workspace/lldb-cmake-matrix/llvm-project/lldb/packages/Python/lldbsuite/test/functionalities/thread/step_until -C /Users/buildslave/jenkins/workspace/lldb-cmake-matrix/lldb-build/tools/lldb/lldb-test-build.noindex/functionalities/thread/step_until/TestStepUntil.test_missing_one_dsym -I /Users/buildslave/jenkins/workspace/lldb-cmake-matrix/llvm-project/lldb/packages/Python/lldbsuite/test/functionalities/thread/step_until -I /Users/buildslave/jenkins/workspace/lldb-cmake-matrix/llvm-project/lldb/packages/Python/lldbsuite/test/make -f /Users/buildslave/jenkins/workspace/lldb-cmake-matrix/llvm-project/lldb/packages/Python/lldbsuite/test/functionalities/thread/step_until/Makefile MAKE_DSYM=YES ARCH=x86_64 CC="/Users/buildslave/jenkins/workspace/lldb-cmake-matrix/clang_701_build/bin/clang-7" all 

Build Command Output:
clang-7: error: unable to execute command: Killed: 9
clang-7: error: clang frontend command failed due to signal (use -v to see invocation)
clang version 7.0.1 
Target: x86_64-apple-darwin18.0.0
Thread model: posix
InstalledDir: /Users/buildslave/jenkins/workspace/lldb-cmake-matrix/clang_701_build/bin
clang-7: note: diagnostic msg: PLEASE submit a bug report to https://bugs.llvm.org/ and include the crash backtrace, preprocessed source, and associated run script.
clang-7: error: unable to execute command: Killed: 9
clang-7: note: diagnostic msg: Error generating preprocessed source(s).
make: *** [main.o] Killed: 9

Test Directory:
/Users/buildslave/jenkins/workspace/lldb-cmake-matrix/llvm-project/lldb/packages/Python/lldbsuite/test/functionalities/thread/step_until
======================================================================
ERROR: test_targetting_two_hitting_second_dwarf (TestStepUntil.StepUntilTestCase)
    Test thread step until - targeting two lines and hitting the other one.
----------------------------------------------------------------------
Error when building test subject.

Build Command:
make VPATH=/Users/buildslave/jenkins/workspace/lldb-cmake-matrix/llvm-project/lldb/packages/Python/lldbsuite/test/functionalities/thread/step_until -C /Users/buildslave/jenkins/workspace/lldb-cmake-matrix/lldb-build/tools/lldb/lldb-test-build.noindex/functionalities/thread/step_until/TestStepUntil.test_targetting_two_hitting_second_dwarf -I /Users/buildslave/jenkins/workspace/lldb-cmake-matrix/llvm-project/lldb/packages/Python/lldbsuite/test/functionalities/thread/step_until -I /Users/buildslave/jenkins/workspace/lldb-cmake-matrix/llvm-project/lldb/packages/Python/lldbsuite/test/make -f /Users/buildslave/jenkins/workspace/lldb-cmake-matrix/llvm-project/lldb/packages/Python/lldbsuite/test/functionalities/thread/step_until/Makefile MAKE_DSYM=NO ARCH=x86_64 CC="/Users/buildslave/jenkins/workspace/lldb-cmake-matrix/clang_701_build/bin/clang-7" 

Build Command Output:
clang-7: error: unable to execute command: Killed: 9
clang-7: error: clang frontend command failed due to signal (use -v to see invocation)
clang version 7.0.1 
Target: x86_64-apple-darwin18.0.0
Thread model: posix
InstalledDir: /Users/buildslave/jenkins/workspace/lldb-cmake-matrix/clang_701_build/bin
clang-7: note: diagnostic msg: PLEASE submit a bug report to https://bugs.llvm.org/ and include the crash backtrace, preprocessed source, and associated run script.
clang-7: note: diagnostic msg: 
********************

PLEASE ATTACH THE FOLLOWING FILES TO THE BUG REPORT:
Preprocessed source(s) and associated run script(s) are located at:
clang-7: note: diagnostic msg: /var/folders/09/r4vw4v8n5kb67jl66zvlbljw0000gn/T/lit_tmp_bT7Zaw/main-f171e1.c
clang-7: note: diagnostic msg: /var/folders/09/r4vw4v8n5kb67jl66zvlbljw0000gn/T/lit_tmp_bT7Zaw/main-f171e1.sh
clang-7: note: diagnostic msg: Crash backtrace is located in
clang-7: note: diagnostic msg: /Users/buildslave/Library/Logs/DiagnosticReports/clang-7_<YYYY-MM-DD-HHMMSS>_<hostname>.crash
clang-7: note: diagnostic msg: (choose the .crash file that corresponds to your crash)
clang-7: note: diagnostic msg: 

********************
make: *** [main.o] Error 254

Test Directory:
/Users/buildslave/jenkins/workspace/lldb-cmake-matrix/llvm-project/lldb/packages/Python/lldbsuite/test/functionalities/thread/step_until
======================================================================
FAIL: test_hitting_one_dsym (TestStepUntil.StepUntilTestCase)
    Test thread step until - targeting one line and hitting it.
----------------------------------------------------------------------
Traceback (most recent call last):
  File "/Users/buildslave/jenkins/workspace/lldb-cmake-matrix/llvm-project/lldb/packages/Python/lldbsuite/test/lldbtest.py", line 1748, in test_method
    return attrvalue(self)
  File "/Users/buildslave/jenkins/workspace/lldb-cmake-matrix/llvm-project/lldb/packages/Python/lldbsuite/test/functionalities/thread/step_until/TestStepUntil.py", line 72, in test_hitting_one
    self.do_until(None, [self.less_than_two], self.less_than_two)
  File "/Users/buildslave/jenkins/workspace/lldb-cmake-matrix/llvm-project/lldb/packages/Python/lldbsuite/test/functionalities/thread/step_until/TestStepUntil.py", line 49, in do_until
    self.fail("Failed to stop at first breakpoint in main.")
AssertionError: Failed to stop at first breakpoint in main.
Config=x86_64-/Users/buildslave/jenkins/workspace/lldb-cmake-matrix/clang_701_build/bin/clang-7
======================================================================
FAIL: test_hitting_one_dwarf (TestStepUntil.StepUntilTestCase)
    Test thread step until - targeting one line and hitting it.
----------------------------------------------------------------------
Traceback (most recent call last):
  File "/Users/buildslave/jenkins/workspace/lldb-cmake-matrix/llvm-project/lldb/packages/Python/lldbsuite/test/lldbtest.py", line 1748, in test_method
    return attrvalue(self)
  File "/Users/buildslave/jenkins/workspace/lldb-cmake-matrix/llvm-project/lldb/packages/Python/lldbsuite/test/functionalities/thread/step_until/TestStepUntil.py", line 72, in test_hitting_one
    self.do_until(None, [self.less_than_two], self.less_than_two)
  File "/Users/buildslave/jenkins/workspace/lldb-cmake-matrix/llvm-project/lldb/packages/Python/lldbsuite/test/functionalities/thread/step_until/TestStepUntil.py", line 49, in do_until
    self.fail("Failed to stop at first breakpoint in main.")
AssertionError: Failed to stop at first breakpoint in main.
Config=x86_64-/Users/buildslave/jenkins/workspace/lldb-cmake-matrix/clang_701_build/bin/clang-7
======================================================================
FAIL: test_missing_one_dwarf (TestStepUntil.StepUntilTestCase)
    Test thread step until - targeting one line and missing it.
----------------------------------------------------------------------
Traceback (most recent call last):
  File "/Users/buildslave/jenkins/workspace/lldb-cmake-matrix/llvm-project/lldb/packages/Python/lldbsuite/test/lldbtest.py", line 1748, in test_method
    return attrvalue(self)
  File "/Users/buildslave/jenkins/workspace/lldb-cmake-matrix/llvm-project/lldb/packages/Python/lldbsuite/test/functionalities/thread/step_until/TestStepUntil.py", line 84, in test_missing_one
    self.do_until(["foo", "bar", "baz"], [self.less_than_two], self.back_out_in_main)
  File "/Users/buildslave/jenkins/workspace/lldb-cmake-matrix/llvm-project/lldb/packages/Python/lldbsuite/test/functionalities/thread/step_until/TestStepUntil.py", line 49, in do_until
    self.fail("Failed to stop at first breakpoint in main.")
AssertionError: Failed to stop at first breakpoint in main.
Config=x86_64-/Users/buildslave/jenkins/workspace/lldb-cmake-matrix/clang_701_build/bin/clang-7
======================================================================
FAIL: test_targetting_two_hitting_first_dsym (TestStepUntil.StepUntilTestCase)
    Test thread step until - targeting two lines and hitting one.
----------------------------------------------------------------------
Traceback (most recent call last):
  File "/Users/buildslave/jenkins/workspace/lldb-cmake-matrix/llvm-project/lldb/packages/Python/lldbsuite/test/lldbtest.py", line 1748, in test_method
    return attrvalue(self)
  File "/Users/buildslave/jenkins/workspace/lldb-cmake-matrix/llvm-project/lldb/packages/Python/lldbsuite/test/functionalities/thread/step_until/TestStepUntil.py", line 76, in test_targetting_two_hitting_first
    self.do_until(["foo", "bar", "baz"], [self.less_than_two, self.greater_than_two], self.greater_than_two)
  File "/Users/buildslave/jenkins/workspace/lldb-cmake-matrix/llvm-project/lldb/packages/Python/lldbsuite/test/functionalities/thread/step_until/TestStepUntil.py", line 49, in do_until
    self.fail("Failed to stop at first breakpoint in main.")
AssertionError: Failed to stop at first breakpoint in main.
Config=x86_64-/Users/buildslave/jenkins/workspace/lldb-cmake-matrix/clang_701_build/bin/clang-7
======================================================================
FAIL: test_targetting_two_hitting_first_dwarf (TestStepUntil.StepUntilTestCase)
    Test thread step until - targeting two lines and hitting one.
----------------------------------------------------------------------
Traceback (most recent call last):
  File "/Users/buildslave/jenkins/workspace/lldb-cmake-matrix/llvm-project/lldb/packages/Python/lldbsuite/test/lldbtest.py", line 1748, in test_method
    return attrvalue(self)
  File "/Users/buildslave/jenkins/workspace/lldb-cmake-matrix/llvm-project/lldb/packages/Python/lldbsuite/test/functionalities/thread/step_until/TestStepUntil.py", line 76, in test_targetting_two_hitting_first
    self.do_until(["foo", "bar", "baz"], [self.less_than_two, self.greater_than_two], self.greater_than_two)
  File "/Users/buildslave/jenkins/workspace/lldb-cmake-matrix/llvm-project/lldb/packages/Python/lldbsuite/test/functionalities/thread/step_until/TestStepUntil.py", line 49, in do_until
    self.fail("Failed to stop at first breakpoint in main.")
AssertionError: Failed to stop at first breakpoint in main.
Config=x86_64-/Users/buildslave/jenkins/workspace/lldb-cmake-matrix/clang_701_build/bin/clang-7
======================================================================
FAIL: test_targetting_two_hitting_second_dsym (TestStepUntil.StepUntilTestCase)
    Test thread step until - targeting two lines and hitting the other one.
----------------------------------------------------------------------
Traceback (most recent call last):
  File "/Users/buildslave/jenkins/workspace/lldb-cmake-matrix/llvm-project/lldb/packages/Python/lldbsuite/test/lldbtest.py", line 1748, in test_method
    return attrvalue(self)
  File "/Users/buildslave/jenkins/workspace/lldb-cmake-matrix/llvm-project/lldb/packages/Python/lldbsuite/test/functionalities/thread/step_until/TestStepUntil.py", line 80, in test_targetting_two_hitting_second
    self.do_until(None, [self.less_than_two, self.greater_than_two], self.less_than_two)
  File "/Users/buildslave/jenkins/workspace/lldb-cmake-matrix/llvm-project/lldb/packages/Python/lldbsuite/test/functionalities/thread/step_until/TestStepUntil.py", line 49, in do_until
    self.fail("Failed to stop at first breakpoint in main.")
AssertionError: Failed to stop at first breakpoint in main.
Config=x86_64-/Users/buildslave/jenkins/workspace/lldb-cmake-matrix/clang_701_build/bin/clang-7
----------------------------------------------------------------------
Ran 16 tests in 4.474s

RESULT: FAILED (0 passes, 6 failures, 2 errors, 8 skipped, 0 expected failures, 0 unexpected successes)