Regression

Test Clang 7.0.1 / lldb-Suite.lang/cpp/enum_types.TestCPP11EnumTypes.py (from lldb-Suite)

Failing for the past 1 build (Since Unstable#270 )
Took 15 sec.

Stacktrace

lldb version 10.0.99 (http://labmaster3.local/git/llvm-project.git revision 1a3dd638c4a9173e53628b497a1aadc31c32eb50)
  clang revision daa79c5338228a746a7eba0cf2f2f356e1d45a5b
  llvm revision daa79c5338228a746a7eba0cf2f2f356e1d45a5b
LLDB library dir: /Users/buildslave/jenkins/workspace/lldb-cmake-matrix/lldb-build/bin
LLDB import library dir: /Users/buildslave/jenkins/workspace/lldb-cmake-matrix/lldb-build/bin
libstdcxx tests will not be run because: Don't know how to build with libstdcxx on macosx
Skipping following debug info categories: ['dwo']

Session logs for test failures/errors/unexpected successes will go into directory '/Users/buildslave/jenkins/workspace/lldb-cmake-matrix/test/logs'
Command invoked: /Users/buildslave/jenkins/workspace/lldb-cmake-matrix/llvm-project/lldb/test/dotest.py --arch=x86_64 -s /Users/buildslave/jenkins/workspace/lldb-cmake-matrix/lldb-build/lldb-test-traces -S nm -u CXXFLAGS -u CFLAGS --executable /Users/buildslave/jenkins/workspace/lldb-cmake-matrix/lldb-build/./bin/lldb --dsymutil /Users/buildslave/jenkins/workspace/lldb-cmake-matrix/lldb-build/./bin/dsymutil --filecheck /Users/buildslave/jenkins/workspace/lldb-cmake-matrix/lldb-build/./bin/FileCheck -C /Users/buildslave/jenkins/workspace/lldb-cmake-matrix/clang_701_build/bin/clang --codesign-identity lldb_codesign --server /Users/buildslave/jenkins/workspace/lldb-cmake-matrix/lldb-build/./bin/debugserver --arch x86_64 --build-dir /Users/buildslave/jenkins/workspace/lldb-cmake-matrix/lldb-build/lldb-test-build.noindex -s=/Users/buildslave/jenkins/workspace/lldb-cmake-matrix/test/logs -t --env TERM=vt100 --skip-category gmodules --skip-category watchpoint --arch=x86_64 --env LLVM_LIBS_DIR=/Users/buildslave/jenkins/workspace/lldb-cmake-matrix/lldb-build/./lib --build-dir /Users/buildslave/jenkins/workspace/lldb-cmake-matrix/lldb-build/tools/lldb/lldb-test-build.noindex --module-cache-dir /Users/buildslave/jenkins/workspace/lldb-cmake-matrix/lldb-build/tools/lldb/lldb-test-build.noindex/module-cache-lldb /Users/buildslave/jenkins/workspace/lldb-cmake-matrix/llvm-project/lldb/packages/Python/lldbsuite/test/lang/cpp/enum_types -p TestCPP11EnumTypes.py
Change dir to: /Users/buildslave/jenkins/workspace/lldb-cmake-matrix/llvm-project/lldb/packages/Python/lldbsuite/test/lang/cpp/enum_types
runCmd: settings set symbols.enable-external-lookup false
output: 

runCmd: settings set plugin.process.gdb-remote.packet-timeout 60
output: 

runCmd: settings set symbols.clang-modules-cache-path "/Users/buildslave/jenkins/workspace/lldb-cmake-matrix/lldb-build/tools/lldb/lldb-test-build.noindex/module-cache-lldb"
output: 

runCmd: settings set use-color false
output: 

runCmd: file /Users/buildslave/jenkins/workspace/lldb-cmake-matrix/lldb-build/tools/lldb/lldb-test-build.noindex/lang/cpp/enum_types/TestCPP11EnumTypes.test_int16_t_dsym/a.out
output: Current executable set to '/Users/buildslave/jenkins/workspace/lldb-cmake-matrix/lldb-build/tools/lldb/lldb-test-build.noindex/lang/cpp/enum_types/TestCPP11EnumTypes.test_int16_t_dsym/a.out' (x86_64).


runCmd: breakpoint set -f "main.cpp" -l 29
output: Breakpoint 1: where = a.out`main + 49 at main.cpp:29:38, address = 0x0000000100000f51


Expecting pattern: ^Breakpoint (?P<bpno>[0-9]+): (?P<num_locations>[0-9]+) locations\.$
Not matched

Expecting pattern: ^Breakpoint (?P<bpno>[0-9]+): (?P<num_locations>no) locations \(pending\)\.
Not matched

Expecting pattern: ^Breakpoint (?P<bpno>[0-9]+): where = (?P<module>.*)`(?P<symbol>[+\-]{0,1}[^+]+)( \+ (?P<offset>[0-9]+)){0,1}( \[inlined\] (?P<inline_symbol>.*)){0,1} at (?P<file>[^:]+):(?P<line_no>[0-9]+)(?P<column>(:[0-9]+)?), address = (?P<address>0x[0-9a-fA-F]+)$
Matched

runCmd: run
output: Process 87100 stopped
* thread #1, queue = 'com.apple.main-thread', stop reason = breakpoint 1.1
    frame #0: 0x0000000100000f51 a.out`main(argc=1, argv=0x00007ffeefbff568) at main.cpp:29:38
   26  	    for (day_value = (enum_integer_t)DayType::Monday - 1; day_value <= (enum_integer_t)DayType::kNumDays + 1; ++day_value)
   27  	    {
   28  	        DayType day = (DayType)day_value;
-> 29  	        printf("day as int is %i\n", (int)day); // Set break point at this line.
    	                                     ^
   30  	    }
   31  	    return 0;
   32  	}

Process 87100 launched: '/Users/buildslave/jenkins/workspace/lldb-cmake-matrix/lldb-build/tools/lldb/lldb-test-build.noindex/lang/cpp/enum_types/TestCPP11EnumTypes.test_int16_t_dsym/a.out' (x86_64)


runCmd: thread list
output: Process 87100 stopped
* thread #1: tid = 0x27730a6, 0x0000000100000f51 a.out`main(argc=1, argv=0x00007ffeefbff568) at main.cpp:29:38, queue = 'com.apple.main-thread', stop reason = breakpoint 1.1


Expecting sub string: stopped
Matched

Expecting sub string: stop reason = breakpoint
Matched

runCmd: breakpoint list -f
output: Current breakpoints:
1: file = 'main.cpp', line = 29, exact_match = 0, locations = 1, resolved = 1, hit count = 1
  1.1: where = a.out`main + 49 at main.cpp:29:38, address = 0x0000000100000f51, resolved, hit count = 1 



Expecting sub string:  resolved, hit count = 1
Matched

runCmd: image lookup -t DayType
output: Best match found in /Users/buildslave/jenkins/workspace/lldb-cmake-matrix/lldb-build/tools/lldb/lldb-test-build.noindex/lang/cpp/enum_types/TestCPP11EnumTypes.test_int16_t_dsym/a.out:
id = {0x7fffffff00000043}, name = "DayType", byte-size = 2, decl = main.cpp:15, compiler_type = "enum class DayType {
    Monday,
    Tuesday,
    Wednesday,
    Thursday,
    Friday,
    Saturday,
    Sunday,
    kNumDays
}"



Expecting sub string: Monday
Matched

Expecting sub string: Tuesday
Matched

Expecting sub string: Wednesday
Matched

Expecting sub string: Thursday
Matched

Expecting sub string: Friday
Matched

Expecting sub string: Saturday
Matched

Expecting sub string: Sunday
Matched

Expecting sub string: kNumDays
Matched

Expecting sub string: }
Matched

Expecting pattern: enum( struct| class) DayType {
Matched

runCmd: frame variable day
output: (DayType) day = -4


Expecting sub string: -4
Matched

runCmd: frame variable day
output: (DayType) day = Monday


Expecting sub string: Monday
Matched

runCmd: frame variable day
output: (DayType) day = Tuesday


Expecting sub string: Tuesday
Matched

runCmd: frame variable day
output: (DayType) day = Wednesday


Expecting sub string: Wednesday
Matched

runCmd: frame variable day
output: (DayType) day = Thursday


Expecting sub string: Thursday
Matched

runCmd: frame variable day
output: (DayType) day = Friday


Expecting sub string: Friday
Matched

runCmd: frame variable day
output: (DayType) day = Saturday


Expecting sub string: Saturday
Matched

runCmd: frame variable day
output: (DayType) day = Sunday


Expecting sub string: Sunday
Matched

runCmd: frame variable day
output: (DayType) day = kNumDays


Expecting sub string: kNumDays
Matched

runCmd: frame variable day
output: (DayType) day = 5


Expecting sub string: 5
Matched

<bound method SBProcess.Kill of <lldb.SBProcess; proxy of <Swig Object of type 'lldb::SBProcess *' at 0x104515240> >>: success

PASS: LLDB (/Users/buildslave/jenkins/workspace/lldb-cmake-matrix/clang_701_build/bin/clang-7-x86_64) :: test_int16_t_dsym (TestCPP11EnumTypes.CPP11EnumTypesTestCase)
runCmd: settings set symbols.enable-external-lookup false
output: 

runCmd: settings set plugin.process.gdb-remote.packet-timeout 60
output: 

runCmd: settings set symbols.clang-modules-cache-path "/Users/buildslave/jenkins/workspace/lldb-cmake-matrix/lldb-build/tools/lldb/lldb-test-build.noindex/module-cache-lldb"
output: 

runCmd: settings set use-color false
output: 

runCmd: file /Users/buildslave/jenkins/workspace/lldb-cmake-matrix/lldb-build/tools/lldb/lldb-test-build.noindex/lang/cpp/enum_types/TestCPP11EnumTypes.test_int16_t_dwarf/a.out
output: Current executable set to '/Users/buildslave/jenkins/workspace/lldb-cmake-matrix/lldb-build/tools/lldb/lldb-test-build.noindex/lang/cpp/enum_types/TestCPP11EnumTypes.test_int16_t_dwarf/a.out' (x86_64).


runCmd: breakpoint set -f "main.cpp" -l 29
output: Breakpoint 1: where = a.out`main + 49 at main.cpp:29:38, address = 0x0000000100000f51


Expecting pattern: ^Breakpoint (?P<bpno>[0-9]+): (?P<num_locations>[0-9]+) locations\.$
Not matched

Expecting pattern: ^Breakpoint (?P<bpno>[0-9]+): (?P<num_locations>no) locations \(pending\)\.
Not matched

Expecting pattern: ^Breakpoint (?P<bpno>[0-9]+): where = (?P<module>.*)`(?P<symbol>[+\-]{0,1}[^+]+)( \+ (?P<offset>[0-9]+)){0,1}( \[inlined\] (?P<inline_symbol>.*)){0,1} at (?P<file>[^:]+):(?P<line_no>[0-9]+)(?P<column>(:[0-9]+)?), address = (?P<address>0x[0-9a-fA-F]+)$
Matched

runCmd: run
output: Process 87445 stopped
* thread #1, queue = 'com.apple.main-thread', stop reason = breakpoint 1.1
    frame #0: 0x0000000100000f51 a.out`main(argc=1, argv=0x00007ffeefbff568) at main.cpp:29:38
   26  	    for (day_value = (enum_integer_t)DayType::Monday - 1; day_value <= (enum_integer_t)DayType::kNumDays + 1; ++day_value)
   27  	    {
   28  	        DayType day = (DayType)day_value;
-> 29  	        printf("day as int is %i\n", (int)day); // Set break point at this line.
    	                                     ^
   30  	    }
   31  	    return 0;
   32  	}

Process 87445 launched: '/Users/buildslave/jenkins/workspace/lldb-cmake-matrix/lldb-build/tools/lldb/lldb-test-build.noindex/lang/cpp/enum_types/TestCPP11EnumTypes.test_int16_t_dwarf/a.out' (x86_64)


runCmd: thread list
output: Process 87445 stopped
* thread #1: tid = 0x277330f, 0x0000000100000f51 a.out`main(argc=1, argv=0x00007ffeefbff568) at main.cpp:29:38, queue = 'com.apple.main-thread', stop reason = breakpoint 1.1


Expecting sub string: stopped
Matched

Expecting sub string: stop reason = breakpoint
Matched

runCmd: breakpoint list -f
output: Current breakpoints:
1: file = 'main.cpp', line = 29, exact_match = 0, locations = 1, resolved = 1, hit count = 1
  1.1: where = a.out`main + 49 at main.cpp:29:38, address = 0x0000000100000f51, resolved, hit count = 1 



Expecting sub string:  resolved, hit count = 1
Matched

runCmd: image lookup -t DayType
output: Best match found in /Users/buildslave/jenkins/workspace/lldb-cmake-matrix/lldb-build/tools/lldb/lldb-test-build.noindex/lang/cpp/enum_types/TestCPP11EnumTypes.test_int16_t_dwarf/a.out:
id = {0x100000043}, name = "DayType", byte-size = 2, decl = main.cpp:15, compiler_type = "enum class DayType {
    Monday,
    Tuesday,
    Wednesday,
    Thursday,
    Friday,
    Saturday,
    Sunday,
    kNumDays
}"



Expecting sub string: Monday
Matched

Expecting sub string: Tuesday
Matched

Expecting sub string: Wednesday
Matched

Expecting sub string: Thursday
Matched

Expecting sub string: Friday
Matched

Expecting sub string: Saturday
Matched

Expecting sub string: Sunday
Matched

Expecting sub string: kNumDays
Matched

Expecting sub string: }
Matched

Expecting pattern: enum( struct| class) DayType {
Matched

runCmd: frame variable day
output: (DayType) day = -4


Expecting sub string: -4
Matched

runCmd: frame variable day
output: (DayType) day = Monday


Expecting sub string: Monday
Matched

runCmd: frame variable day
output: (DayType) day = Tuesday


Expecting sub string: Tuesday
Matched

runCmd: frame variable day
output: (DayType) day = Wednesday


Expecting sub string: Wednesday
Matched

runCmd: frame variable day
output: (DayType) day = Thursday


Expecting sub string: Thursday
Matched

runCmd: frame variable day
output: (DayType) day = Friday


Expecting sub string: Friday
Matched

runCmd: frame variable day
output: (DayType) day = Saturday


Expecting sub string: Saturday
Matched

runCmd: frame variable day
output: (DayType) day = Sunday


Expecting sub string: Sunday
Matched

runCmd: frame variable day
output: (DayType) day = kNumDays


Expecting sub string: kNumDays
Matched

runCmd: frame variable day
output: (DayType) day = 5


Expecting sub string: 5
Matched

<bound method SBProcess.Kill of <lldb.SBProcess; proxy of <Swig Object of type 'lldb::SBProcess *' at 0x104680390> >>: success

PASS: LLDB (/Users/buildslave/jenkins/workspace/lldb-cmake-matrix/clang_701_build/bin/clang-7-x86_64) :: test_int16_t_dwarf (TestCPP11EnumTypes.CPP11EnumTypesTestCase)
UNSUPPORTED: LLDB (/Users/buildslave/jenkins/workspace/lldb-cmake-matrix/clang_701_build/bin/clang-7-x86_64) :: test_int16_t_dwo (TestCPP11EnumTypes.CPP11EnumTypesTestCase) (test case does not fall in any category of interest for this run) 
UNSUPPORTED: LLDB (/Users/buildslave/jenkins/workspace/lldb-cmake-matrix/clang_701_build/bin/clang-7-x86_64) :: test_int16_t_gmodules (TestCPP11EnumTypes.CPP11EnumTypesTestCase) (test case does not fall in any category of interest for this run) 
runCmd: settings set symbols.enable-external-lookup false
output: 

runCmd: settings set plugin.process.gdb-remote.packet-timeout 60
output: 

runCmd: settings set symbols.clang-modules-cache-path "/Users/buildslave/jenkins/workspace/lldb-cmake-matrix/lldb-build/tools/lldb/lldb-test-build.noindex/module-cache-lldb"
output: 

runCmd: settings set use-color false
output: 

runCmd: file /Users/buildslave/jenkins/workspace/lldb-cmake-matrix/lldb-build/tools/lldb/lldb-test-build.noindex/lang/cpp/enum_types/TestCPP11EnumTypes.test_int32_t_dsym/a.out
output: Current executable set to '/Users/buildslave/jenkins/workspace/lldb-cmake-matrix/lldb-build/tools/lldb/lldb-test-build.noindex/lang/cpp/enum_types/TestCPP11EnumTypes.test_int32_t_dsym/a.out' (x86_64).


runCmd: breakpoint set -f "main.cpp" -l 29
output: Breakpoint 1: where = a.out`main + 49 at main.cpp:29:38, address = 0x0000000100000f51


Expecting pattern: ^Breakpoint (?P<bpno>[0-9]+): (?P<num_locations>[0-9]+) locations\.$
Not matched

Expecting pattern: ^Breakpoint (?P<bpno>[0-9]+): (?P<num_locations>no) locations \(pending\)\.
Not matched

Expecting pattern: ^Breakpoint (?P<bpno>[0-9]+): where = (?P<module>.*)`(?P<symbol>[+\-]{0,1}[^+]+)( \+ (?P<offset>[0-9]+)){0,1}( \[inlined\] (?P<inline_symbol>.*)){0,1} at (?P<file>[^:]+):(?P<line_no>[0-9]+)(?P<column>(:[0-9]+)?), address = (?P<address>0x[0-9a-fA-F]+)$
Matched

runCmd: run
output: Process 87890 stopped
* thread #1, queue = 'com.apple.main-thread', stop reason = breakpoint 1.1
    frame #0: 0x0000000100000f51 a.out`main(argc=1, argv=0x00007ffeefbff568) at main.cpp:29:38
   26  	    for (day_value = (enum_integer_t)DayType::Monday - 1; day_value <= (enum_integer_t)DayType::kNumDays + 1; ++day_value)
   27  	    {
   28  	        DayType day = (DayType)day_value;
-> 29  	        printf("day as int is %i\n", (int)day); // Set break point at this line.
    	                                     ^
   30  	    }
   31  	    return 0;
   32  	}

Process 87890 launched: '/Users/buildslave/jenkins/workspace/lldb-cmake-matrix/lldb-build/tools/lldb/lldb-test-build.noindex/lang/cpp/enum_types/TestCPP11EnumTypes.test_int32_t_dsym/a.out' (x86_64)


runCmd: thread list
output: Process 87890 stopped
* thread #1: tid = 0x2773642, 0x0000000100000f51 a.out`main(argc=1, argv=0x00007ffeefbff568) at main.cpp:29:38, queue = 'com.apple.main-thread', stop reason = breakpoint 1.1


Expecting sub string: stopped
Matched

Expecting sub string: stop reason = breakpoint
Matched

runCmd: breakpoint list -f
output: Current breakpoints:
1: file = 'main.cpp', line = 29, exact_match = 0, locations = 1, resolved = 1, hit count = 1
  1.1: where = a.out`main + 49 at main.cpp:29:38, address = 0x0000000100000f51, resolved, hit count = 1 



Expecting sub string:  resolved, hit count = 1
Matched

runCmd: image lookup -t DayType
output: Best match found in /Users/buildslave/jenkins/workspace/lldb-cmake-matrix/lldb-build/tools/lldb/lldb-test-build.noindex/lang/cpp/enum_types/TestCPP11EnumTypes.test_int32_t_dsym/a.out:
id = {0x7fffffff00000043}, name = "DayType", byte-size = 2, decl = main.cpp:15, compiler_type = "enum class DayType {
    Monday,
    Tuesday,
    Wednesday,
    Thursday,
    Friday,
    Saturday,
    Sunday,
    kNumDays
}"



Expecting sub string: Monday
Matched

Expecting sub string: Tuesday
Matched

Expecting sub string: Wednesday
Matched

Expecting sub string: Thursday
Matched

Expecting sub string: Friday
Matched

Expecting sub string: Saturday
Matched

Expecting sub string: Sunday
Matched

Expecting sub string: kNumDays
Matched

Expecting sub string: }
Matched

Expecting pattern: enum( struct| class) DayType {
Matched

runCmd: frame variable day
output: (DayType) day = -4


Expecting sub string: -4
Matched

runCmd: frame variable day
output: (DayType) day = Monday


Expecting sub string: Monday
Matched

runCmd: frame variable day
output: (DayType) day = Tuesday


Expecting sub string: Tuesday
Matched

runCmd: frame variable day
output: (DayType) day = Wednesday


Expecting sub string: Wednesday
Matched

runCmd: frame variable day
output: (DayType) day = Thursday


Expecting sub string: Thursday
Matched

runCmd: frame variable day
output: (DayType) day = Friday


Expecting sub string: Friday
Matched

runCmd: frame variable day
output: (DayType) day = Saturday


Expecting sub string: Saturday
Matched

runCmd: frame variable day
output: (DayType) day = Sunday


Expecting sub string: Sunday
Matched

runCmd: frame variable day
output: (DayType) day = kNumDays


Expecting sub string: kNumDays
Matched

runCmd: frame variable day
output: (DayType) day = 5


Expecting sub string: 5
Matched

<bound method SBProcess.Kill of <lldb.SBProcess; proxy of <Swig Object of type 'lldb::SBProcess *' at 0x104515270> >>: success

PASS: LLDB (/Users/buildslave/jenkins/workspace/lldb-cmake-matrix/clang_701_build/bin/clang-7-x86_64) :: test_int32_t_dsym (TestCPP11EnumTypes.CPP11EnumTypesTestCase)
runCmd: settings set symbols.enable-external-lookup false
output: 

runCmd: settings set plugin.process.gdb-remote.packet-timeout 60
output: 

runCmd: settings set symbols.clang-modules-cache-path "/Users/buildslave/jenkins/workspace/lldb-cmake-matrix/lldb-build/tools/lldb/lldb-test-build.noindex/module-cache-lldb"
output: 

runCmd: settings set use-color false
output: 

runCmd: file /Users/buildslave/jenkins/workspace/lldb-cmake-matrix/lldb-build/tools/lldb/lldb-test-build.noindex/lang/cpp/enum_types/TestCPP11EnumTypes.test_int32_t_dwarf/a.out
output: Current executable set to '/Users/buildslave/jenkins/workspace/lldb-cmake-matrix/lldb-build/tools/lldb/lldb-test-build.noindex/lang/cpp/enum_types/TestCPP11EnumTypes.test_int32_t_dwarf/a.out' (x86_64).


runCmd: breakpoint set -f "main.cpp" -l 29
output: Breakpoint 1: where = a.out`main + 49 at main.cpp:29:38, address = 0x0000000100000f51


Expecting pattern: ^Breakpoint (?P<bpno>[0-9]+): (?P<num_locations>[0-9]+) locations\.$
Not matched

Expecting pattern: ^Breakpoint (?P<bpno>[0-9]+): (?P<num_locations>no) locations \(pending\)\.
Not matched

Expecting pattern: ^Breakpoint (?P<bpno>[0-9]+): where = (?P<module>.*)`(?P<symbol>[+\-]{0,1}[^+]+)( \+ (?P<offset>[0-9]+)){0,1}( \[inlined\] (?P<inline_symbol>.*)){0,1} at (?P<file>[^:]+):(?P<line_no>[0-9]+)(?P<column>(:[0-9]+)?), address = (?P<address>0x[0-9a-fA-F]+)$
Matched

runCmd: run
output: Process 88524 stopped
* thread #1, queue = 'com.apple.main-thread', stop reason = breakpoint 1.1
    frame #0: 0x0000000100000f51 a.out`main(argc=1, argv=0x00007ffeefbff568) at main.cpp:29:38
   26  	    for (day_value = (enum_integer_t)DayType::Monday - 1; day_value <= (enum_integer_t)DayType::kNumDays + 1; ++day_value)
   27  	    {
   28  	        DayType day = (DayType)day_value;
-> 29  	        printf("day as int is %i\n", (int)day); // Set break point at this line.
    	                                     ^
   30  	    }
   31  	    return 0;
   32  	}

Process 88524 launched: '/Users/buildslave/jenkins/workspace/lldb-cmake-matrix/lldb-build/tools/lldb/lldb-test-build.noindex/lang/cpp/enum_types/TestCPP11EnumTypes.test_int32_t_dwarf/a.out' (x86_64)


runCmd: thread list
output: Process 88524 stopped
* thread #1: tid = 0x27739c0, 0x0000000100000f51 a.out`main(argc=1, argv=0x00007ffeefbff568) at main.cpp:29:38, queue = 'com.apple.main-thread', stop reason = breakpoint 1.1


Expecting sub string: stopped
Matched

Expecting sub string: stop reason = breakpoint
Matched

runCmd: breakpoint list -f
output: Current breakpoints:
1: file = 'main.cpp', line = 29, exact_match = 0, locations = 1, resolved = 1, hit count = 1
  1.1: where = a.out`main + 49 at main.cpp:29:38, address = 0x0000000100000f51, resolved, hit count = 1 



Expecting sub string:  resolved, hit count = 1
Matched

runCmd: image lookup -t DayType
output: Best match found in /Users/buildslave/jenkins/workspace/lldb-cmake-matrix/lldb-build/tools/lldb/lldb-test-build.noindex/lang/cpp/enum_types/TestCPP11EnumTypes.test_int32_t_dwarf/a.out:
id = {0x100000043}, name = "DayType", byte-size = 2, decl = main.cpp:15, compiler_type = "enum class DayType {
    Monday,
    Tuesday,
    Wednesday,
    Thursday,
    Friday,
    Saturday,
    Sunday,
    kNumDays
}"



Expecting sub string: Monday
Matched

Expecting sub string: Tuesday
Matched

Expecting sub string: Wednesday
Matched

Expecting sub string: Thursday
Matched

Expecting sub string: Friday
Matched

Expecting sub string: Saturday
Matched

Expecting sub string: Sunday
Matched

Expecting sub string: kNumDays
Matched

Expecting sub string: }
Matched

Expecting pattern: enum( struct| class) DayType {
Matched

runCmd: frame variable day
output: (DayType) day = -4


Expecting sub string: -4
Matched

runCmd: frame variable day
output: (DayType) day = Monday


Expecting sub string: Monday
Matched

runCmd: frame variable day
output: (DayType) day = Tuesday


Expecting sub string: Tuesday
Matched

runCmd: frame variable day
output: (DayType) day = Wednesday


Expecting sub string: Wednesday
Matched

runCmd: frame variable day
output: (DayType) day = Thursday


Expecting sub string: Thursday
Matched

runCmd: frame variable day
output: (DayType) day = Friday


Expecting sub string: Friday
Matched

runCmd: frame variable day
output: (DayType) day = Saturday


Expecting sub string: Saturday
Matched

runCmd: frame variable day
output: (DayType) day = Sunday


Expecting sub string: Sunday
Matched

runCmd: frame variable day
output: (DayType) day = kNumDays


Expecting sub string: kNumDays
Matched

runCmd: frame variable day
output: (DayType) day = 5


Expecting sub string: 5
Matched

<bound method SBProcess.Kill of <lldb.SBProcess; proxy of <Swig Object of type 'lldb::SBProcess *' at 0x104515240> >>: success

PASS: LLDB (/Users/buildslave/jenkins/workspace/lldb-cmake-matrix/clang_701_build/bin/clang-7-x86_64) :: test_int32_t_dwarf (TestCPP11EnumTypes.CPP11EnumTypesTestCase)
UNSUPPORTED: LLDB (/Users/buildslave/jenkins/workspace/lldb-cmake-matrix/clang_701_build/bin/clang-7-x86_64) :: test_int32_t_dwo (TestCPP11EnumTypes.CPP11EnumTypesTestCase) (test case does not fall in any category of interest for this run) 
UNSUPPORTED: LLDB (/Users/buildslave/jenkins/workspace/lldb-cmake-matrix/clang_701_build/bin/clang-7-x86_64) :: test_int32_t_gmodules (TestCPP11EnumTypes.CPP11EnumTypesTestCase) (test case does not fall in any category of interest for this run) 
runCmd: settings set symbols.enable-external-lookup false
output: 

runCmd: settings set plugin.process.gdb-remote.packet-timeout 60
output: 

runCmd: settings set symbols.clang-modules-cache-path "/Users/buildslave/jenkins/workspace/lldb-cmake-matrix/lldb-build/tools/lldb/lldb-test-build.noindex/module-cache-lldb"
output: 

runCmd: settings set use-color false
output: 

runCmd: file /Users/buildslave/jenkins/workspace/lldb-cmake-matrix/lldb-build/tools/lldb/lldb-test-build.noindex/lang/cpp/enum_types/TestCPP11EnumTypes.test_int64_t_dsym/a.out
output: Current executable set to '/Users/buildslave/jenkins/workspace/lldb-cmake-matrix/lldb-build/tools/lldb/lldb-test-build.noindex/lang/cpp/enum_types/TestCPP11EnumTypes.test_int64_t_dsym/a.out' (x86_64).


runCmd: breakpoint set -f "main.cpp" -l 29
output: Breakpoint 1: where = a.out`main + 49 at main.cpp:29:38, address = 0x0000000100000f51


Expecting pattern: ^Breakpoint (?P<bpno>[0-9]+): (?P<num_locations>[0-9]+) locations\.$
Not matched

Expecting pattern: ^Breakpoint (?P<bpno>[0-9]+): (?P<num_locations>no) locations \(pending\)\.
Not matched

Expecting pattern: ^Breakpoint (?P<bpno>[0-9]+): where = (?P<module>.*)`(?P<symbol>[+\-]{0,1}[^+]+)( \+ (?P<offset>[0-9]+)){0,1}( \[inlined\] (?P<inline_symbol>.*)){0,1} at (?P<file>[^:]+):(?P<line_no>[0-9]+)(?P<column>(:[0-9]+)?), address = (?P<address>0x[0-9a-fA-F]+)$
Matched

runCmd: run
output: Process 88926 stopped
* thread #1, queue = 'com.apple.main-thread', stop reason = breakpoint 1.1
    frame #0: 0x0000000100000f51 a.out`main(argc=1, argv=0x00007ffeefbff568) at main.cpp:29:38
   26  	    for (day_value = (enum_integer_t)DayType::Monday - 1; day_value <= (enum_integer_t)DayType::kNumDays + 1; ++day_value)
   27  	    {
   28  	        DayType day = (DayType)day_value;
-> 29  	        printf("day as int is %i\n", (int)day); // Set break point at this line.
    	                                     ^
   30  	    }
   31  	    return 0;
   32  	}

Process 88926 launched: '/Users/buildslave/jenkins/workspace/lldb-cmake-matrix/lldb-build/tools/lldb/lldb-test-build.noindex/lang/cpp/enum_types/TestCPP11EnumTypes.test_int64_t_dsym/a.out' (x86_64)


runCmd: thread list
output: Process 88926 stopped
* thread #1: tid = 0x2773c7d, 0x0000000100000f51 a.out`main(argc=1, argv=0x00007ffeefbff568) at main.cpp:29:38, queue = 'com.apple.main-thread', stop reason = breakpoint 1.1


Expecting sub string: stopped
Matched

Expecting sub string: stop reason = breakpoint
Matched

runCmd: breakpoint list -f
output: Current breakpoints:
1: file = 'main.cpp', line = 29, exact_match = 0, locations = 1, resolved = 1, hit count = 1
  1.1: where = a.out`main + 49 at main.cpp:29:38, address = 0x0000000100000f51, resolved, hit count = 1 



Expecting sub string:  resolved, hit count = 1
Matched

runCmd: image lookup -t DayType
output: Best match found in /Users/buildslave/jenkins/workspace/lldb-cmake-matrix/lldb-build/tools/lldb/lldb-test-build.noindex/lang/cpp/enum_types/TestCPP11EnumTypes.test_int64_t_dsym/a.out:
id = {0x7fffffff00000043}, name = "DayType", byte-size = 2, decl = main.cpp:15, compiler_type = "enum class DayType {
    Monday,
    Tuesday,
    Wednesday,
    Thursday,
    Friday,
    Saturday,
    Sunday,
    kNumDays
}"



Expecting sub string: Monday
Matched

Expecting sub string: Tuesday
Matched

Expecting sub string: Wednesday
Matched

Expecting sub string: Thursday
Matched

Expecting sub string: Friday
Matched

Expecting sub string: Saturday
Matched

Expecting sub string: Sunday
Matched

Expecting sub string: kNumDays
Matched

Expecting sub string: }
Matched

Expecting pattern: enum( struct| class) DayType {
Matched

runCmd: frame variable day
output: (DayType) day = -4


Expecting sub string: -4
Matched

runCmd: frame variable day
output: (DayType) day = Monday


Expecting sub string: Monday
Matched

runCmd: frame variable day
output: (DayType) day = Tuesday


Expecting sub string: Tuesday
Matched

runCmd: frame variable day
output: (DayType) day = Wednesday


Expecting sub string: Wednesday
Matched

runCmd: frame variable day
output: (DayType) day = Thursday


Expecting sub string: Thursday
Matched

runCmd: frame variable day
output: (DayType) day = Friday


Expecting sub string: Friday
Matched

runCmd: frame variable day
output: (DayType) day = Saturday


Expecting sub string: Saturday
Matched

runCmd: frame variable day
output: (DayType) day = Sunday


Expecting sub string: Sunday
Matched

runCmd: frame variable day
output: (DayType) day = kNumDays


Expecting sub string: kNumDays
Matched

runCmd: frame variable day
output: (DayType) day = 5


Expecting sub string: 5
Matched

<bound method SBProcess.Kill of <lldb.SBProcess; proxy of <Swig Object of type 'lldb::SBProcess *' at 0x104515270> >>: success

PASS: LLDB (/Users/buildslave/jenkins/workspace/lldb-cmake-matrix/clang_701_build/bin/clang-7-x86_64) :: test_int64_t_dsym (TestCPP11EnumTypes.CPP11EnumTypesTestCase)
runCmd: settings set symbols.enable-external-lookup false
output: 

runCmd: settings set plugin.process.gdb-remote.packet-timeout 60
output: 

runCmd: settings set symbols.clang-modules-cache-path "/Users/buildslave/jenkins/workspace/lldb-cmake-matrix/lldb-build/tools/lldb/lldb-test-build.noindex/module-cache-lldb"
output: 

runCmd: settings set use-color false
output: 

runCmd: file /Users/buildslave/jenkins/workspace/lldb-cmake-matrix/lldb-build/tools/lldb/lldb-test-build.noindex/lang/cpp/enum_types/TestCPP11EnumTypes.test_int64_t_dwarf/a.out
output: Current executable set to '/Users/buildslave/jenkins/workspace/lldb-cmake-matrix/lldb-build/tools/lldb/lldb-test-build.noindex/lang/cpp/enum_types/TestCPP11EnumTypes.test_int64_t_dwarf/a.out' (x86_64).


runCmd: breakpoint set -f "main.cpp" -l 29
output: Breakpoint 1: where = a.out`main + 49 at main.cpp:29:38, address = 0x0000000100000f51


Expecting pattern: ^Breakpoint (?P<bpno>[0-9]+): (?P<num_locations>[0-9]+) locations\.$
Not matched

Expecting pattern: ^Breakpoint (?P<bpno>[0-9]+): (?P<num_locations>no) locations \(pending\)\.
Not matched

Expecting pattern: ^Breakpoint (?P<bpno>[0-9]+): where = (?P<module>.*)`(?P<symbol>[+\-]{0,1}[^+]+)( \+ (?P<offset>[0-9]+)){0,1}( \[inlined\] (?P<inline_symbol>.*)){0,1} at (?P<file>[^:]+):(?P<line_no>[0-9]+)(?P<column>(:[0-9]+)?), address = (?P<address>0x[0-9a-fA-F]+)$
Matched

runCmd: run
output: Process 89437 stopped
* thread #1, queue = 'com.apple.main-thread', stop reason = breakpoint 1.1
    frame #0: 0x0000000100000f51 a.out`main(argc=1, argv=0x00007ffeefbff568) at main.cpp:29:38
   26  	    for (day_value = (enum_integer_t)DayType::Monday - 1; day_value <= (enum_integer_t)DayType::kNumDays + 1; ++day_value)
   27  	    {
   28  	        DayType day = (DayType)day_value;
-> 29  	        printf("day as int is %i\n", (int)day); // Set break point at this line.
    	                                     ^
   30  	    }
   31  	    return 0;
   32  	}

Process 89437 launched: '/Users/buildslave/jenkins/workspace/lldb-cmake-matrix/lldb-build/tools/lldb/lldb-test-build.noindex/lang/cpp/enum_types/TestCPP11EnumTypes.test_int64_t_dwarf/a.out' (x86_64)


runCmd: thread list
output: Process 89437 stopped
* thread #1: tid = 0x2773fbe, 0x0000000100000f51 a.out`main(argc=1, argv=0x00007ffeefbff568) at main.cpp:29:38, queue = 'com.apple.main-thread', stop reason = breakpoint 1.1


Expecting sub string: stopped
Matched

Expecting sub string: stop reason = breakpoint
Matched

runCmd: breakpoint list -f
output: Current breakpoints:
1: file = 'main.cpp', line = 29, exact_match = 0, locations = 1, resolved = 1, hit count = 1
  1.1: where = a.out`main + 49 at main.cpp:29:38, address = 0x0000000100000f51, resolved, hit count = 1 



Expecting sub string:  resolved, hit count = 1
Matched

runCmd: image lookup -t DayType
output: Best match found in /Users/buildslave/jenkins/workspace/lldb-cmake-matrix/lldb-build/tools/lldb/lldb-test-build.noindex/lang/cpp/enum_types/TestCPP11EnumTypes.test_int64_t_dwarf/a.out:
id = {0x100000043}, name = "DayType", byte-size = 2, decl = main.cpp:15, compiler_type = "enum class DayType {
    Monday,
    Tuesday,
    Wednesday,
    Thursday,
    Friday,
    Saturday,
    Sunday,
    kNumDays
}"



Expecting sub string: Monday
Matched

Expecting sub string: Tuesday
Matched

Expecting sub string: Wednesday
Matched

Expecting sub string: Thursday
Matched

Expecting sub string: Friday
Matched

Expecting sub string: Saturday
Matched

Expecting sub string: Sunday
Matched

Expecting sub string: kNumDays
Matched

Expecting sub string: }
Matched

Expecting pattern: enum( struct| class) DayType {
Matched

runCmd: frame variable day
output: (DayType) day = -4


Expecting sub string: -4
Matched

runCmd: frame variable day
output: (DayType) day = Monday


Expecting sub string: Monday
Matched

runCmd: frame variable day
output: (DayType) day = Tuesday


Expecting sub string: Tuesday
Matched

runCmd: frame variable day
output: (DayType) day = Wednesday


Expecting sub string: Wednesday
Matched

runCmd: frame variable day
output: (DayType) day = Thursday


Expecting sub string: Thursday
Matched

runCmd: frame variable day
output: (DayType) day = Friday


Expecting sub string: Friday
Matched

runCmd: frame variable day
output: (DayType) day = Saturday


Expecting sub string: Saturday
Matched

runCmd: frame variable day
output: (DayType) day = Sunday


Expecting sub string: Sunday
Matched

runCmd: frame variable day
output: (DayType) day = kNumDays


Expecting sub string: kNumDays
Matched

runCmd: frame variable day
output: (DayType) day = 5


Expecting sub string: 5
Matched

<bound method SBProcess.Kill of <lldb.SBProcess; proxy of <Swig Object of type 'lldb::SBProcess *' at 0x1045152a0> >>: success

PASS: LLDB (/Users/buildslave/jenkins/workspace/lldb-cmake-matrix/clang_701_build/bin/clang-7-x86_64) :: test_int64_t_dwarf (TestCPP11EnumTypes.CPP11EnumTypesTestCase)
UNSUPPORTED: LLDB (/Users/buildslave/jenkins/workspace/lldb-cmake-matrix/clang_701_build/bin/clang-7-x86_64) :: test_int64_t_dwo (TestCPP11EnumTypes.CPP11EnumTypesTestCase) (test case does not fall in any category of interest for this run) 
UNSUPPORTED: LLDB (/Users/buildslave/jenkins/workspace/lldb-cmake-matrix/clang_701_build/bin/clang-7-x86_64) :: test_int64_t_gmodules (TestCPP11EnumTypes.CPP11EnumTypesTestCase) (test case does not fall in any category of interest for this run) 
runCmd: settings set symbols.enable-external-lookup false
output: 

runCmd: settings set plugin.process.gdb-remote.packet-timeout 60
output: 

runCmd: settings set symbols.clang-modules-cache-path "/Users/buildslave/jenkins/workspace/lldb-cmake-matrix/lldb-build/tools/lldb/lldb-test-build.noindex/module-cache-lldb"
output: 

runCmd: settings set use-color false
output: 

runCmd: file /Users/buildslave/jenkins/workspace/lldb-cmake-matrix/lldb-build/tools/lldb/lldb-test-build.noindex/lang/cpp/enum_types/TestCPP11EnumTypes.test_int8_t_dsym/a.out
output: Current executable set to '/Users/buildslave/jenkins/workspace/lldb-cmake-matrix/lldb-build/tools/lldb/lldb-test-build.noindex/lang/cpp/enum_types/TestCPP11EnumTypes.test_int8_t_dsym/a.out' (x86_64).


runCmd: breakpoint set -f "main.cpp" -l 29
output: Breakpoint 1: where = a.out`main + 49 at main.cpp:29:38, address = 0x0000000100000f51


Expecting pattern: ^Breakpoint (?P<bpno>[0-9]+): (?P<num_locations>[0-9]+) locations\.$
Not matched

Expecting pattern: ^Breakpoint (?P<bpno>[0-9]+): (?P<num_locations>no) locations \(pending\)\.
Not matched

Expecting pattern: ^Breakpoint (?P<bpno>[0-9]+): where = (?P<module>.*)`(?P<symbol>[+\-]{0,1}[^+]+)( \+ (?P<offset>[0-9]+)){0,1}( \[inlined\] (?P<inline_symbol>.*)){0,1} at (?P<file>[^:]+):(?P<line_no>[0-9]+)(?P<column>(:[0-9]+)?), address = (?P<address>0x[0-9a-fA-F]+)$
Matched

runCmd: run
output: Process 89869 stopped
* thread #1, queue = 'com.apple.main-thread', stop reason = breakpoint 1.1
    frame #0: 0x0000000100000f51 a.out`main(argc=1, argv=0x00007ffeefbff570) at main.cpp:29:38
   26  	    for (day_value = (enum_integer_t)DayType::Monday - 1; day_value <= (enum_integer_t)DayType::kNumDays + 1; ++day_value)
   27  	    {
   28  	        DayType day = (DayType)day_value;
-> 29  	        printf("day as int is %i\n", (int)day); // Set break point at this line.
    	                                     ^
   30  	    }
   31  	    return 0;
   32  	}

Process 89869 launched: '/Users/buildslave/jenkins/workspace/lldb-cmake-matrix/lldb-build/tools/lldb/lldb-test-build.noindex/lang/cpp/enum_types/TestCPP11EnumTypes.test_int8_t_dsym/a.out' (x86_64)


runCmd: thread list
output: Process 89869 stopped
* thread #1: tid = 0x2774337, 0x0000000100000f51 a.out`main(argc=1, argv=0x00007ffeefbff570) at main.cpp:29:38, queue = 'com.apple.main-thread', stop reason = breakpoint 1.1


Expecting sub string: stopped
Matched

Expecting sub string: stop reason = breakpoint
Matched

runCmd: breakpoint list -f
output: Current breakpoints:
1: file = 'main.cpp', line = 29, exact_match = 0, locations = 1, resolved = 1, hit count = 1
  1.1: where = a.out`main + 49 at main.cpp:29:38, address = 0x0000000100000f51, resolved, hit count = 1 



Expecting sub string:  resolved, hit count = 1
Matched

runCmd: image lookup -t DayType
output: Best match found in /Users/buildslave/jenkins/workspace/lldb-cmake-matrix/lldb-build/tools/lldb/lldb-test-build.noindex/lang/cpp/enum_types/TestCPP11EnumTypes.test_int8_t_dsym/a.out:
id = {0x7fffffff00000043}, name = "DayType", byte-size = 2, decl = main.cpp:15, compiler_type = "enum class DayType {
    Monday,
    Tuesday,
    Wednesday,
    Thursday,
    Friday,
    Saturday,
    Sunday,
    kNumDays
}"



Expecting sub string: Monday
Matched

Expecting sub string: Tuesday
Matched

Expecting sub string: Wednesday
Matched

Expecting sub string: Thursday
Matched

Expecting sub string: Friday
Matched

Expecting sub string: Saturday
Matched

Expecting sub string: Sunday
Matched

Expecting sub string: kNumDays
Matched

Expecting sub string: }
Matched

Expecting pattern: enum( struct| class) DayType {
Matched

runCmd: frame variable day
output: (DayType) day = -4


Expecting sub string: -4
Matched

runCmd: frame variable day
output: (DayType) day = Monday


Expecting sub string: Monday
Matched

runCmd: frame variable day
output: (DayType) day = Tuesday


Expecting sub string: Tuesday
Matched

runCmd: frame variable day
output: (DayType) day = Wednesday


Expecting sub string: Wednesday
Matched

runCmd: frame variable day
output: (DayType) day = Thursday


Expecting sub string: Thursday
Matched

runCmd: frame variable day
output: (DayType) day = Friday


Expecting sub string: Friday
Matched

runCmd: frame variable day
output: (DayType) day = Saturday


Expecting sub string: Saturday
Matched

runCmd: frame variable day
output: (DayType) day = Sunday


Expecting sub string: Sunday
Matched

runCmd: frame variable day
output: (DayType) day = kNumDays


Expecting sub string: kNumDays
Matched

runCmd: frame variable day
output: (DayType) day = 5


Expecting sub string: 5
Matched

<bound method SBProcess.Kill of <lldb.SBProcess; proxy of <Swig Object of type 'lldb::SBProcess *' at 0x104515810> >>: success

PASS: LLDB (/Users/buildslave/jenkins/workspace/lldb-cmake-matrix/clang_701_build/bin/clang-7-x86_64) :: test_int8_t_dsym (TestCPP11EnumTypes.CPP11EnumTypesTestCase)
runCmd: settings set symbols.enable-external-lookup false
output: 

runCmd: settings set plugin.process.gdb-remote.packet-timeout 60
output: 

runCmd: settings set symbols.clang-modules-cache-path "/Users/buildslave/jenkins/workspace/lldb-cmake-matrix/lldb-build/tools/lldb/lldb-test-build.noindex/module-cache-lldb"
output: 

runCmd: settings set use-color false
output: 

runCmd: file /Users/buildslave/jenkins/workspace/lldb-cmake-matrix/lldb-build/tools/lldb/lldb-test-build.noindex/lang/cpp/enum_types/TestCPP11EnumTypes.test_int8_t_dwarf/a.out
output: Current executable set to '/Users/buildslave/jenkins/workspace/lldb-cmake-matrix/lldb-build/tools/lldb/lldb-test-build.noindex/lang/cpp/enum_types/TestCPP11EnumTypes.test_int8_t_dwarf/a.out' (x86_64).


runCmd: breakpoint set -f "main.cpp" -l 29
output: Breakpoint 1: where = a.out`main + 49 at main.cpp:29:38, address = 0x0000000100000f51


Expecting pattern: ^Breakpoint (?P<bpno>[0-9]+): (?P<num_locations>[0-9]+) locations\.$
Not matched

Expecting pattern: ^Breakpoint (?P<bpno>[0-9]+): (?P<num_locations>no) locations \(pending\)\.
Not matched

Expecting pattern: ^Breakpoint (?P<bpno>[0-9]+): where = (?P<module>.*)`(?P<symbol>[+\-]{0,1}[^+]+)( \+ (?P<offset>[0-9]+)){0,1}( \[inlined\] (?P<inline_symbol>.*)){0,1} at (?P<file>[^:]+):(?P<line_no>[0-9]+)(?P<column>(:[0-9]+)?), address = (?P<address>0x[0-9a-fA-F]+)$
Matched

runCmd: run
output: Process 90365 stopped
* thread #1, queue = 'com.apple.main-thread', stop reason = breakpoint 1.1
    frame #0: 0x0000000100000f51 a.out`main(argc=1, argv=0x00007ffeefbff568) at main.cpp:29:38
   26  	    for (day_value = (enum_integer_t)DayType::Monday - 1; day_value <= (enum_integer_t)DayType::kNumDays + 1; ++day_value)
   27  	    {
   28  	        DayType day = (DayType)day_value;
-> 29  	        printf("day as int is %i\n", (int)day); // Set break point at this line.
    	                                     ^
   30  	    }
   31  	    return 0;
   32  	}

Process 90365 launched: '/Users/buildslave/jenkins/workspace/lldb-cmake-matrix/lldb-build/tools/lldb/lldb-test-build.noindex/lang/cpp/enum_types/TestCPP11EnumTypes.test_int8_t_dwarf/a.out' (x86_64)


runCmd: thread list
output: Process 90365 stopped
* thread #1: tid = 0x2774669, 0x0000000100000f51 a.out`main(argc=1, argv=0x00007ffeefbff568) at main.cpp:29:38, queue = 'com.apple.main-thread', stop reason = breakpoint 1.1


Expecting sub string: stopped
Matched

Expecting sub string: stop reason = breakpoint
Matched

runCmd: breakpoint list -f
output: Current breakpoints:
1: file = 'main.cpp', line = 29, exact_match = 0, locations = 1, resolved = 1, hit count = 1
  1.1: where = a.out`main + 49 at main.cpp:29:38, address = 0x0000000100000f51, resolved, hit count = 1 



Expecting sub string:  resolved, hit count = 1
Matched

runCmd: image lookup -t DayType
output: Best match found in /Users/buildslave/jenkins/workspace/lldb-cmake-matrix/lldb-build/tools/lldb/lldb-test-build.noindex/lang/cpp/enum_types/TestCPP11EnumTypes.test_int8_t_dwarf/a.out:
id = {0x100000043}, name = "DayType", byte-size = 2, decl = main.cpp:15, compiler_type = "enum class DayType {
    Monday,
    Tuesday,
    Wednesday,
    Thursday,
    Friday,
    Saturday,
    Sunday,
    kNumDays
}"



Expecting sub string: Monday
Matched

Expecting sub string: Tuesday
Matched

Expecting sub string: Wednesday
Matched

Expecting sub string: Thursday
Matched

Expecting sub string: Friday
Matched

Expecting sub string: Saturday
Matched

Expecting sub string: Sunday
Matched

Expecting sub string: kNumDays
Matched

Expecting sub string: }
Matched

Expecting pattern: enum( struct| class) DayType {
Matched

runCmd: frame variable day
output: (DayType) day = -4


Expecting sub string: -4
Matched

runCmd: frame variable day
output: (DayType) day = Monday


Expecting sub string: Monday
Matched

runCmd: frame variable day
output: (DayType) day = Tuesday


Expecting sub string: Tuesday
Matched

runCmd: frame variable day
output: (DayType) day = Wednesday


Expecting sub string: Wednesday
Matched

runCmd: frame variable day
output: (DayType) day = Thursday


Expecting sub string: Thursday
Matched

runCmd: frame variable day
output: (DayType) day = Friday


Expecting sub string: Friday
Matched

runCmd: frame variable day
output: (DayType) day = Saturday


Expecting sub string: Saturday
Matched

runCmd: frame variable day
output: (DayType) day = Sunday


Expecting sub string: Sunday
Matched

runCmd: frame variable day
output: (DayType) day = kNumDays


Expecting sub string: kNumDays
Matched

runCmd: frame variable day
output: (DayType) day = 5


Expecting sub string: 5
Matched

<bound method SBProcess.Kill of <lldb.SBProcess; proxy of <Swig Object of type 'lldb::SBProcess *' at 0x104515240> >>: success

PASS: LLDB (/Users/buildslave/jenkins/workspace/lldb-cmake-matrix/clang_701_build/bin/clang-7-x86_64) :: test_int8_t_dwarf (TestCPP11EnumTypes.CPP11EnumTypesTestCase)
UNSUPPORTED: LLDB (/Users/buildslave/jenkins/workspace/lldb-cmake-matrix/clang_701_build/bin/clang-7-x86_64) :: test_int8_t_dwo (TestCPP11EnumTypes.CPP11EnumTypesTestCase) (test case does not fall in any category of interest for this run) 
UNSUPPORTED: LLDB (/Users/buildslave/jenkins/workspace/lldb-cmake-matrix/clang_701_build/bin/clang-7-x86_64) :: test_int8_t_gmodules (TestCPP11EnumTypes.CPP11EnumTypesTestCase) (test case does not fall in any category of interest for this run) 
runCmd: settings set symbols.enable-external-lookup false
output: 

runCmd: settings set plugin.process.gdb-remote.packet-timeout 60
output: 

runCmd: settings set symbols.clang-modules-cache-path "/Users/buildslave/jenkins/workspace/lldb-cmake-matrix/lldb-build/tools/lldb/lldb-test-build.noindex/module-cache-lldb"
output: 

runCmd: settings set use-color false
output: 

runCmd: file /Users/buildslave/jenkins/workspace/lldb-cmake-matrix/lldb-build/tools/lldb/lldb-test-build.noindex/lang/cpp/enum_types/TestCPP11EnumTypes.test_uint16_t_dsym/a.out
output: Current executable set to '/Users/buildslave/jenkins/workspace/lldb-cmake-matrix/lldb-build/tools/lldb/lldb-test-build.noindex/lang/cpp/enum_types/TestCPP11EnumTypes.test_uint16_t_dsym/a.out' (x86_64).


runCmd: breakpoint set -f "main.cpp" -l 29
output: Breakpoint 1: where = a.out`main + 49 at main.cpp:29:38, address = 0x0000000100000f51


Expecting pattern: ^Breakpoint (?P<bpno>[0-9]+): (?P<num_locations>[0-9]+) locations\.$
Not matched

Expecting pattern: ^Breakpoint (?P<bpno>[0-9]+): (?P<num_locations>no) locations \(pending\)\.
Not matched

Expecting pattern: ^Breakpoint (?P<bpno>[0-9]+): where = (?P<module>.*)`(?P<symbol>[+\-]{0,1}[^+]+)( \+ (?P<offset>[0-9]+)){0,1}( \[inlined\] (?P<inline_symbol>.*)){0,1} at (?P<file>[^:]+):(?P<line_no>[0-9]+)(?P<column>(:[0-9]+)?), address = (?P<address>0x[0-9a-fA-F]+)$
Matched

runCmd: run
output: Process 90932 stopped
* thread #1, queue = 'com.apple.main-thread', stop reason = breakpoint 1.1
    frame #0: 0x0000000100000f51 a.out`main(argc=1, argv=0x00007ffeefbff568) at main.cpp:29:38
   26  	    for (day_value = (enum_integer_t)DayType::Monday - 1; day_value <= (enum_integer_t)DayType::kNumDays + 1; ++day_value)
   27  	    {
   28  	        DayType day = (DayType)day_value;
-> 29  	        printf("day as int is %i\n", (int)day); // Set break point at this line.
    	                                     ^
   30  	    }
   31  	    return 0;
   32  	}

Process 90932 launched: '/Users/buildslave/jenkins/workspace/lldb-cmake-matrix/lldb-build/tools/lldb/lldb-test-build.noindex/lang/cpp/enum_types/TestCPP11EnumTypes.test_uint16_t_dsym/a.out' (x86_64)


runCmd: thread list
output: Process 90932 stopped
* thread #1: tid = 0x27749d6, 0x0000000100000f51 a.out`main(argc=1, argv=0x00007ffeefbff568) at main.cpp:29:38, queue = 'com.apple.main-thread', stop reason = breakpoint 1.1


Expecting sub string: stopped
Matched

Expecting sub string: stop reason = breakpoint
Matched

runCmd: breakpoint list -f
output: Current breakpoints:
1: file = 'main.cpp', line = 29, exact_match = 0, locations = 1, resolved = 1, hit count = 1
  1.1: where = a.out`main + 49 at main.cpp:29:38, address = 0x0000000100000f51, resolved, hit count = 1 



Expecting sub string:  resolved, hit count = 1
Matched

runCmd: image lookup -t DayType
output: Best match found in /Users/buildslave/jenkins/workspace/lldb-cmake-matrix/lldb-build/tools/lldb/lldb-test-build.noindex/lang/cpp/enum_types/TestCPP11EnumTypes.test_uint16_t_dsym/a.out:
id = {0x7fffffff00000043}, name = "DayType", byte-size = 2, decl = main.cpp:15, compiler_type = "enum class DayType {
    Monday,
    Tuesday,
    Wednesday,
    Thursday,
    Friday,
    Saturday,
    Sunday,
    kNumDays
}"



Expecting sub string: Monday
Matched

Expecting sub string: Tuesday
Matched

Expecting sub string: Wednesday
Matched

Expecting sub string: Thursday
Matched

Expecting sub string: Friday
Matched

Expecting sub string: Saturday
Matched

Expecting sub string: Sunday
Matched

Expecting sub string: kNumDays
Matched

Expecting sub string: }
Matched

Expecting pattern: enum( struct| class) DayType {
Matched

runCmd: frame variable day
output: (DayType) day = -4


Expecting sub string: -4
Matched

runCmd: frame variable day
output: (DayType) day = Monday


Expecting sub string: Monday
Matched

runCmd: frame variable day
output: (DayType) day = Tuesday


Expecting sub string: Tuesday
Matched

runCmd: frame variable day
output: (DayType) day = Wednesday


Expecting sub string: Wednesday
Matched

runCmd: frame variable day
output: (DayType) day = Thursday


Expecting sub string: Thursday
Matched

runCmd: frame variable day
output: (DayType) day = Friday


Expecting sub string: Friday
Matched

runCmd: frame variable day
output: (DayType) day = Saturday


Expecting sub string: Saturday
Matched

runCmd: frame variable day
output: (DayType) day = Sunday


Expecting sub string: Sunday
Matched

runCmd: frame variable day
output: (DayType) day = kNumDays


Expecting sub string: kNumDays
Matched

runCmd: frame variable day
output: (DayType) day = 5


Expecting sub string: 5
Matched

<bound method SBProcess.Kill of <lldb.SBProcess; proxy of <Swig Object of type 'lldb::SBProcess *' at 0x104515780> >>: success

PASS: LLDB (/Users/buildslave/jenkins/workspace/lldb-cmake-matrix/clang_701_build/bin/clang-7-x86_64) :: test_uint16_t_dsym (TestCPP11EnumTypes.CPP11EnumTypesTestCase)
runCmd: settings set symbols.enable-external-lookup false
output: 

runCmd: settings set plugin.process.gdb-remote.packet-timeout 60
output: 

runCmd: settings set symbols.clang-modules-cache-path "/Users/buildslave/jenkins/workspace/lldb-cmake-matrix/lldb-build/tools/lldb/lldb-test-build.noindex/module-cache-lldb"
output: 

runCmd: settings set use-color false
output: 

FAIL: LLDB (/Users/buildslave/jenkins/workspace/lldb-cmake-matrix/clang_701_build/bin/clang-7-x86_64) :: test_uint16_t_dwarf (TestCPP11EnumTypes.CPP11EnumTypesTestCase)
UNSUPPORTED: LLDB (/Users/buildslave/jenkins/workspace/lldb-cmake-matrix/clang_701_build/bin/clang-7-x86_64) :: test_uint16_t_dwo (TestCPP11EnumTypes.CPP11EnumTypesTestCase) (test case does not fall in any category of interest for this run) 
UNSUPPORTED: LLDB (/Users/buildslave/jenkins/workspace/lldb-cmake-matrix/clang_701_build/bin/clang-7-x86_64) :: test_uint16_t_gmodules (TestCPP11EnumTypes.CPP11EnumTypesTestCase) (test case does not fall in any category of interest for this run) 
runCmd: settings set symbols.enable-external-lookup false
output: 

runCmd: settings set plugin.process.gdb-remote.packet-timeout 60
output: 

runCmd: settings set symbols.clang-modules-cache-path "/Users/buildslave/jenkins/workspace/lldb-cmake-matrix/lldb-build/tools/lldb/lldb-test-build.noindex/module-cache-lldb"
output: 

runCmd: settings set use-color false
output: 

FAIL: LLDB (/Users/buildslave/jenkins/workspace/lldb-cmake-matrix/clang_701_build/bin/clang-7-x86_64) :: test_uint32_t_dsym (TestCPP11EnumTypes.CPP11EnumTypesTestCase)
runCmd: settings set symbols.enable-external-lookup false
output: 

runCmd: settings set plugin.process.gdb-remote.packet-timeout 60
output: 

runCmd: settings set symbols.clang-modules-cache-path "/Users/buildslave/jenkins/workspace/lldb-cmake-matrix/lldb-build/tools/lldb/lldb-test-build.noindex/module-cache-lldb"
output: 

runCmd: settings set use-color false
output: 

FAIL: LLDB (/Users/buildslave/jenkins/workspace/lldb-cmake-matrix/clang_701_build/bin/clang-7-x86_64) :: test_uint32_t_dwarf (TestCPP11EnumTypes.CPP11EnumTypesTestCase)
UNSUPPORTED: LLDB (/Users/buildslave/jenkins/workspace/lldb-cmake-matrix/clang_701_build/bin/clang-7-x86_64) :: test_uint32_t_dwo (TestCPP11EnumTypes.CPP11EnumTypesTestCase) (test case does not fall in any category of interest for this run) 
UNSUPPORTED: LLDB (/Users/buildslave/jenkins/workspace/lldb-cmake-matrix/clang_701_build/bin/clang-7-x86_64) :: test_uint32_t_gmodules (TestCPP11EnumTypes.CPP11EnumTypesTestCase) (test case does not fall in any category of interest for this run) 
runCmd: settings set symbols.enable-external-lookup false
output: 

runCmd: settings set plugin.process.gdb-remote.packet-timeout 60
output: 

runCmd: settings set symbols.clang-modules-cache-path "/Users/buildslave/jenkins/workspace/lldb-cmake-matrix/lldb-build/tools/lldb/lldb-test-build.noindex/module-cache-lldb"
output: 

runCmd: settings set use-color false
output: 

UNSUPPORTED: LLDB (/Users/buildslave/jenkins/workspace/lldb-cmake-matrix/clang_701_build/bin/clang-7-x86_64) :: test_uint64_t_dsym (TestCPP11EnumTypes.CPP11EnumTypesTestCase) (skipping due to the following parameter(s): dwarf version) 
runCmd: settings set symbols.enable-external-lookup false
output: 

runCmd: settings set plugin.process.gdb-remote.packet-timeout 60
output: 

runCmd: settings set symbols.clang-modules-cache-path "/Users/buildslave/jenkins/workspace/lldb-cmake-matrix/lldb-build/tools/lldb/lldb-test-build.noindex/module-cache-lldb"
output: 

runCmd: settings set use-color false
output: 

runCmd: file /Users/buildslave/jenkins/workspace/lldb-cmake-matrix/lldb-build/tools/lldb/lldb-test-build.noindex/lang/cpp/enum_types/TestCPP11EnumTypes.test_uint64_t_dwarf/a.out
output: Current executable set to '/Users/buildslave/jenkins/workspace/lldb-cmake-matrix/lldb-build/tools/lldb/lldb-test-build.noindex/lang/cpp/enum_types/TestCPP11EnumTypes.test_uint64_t_dwarf/a.out' (x86_64).


runCmd: breakpoint set -f "main.cpp" -l 29
output: Breakpoint 1: where = a.out`main + 49 at main.cpp:29:38, address = 0x0000000100000f51


Expecting pattern: ^Breakpoint (?P<bpno>[0-9]+): (?P<num_locations>[0-9]+) locations\.$
Not matched

Expecting pattern: ^Breakpoint (?P<bpno>[0-9]+): (?P<num_locations>no) locations \(pending\)\.
Not matched

Expecting pattern: ^Breakpoint (?P<bpno>[0-9]+): where = (?P<module>.*)`(?P<symbol>[+\-]{0,1}[^+]+)( \+ (?P<offset>[0-9]+)){0,1}( \[inlined\] (?P<inline_symbol>.*)){0,1} at (?P<file>[^:]+):(?P<line_no>[0-9]+)(?P<column>(:[0-9]+)?), address = (?P<address>0x[0-9a-fA-F]+)$
Matched

runCmd: run
runCmd failed!
error: shell expansion failed (reason: lldb-argdumper exited with error -1). consider launching with 'process launch'.


Command 'run' failed!

FAIL: LLDB (/Users/buildslave/jenkins/workspace/lldb-cmake-matrix/clang_701_build/bin/clang-7-x86_64) :: test_uint64_t_dwarf (TestCPP11EnumTypes.CPP11EnumTypesTestCase)
UNSUPPORTED: LLDB (/Users/buildslave/jenkins/workspace/lldb-cmake-matrix/clang_701_build/bin/clang-7-x86_64) :: test_uint64_t_dwo (TestCPP11EnumTypes.CPP11EnumTypesTestCase) (test case does not fall in any category of interest for this run) 
UNSUPPORTED: LLDB (/Users/buildslave/jenkins/workspace/lldb-cmake-matrix/clang_701_build/bin/clang-7-x86_64) :: test_uint64_t_gmodules (TestCPP11EnumTypes.CPP11EnumTypesTestCase) (test case does not fall in any category of interest for this run) 
runCmd: settings set symbols.enable-external-lookup false
output: 

runCmd: settings set plugin.process.gdb-remote.packet-timeout 60
output: 

runCmd: settings set symbols.clang-modules-cache-path "/Users/buildslave/jenkins/workspace/lldb-cmake-matrix/lldb-build/tools/lldb/lldb-test-build.noindex/module-cache-lldb"
output: 

runCmd: settings set use-color false
output: 

runCmd: file /Users/buildslave/jenkins/workspace/lldb-cmake-matrix/lldb-build/tools/lldb/lldb-test-build.noindex/lang/cpp/enum_types/TestCPP11EnumTypes.test_uint8_t_dsym/a.out
output: Current executable set to '/Users/buildslave/jenkins/workspace/lldb-cmake-matrix/lldb-build/tools/lldb/lldb-test-build.noindex/lang/cpp/enum_types/TestCPP11EnumTypes.test_uint8_t_dsym/a.out' (x86_64).


runCmd: breakpoint set -f "main.cpp" -l 29
output: Breakpoint 1: where = a.out`main + 49 at main.cpp:29:38, address = 0x0000000100000f51


Expecting pattern: ^Breakpoint (?P<bpno>[0-9]+): (?P<num_locations>[0-9]+) locations\.$
Not matched

Expecting pattern: ^Breakpoint (?P<bpno>[0-9]+): (?P<num_locations>no) locations \(pending\)\.
Not matched

Expecting pattern: ^Breakpoint (?P<bpno>[0-9]+): where = (?P<module>.*)`(?P<symbol>[+\-]{0,1}[^+]+)( \+ (?P<offset>[0-9]+)){0,1}( \[inlined\] (?P<inline_symbol>.*)){0,1} at (?P<file>[^:]+):(?P<line_no>[0-9]+)(?P<column>(:[0-9]+)?), address = (?P<address>0x[0-9a-fA-F]+)$
Matched

runCmd: run
runCmd failed!
error: shell expansion failed (reason: lldb-argdumper exited with error -1). consider launching with 'process launch'.


Command 'run' failed!

FAIL: LLDB (/Users/buildslave/jenkins/workspace/lldb-cmake-matrix/clang_701_build/bin/clang-7-x86_64) :: test_uint8_t_dsym (TestCPP11EnumTypes.CPP11EnumTypesTestCase)
runCmd: settings set symbols.enable-external-lookup false
output: 

runCmd: settings set plugin.process.gdb-remote.packet-timeout 60
output: 

runCmd: settings set symbols.clang-modules-cache-path "/Users/buildslave/jenkins/workspace/lldb-cmake-matrix/lldb-build/tools/lldb/lldb-test-build.noindex/module-cache-lldb"
output: 

runCmd: settings set use-color false
output: 

runCmd: file /Users/buildslave/jenkins/workspace/lldb-cmake-matrix/lldb-build/tools/lldb/lldb-test-build.noindex/lang/cpp/enum_types/TestCPP11EnumTypes.test_uint8_t_dwarf/a.out
output: Current executable set to '/Users/buildslave/jenkins/workspace/lldb-cmake-matrix/lldb-build/tools/lldb/lldb-test-build.noindex/lang/cpp/enum_types/TestCPP11EnumTypes.test_uint8_t_dwarf/a.out' (x86_64).


runCmd: breakpoint set -f "main.cpp" -l 29
output: Breakpoint 1: where = a.out`main + 49 at main.cpp:29:38, address = 0x0000000100000f51


Expecting pattern: ^Breakpoint (?P<bpno>[0-9]+): (?P<num_locations>[0-9]+) locations\.$
Not matched

Expecting pattern: ^Breakpoint (?P<bpno>[0-9]+): (?P<num_locations>no) locations \(pending\)\.
Not matched

Expecting pattern: ^Breakpoint (?P<bpno>[0-9]+): where = (?P<module>.*)`(?P<symbol>[+\-]{0,1}[^+]+)( \+ (?P<offset>[0-9]+)){0,1}( \[inlined\] (?P<inline_symbol>.*)){0,1} at (?P<file>[^:]+):(?P<line_no>[0-9]+)(?P<column>(:[0-9]+)?), address = (?P<address>0x[0-9a-fA-F]+)$
Matched

runCmd: run
runCmd failed!
error: process exited with status -1 (Error 1)


Command 'run' failed!

FAIL: LLDB (/Users/buildslave/jenkins/workspace/lldb-cmake-matrix/clang_701_build/bin/clang-7-x86_64) :: test_uint8_t_dwarf (TestCPP11EnumTypes.CPP11EnumTypesTestCase)
<bound method SBProcess.Kill of <lldb.SBProcess; proxy of <Swig Object of type 'lldb::SBProcess *' at 0x1045dd5a0> >>: success

UNSUPPORTED: LLDB (/Users/buildslave/jenkins/workspace/lldb-cmake-matrix/clang_701_build/bin/clang-7-x86_64) :: test_uint8_t_dwo (TestCPP11EnumTypes.CPP11EnumTypesTestCase) (test case does not fall in any category of interest for this run) 
UNSUPPORTED: LLDB (/Users/buildslave/jenkins/workspace/lldb-cmake-matrix/clang_701_build/bin/clang-7-x86_64) :: test_uint8_t_gmodules (TestCPP11EnumTypes.CPP11EnumTypesTestCase) (test case does not fall in any category of interest for this run) 
Restore dir to: /Users/buildslave/jenkins/workspace/lldb-cmake-matrix/lldb-build/tools/lldb/lit
======================================================================
ERROR: test_uint16_t_dwarf (TestCPP11EnumTypes.CPP11EnumTypesTestCase)
    Test C++11 enumeration class types as uint16_t types.
----------------------------------------------------------------------
Error when building test subject.

Build Command:
make VPATH=/Users/buildslave/jenkins/workspace/lldb-cmake-matrix/llvm-project/lldb/packages/Python/lldbsuite/test/lang/cpp/enum_types -C /Users/buildslave/jenkins/workspace/lldb-cmake-matrix/lldb-build/tools/lldb/lldb-test-build.noindex/lang/cpp/enum_types/TestCPP11EnumTypes.test_uint16_t_dwarf -I /Users/buildslave/jenkins/workspace/lldb-cmake-matrix/llvm-project/lldb/packages/Python/lldbsuite/test/lang/cpp/enum_types -I /Users/buildslave/jenkins/workspace/lldb-cmake-matrix/llvm-project/lldb/packages/Python/lldbsuite/test/make -f /Users/buildslave/jenkins/workspace/lldb-cmake-matrix/llvm-project/lldb/packages/Python/lldbsuite/test/lang/cpp/enum_types/Makefile MAKE_DSYM=NO ARCH=x86_64 CC="/Users/buildslave/jenkins/workspace/lldb-cmake-matrix/clang_701_build/bin/clang-7" CFLAGS_EXTRAS='"-DTEST_BLOCK_CAPTURED_VARS=uint16_t"'

Build Command Output:
clang-7: error: unable to execute command: Killed: 9
clang-7: error: clang frontend command failed due to signal (use -v to see invocation)
clang version 7.0.1 
Target: x86_64-apple-darwin18.0.0
Thread model: posix
InstalledDir: /Users/buildslave/jenkins/workspace/lldb-cmake-matrix/clang_701_build/bin
clang-7: note: diagnostic msg: PLEASE submit a bug report to https://bugs.llvm.org/ and include the crash backtrace, preprocessed source, and associated run script.
clang-7: note: diagnostic msg: 
********************

PLEASE ATTACH THE FOLLOWING FILES TO THE BUG REPORT:
Preprocessed source(s) and associated run script(s) are located at:
clang-7: note: diagnostic msg: /var/folders/09/r4vw4v8n5kb67jl66zvlbljw0000gn/T/lit_tmp_bT7Zaw/main-6dcabd.cpp
clang-7: note: diagnostic msg: /var/folders/09/r4vw4v8n5kb67jl66zvlbljw0000gn/T/lit_tmp_bT7Zaw/main-6dcabd.sh
clang-7: note: diagnostic msg: Crash backtrace is located in
clang-7: note: diagnostic msg: /Users/buildslave/Library/Logs/DiagnosticReports/clang-7_<YYYY-MM-DD-HHMMSS>_<hostname>.crash
clang-7: note: diagnostic msg: (choose the .crash file that corresponds to your crash)
clang-7: note: diagnostic msg: 

********************
make: *** [main.o] Error 254

Test Directory:
/Users/buildslave/jenkins/workspace/lldb-cmake-matrix/llvm-project/lldb/packages/Python/lldbsuite/test/lang/cpp/enum_types
======================================================================
ERROR: test_uint32_t_dsym (TestCPP11EnumTypes.CPP11EnumTypesTestCase)
    Test C++11 enumeration class types as uint32_t types.
----------------------------------------------------------------------
Error when building test subject.

Build Command:
make VPATH=/Users/buildslave/jenkins/workspace/lldb-cmake-matrix/llvm-project/lldb/packages/Python/lldbsuite/test/lang/cpp/enum_types -C /Users/buildslave/jenkins/workspace/lldb-cmake-matrix/lldb-build/tools/lldb/lldb-test-build.noindex/lang/cpp/enum_types/TestCPP11EnumTypes.test_uint32_t_dsym -I /Users/buildslave/jenkins/workspace/lldb-cmake-matrix/llvm-project/lldb/packages/Python/lldbsuite/test/lang/cpp/enum_types -I /Users/buildslave/jenkins/workspace/lldb-cmake-matrix/llvm-project/lldb/packages/Python/lldbsuite/test/make -f /Users/buildslave/jenkins/workspace/lldb-cmake-matrix/llvm-project/lldb/packages/Python/lldbsuite/test/lang/cpp/enum_types/Makefile MAKE_DSYM=YES ARCH=x86_64 CC="/Users/buildslave/jenkins/workspace/lldb-cmake-matrix/clang_701_build/bin/clang-7" all CFLAGS_EXTRAS='"-DTEST_BLOCK_CAPTURED_VARS=uint32_t"'

Build Command Output:
/bin/sh: line 1: 91499 Killed: 9               /Users/buildslave/jenkins/workspace/lldb-cmake-matrix/clang_701_build/bin/clang-7 -M -std=c++11 -std=c++11 -g -O0 -fno-builtin -isysroot "/Applications/Xcode.app/Contents/Developer/Platforms/MacOSX.platform/Developer/SDKs/MacOSX10.14.sdk" -arch x86_64 -I/Users/buildslave/jenkins/workspace/lldb-cmake-matrix/llvm-project/lldb/packages/Python/lldbsuite/test/make/../../../../../include -I/Users/buildslave/jenkins/workspace/lldb-cmake-matrix/llvm-project/lldb/packages/Python/lldbsuite/test/lang/cpp/enum_types -I/Users/buildslave/jenkins/workspace/lldb-cmake-matrix/llvm-project/lldb/packages/Python/lldbsuite/test/make -include /Users/buildslave/jenkins/workspace/lldb-cmake-matrix/llvm-project/lldb/packages/Python/lldbsuite/test/make/test_common.h -fno-limit-debug-info "-DTEST_BLOCK_CAPTURED_VARS=uint32_t" --driver-mode=g++ /Users/buildslave/jenkins/workspace/lldb-cmake-matrix/llvm-project/lldb/packages/Python/lldbsuite/test/lang/cpp/enum_types/main.cpp > main.d.tmp
make: *** [main.o] Killed: 9

Test Directory:
/Users/buildslave/jenkins/workspace/lldb-cmake-matrix/llvm-project/lldb/packages/Python/lldbsuite/test/lang/cpp/enum_types
======================================================================
ERROR: test_uint32_t_dwarf (TestCPP11EnumTypes.CPP11EnumTypesTestCase)
    Test C++11 enumeration class types as uint32_t types.
----------------------------------------------------------------------
Error when building test subject.

Build Command:
make VPATH=/Users/buildslave/jenkins/workspace/lldb-cmake-matrix/llvm-project/lldb/packages/Python/lldbsuite/test/lang/cpp/enum_types -C /Users/buildslave/jenkins/workspace/lldb-cmake-matrix/lldb-build/tools/lldb/lldb-test-build.noindex/lang/cpp/enum_types/TestCPP11EnumTypes.test_uint32_t_dwarf -I /Users/buildslave/jenkins/workspace/lldb-cmake-matrix/llvm-project/lldb/packages/Python/lldbsuite/test/lang/cpp/enum_types -I /Users/buildslave/jenkins/workspace/lldb-cmake-matrix/llvm-project/lldb/packages/Python/lldbsuite/test/make -f /Users/buildslave/jenkins/workspace/lldb-cmake-matrix/llvm-project/lldb/packages/Python/lldbsuite/test/lang/cpp/enum_types/Makefile MAKE_DSYM=NO ARCH=x86_64 CC="/Users/buildslave/jenkins/workspace/lldb-cmake-matrix/clang_701_build/bin/clang-7" CFLAGS_EXTRAS='"-DTEST_BLOCK_CAPTURED_VARS=uint32_t"'

Build Command Output:
/bin/sh: line 1: 91618 Killed: 9               /Users/buildslave/jenkins/workspace/lldb-cmake-matrix/clang_701_build/bin/clang-7 -M -std=c++11 -std=c++11 -g -O0 -fno-builtin -isysroot "/Applications/Xcode.app/Contents/Developer/Platforms/MacOSX.platform/Developer/SDKs/MacOSX10.14.sdk" -arch x86_64 -I/Users/buildslave/jenkins/workspace/lldb-cmake-matrix/llvm-project/lldb/packages/Python/lldbsuite/test/make/../../../../../include -I/Users/buildslave/jenkins/workspace/lldb-cmake-matrix/llvm-project/lldb/packages/Python/lldbsuite/test/lang/cpp/enum_types -I/Users/buildslave/jenkins/workspace/lldb-cmake-matrix/llvm-project/lldb/packages/Python/lldbsuite/test/make -include /Users/buildslave/jenkins/workspace/lldb-cmake-matrix/llvm-project/lldb/packages/Python/lldbsuite/test/make/test_common.h -fno-limit-debug-info "-DTEST_BLOCK_CAPTURED_VARS=uint32_t" --driver-mode=g++ /Users/buildslave/jenkins/workspace/lldb-cmake-matrix/llvm-project/lldb/packages/Python/lldbsuite/test/lang/cpp/enum_types/main.cpp > main.d.tmp
make: *** [a.out] Killed: 9

Test Directory:
/Users/buildslave/jenkins/workspace/lldb-cmake-matrix/llvm-project/lldb/packages/Python/lldbsuite/test/lang/cpp/enum_types
======================================================================
FAIL: test_uint64_t_dwarf (TestCPP11EnumTypes.CPP11EnumTypesTestCase)
    Test C++11 enumeration class types as uint64_t types.
----------------------------------------------------------------------
Traceback (most recent call last):
  File "/Users/buildslave/jenkins/workspace/lldb-cmake-matrix/llvm-project/lldb/packages/Python/lldbsuite/test/lldbtest.py", line 1748, in test_method
    return attrvalue(self)
  File "/Users/buildslave/jenkins/workspace/lldb-cmake-matrix/llvm-project/lldb/packages/Python/lldbsuite/test/decorators.py", line 111, in wrapper
    func(*args, **kwargs)
  File "/Users/buildslave/jenkins/workspace/lldb-cmake-matrix/llvm-project/lldb/packages/Python/lldbsuite/test/decorators.py", line 141, in wrapper
    func(*args, **kwargs)
  File "/Users/buildslave/jenkins/workspace/lldb-cmake-matrix/llvm-project/lldb/packages/Python/lldbsuite/test/lang/cpp/enum_types/TestCPP11EnumTypes.py", line 86, in test_uint64_t
    self.image_lookup_for_enum_type()
  File "/Users/buildslave/jenkins/workspace/lldb-cmake-matrix/llvm-project/lldb/packages/Python/lldbsuite/test/lang/cpp/enum_types/TestCPP11EnumTypes.py", line 103, in image_lookup_for_enum_type
    self.runCmd("run", RUN_SUCCEEDED)
  File "/Users/buildslave/jenkins/workspace/lldb-cmake-matrix/llvm-project/lldb/packages/Python/lldbsuite/test/lldbtest.py", line 2068, in runCmd
    msg if (msg) else CMD_MSG(cmd))
AssertionError: False is not True : Process is launched successfully
Error output:
error: shell expansion failed (reason: lldb-argdumper exited with error -1). consider launching with 'process launch'.

Config=x86_64-/Users/buildslave/jenkins/workspace/lldb-cmake-matrix/clang_701_build/bin/clang-7
======================================================================
FAIL: test_uint8_t_dsym (TestCPP11EnumTypes.CPP11EnumTypesTestCase)
    Test C++11 enumeration class types as uint8_t types.
----------------------------------------------------------------------
Traceback (most recent call last):
  File "/Users/buildslave/jenkins/workspace/lldb-cmake-matrix/llvm-project/lldb/packages/Python/lldbsuite/test/lldbtest.py", line 1748, in test_method
    return attrvalue(self)
  File "/Users/buildslave/jenkins/workspace/lldb-cmake-matrix/llvm-project/lldb/packages/Python/lldbsuite/test/decorators.py", line 111, in wrapper
    func(*args, **kwargs)
  File "/Users/buildslave/jenkins/workspace/lldb-cmake-matrix/llvm-project/lldb/packages/Python/lldbsuite/test/decorators.py", line 141, in wrapper
    func(*args, **kwargs)
  File "/Users/buildslave/jenkins/workspace/lldb-cmake-matrix/llvm-project/lldb/packages/Python/lldbsuite/test/lang/cpp/enum_types/TestCPP11EnumTypes.py", line 59, in test_uint8_t
    self.image_lookup_for_enum_type()
  File "/Users/buildslave/jenkins/workspace/lldb-cmake-matrix/llvm-project/lldb/packages/Python/lldbsuite/test/lang/cpp/enum_types/TestCPP11EnumTypes.py", line 103, in image_lookup_for_enum_type
    self.runCmd("run", RUN_SUCCEEDED)
  File "/Users/buildslave/jenkins/workspace/lldb-cmake-matrix/llvm-project/lldb/packages/Python/lldbsuite/test/lldbtest.py", line 2068, in runCmd
    msg if (msg) else CMD_MSG(cmd))
AssertionError: False is not True : Process is launched successfully
Error output:
error: shell expansion failed (reason: lldb-argdumper exited with error -1). consider launching with 'process launch'.

Config=x86_64-/Users/buildslave/jenkins/workspace/lldb-cmake-matrix/clang_701_build/bin/clang-7
======================================================================
FAIL: test_uint8_t_dwarf (TestCPP11EnumTypes.CPP11EnumTypesTestCase)
    Test C++11 enumeration class types as uint8_t types.
----------------------------------------------------------------------
Traceback (most recent call last):
  File "/Users/buildslave/jenkins/workspace/lldb-cmake-matrix/llvm-project/lldb/packages/Python/lldbsuite/test/lldbtest.py", line 1748, in test_method
    return attrvalue(self)
  File "/Users/buildslave/jenkins/workspace/lldb-cmake-matrix/llvm-project/lldb/packages/Python/lldbsuite/test/decorators.py", line 111, in wrapper
    func(*args, **kwargs)
  File "/Users/buildslave/jenkins/workspace/lldb-cmake-matrix/llvm-project/lldb/packages/Python/lldbsuite/test/decorators.py", line 141, in wrapper
    func(*args, **kwargs)
  File "/Users/buildslave/jenkins/workspace/lldb-cmake-matrix/llvm-project/lldb/packages/Python/lldbsuite/test/lang/cpp/enum_types/TestCPP11EnumTypes.py", line 59, in test_uint8_t
    self.image_lookup_for_enum_type()
  File "/Users/buildslave/jenkins/workspace/lldb-cmake-matrix/llvm-project/lldb/packages/Python/lldbsuite/test/lang/cpp/enum_types/TestCPP11EnumTypes.py", line 103, in image_lookup_for_enum_type
    self.runCmd("run", RUN_SUCCEEDED)
  File "/Users/buildslave/jenkins/workspace/lldb-cmake-matrix/llvm-project/lldb/packages/Python/lldbsuite/test/lldbtest.py", line 2068, in runCmd
    msg if (msg) else CMD_MSG(cmd))
AssertionError: False is not True : Process is launched successfully
Error output:
error: process exited with status -1 (Error 1)

Config=x86_64-/Users/buildslave/jenkins/workspace/lldb-cmake-matrix/clang_701_build/bin/clang-7
----------------------------------------------------------------------
Ran 32 tests in 14.646s

RESULT: FAILED (9 passes, 3 failures, 3 errors, 17 skipped, 0 expected failures, 0 unexpected successes)