Regression

Test Clang 7.0.1 / lldb-Suite.lang/cpp/global_operators.TestCppGlobalOperators.py (from lldb-Suite)

Failing for the past 1 build (Since Unstable#270 )
Took 2.8 sec.

Stacktrace

lldb version 10.0.99 (http://labmaster3.local/git/llvm-project.git revision 1a3dd638c4a9173e53628b497a1aadc31c32eb50)
  clang revision daa79c5338228a746a7eba0cf2f2f356e1d45a5b
  llvm revision daa79c5338228a746a7eba0cf2f2f356e1d45a5b
LLDB library dir: /Users/buildslave/jenkins/workspace/lldb-cmake-matrix/lldb-build/bin
LLDB import library dir: /Users/buildslave/jenkins/workspace/lldb-cmake-matrix/lldb-build/bin
libstdcxx tests will not be run because: Don't know how to build with libstdcxx on macosx
Skipping following debug info categories: ['dwo']

Session logs for test failures/errors/unexpected successes will go into directory '/Users/buildslave/jenkins/workspace/lldb-cmake-matrix/test/logs'
Command invoked: /Users/buildslave/jenkins/workspace/lldb-cmake-matrix/llvm-project/lldb/test/dotest.py --arch=x86_64 -s /Users/buildslave/jenkins/workspace/lldb-cmake-matrix/lldb-build/lldb-test-traces -S nm -u CXXFLAGS -u CFLAGS --executable /Users/buildslave/jenkins/workspace/lldb-cmake-matrix/lldb-build/./bin/lldb --dsymutil /Users/buildslave/jenkins/workspace/lldb-cmake-matrix/lldb-build/./bin/dsymutil --filecheck /Users/buildslave/jenkins/workspace/lldb-cmake-matrix/lldb-build/./bin/FileCheck -C /Users/buildslave/jenkins/workspace/lldb-cmake-matrix/clang_701_build/bin/clang --codesign-identity lldb_codesign --server /Users/buildslave/jenkins/workspace/lldb-cmake-matrix/lldb-build/./bin/debugserver --arch x86_64 --build-dir /Users/buildslave/jenkins/workspace/lldb-cmake-matrix/lldb-build/lldb-test-build.noindex -s=/Users/buildslave/jenkins/workspace/lldb-cmake-matrix/test/logs -t --env TERM=vt100 --skip-category gmodules --skip-category watchpoint --arch=x86_64 --env LLVM_LIBS_DIR=/Users/buildslave/jenkins/workspace/lldb-cmake-matrix/lldb-build/./lib --build-dir /Users/buildslave/jenkins/workspace/lldb-cmake-matrix/lldb-build/tools/lldb/lldb-test-build.noindex --module-cache-dir /Users/buildslave/jenkins/workspace/lldb-cmake-matrix/lldb-build/tools/lldb/lldb-test-build.noindex/module-cache-lldb /Users/buildslave/jenkins/workspace/lldb-cmake-matrix/llvm-project/lldb/packages/Python/lldbsuite/test/lang/cpp/global_operators -p TestCppGlobalOperators.py
Change dir to: /Users/buildslave/jenkins/workspace/lldb-cmake-matrix/llvm-project/lldb/packages/Python/lldbsuite/test/lang/cpp/global_operators
runCmd: settings set symbols.enable-external-lookup false
output: 

runCmd: settings set plugin.process.gdb-remote.packet-timeout 60
output: 

runCmd: settings set symbols.clang-modules-cache-path "/Users/buildslave/jenkins/workspace/lldb-cmake-matrix/lldb-build/tools/lldb/lldb-test-build.noindex/module-cache-lldb"
output: 

runCmd: settings set use-color false
output: 

FAIL: LLDB (/Users/buildslave/jenkins/workspace/lldb-cmake-matrix/clang_701_build/bin/clang-7-x86_64) :: test_equals_operator_dsym (TestCppGlobalOperators.TestCppGlobalOperators)
<bound method SBProcess.Kill of <lldb.SBProcess; proxy of <Swig Object of type 'lldb::SBProcess *' at 0x106833840> >>: success

runCmd: settings set symbols.enable-external-lookup false
output: 

runCmd: settings set plugin.process.gdb-remote.packet-timeout 60
output: 

runCmd: settings set symbols.clang-modules-cache-path "/Users/buildslave/jenkins/workspace/lldb-cmake-matrix/lldb-build/tools/lldb/lldb-test-build.noindex/module-cache-lldb"
output: 

runCmd: settings set use-color false
output: 

FAIL: LLDB (/Users/buildslave/jenkins/workspace/lldb-cmake-matrix/clang_701_build/bin/clang-7-x86_64) :: test_equals_operator_dwarf (TestCppGlobalOperators.TestCppGlobalOperators)
<bound method SBProcess.Kill of <lldb.SBProcess; proxy of <Swig Object of type 'lldb::SBProcess *' at 0x10677acc0> >>: success

UNSUPPORTED: LLDB (/Users/buildslave/jenkins/workspace/lldb-cmake-matrix/clang_701_build/bin/clang-7-x86_64) :: test_equals_operator_dwo (TestCppGlobalOperators.TestCppGlobalOperators) (test case does not fall in any category of interest for this run) 
UNSUPPORTED: LLDB (/Users/buildslave/jenkins/workspace/lldb-cmake-matrix/clang_701_build/bin/clang-7-x86_64) :: test_equals_operator_gmodules (TestCppGlobalOperators.TestCppGlobalOperators) (test case does not fall in any category of interest for this run) 
runCmd: settings set symbols.enable-external-lookup false
output: 

runCmd: settings set plugin.process.gdb-remote.packet-timeout 60
output: 

runCmd: settings set symbols.clang-modules-cache-path "/Users/buildslave/jenkins/workspace/lldb-cmake-matrix/lldb-build/tools/lldb/lldb-test-build.noindex/module-cache-lldb"
output: 

runCmd: settings set use-color false
output: 

FAIL: LLDB (/Users/buildslave/jenkins/workspace/lldb-cmake-matrix/clang_701_build/bin/clang-7-x86_64) :: test_operator_new_dsym (TestCppGlobalOperators.TestCppGlobalOperators)
<bound method SBProcess.Kill of <lldb.SBProcess; proxy of <Swig Object of type 'lldb::SBProcess *' at 0x1068d6d20> >>: success

runCmd: settings set symbols.enable-external-lookup false
output: 

runCmd: settings set plugin.process.gdb-remote.packet-timeout 60
output: 

runCmd: settings set symbols.clang-modules-cache-path "/Users/buildslave/jenkins/workspace/lldb-cmake-matrix/lldb-build/tools/lldb/lldb-test-build.noindex/module-cache-lldb"
output: 

runCmd: settings set use-color false
output: 

FAIL: LLDB (/Users/buildslave/jenkins/workspace/lldb-cmake-matrix/clang_701_build/bin/clang-7-x86_64) :: test_operator_new_dwarf (TestCppGlobalOperators.TestCppGlobalOperators)
UNSUPPORTED: LLDB (/Users/buildslave/jenkins/workspace/lldb-cmake-matrix/clang_701_build/bin/clang-7-x86_64) :: test_operator_new_dwo (TestCppGlobalOperators.TestCppGlobalOperators) (test case does not fall in any category of interest for this run) 
UNSUPPORTED: LLDB (/Users/buildslave/jenkins/workspace/lldb-cmake-matrix/clang_701_build/bin/clang-7-x86_64) :: test_operator_new_gmodules (TestCppGlobalOperators.TestCppGlobalOperators) (test case does not fall in any category of interest for this run) 
Restore dir to: /Users/buildslave/jenkins/workspace/lldb-cmake-matrix/lldb-build/tools/lldb/lit
======================================================================
ERROR: test_operator_new_dwarf (TestCppGlobalOperators.TestCppGlobalOperators)
----------------------------------------------------------------------
Error when building test subject.

Build Command:
make VPATH=/Users/buildslave/jenkins/workspace/lldb-cmake-matrix/llvm-project/lldb/packages/Python/lldbsuite/test/lang/cpp/global_operators -C /Users/buildslave/jenkins/workspace/lldb-cmake-matrix/lldb-build/tools/lldb/lldb-test-build.noindex/lang/cpp/global_operators/TestCppGlobalOperators.test_operator_new_dwarf -I /Users/buildslave/jenkins/workspace/lldb-cmake-matrix/llvm-project/lldb/packages/Python/lldbsuite/test/lang/cpp/global_operators -I /Users/buildslave/jenkins/workspace/lldb-cmake-matrix/llvm-project/lldb/packages/Python/lldbsuite/test/make -f /Users/buildslave/jenkins/workspace/lldb-cmake-matrix/llvm-project/lldb/packages/Python/lldbsuite/test/lang/cpp/global_operators/Makefile MAKE_DSYM=NO ARCH=x86_64 CC="/Users/buildslave/jenkins/workspace/lldb-cmake-matrix/clang_701_build/bin/clang-7" 

Build Command Output:
make: *** [main.o] Killed: 9

Test Directory:
/Users/buildslave/jenkins/workspace/lldb-cmake-matrix/llvm-project/lldb/packages/Python/lldbsuite/test/lang/cpp/global_operators
======================================================================
FAIL: test_equals_operator_dsym (TestCppGlobalOperators.TestCppGlobalOperators)
----------------------------------------------------------------------
Traceback (most recent call last):
  File "/Users/buildslave/jenkins/workspace/lldb-cmake-matrix/llvm-project/lldb/packages/Python/lldbsuite/test/lldbtest.py", line 1748, in test_method
    return attrvalue(self)
  File "/Users/buildslave/jenkins/workspace/lldb-cmake-matrix/llvm-project/lldb/packages/Python/lldbsuite/test/lang/cpp/global_operators/TestCppGlobalOperators.py", line 53, in test_equals_operator
    frame = self.prepare_executable_and_get_frame()
  File "/Users/buildslave/jenkins/workspace/lldb-cmake-matrix/llvm-project/lldb/packages/Python/lldbsuite/test/lang/cpp/global_operators/TestCppGlobalOperators.py", line 46, in prepare_executable_and_get_frame
    PROCESS_STOPPED)
AssertionError: False is not True : Process status should be stopped
Config=x86_64-/Users/buildslave/jenkins/workspace/lldb-cmake-matrix/clang_701_build/bin/clang-7
======================================================================
FAIL: test_equals_operator_dwarf (TestCppGlobalOperators.TestCppGlobalOperators)
----------------------------------------------------------------------
Traceback (most recent call last):
  File "/Users/buildslave/jenkins/workspace/lldb-cmake-matrix/llvm-project/lldb/packages/Python/lldbsuite/test/lldbtest.py", line 1748, in test_method
    return attrvalue(self)
  File "/Users/buildslave/jenkins/workspace/lldb-cmake-matrix/llvm-project/lldb/packages/Python/lldbsuite/test/lang/cpp/global_operators/TestCppGlobalOperators.py", line 53, in test_equals_operator
    frame = self.prepare_executable_and_get_frame()
  File "/Users/buildslave/jenkins/workspace/lldb-cmake-matrix/llvm-project/lldb/packages/Python/lldbsuite/test/lang/cpp/global_operators/TestCppGlobalOperators.py", line 46, in prepare_executable_and_get_frame
    PROCESS_STOPPED)
AssertionError: False is not True : Process status should be stopped
Config=x86_64-/Users/buildslave/jenkins/workspace/lldb-cmake-matrix/clang_701_build/bin/clang-7
======================================================================
FAIL: test_operator_new_dsym (TestCppGlobalOperators.TestCppGlobalOperators)
----------------------------------------------------------------------
Traceback (most recent call last):
  File "/Users/buildslave/jenkins/workspace/lldb-cmake-matrix/llvm-project/lldb/packages/Python/lldbsuite/test/lldbtest.py", line 1748, in test_method
    return attrvalue(self)
  File "/Users/buildslave/jenkins/workspace/lldb-cmake-matrix/llvm-project/lldb/packages/Python/lldbsuite/test/lang/cpp/global_operators/TestCppGlobalOperators.py", line 90, in test_operator_new
    frame = self.prepare_executable_and_get_frame()
  File "/Users/buildslave/jenkins/workspace/lldb-cmake-matrix/llvm-project/lldb/packages/Python/lldbsuite/test/lang/cpp/global_operators/TestCppGlobalOperators.py", line 46, in prepare_executable_and_get_frame
    PROCESS_STOPPED)
AssertionError: False is not True : Process status should be stopped
Config=x86_64-/Users/buildslave/jenkins/workspace/lldb-cmake-matrix/clang_701_build/bin/clang-7
----------------------------------------------------------------------
Ran 8 tests in 2.280s

RESULT: FAILED (0 passes, 3 failures, 1 errors, 4 skipped, 0 expected failures, 0 unexpected successes)