Regression

Test Clang 7.0.1 / lldb-Suite.python_api/module_section.TestModuleAndSection.py (from lldb-Suite)

Failing for the past 1 build (Since Unstable#270 )
Took 17 sec.

Stacktrace

lldb version 10.0.99 (http://labmaster3.local/git/llvm-project.git revision 1a3dd638c4a9173e53628b497a1aadc31c32eb50)
  clang revision daa79c5338228a746a7eba0cf2f2f356e1d45a5b
  llvm revision daa79c5338228a746a7eba0cf2f2f356e1d45a5b
LLDB library dir: /Users/buildslave/jenkins/workspace/lldb-cmake-matrix/lldb-build/bin
LLDB import library dir: /Users/buildslave/jenkins/workspace/lldb-cmake-matrix/lldb-build/bin
libstdcxx tests will not be run because: Don't know how to build with libstdcxx on macosx
Skipping following debug info categories: ['dwo']
Number of modules for the target: 39
(x86_64) /Users/buildslave/jenkins/workspace/lldb-cmake-matrix/lldb-build/tools/lldb/lldb-test-build.noindex/python_api/module_section/TestModuleAndSection.test_module_and_section_boundary_condition_dsym/a.out
(x86_64) /usr/lib/dyld
(x86_64) /usr/lib/libc++.1.dylib
(x86_64) /usr/lib/libSystem.B.dylib
(x86_64) /usr/lib/libc++abi.dylib
(x86_64) /usr/lib/system/libcache.dylib
(x86_64) /usr/lib/system/libcommonCrypto.dylib
(x86_64) /usr/lib/system/libcompiler_rt.dylib
(x86_64) /usr/lib/system/libcopyfile.dylib
(x86_64) /usr/lib/system/libcorecrypto.dylib
(x86_64) /usr/lib/system/libdispatch.dylib
(x86_64) /usr/lib/system/libdyld.dylib
(x86_64) /usr/lib/system/libkeymgr.dylib
(x86_64) /usr/lib/system/liblaunch.dylib
(x86_64) /usr/lib/system/libmacho.dylib
(x86_64) /usr/lib/system/libquarantine.dylib
(x86_64) /usr/lib/system/libremovefile.dylib
(x86_64) /usr/lib/system/libsystem_asl.dylib
(x86_64) /usr/lib/system/libsystem_blocks.dylib
(x86_64) /usr/lib/system/libsystem_c.dylib
(x86_64) /usr/lib/system/libsystem_configuration.dylib
(x86_64) /usr/lib/system/libsystem_coreservices.dylib
(x86_64) /usr/lib/system/libsystem_darwin.dylib
(x86_64) /usr/lib/system/libsystem_dnssd.dylib
(x86_64) /usr/lib/system/libsystem_info.dylib
(x86_64) /usr/lib/system/libsystem_m.dylib
(x86_64) /usr/lib/system/libsystem_malloc.dylib
(x86_64) /usr/lib/system/libsystem_networkextension.dylib
(x86_64) /usr/lib/system/libsystem_notify.dylib
(x86_64) /usr/lib/system/libsystem_sandbox.dylib
(x86_64) /usr/lib/system/libsystem_secinit.dylib
(x86_64) /usr/lib/system/libsystem_kernel.dylib
(x86_64) /usr/lib/system/libsystem_platform.dylib
(x86_64) /usr/lib/system/libsystem_pthread.dylib
(x86_64) /usr/lib/system/libsystem_symptoms.dylib
(x86_64) /usr/lib/system/libsystem_trace.dylib
(x86_64) /usr/lib/system/libunwind.dylib
(x86_64) /usr/lib/system/libxpc.dylib
(x86_64) /usr/lib/libobjc.A.dylib
Exe module: (x86_64) /Users/buildslave/jenkins/workspace/lldb-cmake-matrix/lldb-build/tools/lldb/lldb-test-build.noindex/python_api/module_section/TestModuleAndSection.test_module_and_section_boundary_condition_dsym/a.out
Number of sections: 5
[0x0000000100000000-0x0000000100004000) a.out.__TEXT
Number of modules for the target: 39
(x86_64) /Users/buildslave/jenkins/workspace/lldb-cmake-matrix/lldb-build/tools/lldb/lldb-test-build.noindex/python_api/module_section/TestModuleAndSection.test_module_and_section_boundary_condition_dwarf/a.out
(x86_64) /usr/lib/dyld
(x86_64) /usr/lib/libc++.1.dylib
(x86_64) /usr/lib/libSystem.B.dylib
(x86_64) /usr/lib/libc++abi.dylib
(x86_64) /usr/lib/system/libcache.dylib
(x86_64) /usr/lib/system/libcommonCrypto.dylib
(x86_64) /usr/lib/system/libcompiler_rt.dylib
(x86_64) /usr/lib/system/libcopyfile.dylib
(x86_64) /usr/lib/system/libcorecrypto.dylib
(x86_64) /usr/lib/system/libdispatch.dylib
(x86_64) /usr/lib/system/libdyld.dylib
(x86_64) /usr/lib/system/libkeymgr.dylib
(x86_64) /usr/lib/system/liblaunch.dylib
(x86_64) /usr/lib/system/libmacho.dylib
(x86_64) /usr/lib/system/libquarantine.dylib
(x86_64) /usr/lib/system/libremovefile.dylib
(x86_64) /usr/lib/system/libsystem_asl.dylib
(x86_64) /usr/lib/system/libsystem_blocks.dylib
(x86_64) /usr/lib/system/libsystem_c.dylib
(x86_64) /usr/lib/system/libsystem_configuration.dylib
(x86_64) /usr/lib/system/libsystem_coreservices.dylib
(x86_64) /usr/lib/system/libsystem_darwin.dylib
(x86_64) /usr/lib/system/libsystem_dnssd.dylib
(x86_64) /usr/lib/system/libsystem_info.dylib
(x86_64) /usr/lib/system/libsystem_m.dylib
(x86_64) /usr/lib/system/libsystem_malloc.dylib
(x86_64) /usr/lib/system/libsystem_networkextension.dylib
(x86_64) /usr/lib/system/libsystem_notify.dylib
(x86_64) /usr/lib/system/libsystem_sandbox.dylib
(x86_64) /usr/lib/system/libsystem_secinit.dylib
(x86_64) /usr/lib/system/libsystem_kernel.dylib
(x86_64) /usr/lib/system/libsystem_platform.dylib
(x86_64) /usr/lib/system/libsystem_pthread.dylib
(x86_64) /usr/lib/system/libsystem_symptoms.dylib
(x86_64) /usr/lib/system/libsystem_trace.dylib
(x86_64) /usr/lib/system/libunwind.dylib
(x86_64) /usr/lib/system/libxpc.dylib
(x86_64) /usr/lib/libobjc.A.dylib
Exe module: (x86_64) /Users/buildslave/jenkins/workspace/lldb-cmake-matrix/lldb-build/tools/lldb/lldb-test-build.noindex/python_api/module_section/TestModuleAndSection.test_module_and_section_boundary_condition_dwarf/a.out
Number of sections: 4
[0x0000000100000000-0x0000000100004000) a.out.__TEXT
Number of modules for the target: 39
(x86_64) /Users/buildslave/jenkins/workspace/lldb-cmake-matrix/lldb-build/tools/lldb/lldb-test-build.noindex/python_api/module_section/TestModuleAndSection.test_module_and_section_dsym/a.out
(x86_64) /usr/lib/dyld
(x86_64) /usr/lib/libc++.1.dylib
(x86_64) /usr/lib/libSystem.B.dylib
(x86_64) /usr/lib/libc++abi.dylib
(x86_64) /usr/lib/system/libcache.dylib
(x86_64) /usr/lib/system/libcommonCrypto.dylib
(x86_64) /usr/lib/system/libcompiler_rt.dylib
(x86_64) /usr/lib/system/libcopyfile.dylib
(x86_64) /usr/lib/system/libcorecrypto.dylib
(x86_64) /usr/lib/system/libdispatch.dylib
(x86_64) /usr/lib/system/libdyld.dylib
(x86_64) /usr/lib/system/libkeymgr.dylib
(x86_64) /usr/lib/system/liblaunch.dylib
(x86_64) /usr/lib/system/libmacho.dylib
(x86_64) /usr/lib/system/libquarantine.dylib
(x86_64) /usr/lib/system/libremovefile.dylib
(x86_64) /usr/lib/system/libsystem_asl.dylib
(x86_64) /usr/lib/system/libsystem_blocks.dylib
(x86_64) /usr/lib/system/libsystem_c.dylib
(x86_64) /usr/lib/system/libsystem_configuration.dylib
(x86_64) /usr/lib/system/libsystem_coreservices.dylib
(x86_64) /usr/lib/system/libsystem_darwin.dylib
(x86_64) /usr/lib/system/libsystem_dnssd.dylib
(x86_64) /usr/lib/system/libsystem_info.dylib
(x86_64) /usr/lib/system/libsystem_m.dylib
(x86_64) /usr/lib/system/libsystem_malloc.dylib
(x86_64) /usr/lib/system/libsystem_networkextension.dylib
(x86_64) /usr/lib/system/libsystem_notify.dylib
(x86_64) /usr/lib/system/libsystem_sandbox.dylib
(x86_64) /usr/lib/system/libsystem_secinit.dylib
(x86_64) /usr/lib/system/libsystem_kernel.dylib
(x86_64) /usr/lib/system/libsystem_platform.dylib
(x86_64) /usr/lib/system/libsystem_pthread.dylib
(x86_64) /usr/lib/system/libsystem_symptoms.dylib
(x86_64) /usr/lib/system/libsystem_trace.dylib
(x86_64) /usr/lib/system/libunwind.dylib
(x86_64) /usr/lib/system/libxpc.dylib
(x86_64) /usr/lib/libobjc.A.dylib
Exe module: (x86_64) /Users/buildslave/jenkins/workspace/lldb-cmake-matrix/lldb-build/tools/lldb/lldb-test-build.noindex/python_api/module_section/TestModuleAndSection.test_module_and_section_dsym/a.out
Number of sections: 5
Number of symbols: 83
[0x0000000000000000-0x0000000100000000) a.out.__PAGEZERO
    Number of subsections: 0
[0x0000000100000000-0x0000000100004000) a.out.__TEXT
    Number of subsections: 8
    [0x0000000100001300-0x0000000100003c0d) a.out.__TEXT.__text
        id = {0x00000004}, range = [0x0000000100001300-0x00000001000013e0), name="mask_access(MaskAction, unsigned int)", mangled="_Z11mask_access10MaskActionj"
        symbol type: code
        id = {0x00000009}, range = [0x00000001000013e0-0x00000001000015c0), name="thread_func(void*)", mangled="_Z11thread_funcPv"
        symbol type: code
        id = {0x0000000f}, range = [0x00000001000015c0-0x00000001000015f0), name="std::__1::uniform_int_distribution<int>::uniform_int_distribution(int, int)", mangled="_ZNSt3__124uniform_int_distributionIiEC1Eii"
        symbol type: code
        id = {0x00000014}, range = [0x00000001000015f0-0x0000000100001630), name="int std::__1::uniform_int_distribution<int>::operator()<std::__1::linear_congruential_engine<unsigned int, 48271u, 0u, 2147483647u> >(std::__1::linear_congruential_engine<unsigned int, 48271u, 0u, 2147483647u>&)", mangled="_ZNSt3__124uniform_int_distributionIiEclINS_26linear_congruential_engineIjLj48271ELj0ELj2147483647EEEEEiRT_"
        symbol type: code
        id = {0x00000018}, range = [0x0000000100001630-0x0000000100001d70), name="void std::__1::this_thread::sleep_for<long long, std::__1::ratio<1l, 1000000l> >(std::__1::chrono::duration<long long, std::__1::ratio<1l, 1000000l> > const&)", mangled="_ZNSt3__111this_thread9sleep_forIxNS_5ratioILl1ELl1000000EEEEEvRKNS_6chrono8durationIT_T0_EE"
        symbol type: code
        id = {0x0000001d}, range = [0x0000000100001d70-0x00000001000021a0), name="main"
        symbol type: code
        id = {0x00000022}, range = [0x00000001000021a0-0x00000001000021d0), name="std::__1::thread::thread<void* (&)(void*), void*, void>(void* (&)(void*), void*&&)", mangled="_ZNSt3__16threadC1IRFPvS2_EJS2_EvEEOT_DpOT0_"
        symbol type: code
        id = {0x00000026}, range = [0x00000001000021d0-0x00000001000021e0), mangled="__clang_call_terminate"
        symbol type: code
        id = {0x0000002a}, range = [0x00000001000021e0-0x0000000100002210), name="std::__1::uniform_int_distribution<int>::uniform_int_distribution(int, int)", mangled="_ZNSt3__124uniform_int_distributionIiEC2Eii"
        symbol type: code
        id = {0x0000002e}, range = [0x0000000100002210-0x0000000100002240), name="std::__1::uniform_int_distribution<int>::param_type::param_type(int, int)", mangled="_ZNSt3__124uniform_int_distributionIiE10param_typeC1Eii"
        symbol type: code
        id = {0x00000032}, range = [0x0000000100002240-0x0000000100002260), name="std::__1::uniform_int_distribution<int>::param_type::param_type(int, int)", mangled="_ZNSt3__124uniform_int_distributionIiE10param_typeC2Eii"
        symbol type: code
        id = {0x00000036}, range = [0x0000000100002260-0x00000001000023b0), name="int std::__1::uniform_int_distribution<int>::operator()<std::__1::linear_congruential_engine<unsigned int, 48271u, 0u, 2147483647u> >(std::__1::linear_congruential_engine<unsigned int, 48271u, 0u, 2147483647u>&, std::__1::uniform_int_distribution<int>::param_type const&)", mangled="_ZNSt3__124uniform_int_distributionIiEclINS_26linear_congruential_engineIjLj48271ELj0ELj2147483647EEEEEiRT_RKNS1_10param_typeE"
        symbol type: code
        id = {0x0000003a}, range = [0x00000001000023b0-0x00000001000023d0), name="std::__1::uniform_int_distribution<int>::param_type::b() const", mangled="_ZNKSt3__124uniform_int_distributionIiE10param_type1bEv"
        symbol type: code
        id = {0x0000003e}, range = [0x00000001000023d0-0x00000001000023e0), name="std::__1::uniform_int_distribution<int>::param_type::a() const", mangled="_ZNKSt3__124uniform_int_distributionIiE10param_type1aEv"
        symbol type: code
        id = {0x00000042}, range = [0x00000001000023e0-0x0000000100002410), name="std::__1::__independent_bits_engine<std::__1::linear_congruential_engine<unsigned int, 48271u, 0u, 2147483647u>, unsigned int>::__independent_bits_engine(std::__1::linear_congruential_engine<unsigned int, 48271u, 0u, 2147483647u>&, unsigned long)", mangled="_ZNSt3__125__independent_bits_engineINS_26linear_congruential_engineIjLj48271ELj0ELj2147483647EEEjEC1ERS2_m"
        symbol type: code
        id = {0x00000046}, range = [0x0000000100002410-0x0000000100002430), name="std::__1::__independent_bits_engine<std::__1::linear_congruential_engine<unsigned int, 48271u, 0u, 2147483647u>, unsigned int>::operator()()", mangled="_ZNSt3__125__independent_bits_engineINS_26linear_congruential_engineIjLj48271ELj0ELj2147483647EEEjEclEv"
        symbol type: code
        id = {0x0000004a}, range = [0x0000000100002430-0x0000000100002680), name="std::__1::__independent_bits_engine<std::__1::linear_congruential_engine<unsigned int, 48271u, 0u, 2147483647u>, unsigned int>::__independent_bits_engine(std::__1::linear_congruential_engine<unsigned int, 48271u, 0u, 2147483647u>&, unsigned long)", mangled="_ZNSt3__125__independent_bits_engineINS_26linear_congruential_engineIjLj48271ELj0ELj2147483647EEEjEC2ERS2_m"
        symbol type: code
        id = {0x0000004e}, range = [0x0000000100002680-0x0000000100002900), name="std::__1::__independent_bits_engine<std::__1::linear_congruential_engine<unsigned int, 48271u, 0u, 2147483647u>, unsigned int>::__eval(std::__1::integral_constant<bool, true>)", mangled="_ZNSt3__125__independent_bits_engineINS_26linear_congruential_engineIjLj48271ELj0ELj2147483647EEEjE6__evalENS_17integral_constantIbLb1EEE"
        symbol type: code
        id = {0x00000052}, range = [0x0000000100002900-0x0000000100003470), name="std::__1::thread::thread<void* (&)(void*), void*, void>(void* (&)(void*), void*&&)", mangled="_ZNSt3__16threadC2IRFPvS2_EJS2_EvEEOT_DpOT0_"
        symbol type: code
        id = {0x00000059}, range = [0x0000000100003470-0x0000000100003900), name="void* std::__1::__thread_proxy<std::__1::tuple<std::__1::unique_ptr<std::__1::__thread_struct, std::__1::default_delete<std::__1::__thread_struct> >, void* (*)(void*), void*> >(void*)", mangled="_ZNSt3__114__thread_proxyINS_5tupleIJNS_10unique_ptrINS_15__thread_structENS_14default_deleteIS3_EEEEPFPvS7_ES7_EEEEES7_S7_"
        symbol type: code
        id = {0x0000005d}, range = [0x0000000100003900-0x0000000100003940), name="std::__1::__thread_specific_ptr<std::__1::__thread_struct>::set_pointer(std::__1::__thread_struct*)", mangled="_ZNSt3__121__thread_specific_ptrINS_15__thread_structEE11set_pointerEPS1_"
        symbol type: code
        id = {0x00000061}, range = [0x0000000100003940-0x0000000100003960), name="std::__1::tuple<std::__1::unique_ptr<std::__1::__thread_struct, std::__1::default_delete<std::__1::__thread_struct> >, void* (*)(void*), void*>::~tuple()", mangled="_ZNSt3__15tupleIJNS_10unique_ptrINS_15__thread_structENS_14default_deleteIS2_EEEEPFPvS6_ES6_EED1Ev"
        symbol type: code
        id = {0x00000065}, range = [0x0000000100003960-0x0000000100003980), name="std::__1::tuple<std::__1::unique_ptr<std::__1::__thread_struct, std::__1::default_delete<std::__1::__thread_struct> >, void* (*)(void*), void*>::~tuple()", mangled="_ZNSt3__15tupleIJNS_10unique_ptrINS_15__thread_structENS_14default_deleteIS2_EEEEPFPvS6_ES6_EED2Ev"
        symbol type: code
        id = {0x00000069}, range = [0x0000000100003980-0x00000001000039a0), name="std::__1::__tuple_impl<std::__1::__tuple_indices<0ul, 1ul, 2ul>, std::__1::unique_ptr<std::__1::__thread_struct, std::__1::default_delete<std::__1::__thread_struct> >, void* (*)(void*), void*>::~__tuple_impl()", mangled="_ZNSt3__112__tuple_implINS_15__tuple_indicesIJLm0ELm1ELm2EEEEJNS_10unique_ptrINS_15__thread_structENS_14default_deleteIS4_EEEEPFPvS8_ES8_EED1Ev"
        symbol type: code
        id = {0x0000006d}, range = [0x00000001000039a0-0x00000001000039c0), name="std::__1::__tuple_impl<std::__1::__tuple_indices<0ul, 1ul, 2ul>, std::__1::unique_ptr<std::__1::__thread_struct, std::__1::default_delete<std::__1::__thread_struct> >, void* (*)(void*), void*>::~__tuple_impl()", mangled="_ZNSt3__112__tuple_implINS_15__tuple_indicesIJLm0ELm1ELm2EEEEJNS_10unique_ptrINS_15__thread_structENS_14default_deleteIS4_EEEEPFPvS8_ES8_EED2Ev"
        symbol type: code
        id = {0x00000071}, range = [0x00000001000039c0-0x0000000100003a82), name="std::__1::__tuple_leaf<0ul, std::__1::unique_ptr<std::__1::__thread_struct, std::__1::default_delete<std::__1::__thread_struct> >, false>::~__tuple_leaf()", mangled="_ZNSt3__112__tuple_leafILm0ENS_10unique_ptrINS_15__thread_structENS_14default_deleteIS2_EEEELb0EED2Ev"
        symbol type: code
        id = {0x00000075}, range = [0x0000000100003a90-0x0000000100003ae0), mangled="__cxx_global_var_init"
        symbol type: code
        id = {0x00000079}, range = [0x0000000100003ae0-0x0000000100003b30), mangled="__cxx_global_var_init.1"
        symbol type: code
        id = {0x0000007d}, range = [0x0000000100003b30-0x0000000100003b80), mangled="__cxx_global_var_init.2"
        symbol type: code
        id = {0x00000081}, range = [0x0000000100003b80-0x0000000100003bc0), mangled="__cxx_global_var_init.3"
        symbol type: code
        id = {0x00000085}, range = [0x0000000100003bc0-0x0000000100003bda), mangled="_GLOBAL__sub_I_main.cpp"
        symbol type: code
        id = {0x00000094}, range = [0x0000000100003be0-0x0000000100003bf1), name="b_function(int)", mangled="_Z10b_functioni"
        symbol type: code
        id = {0x0000009c}, range = [0x0000000100003c00-0x0000000100003c0d), name="c_function(int)", mangled="_Z10c_functioni"
        symbol type: code
    [0x0000000100003c0e-0x0000000100003cc2) a.out.__TEXT.__stubs
        id = {0x000000c9}, range = [0x0000000100003c0e-0x0000000100003c14), mangled="_Unwind_Resume"
        symbol type: trampoline
        id = {0x000000ca}, range = [0x0000000100003c20-0x0000000100003c26), name="std::__1::this_thread::sleep_for(std::__1::chrono::duration<long long, std::__1::ratio<1l, 1000000000l> > const&)", mangled="_ZNSt3__111this_thread9sleep_forERKNS_6chrono8durationIxNS_5ratioILl1ELl1000000000EEEEE"
        symbol type: trampoline
        id = {0x000000cb}, range = [0x0000000100003c2c-0x0000000100003c32), name="std::__1::__thread_struct::__thread_struct()", mangled="_ZNSt3__115__thread_structC1Ev"
        symbol type: trampoline
        id = {0x000000cc}, range = [0x0000000100003c32-0x0000000100003c38), name="std::__1::__thread_struct::~__thread_struct()", mangled="_ZNSt3__115__thread_structD1Ev"
        symbol type: trampoline
        id = {0x000000cd}, range = [0x0000000100003c38-0x0000000100003c3e), name="std::__1::__thread_local_data()", mangled="_ZNSt3__119__thread_local_dataEv"
        symbol type: trampoline
        id = {0x000000ce}, range = [0x0000000100003c3e-0x0000000100003c44), name="std::__1::__throw_system_error(int, char const*)", mangled="_ZNSt3__120__throw_system_errorEiPKc"
        symbol type: trampoline
        id = {0x000000cf}, range = [0x0000000100003c62-0x0000000100003c68), name="std::__1::mutex::lock()", mangled="_ZNSt3__15mutex4lockEv"
        symbol type: trampoline
        id = {0x000000d0}, range = [0x0000000100003c68-0x0000000100003c6e), name="std::__1::mutex::unlock()", mangled="_ZNSt3__15mutex6unlockEv"
        symbol type: trampoline
        id = {0x000000d2}, range = [0x0000000100003c6e-0x0000000100003c74), name="std::__1::thread::join()", mangled="_ZNSt3__16thread4joinEv"
        symbol type: trampoline
        id = {0x000000d3}, range = [0x0000000100003c74-0x0000000100003c7a), name="std::__1::thread::~thread()", mangled="_ZNSt3__16threadD1Ev"
        symbol type: trampoline
        id = {0x000000d4}, range = [0x0000000100003c7a-0x0000000100003c80), name="std::terminate()", mangled="_ZSt9terminatev"
        symbol type: trampoline
        id = {0x000000d5}, range = [0x0000000100003c80-0x0000000100003c86), name="operator delete(void*)", mangled="_ZdlPv"
        symbol type: trampoline
        id = {0x000000d6}, range = [0x0000000100003c86-0x0000000100003c8c), name="operator new(unsigned long)", mangled="_Znwm"
        symbol type: trampoline
        id = {0x000000d7}, range = [0x0000000100003c8c-0x0000000100003c92), mangled="__cxa_atexit"
        symbol type: trampoline
        id = {0x000000d8}, range = [0x0000000100003c92-0x0000000100003c98), mangled="__cxa_begin_catch"
        symbol type: trampoline
        id = {0x000000da}, range = [0x0000000100003c98-0x0000000100003c9e), mangled="__stack_chk_fail"
        symbol type: trampoline
        id = {0x000000de}, range = [0x0000000100003c9e-0x0000000100003ca4), name="fflush"
        symbol type: trampoline
        id = {0x000000df}, range = [0x0000000100003ca4-0x0000000100003caa), name="fgets"
        symbol type: trampoline
        id = {0x000000e0}, range = [0x0000000100003caa-0x0000000100003cb0), name="printf"
        symbol type: trampoline
        id = {0x000000e1}, range = [0x0000000100003cb0-0x0000000100003cb6), name="pthread_create"
        symbol type: trampoline
        id = {0x000000e2}, range = [0x0000000100003cb6-0x0000000100003cbc), name="pthread_setspecific"
        symbol type: trampoline
        id = {0x000000e3}, range = [0x0000000100003cbc-0x0000000100003cc2), name="strtoul"
        symbol type: trampoline
        id = {0x000000e5}, range = [0x0000000100003c14-0x0000000100003c1a), name="std::__1::uniform_int_distribution<int>::param_type::a() const", mangled="_ZNKSt3__124uniform_int_distributionIiE10param_type1aEv"
        symbol type: trampoline
        id = {0x000000e6}, range = [0x0000000100003c1a-0x0000000100003c20), name="std::__1::uniform_int_distribution<int>::param_type::b() const", mangled="_ZNKSt3__124uniform_int_distributionIiE10param_type1bEv"
        symbol type: trampoline
        id = {0x000000e7}, range = [0x0000000100003c26-0x0000000100003c2c), name="void std::__1::this_thread::sleep_for<long long, std::__1::ratio<1l, 1000000l> >(std::__1::chrono::duration<long long, std::__1::ratio<1l, 1000000l> > const&)", mangled="_ZNSt3__111this_thread9sleep_forIxNS_5ratioILl1ELl1000000EEEEEvRKNS_6chrono8durationIT_T0_EE"
        symbol type: trampoline
        id = {0x000000e8}, range = [0x0000000100003c44-0x0000000100003c4a), name="std::__1::__thread_specific_ptr<std::__1::__thread_struct>::set_pointer(std::__1::__thread_struct*)", mangled="_ZNSt3__121__thread_specific_ptrINS_15__thread_structEE11set_pointerEPS1_"
        symbol type: trampoline
        id = {0x000000e9}, range = [0x0000000100003c4a-0x0000000100003c50), name="int std::__1::uniform_int_distribution<int>::operator()<std::__1::linear_congruential_engine<unsigned int, 48271u, 0u, 2147483647u> >(std::__1::linear_congruential_engine<unsigned int, 48271u, 0u, 2147483647u>&)", mangled="_ZNSt3__124uniform_int_distributionIiEclINS_26linear_congruential_engineIjLj48271ELj0ELj2147483647EEEEEiRT_"
        symbol type: trampoline
        id = {0x000000ea}, range = [0x0000000100003c50-0x0000000100003c56), name="int std::__1::uniform_int_distribution<int>::operator()<std::__1::linear_congruential_engine<unsigned int, 48271u, 0u, 2147483647u> >(std::__1::linear_congruential_engine<unsigned int, 48271u, 0u, 2147483647u>&, std::__1::uniform_int_distribution<int>::param_type const&)", mangled="_ZNSt3__124uniform_int_distributionIiEclINS_26linear_congruential_engineIjLj48271ELj0ELj2147483647EEEEEiRT_RKNS1_10param_typeE"
        symbol type: trampoline
        id = {0x000000eb}, range = [0x0000000100003c56-0x0000000100003c5c), name="std::__1::__independent_bits_engine<std::__1::linear_congruential_engine<unsigned int, 48271u, 0u, 2147483647u>, unsigned int>::__eval(std::__1::integral_constant<bool, true>)", mangled="_ZNSt3__125__independent_bits_engineINS_26linear_congruential_engineIjLj48271ELj0ELj2147483647EEEjE6__evalENS_17integral_constantIbLb1EEE"
        symbol type: trampoline
        id = {0x000000ec}, range = [0x0000000100003c5c-0x0000000100003c62), name="std::__1::__independent_bits_engine<std::__1::linear_congruential_engine<unsigned int, 48271u, 0u, 2147483647u>, unsigned int>::operator()()", mangled="_ZNSt3__125__independent_bits_engineINS_26linear_congruential_engineIjLj48271ELj0ELj2147483647EEEjEclEv"
        symbol type: trampoline
    [0x0000000100003cc4-0x0000000100003d9c) a.out.__TEXT.__stub_helper
    [0x0000000100003da0-0x0000000100003dc0) a.out.__TEXT.__const
    [0x0000000100003dc0-0x0000000100003df4) a.out.__TEXT.__gcc_except_tab
        id = {0x00000088}, range = [0x0000000100003dc0-0x0000000100003de0), name="GCC_except_table22"
        symbol type: data
        id = {0x00000089}, range = [0x0000000100003de0-0x0000000100003df4), name="GCC_except_table23"
        symbol type: data
    [0x0000000100003df4-0x0000000100003ef2) a.out.__TEXT.__cstring
    [0x0000000100003ef4-0x0000000100003f6c) a.out.__TEXT.__unwind_info
    [0x0000000100003f70-0x0000000100003ff8) a.out.__TEXT.__eh_frame
[0x0000000100004000-0x0000000100005000) a.out.__DATA
    Number of subsections: 7
    [0x0000000100004000-0x0000000100004010) a.out.__DATA.__nl_symbol_ptr
    [0x0000000100004010-0x0000000100004048) a.out.__DATA.__got
    [0x0000000100004048-0x0000000100004138) a.out.__DATA.__la_symbol_ptr
    [0x0000000100004138-0x0000000100004140) a.out.__DATA.__mod_init_func
    [0x0000000100004140-0x0000000100004180) a.out.__DATA.__data
        id = {0x0000008a}, range = [0x0000000100004140-0x0000000100004180), name="g_mask_mutex"
        symbol type: data
    [0x0000000100004180-0x0000000100004198) a.out.__DATA.__common
        id = {0x0000008b}, range = [0x0000000100004180-0x0000000100004188), name="g_thread_1"
        symbol type: data
        id = {0x0000008c}, range = [0x0000000100004188-0x0000000100004190), name="g_thread_2"
        symbol type: data
        id = {0x0000008d}, range = [0x0000000100004190-0x0000000100004198), name="g_thread_3"
        symbol type: data
    [0x0000000100004198-0x000000010000419c) a.out.__DATA.__bss
        id = {0x0000008e}, range = [0x0000000100004198-0x000000010000419c), name="mask_access(MaskAction, unsigned int)::g_mask", mangled="_ZZ11mask_access10MaskActionjE6g_mask"
        symbol type: data
[0x0000000100005000-0x0000000100009000) a.out.__LINKEDIT
    Number of subsections: 0
[0x0000000100006000-0x0000000100025000) a.out.__DWARF
    Number of subsections: 12
    [0x0000000100006000-0x0000000100007ad8) a.out.__DWARF.__debug_line
    [0x0000000100007ad8-0x0000000100008795) a.out.__DWARF.__debug_pubnames
    [0x0000000100008795-0x000000010000b6ef) a.out.__DWARF.__debug_pubtypes
    [0x000000010000b6ef-0x000000010000b90f) a.out.__DWARF.__debug_ranges
    [0x000000010000b90f-0x000000010000bb5f) a.out.__DWARF.__debug_aranges
    [0x000000010000bb5f-0x0000000100015334) a.out.__DWARF.__debug_info
    [0x0000000100015334-0x0000000100015a19) a.out.__DWARF.__debug_abbrev
    [0x0000000100015a19-0x00000001000212aa) a.out.__DWARF.__debug_str
    [0x00000001000212aa-0x0000000100022ca2) a.out.__DWARF.__apple_names
    [0x0000000100022ca2-0x0000000100022d4e) a.out.__DWARF.__apple_namespac
    [0x0000000100022d4e-0x0000000100024c96) a.out.__DWARF.__apple_types
    [0x0000000100024c96-0x0000000100024cba) a.out.__DWARF.__apple_objc
Number of modules for the target: 39
(x86_64) /Users/buildslave/jenkins/workspace/lldb-cmake-matrix/lldb-build/tools/lldb/lldb-test-build.noindex/python_api/module_section/TestModuleAndSection.test_module_and_section_dwarf/a.out
(x86_64) /usr/lib/dyld
(x86_64) /usr/lib/libc++.1.dylib
(x86_64) /usr/lib/libSystem.B.dylib
(x86_64) /usr/lib/libc++abi.dylib
(x86_64) /usr/lib/system/libcache.dylib
(x86_64) /usr/lib/system/libcommonCrypto.dylib
(x86_64) /usr/lib/system/libcompiler_rt.dylib
(x86_64) /usr/lib/system/libcopyfile.dylib
(x86_64) /usr/lib/system/libcorecrypto.dylib
(x86_64) /usr/lib/system/libdispatch.dylib
(x86_64) /usr/lib/system/libdyld.dylib
(x86_64) /usr/lib/system/libkeymgr.dylib
(x86_64) /usr/lib/system/liblaunch.dylib
(x86_64) /usr/lib/system/libmacho.dylib
(x86_64) /usr/lib/system/libquarantine.dylib
(x86_64) /usr/lib/system/libremovefile.dylib
(x86_64) /usr/lib/system/libsystem_asl.dylib
(x86_64) /usr/lib/system/libsystem_blocks.dylib
(x86_64) /usr/lib/system/libsystem_c.dylib
(x86_64) /usr/lib/system/libsystem_configuration.dylib
(x86_64) /usr/lib/system/libsystem_coreservices.dylib
(x86_64) /usr/lib/system/libsystem_darwin.dylib
(x86_64) /usr/lib/system/libsystem_dnssd.dylib
(x86_64) /usr/lib/system/libsystem_info.dylib
(x86_64) /usr/lib/system/libsystem_m.dylib
(x86_64) /usr/lib/system/libsystem_malloc.dylib
(x86_64) /usr/lib/system/libsystem_networkextension.dylib
(x86_64) /usr/lib/system/libsystem_notify.dylib
(x86_64) /usr/lib/system/libsystem_sandbox.dylib
(x86_64) /usr/lib/system/libsystem_secinit.dylib
(x86_64) /usr/lib/system/libsystem_kernel.dylib
(x86_64) /usr/lib/system/libsystem_platform.dylib
(x86_64) /usr/lib/system/libsystem_pthread.dylib
(x86_64) /usr/lib/system/libsystem_symptoms.dylib
(x86_64) /usr/lib/system/libsystem_trace.dylib
(x86_64) /usr/lib/system/libunwind.dylib
(x86_64) /usr/lib/system/libxpc.dylib
(x86_64) /usr/lib/libobjc.A.dylib
Exe module: (x86_64) /Users/buildslave/jenkins/workspace/lldb-cmake-matrix/lldb-build/tools/lldb/lldb-test-build.noindex/python_api/module_section/TestModuleAndSection.test_module_and_section_dwarf/a.out
Number of sections: 4
Number of symbols: 83
[0x0000000000000000-0x0000000100000000) a.out.__PAGEZERO
    Number of subsections: 0
[0x0000000100000000-0x0000000100004000) a.out.__TEXT
    Number of subsections: 8
    [0x0000000100001300-0x0000000100003c0d) a.out.__TEXT.__text
        id = {0x00000004}, range = [0x0000000100001300-0x00000001000013e0), name="mask_access(MaskAction, unsigned int)", mangled="_Z11mask_access10MaskActionj"
        symbol type: code
        id = {0x00000009}, range = [0x00000001000013e0-0x00000001000015c0), name="thread_func(void*)", mangled="_Z11thread_funcPv"
        symbol type: code
        id = {0x0000000f}, range = [0x00000001000015c0-0x00000001000015f0), name="std::__1::uniform_int_distribution<int>::uniform_int_distribution(int, int)", mangled="_ZNSt3__124uniform_int_distributionIiEC1Eii"
        symbol type: code
        id = {0x00000014}, range = [0x00000001000015f0-0x0000000100001630), name="int std::__1::uniform_int_distribution<int>::operator()<std::__1::linear_congruential_engine<unsigned int, 48271u, 0u, 2147483647u> >(std::__1::linear_congruential_engine<unsigned int, 48271u, 0u, 2147483647u>&)", mangled="_ZNSt3__124uniform_int_distributionIiEclINS_26linear_congruential_engineIjLj48271ELj0ELj2147483647EEEEEiRT_"
        symbol type: code
        id = {0x00000018}, range = [0x0000000100001630-0x0000000100001d70), name="void std::__1::this_thread::sleep_for<long long, std::__1::ratio<1l, 1000000l> >(std::__1::chrono::duration<long long, std::__1::ratio<1l, 1000000l> > const&)", mangled="_ZNSt3__111this_thread9sleep_forIxNS_5ratioILl1ELl1000000EEEEEvRKNS_6chrono8durationIT_T0_EE"
        symbol type: code
        id = {0x0000001d}, range = [0x0000000100001d70-0x00000001000021a0), name="main"
        symbol type: code
        id = {0x00000022}, range = [0x00000001000021a0-0x00000001000021d0), name="std::__1::thread::thread<void* (&)(void*), void*, void>(void* (&)(void*), void*&&)", mangled="_ZNSt3__16threadC1IRFPvS2_EJS2_EvEEOT_DpOT0_"
        symbol type: code
        id = {0x00000026}, range = [0x00000001000021d0-0x00000001000021e0), mangled="__clang_call_terminate"
        symbol type: code
        id = {0x0000002a}, range = [0x00000001000021e0-0x0000000100002210), name="std::__1::uniform_int_distribution<int>::uniform_int_distribution(int, int)", mangled="_ZNSt3__124uniform_int_distributionIiEC2Eii"
        symbol type: code
        id = {0x0000002e}, range = [0x0000000100002210-0x0000000100002240), name="std::__1::uniform_int_distribution<int>::param_type::param_type(int, int)", mangled="_ZNSt3__124uniform_int_distributionIiE10param_typeC1Eii"
        symbol type: code
        id = {0x00000032}, range = [0x0000000100002240-0x0000000100002260), name="std::__1::uniform_int_distribution<int>::param_type::param_type(int, int)", mangled="_ZNSt3__124uniform_int_distributionIiE10param_typeC2Eii"
        symbol type: code
        id = {0x00000036}, range = [0x0000000100002260-0x00000001000023b0), name="int std::__1::uniform_int_distribution<int>::operator()<std::__1::linear_congruential_engine<unsigned int, 48271u, 0u, 2147483647u> >(std::__1::linear_congruential_engine<unsigned int, 48271u, 0u, 2147483647u>&, std::__1::uniform_int_distribution<int>::param_type const&)", mangled="_ZNSt3__124uniform_int_distributionIiEclINS_26linear_congruential_engineIjLj48271ELj0ELj2147483647EEEEEiRT_RKNS1_10param_typeE"
        symbol type: code
        id = {0x0000003a}, range = [0x00000001000023b0-0x00000001000023d0), name="std::__1::uniform_int_distribution<int>::param_type::b() const", mangled="_ZNKSt3__124uniform_int_distributionIiE10param_type1bEv"
        symbol type: code
        id = {0x0000003e}, range = [0x00000001000023d0-0x00000001000023e0), name="std::__1::uniform_int_distribution<int>::param_type::a() const", mangled="_ZNKSt3__124uniform_int_distributionIiE10param_type1aEv"
        symbol type: code
        id = {0x00000042}, range = [0x00000001000023e0-0x0000000100002410), name="std::__1::__independent_bits_engine<std::__1::linear_congruential_engine<unsigned int, 48271u, 0u, 2147483647u>, unsigned int>::__independent_bits_engine(std::__1::linear_congruential_engine<unsigned int, 48271u, 0u, 2147483647u>&, unsigned long)", mangled="_ZNSt3__125__independent_bits_engineINS_26linear_congruential_engineIjLj48271ELj0ELj2147483647EEEjEC1ERS2_m"
        symbol type: code
        id = {0x00000046}, range = [0x0000000100002410-0x0000000100002430), name="std::__1::__independent_bits_engine<std::__1::linear_congruential_engine<unsigned int, 48271u, 0u, 2147483647u>, unsigned int>::operator()()", mangled="_ZNSt3__125__independent_bits_engineINS_26linear_congruential_engineIjLj48271ELj0ELj2147483647EEEjEclEv"
        symbol type: code
        id = {0x0000004a}, range = [0x0000000100002430-0x0000000100002680), name="std::__1::__independent_bits_engine<std::__1::linear_congruential_engine<unsigned int, 48271u, 0u, 2147483647u>, unsigned int>::__independent_bits_engine(std::__1::linear_congruential_engine<unsigned int, 48271u, 0u, 2147483647u>&, unsigned long)", mangled="_ZNSt3__125__independent_bits_engineINS_26linear_congruential_engineIjLj48271ELj0ELj2147483647EEEjEC2ERS2_m"
        symbol type: code
        id = {0x0000004e}, range = [0x0000000100002680-0x0000000100002900), name="std::__1::__independent_bits_engine<std::__1::linear_congruential_engine<unsigned int, 48271u, 0u, 2147483647u>, unsigned int>::__eval(std::__1::integral_constant<bool, true>)", mangled="_ZNSt3__125__independent_bits_engineINS_26linear_congruential_engineIjLj48271ELj0ELj2147483647EEEjE6__evalENS_17integral_constantIbLb1EEE"
        symbol type: code
        id = {0x00000052}, range = [0x0000000100002900-0x0000000100003470), name="std::__1::thread::thread<void* (&)(void*), void*, void>(void* (&)(void*), void*&&)", mangled="_ZNSt3__16threadC2IRFPvS2_EJS2_EvEEOT_DpOT0_"
        symbol type: code
        id = {0x00000059}, range = [0x0000000100003470-0x0000000100003900), name="void* std::__1::__thread_proxy<std::__1::tuple<std::__1::unique_ptr<std::__1::__thread_struct, std::__1::default_delete<std::__1::__thread_struct> >, void* (*)(void*), void*> >(void*)", mangled="_ZNSt3__114__thread_proxyINS_5tupleIJNS_10unique_ptrINS_15__thread_structENS_14default_deleteIS3_EEEEPFPvS7_ES7_EEEEES7_S7_"
        symbol type: code
        id = {0x0000005d}, range = [0x0000000100003900-0x0000000100003940), name="std::__1::__thread_specific_ptr<std::__1::__thread_struct>::set_pointer(std::__1::__thread_struct*)", mangled="_ZNSt3__121__thread_specific_ptrINS_15__thread_structEE11set_pointerEPS1_"
        symbol type: code
        id = {0x00000061}, range = [0x0000000100003940-0x0000000100003960), name="std::__1::tuple<std::__1::unique_ptr<std::__1::__thread_struct, std::__1::default_delete<std::__1::__thread_struct> >, void* (*)(void*), void*>::~tuple()", mangled="_ZNSt3__15tupleIJNS_10unique_ptrINS_15__thread_structENS_14default_deleteIS2_EEEEPFPvS6_ES6_EED1Ev"
        symbol type: code
        id = {0x00000065}, range = [0x0000000100003960-0x0000000100003980), name="std::__1::tuple<std::__1::unique_ptr<std::__1::__thread_struct, std::__1::default_delete<std::__1::__thread_struct> >, void* (*)(void*), void*>::~tuple()", mangled="_ZNSt3__15tupleIJNS_10unique_ptrINS_15__thread_structENS_14default_deleteIS2_EEEEPFPvS6_ES6_EED2Ev"
        symbol type: code
        id = {0x00000069}, range = [0x0000000100003980-0x00000001000039a0), name="std::__1::__tuple_impl<std::__1::__tuple_indices<0ul, 1ul, 2ul>, std::__1::unique_ptr<std::__1::__thread_struct, std::__1::default_delete<std::__1::__thread_struct> >, void* (*)(void*), void*>::~__tuple_impl()", mangled="_ZNSt3__112__tuple_implINS_15__tuple_indicesIJLm0ELm1ELm2EEEEJNS_10unique_ptrINS_15__thread_structENS_14default_deleteIS4_EEEEPFPvS8_ES8_EED1Ev"
        symbol type: code
        id = {0x0000006d}, range = [0x00000001000039a0-0x00000001000039c0), name="std::__1::__tuple_impl<std::__1::__tuple_indices<0ul, 1ul, 2ul>, std::__1::unique_ptr<std::__1::__thread_struct, std::__1::default_delete<std::__1::__thread_struct> >, void* (*)(void*), void*>::~__tuple_impl()", mangled="_ZNSt3__112__tuple_implINS_15__tuple_indicesIJLm0ELm1ELm2EEEEJNS_10unique_ptrINS_15__thread_structENS_14default_deleteIS4_EEEEPFPvS8_ES8_EED2Ev"
        symbol type: code
        id = {0x00000071}, range = [0x00000001000039c0-0x0000000100003a82), name="std::__1::__tuple_leaf<0ul, std::__1::unique_ptr<std::__1::__thread_struct, std::__1::default_delete<std::__1::__thread_struct> >, false>::~__tuple_leaf()", mangled="_ZNSt3__112__tuple_leafILm0ENS_10unique_ptrINS_15__thread_structENS_14default_deleteIS2_EEEELb0EED2Ev"
        symbol type: code
        id = {0x00000075}, range = [0x0000000100003a90-0x0000000100003ae0), mangled="__cxx_global_var_init"
        symbol type: code
        id = {0x00000079}, range = [0x0000000100003ae0-0x0000000100003b30), mangled="__cxx_global_var_init.1"
        symbol type: code
        id = {0x0000007d}, range = [0x0000000100003b30-0x0000000100003b80), mangled="__cxx_global_var_init.2"
        symbol type: code
        id = {0x00000081}, range = [0x0000000100003b80-0x0000000100003bc0), mangled="__cxx_global_var_init.3"
        symbol type: code
        id = {0x00000085}, range = [0x0000000100003bc0-0x0000000100003bda), mangled="_GLOBAL__sub_I_main.cpp"
        symbol type: code
        id = {0x00000094}, range = [0x0000000100003be0-0x0000000100003bf1), name="b_function(int)", mangled="_Z10b_functioni"
        symbol type: code
        id = {0x0000009c}, range = [0x0000000100003c00-0x0000000100003c0d), name="c_function(int)", mangled="_Z10c_functioni"
        symbol type: code
    [0x0000000100003c0e-0x0000000100003cc2) a.out.__TEXT.__stubs
        id = {0x000000c9}, range = [0x0000000100003c0e-0x0000000100003c14), mangled="_Unwind_Resume"
        symbol type: trampoline
        id = {0x000000ca}, range = [0x0000000100003c20-0x0000000100003c26), name="std::__1::this_thread::sleep_for(std::__1::chrono::duration<long long, std::__1::ratio<1l, 1000000000l> > const&)", mangled="_ZNSt3__111this_thread9sleep_forERKNS_6chrono8durationIxNS_5ratioILl1ELl1000000000EEEEE"
        symbol type: trampoline
        id = {0x000000cb}, range = [0x0000000100003c2c-0x0000000100003c32), name="std::__1::__thread_struct::__thread_struct()", mangled="_ZNSt3__115__thread_structC1Ev"
        symbol type: trampoline
        id = {0x000000cc}, range = [0x0000000100003c32-0x0000000100003c38), name="std::__1::__thread_struct::~__thread_struct()", mangled="_ZNSt3__115__thread_structD1Ev"
        symbol type: trampoline
        id = {0x000000cd}, range = [0x0000000100003c38-0x0000000100003c3e), name="std::__1::__thread_local_data()", mangled="_ZNSt3__119__thread_local_dataEv"
        symbol type: trampoline
        id = {0x000000ce}, range = [0x0000000100003c3e-0x0000000100003c44), name="std::__1::__throw_system_error(int, char const*)", mangled="_ZNSt3__120__throw_system_errorEiPKc"
        symbol type: trampoline
        id = {0x000000cf}, range = [0x0000000100003c62-0x0000000100003c68), name="std::__1::mutex::lock()", mangled="_ZNSt3__15mutex4lockEv"
        symbol type: trampoline
        id = {0x000000d0}, range = [0x0000000100003c68-0x0000000100003c6e), name="std::__1::mutex::unlock()", mangled="_ZNSt3__15mutex6unlockEv"
        symbol type: trampoline
        id = {0x000000d2}, range = [0x0000000100003c6e-0x0000000100003c74), name="std::__1::thread::join()", mangled="_ZNSt3__16thread4joinEv"
        symbol type: trampoline
        id = {0x000000d3}, range = [0x0000000100003c74-0x0000000100003c7a), name="std::__1::thread::~thread()", mangled="_ZNSt3__16threadD1Ev"
        symbol type: trampoline
        id = {0x000000d4}, range = [0x0000000100003c7a-0x0000000100003c80), name="std::terminate()", mangled="_ZSt9terminatev"
        symbol type: trampoline
        id = {0x000000d5}, range = [0x0000000100003c80-0x0000000100003c86), name="operator delete(void*)", mangled="_ZdlPv"
        symbol type: trampoline
        id = {0x000000d6}, range = [0x0000000100003c86-0x0000000100003c8c), name="operator new(unsigned long)", mangled="_Znwm"
        symbol type: trampoline
        id = {0x000000d7}, range = [0x0000000100003c8c-0x0000000100003c92), mangled="__cxa_atexit"
        symbol type: trampoline
        id = {0x000000d8}, range = [0x0000000100003c92-0x0000000100003c98), mangled="__cxa_begin_catch"
        symbol type: trampoline
        id = {0x000000da}, range = [0x0000000100003c98-0x0000000100003c9e), mangled="__stack_chk_fail"
        symbol type: trampoline
        id = {0x000000de}, range = [0x0000000100003c9e-0x0000000100003ca4), name="fflush"
        symbol type: trampoline
        id = {0x000000df}, range = [0x0000000100003ca4-0x0000000100003caa), name="fgets"
        symbol type: trampoline
        id = {0x000000e0}, range = [0x0000000100003caa-0x0000000100003cb0), name="printf"
        symbol type: trampoline
        id = {0x000000e1}, range = [0x0000000100003cb0-0x0000000100003cb6), name="pthread_create"
        symbol type: trampoline
        id = {0x000000e2}, range = [0x0000000100003cb6-0x0000000100003cbc), name="pthread_setspecific"
        symbol type: trampoline
        id = {0x000000e3}, range = [0x0000000100003cbc-0x0000000100003cc2), name="strtoul"
        symbol type: trampoline
        id = {0x000000e5}, range = [0x0000000100003c14-0x0000000100003c1a), name="std::__1::uniform_int_distribution<int>::param_type::a() const", mangled="_ZNKSt3__124uniform_int_distributionIiE10param_type1aEv"
        symbol type: trampoline
        id = {0x000000e6}, range = [0x0000000100003c1a-0x0000000100003c20), name="std::__1::uniform_int_distribution<int>::param_type::b() const", mangled="_ZNKSt3__124uniform_int_distributionIiE10param_type1bEv"
        symbol type: trampoline
        id = {0x000000e7}, range = [0x0000000100003c26-0x0000000100003c2c), name="void std::__1::this_thread::sleep_for<long long, std::__1::ratio<1l, 1000000l> >(std::__1::chrono::duration<long long, std::__1::ratio<1l, 1000000l> > const&)", mangled="_ZNSt3__111this_thread9sleep_forIxNS_5ratioILl1ELl1000000EEEEEvRKNS_6chrono8durationIT_T0_EE"
        symbol type: trampoline
        id = {0x000000e8}, range = [0x0000000100003c44-0x0000000100003c4a), name="std::__1::__thread_specific_ptr<std::__1::__thread_struct>::set_pointer(std::__1::__thread_struct*)", mangled="_ZNSt3__121__thread_specific_ptrINS_15__thread_structEE11set_pointerEPS1_"
        symbol type: trampoline
        id = {0x000000e9}, range = [0x0000000100003c4a-0x0000000100003c50), name="int std::__1::uniform_int_distribution<int>::operator()<std::__1::linear_congruential_engine<unsigned int, 48271u, 0u, 2147483647u> >(std::__1::linear_congruential_engine<unsigned int, 48271u, 0u, 2147483647u>&)", mangled="_ZNSt3__124uniform_int_distributionIiEclINS_26linear_congruential_engineIjLj48271ELj0ELj2147483647EEEEEiRT_"
        symbol type: trampoline
        id = {0x000000ea}, range = [0x0000000100003c50-0x0000000100003c56), name="int std::__1::uniform_int_distribution<int>::operator()<std::__1::linear_congruential_engine<unsigned int, 48271u, 0u, 2147483647u> >(std::__1::linear_congruential_engine<unsigned int, 48271u, 0u, 2147483647u>&, std::__1::uniform_int_distribution<int>::param_type const&)", mangled="_ZNSt3__124uniform_int_distributionIiEclINS_26linear_congruential_engineIjLj48271ELj0ELj2147483647EEEEEiRT_RKNS1_10param_typeE"
        symbol type: trampoline
        id = {0x000000eb}, range = [0x0000000100003c56-0x0000000100003c5c), name="std::__1::__independent_bits_engine<std::__1::linear_congruential_engine<unsigned int, 48271u, 0u, 2147483647u>, unsigned int>::__eval(std::__1::integral_constant<bool, true>)", mangled="_ZNSt3__125__independent_bits_engineINS_26linear_congruential_engineIjLj48271ELj0ELj2147483647EEEjE6__evalENS_17integral_constantIbLb1EEE"
        symbol type: trampoline
        id = {0x000000ec}, range = [0x0000000100003c5c-0x0000000100003c62), name="std::__1::__independent_bits_engine<std::__1::linear_congruential_engine<unsigned int, 48271u, 0u, 2147483647u>, unsigned int>::operator()()", mangled="_ZNSt3__125__independent_bits_engineINS_26linear_congruential_engineIjLj48271ELj0ELj2147483647EEEjEclEv"
        symbol type: trampoline
    [0x0000000100003cc4-0x0000000100003d9c) a.out.__TEXT.__stub_helper
    [0x0000000100003da0-0x0000000100003dc0) a.out.__TEXT.__const
    [0x0000000100003dc0-0x0000000100003df4) a.out.__TEXT.__gcc_except_tab
        id = {0x00000088}, range = [0x0000000100003dc0-0x0000000100003de0), name="GCC_except_table22"
        symbol type: data
        id = {0x00000089}, range = [0x0000000100003de0-0x0000000100003df4), name="GCC_except_table23"
        symbol type: data
    [0x0000000100003df4-0x0000000100003ef2) a.out.__TEXT.__cstring
    [0x0000000100003ef4-0x0000000100003f6c) a.out.__TEXT.__unwind_info
    [0x0000000100003f70-0x0000000100003ff8) a.out.__TEXT.__eh_frame
[0x0000000100004000-0x0000000100005000) a.out.__DATA
    Number of subsections: 7
    [0x0000000100004000-0x0000000100004010) a.out.__DATA.__nl_symbol_ptr
    [0x0000000100004010-0x0000000100004048) a.out.__DATA.__got
    [0x0000000100004048-0x0000000100004138) a.out.__DATA.__la_symbol_ptr
    [0x0000000100004138-0x0000000100004140) a.out.__DATA.__mod_init_func
    [0x0000000100004140-0x0000000100004180) a.out.__DATA.__data
        id = {0x0000008a}, range = [0x0000000100004140-0x0000000100004180), name="g_mask_mutex"
        symbol type: data
    [0x0000000100004180-0x0000000100004198) a.out.__DATA.__common
        id = {0x0000008b}, range = [0x0000000100004180-0x0000000100004188), name="g_thread_1"
        symbol type: data
        id = {0x0000008c}, range = [0x0000000100004188-0x0000000100004190), name="g_thread_2"
        symbol type: data
        id = {0x0000008d}, range = [0x0000000100004190-0x0000000100004198), name="g_thread_3"
        symbol type: data
    [0x0000000100004198-0x000000010000419c) a.out.__DATA.__bss
        id = {0x0000008e}, range = [0x0000000100004198-0x000000010000419c), name="mask_access(MaskAction, unsigned int)::g_mask", mangled="_ZZ11mask_access10MaskActionjE6g_mask"
        symbol type: data
[0x0000000100005000-0x0000000100009000) a.out.__LINKEDIT
    Number of subsections: 0
Number of modules for the target: 39
(x86_64) /Users/buildslave/jenkins/workspace/lldb-cmake-matrix/lldb-build/tools/lldb/lldb-test-build.noindex/python_api/module_section/TestModuleAndSection.test_module_compile_unit_iter_dsym/a.out
(x86_64) /usr/lib/dyld
(x86_64) /usr/lib/libc++.1.dylib
(x86_64) /usr/lib/libSystem.B.dylib
(x86_64) /usr/lib/libc++abi.dylib
(x86_64) /usr/lib/system/libcache.dylib
(x86_64) /usr/lib/system/libcommonCrypto.dylib
(x86_64) /usr/lib/system/libcompiler_rt.dylib
(x86_64) /usr/lib/system/libcopyfile.dylib
(x86_64) /usr/lib/system/libcorecrypto.dylib
(x86_64) /usr/lib/system/libdispatch.dylib
(x86_64) /usr/lib/system/libdyld.dylib
(x86_64) /usr/lib/system/libkeymgr.dylib
(x86_64) /usr/lib/system/liblaunch.dylib
(x86_64) /usr/lib/system/libmacho.dylib
(x86_64) /usr/lib/system/libquarantine.dylib
(x86_64) /usr/lib/system/libremovefile.dylib
(x86_64) /usr/lib/system/libsystem_asl.dylib
(x86_64) /usr/lib/system/libsystem_blocks.dylib
(x86_64) /usr/lib/system/libsystem_c.dylib
(x86_64) /usr/lib/system/libsystem_configuration.dylib
(x86_64) /usr/lib/system/libsystem_coreservices.dylib
(x86_64) /usr/lib/system/libsystem_darwin.dylib
(x86_64) /usr/lib/system/libsystem_dnssd.dylib
(x86_64) /usr/lib/system/libsystem_info.dylib
(x86_64) /usr/lib/system/libsystem_m.dylib
(x86_64) /usr/lib/system/libsystem_malloc.dylib
(x86_64) /usr/lib/system/libsystem_networkextension.dylib
(x86_64) /usr/lib/system/libsystem_notify.dylib
(x86_64) /usr/lib/system/libsystem_sandbox.dylib
(x86_64) /usr/lib/system/libsystem_secinit.dylib
(x86_64) /usr/lib/system/libsystem_kernel.dylib
(x86_64) /usr/lib/system/libsystem_platform.dylib
(x86_64) /usr/lib/system/libsystem_pthread.dylib
(x86_64) /usr/lib/system/libsystem_symptoms.dylib
(x86_64) /usr/lib/system/libsystem_trace.dylib
(x86_64) /usr/lib/system/libunwind.dylib
(x86_64) /usr/lib/system/libxpc.dylib
(x86_64) /usr/lib/libobjc.A.dylib
Exe module: (x86_64) /Users/buildslave/jenkins/workspace/lldb-cmake-matrix/lldb-build/tools/lldb/lldb-test-build.noindex/python_api/module_section/TestModuleAndSection.test_module_compile_unit_iter_dsym/a.out
Number of compile units: 3
0x7f8285505498: CompileUnit{0x00000000}, language = "c++", file = '/Users/buildslave/jenkins/workspace/lldb-cmake-matrix/llvm-project/lldb/packages/Python/lldbsuite/test/python_api/module_section/main.cpp'
0x7f8285505588: CompileUnit{0x00000001}, language = "c++", file = '/Users/buildslave/jenkins/workspace/lldb-cmake-matrix/llvm-project/lldb/packages/Python/lldbsuite/test/python_api/module_section/b.cpp'
0x7f8285505678: CompileUnit{0x00000002}, language = "c++", file = '/Users/buildslave/jenkins/workspace/lldb-cmake-matrix/llvm-project/lldb/packages/Python/lldbsuite/test/python_api/module_section/c.cpp'
Number of modules for the target: 39
(x86_64) /Users/buildslave/jenkins/workspace/lldb-cmake-matrix/lldb-build/tools/lldb/lldb-test-build.noindex/python_api/module_section/TestModuleAndSection.test_module_compile_unit_iter_dwarf/a.out
(x86_64) /usr/lib/dyld
(x86_64) /usr/lib/libc++.1.dylib
(x86_64) /usr/lib/libSystem.B.dylib
(x86_64) /usr/lib/libc++abi.dylib
(x86_64) /usr/lib/system/libcache.dylib
(x86_64) /usr/lib/system/libcommonCrypto.dylib
(x86_64) /usr/lib/system/libcompiler_rt.dylib
(x86_64) /usr/lib/system/libcopyfile.dylib
(x86_64) /usr/lib/system/libcorecrypto.dylib
(x86_64) /usr/lib/system/libdispatch.dylib
(x86_64) /usr/lib/system/libdyld.dylib
(x86_64) /usr/lib/system/libkeymgr.dylib
(x86_64) /usr/lib/system/liblaunch.dylib
(x86_64) /usr/lib/system/libmacho.dylib
(x86_64) /usr/lib/system/libquarantine.dylib
(x86_64) /usr/lib/system/libremovefile.dylib
(x86_64) /usr/lib/system/libsystem_asl.dylib
(x86_64) /usr/lib/system/libsystem_blocks.dylib
(x86_64) /usr/lib/system/libsystem_c.dylib
(x86_64) /usr/lib/system/libsystem_configuration.dylib
(x86_64) /usr/lib/system/libsystem_coreservices.dylib
(x86_64) /usr/lib/system/libsystem_darwin.dylib
(x86_64) /usr/lib/system/libsystem_dnssd.dylib
(x86_64) /usr/lib/system/libsystem_info.dylib
(x86_64) /usr/lib/system/libsystem_m.dylib
(x86_64) /usr/lib/system/libsystem_malloc.dylib
(x86_64) /usr/lib/system/libsystem_networkextension.dylib
(x86_64) /usr/lib/system/libsystem_notify.dylib
(x86_64) /usr/lib/system/libsystem_sandbox.dylib
(x86_64) /usr/lib/system/libsystem_secinit.dylib
(x86_64) /usr/lib/system/libsystem_kernel.dylib
(x86_64) /usr/lib/system/libsystem_platform.dylib
(x86_64) /usr/lib/system/libsystem_pthread.dylib
(x86_64) /usr/lib/system/libsystem_symptoms.dylib
(x86_64) /usr/lib/system/libsystem_trace.dylib
(x86_64) /usr/lib/system/libunwind.dylib
(x86_64) /usr/lib/system/libxpc.dylib
(x86_64) /usr/lib/libobjc.A.dylib
Exe module: (x86_64) /Users/buildslave/jenkins/workspace/lldb-cmake-matrix/lldb-build/tools/lldb/lldb-test-build.noindex/python_api/module_section/TestModuleAndSection.test_module_compile_unit_iter_dwarf/a.out
Number of compile units: 3
0x7f8285530028: CompileUnit{0x00000000}, language = "unknown", file = '/Users/buildslave/jenkins/workspace/lldb-cmake-matrix/llvm-project/lldb/packages/Python/lldbsuite/test/python_api/module_section/main.cpp'
0x7f82855308d8: CompileUnit{0x00000000}, language = "unknown", file = '/Users/buildslave/jenkins/workspace/lldb-cmake-matrix/llvm-project/lldb/packages/Python/lldbsuite/test/python_api/module_section/b.cpp'
0x7f8285530d68: CompileUnit{0x00000000}, language = "unknown", file = '/Users/buildslave/jenkins/workspace/lldb-cmake-matrix/llvm-project/lldb/packages/Python/lldbsuite/test/python_api/module_section/c.cpp'

Session logs for test failures/errors/unexpected successes will go into directory '/Users/buildslave/jenkins/workspace/lldb-cmake-matrix/test/logs'
Command invoked: /Users/buildslave/jenkins/workspace/lldb-cmake-matrix/llvm-project/lldb/test/dotest.py --arch=x86_64 -s /Users/buildslave/jenkins/workspace/lldb-cmake-matrix/lldb-build/lldb-test-traces -S nm -u CXXFLAGS -u CFLAGS --executable /Users/buildslave/jenkins/workspace/lldb-cmake-matrix/lldb-build/./bin/lldb --dsymutil /Users/buildslave/jenkins/workspace/lldb-cmake-matrix/lldb-build/./bin/dsymutil --filecheck /Users/buildslave/jenkins/workspace/lldb-cmake-matrix/lldb-build/./bin/FileCheck -C /Users/buildslave/jenkins/workspace/lldb-cmake-matrix/clang_701_build/bin/clang --codesign-identity lldb_codesign --server /Users/buildslave/jenkins/workspace/lldb-cmake-matrix/lldb-build/./bin/debugserver --arch x86_64 --build-dir /Users/buildslave/jenkins/workspace/lldb-cmake-matrix/lldb-build/lldb-test-build.noindex -s=/Users/buildslave/jenkins/workspace/lldb-cmake-matrix/test/logs -t --env TERM=vt100 --skip-category gmodules --skip-category watchpoint --arch=x86_64 --env LLVM_LIBS_DIR=/Users/buildslave/jenkins/workspace/lldb-cmake-matrix/lldb-build/./lib --build-dir /Users/buildslave/jenkins/workspace/lldb-cmake-matrix/lldb-build/tools/lldb/lldb-test-build.noindex --module-cache-dir /Users/buildslave/jenkins/workspace/lldb-cmake-matrix/lldb-build/tools/lldb/lldb-test-build.noindex/module-cache-lldb /Users/buildslave/jenkins/workspace/lldb-cmake-matrix/llvm-project/lldb/packages/Python/lldbsuite/test/python_api/module_section -p TestModuleAndSection.py
Change dir to: /Users/buildslave/jenkins/workspace/lldb-cmake-matrix/llvm-project/lldb/packages/Python/lldbsuite/test/python_api/module_section
runCmd: settings set symbols.enable-external-lookup false
output: 

runCmd: settings set plugin.process.gdb-remote.packet-timeout 60
output: 

runCmd: settings set symbols.clang-modules-cache-path "/Users/buildslave/jenkins/workspace/lldb-cmake-matrix/lldb-build/tools/lldb/lldb-test-build.noindex/module-cache-lldb"
output: 

runCmd: settings set use-color false
output: 

FAIL: LLDB (/Users/buildslave/jenkins/workspace/lldb-cmake-matrix/clang_701_build/bin/clang-7-x86_64) :: test_find_compile_units_dsym (TestModuleAndSection.ModuleAndSectionAPIsTestCase)
runCmd: settings set symbols.enable-external-lookup false
output: 

runCmd: settings set plugin.process.gdb-remote.packet-timeout 60
output: 

runCmd: settings set symbols.clang-modules-cache-path "/Users/buildslave/jenkins/workspace/lldb-cmake-matrix/lldb-build/tools/lldb/lldb-test-build.noindex/module-cache-lldb"
output: 

runCmd: settings set use-color false
output: 

PASS: LLDB (/Users/buildslave/jenkins/workspace/lldb-cmake-matrix/clang_701_build/bin/clang-7-x86_64) :: test_find_compile_units_dwarf (TestModuleAndSection.ModuleAndSectionAPIsTestCase)
UNSUPPORTED: LLDB (/Users/buildslave/jenkins/workspace/lldb-cmake-matrix/clang_701_build/bin/clang-7-x86_64) :: test_find_compile_units_dwo (TestModuleAndSection.ModuleAndSectionAPIsTestCase) (test case does not fall in any category of interest for this run) 
UNSUPPORTED: LLDB (/Users/buildslave/jenkins/workspace/lldb-cmake-matrix/clang_701_build/bin/clang-7-x86_64) :: test_find_compile_units_gmodules (TestModuleAndSection.ModuleAndSectionAPIsTestCase) (test case does not fall in any category of interest for this run) 
runCmd: settings set symbols.enable-external-lookup false
output: 

runCmd: settings set plugin.process.gdb-remote.packet-timeout 60
output: 

runCmd: settings set symbols.clang-modules-cache-path "/Users/buildslave/jenkins/workspace/lldb-cmake-matrix/lldb-build/tools/lldb/lldb-test-build.noindex/module-cache-lldb"
output: 

runCmd: settings set use-color false
output: 

PASS: LLDB (/Users/buildslave/jenkins/workspace/lldb-cmake-matrix/clang_701_build/bin/clang-7-x86_64) :: test_module_and_section_boundary_condition_dsym (TestModuleAndSection.ModuleAndSectionAPIsTestCase)
runCmd: settings set symbols.enable-external-lookup false
output: 

runCmd: settings set plugin.process.gdb-remote.packet-timeout 60
output: 

runCmd: settings set symbols.clang-modules-cache-path "/Users/buildslave/jenkins/workspace/lldb-cmake-matrix/lldb-build/tools/lldb/lldb-test-build.noindex/module-cache-lldb"
output: 

runCmd: settings set use-color false
output: 

PASS: LLDB (/Users/buildslave/jenkins/workspace/lldb-cmake-matrix/clang_701_build/bin/clang-7-x86_64) :: test_module_and_section_boundary_condition_dwarf (TestModuleAndSection.ModuleAndSectionAPIsTestCase)
UNSUPPORTED: LLDB (/Users/buildslave/jenkins/workspace/lldb-cmake-matrix/clang_701_build/bin/clang-7-x86_64) :: test_module_and_section_boundary_condition_dwo (TestModuleAndSection.ModuleAndSectionAPIsTestCase) (test case does not fall in any category of interest for this run) 
UNSUPPORTED: LLDB (/Users/buildslave/jenkins/workspace/lldb-cmake-matrix/clang_701_build/bin/clang-7-x86_64) :: test_module_and_section_boundary_condition_gmodules (TestModuleAndSection.ModuleAndSectionAPIsTestCase) (test case does not fall in any category of interest for this run) 
runCmd: settings set symbols.enable-external-lookup false
output: 

runCmd: settings set plugin.process.gdb-remote.packet-timeout 60
output: 

runCmd: settings set symbols.clang-modules-cache-path "/Users/buildslave/jenkins/workspace/lldb-cmake-matrix/lldb-build/tools/lldb/lldb-test-build.noindex/module-cache-lldb"
output: 

runCmd: settings set use-color false
output: 

PASS: LLDB (/Users/buildslave/jenkins/workspace/lldb-cmake-matrix/clang_701_build/bin/clang-7-x86_64) :: test_module_and_section_dsym (TestModuleAndSection.ModuleAndSectionAPIsTestCase)
runCmd: settings set symbols.enable-external-lookup false
output: 

runCmd: settings set plugin.process.gdb-remote.packet-timeout 60
output: 

runCmd: settings set symbols.clang-modules-cache-path "/Users/buildslave/jenkins/workspace/lldb-cmake-matrix/lldb-build/tools/lldb/lldb-test-build.noindex/module-cache-lldb"
output: 

runCmd: settings set use-color false
output: 

PASS: LLDB (/Users/buildslave/jenkins/workspace/lldb-cmake-matrix/clang_701_build/bin/clang-7-x86_64) :: test_module_and_section_dwarf (TestModuleAndSection.ModuleAndSectionAPIsTestCase)
UNSUPPORTED: LLDB (/Users/buildslave/jenkins/workspace/lldb-cmake-matrix/clang_701_build/bin/clang-7-x86_64) :: test_module_and_section_dwo (TestModuleAndSection.ModuleAndSectionAPIsTestCase) (test case does not fall in any category of interest for this run) 
UNSUPPORTED: LLDB (/Users/buildslave/jenkins/workspace/lldb-cmake-matrix/clang_701_build/bin/clang-7-x86_64) :: test_module_and_section_gmodules (TestModuleAndSection.ModuleAndSectionAPIsTestCase) (test case does not fall in any category of interest for this run) 
runCmd: settings set symbols.enable-external-lookup false
output: 

runCmd: settings set plugin.process.gdb-remote.packet-timeout 60
output: 

runCmd: settings set symbols.clang-modules-cache-path "/Users/buildslave/jenkins/workspace/lldb-cmake-matrix/lldb-build/tools/lldb/lldb-test-build.noindex/module-cache-lldb"
output: 

runCmd: settings set use-color false
output: 

PASS: LLDB (/Users/buildslave/jenkins/workspace/lldb-cmake-matrix/clang_701_build/bin/clang-7-x86_64) :: test_module_compile_unit_iter_dsym (TestModuleAndSection.ModuleAndSectionAPIsTestCase)
runCmd: settings set symbols.enable-external-lookup false
output: 

runCmd: settings set plugin.process.gdb-remote.packet-timeout 60
output: 

runCmd: settings set symbols.clang-modules-cache-path "/Users/buildslave/jenkins/workspace/lldb-cmake-matrix/lldb-build/tools/lldb/lldb-test-build.noindex/module-cache-lldb"
output: 

runCmd: settings set use-color false
output: 

PASS: LLDB (/Users/buildslave/jenkins/workspace/lldb-cmake-matrix/clang_701_build/bin/clang-7-x86_64) :: test_module_compile_unit_iter_dwarf (TestModuleAndSection.ModuleAndSectionAPIsTestCase)
UNSUPPORTED: LLDB (/Users/buildslave/jenkins/workspace/lldb-cmake-matrix/clang_701_build/bin/clang-7-x86_64) :: test_module_compile_unit_iter_dwo (TestModuleAndSection.ModuleAndSectionAPIsTestCase) (test case does not fall in any category of interest for this run) 
UNSUPPORTED: LLDB (/Users/buildslave/jenkins/workspace/lldb-cmake-matrix/clang_701_build/bin/clang-7-x86_64) :: test_module_compile_unit_iter_gmodules (TestModuleAndSection.ModuleAndSectionAPIsTestCase) (test case does not fall in any category of interest for this run) 
Restore dir to: /Users/buildslave/jenkins/workspace/lldb-cmake-matrix/lldb-build/tools/lldb/lit
======================================================================
ERROR: test_find_compile_units_dsym (TestModuleAndSection.ModuleAndSectionAPIsTestCase)
    Exercise SBModule.FindCompileUnits() API.
----------------------------------------------------------------------
Error when building test subject.

Build Command:
make VPATH=/Users/buildslave/jenkins/workspace/lldb-cmake-matrix/llvm-project/lldb/packages/Python/lldbsuite/test/python_api/module_section -C /Users/buildslave/jenkins/workspace/lldb-cmake-matrix/lldb-build/tools/lldb/lldb-test-build.noindex/python_api/module_section/TestModuleAndSection.test_find_compile_units_dsym -I /Users/buildslave/jenkins/workspace/lldb-cmake-matrix/llvm-project/lldb/packages/Python/lldbsuite/test/python_api/module_section -I /Users/buildslave/jenkins/workspace/lldb-cmake-matrix/llvm-project/lldb/packages/Python/lldbsuite/test/make -f /Users/buildslave/jenkins/workspace/lldb-cmake-matrix/llvm-project/lldb/packages/Python/lldbsuite/test/python_api/module_section/Makefile MAKE_DSYM=YES ARCH=x86_64 CC="/Users/buildslave/jenkins/workspace/lldb-cmake-matrix/clang_701_build/bin/clang-7" all EXE='b.out'

Build Command Output:
/bin/sh: line 1: 19632 Killed: 9               /Users/buildslave/jenkins/workspace/lldb-cmake-matrix/clang_701_build/bin/clang-7 -M -std=c++11 -g -O0 -fno-builtin -isysroot "/Applications/Xcode.app/Contents/Developer/Platforms/MacOSX.platform/Developer/SDKs/MacOSX10.14.sdk" -arch x86_64 -I/Users/buildslave/jenkins/workspace/lldb-cmake-matrix/llvm-project/lldb/packages/Python/lldbsuite/test/make/../../../../../include -I/Users/buildslave/jenkins/workspace/lldb-cmake-matrix/llvm-project/lldb/packages/Python/lldbsuite/test/python_api/module_section -I/Users/buildslave/jenkins/workspace/lldb-cmake-matrix/llvm-project/lldb/packages/Python/lldbsuite/test/make -include /Users/buildslave/jenkins/workspace/lldb-cmake-matrix/llvm-project/lldb/packages/Python/lldbsuite/test/make/test_common.h -fno-limit-debug-info -D__STDC_LIMIT_MACROS --driver-mode=g++ /Users/buildslave/jenkins/workspace/lldb-cmake-matrix/llvm-project/lldb/packages/Python/lldbsuite/test/python_api/module_section/main.cpp > main.d.tmp
clang-7: error: unable to execute command: Killed: 9
clang-7: error: clang frontend command failed due to signal (use -v to see invocation)
clang version 7.0.1 
Target: x86_64-apple-darwin18.0.0
Thread model: posix
InstalledDir: /Users/buildslave/jenkins/workspace/lldb-cmake-matrix/clang_701_build/bin
clang-7: note: diagnostic msg: PLEASE submit a bug report to https://bugs.llvm.org/ and include the crash backtrace, preprocessed source, and associated run script.
clang-7: error: unable to execute command: Killed: 9
clang-7: note: diagnostic msg: Error generating preprocessed source(s).
make: *** [main.o] Error 254

Test Directory:
/Users/buildslave/jenkins/workspace/lldb-cmake-matrix/llvm-project/lldb/packages/Python/lldbsuite/test/python_api/module_section
----------------------------------------------------------------------
Ran 16 tests in 17.236s

RESULT: FAILED (7 passes, 0 failures, 1 errors, 8 skipped, 0 expected failures, 0 unexpected successes)