Regression

Test Clang 7.0.1 / lldb-Suite.tools/lldb-server.TestGdbRemoteThreadsInStopReply.py (from lldb-Suite)

Failing for the past 1 build (Since Unstable#270 )
Took 14 sec.

Stacktrace

lldb version 10.0.99 (http://labmaster3.local/git/llvm-project.git revision 1a3dd638c4a9173e53628b497a1aadc31c32eb50)
  clang revision daa79c5338228a746a7eba0cf2f2f356e1d45a5b
  llvm revision daa79c5338228a746a7eba0cf2f2f356e1d45a5b
LLDB library dir: /Users/buildslave/jenkins/workspace/lldb-cmake-matrix/lldb-build/bin
LLDB import library dir: /Users/buildslave/jenkins/workspace/lldb-cmake-matrix/lldb-build/bin
libstdcxx tests will not be run because: Don't know how to build with libstdcxx on macosx
Skipping following debug info categories: ['dwo']

Session logs for test failures/errors/unexpected successes will go into directory '/Users/buildslave/jenkins/workspace/lldb-cmake-matrix/test/logs'
Command invoked: /Users/buildslave/jenkins/workspace/lldb-cmake-matrix/llvm-project/lldb/test/dotest.py --arch=x86_64 -s /Users/buildslave/jenkins/workspace/lldb-cmake-matrix/lldb-build/lldb-test-traces -S nm -u CXXFLAGS -u CFLAGS --executable /Users/buildslave/jenkins/workspace/lldb-cmake-matrix/lldb-build/./bin/lldb --dsymutil /Users/buildslave/jenkins/workspace/lldb-cmake-matrix/lldb-build/./bin/dsymutil --filecheck /Users/buildslave/jenkins/workspace/lldb-cmake-matrix/lldb-build/./bin/FileCheck -C /Users/buildslave/jenkins/workspace/lldb-cmake-matrix/clang_701_build/bin/clang --codesign-identity lldb_codesign --server /Users/buildslave/jenkins/workspace/lldb-cmake-matrix/lldb-build/./bin/debugserver --arch x86_64 --build-dir /Users/buildslave/jenkins/workspace/lldb-cmake-matrix/lldb-build/lldb-test-build.noindex -s=/Users/buildslave/jenkins/workspace/lldb-cmake-matrix/test/logs -t --env TERM=vt100 --skip-category gmodules --skip-category watchpoint --arch=x86_64 --env LLVM_LIBS_DIR=/Users/buildslave/jenkins/workspace/lldb-cmake-matrix/lldb-build/./lib --build-dir /Users/buildslave/jenkins/workspace/lldb-cmake-matrix/lldb-build/tools/lldb/lldb-test-build.noindex --module-cache-dir /Users/buildslave/jenkins/workspace/lldb-cmake-matrix/lldb-build/tools/lldb/lldb-test-build.noindex/module-cache-lldb /Users/buildslave/jenkins/workspace/lldb-cmake-matrix/llvm-project/lldb/packages/Python/lldbsuite/test/tools/lldb-server -p TestGdbRemoteThreadsInStopReply.py
Change dir to: /Users/buildslave/jenkins/workspace/lldb-cmake-matrix/llvm-project/lldb/packages/Python/lldbsuite/test/tools/lldb-server
runCmd: settings set symbols.enable-external-lookup false
output: 

runCmd: settings set plugin.process.gdb-remote.packet-timeout 60
output: 

runCmd: settings set symbols.clang-modules-cache-path "/Users/buildslave/jenkins/workspace/lldb-cmake-matrix/lldb-build/tools/lldb/lldb-test-build.noindex/module-cache-lldb"
output: 

runCmd: settings set use-color false
output: 

Adding tearDown hook:         def shutdown_named_pipe():
            # Close the pipe.
            try:
                named_pipe.close()
            except:
                print("failed to close named pipe")
                None

            # Delete the pipe.
            try:
                os.remove(named_pipe_path)
            except:
                print("failed to delete named pipe: {}".format(named_pipe_path))
                None

            # Delete the temp directory.
            try:
                os.rmdir(temp_dir)
            except:
                print(
                    "failed to delete temp dir: {}, directory contents: '{}'".format(
                        temp_dir, os.listdir(temp_dir)))
                None


Adding tearDown hook:     def cleanupSubprocesses(self):
        # Ensure any subprocesses are cleaned up
        for p in self.subprocesses:
            p.terminate()
            del p
        del self.subprocesses[:]
        # Ensure any forked processes are cleaned up
        for pid in self.forkedProcessPids:
            if os.path.exists("/proc/" + str(pid)):
                os.kill(pid, signal.SIGTERM)


Adding tearDown hook:             def shutdown_debug_monitor():
                try:
                    server.terminate()
                except:
                    logger.warning(
                        "failed to terminate server for debug monitor: {}; ignoring".format(
                            sys.exc_info()[0]))


Adding tearDown hook:         def shutdown_socket():
            if sock:
                try:
                    # send the kill packet so lldb-server shuts down gracefully
                    sock.sendall(GdbRemoteTestCaseBase._GDBREMOTE_KILL_PACKET)
                except:
                    logger.warning(
                        "failed to send kill packet to debug monitor: {}; ignoring".format(
                            sys.exc_info()[0]))

                try:
                    sock.close()
                except:
                    logger.warning(
                        "failed to close socket to debug monitor: {}; ignoring".format(
                            sys.exc_info()[0]))


FAIL: LLDB (/Users/buildslave/jenkins/workspace/lldb-cmake-matrix/clang_701_build/bin/clang-7-x86_64) :: test_QListThreadsInStopReply_supported_debugserver (TestGdbRemoteThreadsInStopReply.TestGdbRemoteThreadsInStopReply)
Executing tearDown hook:         def shutdown_socket():
            if sock:
                try:
                    # send the kill packet so lldb-server shuts down gracefully
                    sock.sendall(GdbRemoteTestCaseBase._GDBREMOTE_KILL_PACKET)
                except:
                    logger.warning(
                        "failed to send kill packet to debug monitor: {}; ignoring".format(
                            sys.exc_info()[0]))

                try:
                    sock.close()
                except:
                    logger.warning(
                        "failed to close socket to debug monitor: {}; ignoring".format(
                            sys.exc_info()[0]))


Executing tearDown hook:             def shutdown_debug_monitor():
                try:
                    server.terminate()
                except:
                    logger.warning(
                        "failed to terminate server for debug monitor: {}; ignoring".format(
                            sys.exc_info()[0]))


Executing tearDown hook:     def cleanupSubprocesses(self):
        # Ensure any subprocesses are cleaned up
        for p in self.subprocesses:
            p.terminate()
            del p
        del self.subprocesses[:]
        # Ensure any forked processes are cleaned up
        for pid in self.forkedProcessPids:
            if os.path.exists("/proc/" + str(pid)):
                os.kill(pid, signal.SIGTERM)


Executing tearDown hook:         def shutdown_named_pipe():
            # Close the pipe.
            try:
                named_pipe.close()
            except:
                print("failed to close named pipe")
                None

            # Delete the pipe.
            try:
                os.remove(named_pipe_path)
            except:
                print("failed to delete named pipe: {}".format(named_pipe_path))
                None

            # Delete the temp directory.
            try:
                os.rmdir(temp_dir)
            except:
                print(
                    "failed to delete temp dir: {}, directory contents: '{}'".format(
                        temp_dir, os.listdir(temp_dir)))
                None


runCmd: settings set symbols.enable-external-lookup false
output: 

runCmd: settings set plugin.process.gdb-remote.packet-timeout 60
output: 

runCmd: settings set symbols.clang-modules-cache-path "/Users/buildslave/jenkins/workspace/lldb-cmake-matrix/lldb-build/tools/lldb/lldb-test-build.noindex/module-cache-lldb"
output: 

runCmd: settings set use-color false
output: 

UNSUPPORTED: LLDB (/Users/buildslave/jenkins/workspace/lldb-cmake-matrix/clang_701_build/bin/clang-7-x86_64) :: test_QListThreadsInStopReply_supported_llgs (TestGdbRemoteThreadsInStopReply.TestGdbRemoteThreadsInStopReply) (llgs tests) 
runCmd: settings set symbols.enable-external-lookup false
output: 

runCmd: settings set plugin.process.gdb-remote.packet-timeout 60
output: 

runCmd: settings set symbols.clang-modules-cache-path "/Users/buildslave/jenkins/workspace/lldb-cmake-matrix/lldb-build/tools/lldb/lldb-test-build.noindex/module-cache-lldb"
output: 

runCmd: settings set use-color false
output: 

Adding tearDown hook:         def shutdown_named_pipe():
            # Close the pipe.
            try:
                named_pipe.close()
            except:
                print("failed to close named pipe")
                None

            # Delete the pipe.
            try:
                os.remove(named_pipe_path)
            except:
                print("failed to delete named pipe: {}".format(named_pipe_path))
                None

            # Delete the temp directory.
            try:
                os.rmdir(temp_dir)
            except:
                print(
                    "failed to delete temp dir: {}, directory contents: '{}'".format(
                        temp_dir, os.listdir(temp_dir)))
                None


Adding tearDown hook:     def cleanupSubprocesses(self):
        # Ensure any subprocesses are cleaned up
        for p in self.subprocesses:
            p.terminate()
            del p
        del self.subprocesses[:]
        # Ensure any forked processes are cleaned up
        for pid in self.forkedProcessPids:
            if os.path.exists("/proc/" + str(pid)):
                os.kill(pid, signal.SIGTERM)


Adding tearDown hook:             def shutdown_debug_monitor():
                try:
                    server.terminate()
                except:
                    logger.warning(
                        "failed to terminate server for debug monitor: {}; ignoring".format(
                            sys.exc_info()[0]))


Adding tearDown hook:         def shutdown_socket():
            if sock:
                try:
                    # send the kill packet so lldb-server shuts down gracefully
                    sock.sendall(GdbRemoteTestCaseBase._GDBREMOTE_KILL_PACKET)
                except:
                    logger.warning(
                        "failed to send kill packet to debug monitor: {}; ignoring".format(
                            sys.exc_info()[0]))

                try:
                    sock.close()
                except:
                    logger.warning(
                        "failed to close socket to debug monitor: {}; ignoring".format(
                            sys.exc_info()[0]))


FAIL: LLDB (/Users/buildslave/jenkins/workspace/lldb-cmake-matrix/clang_701_build/bin/clang-7-x86_64) :: test_no_QListThreadsInStopReply_supplies_no_threads_debugserver (TestGdbRemoteThreadsInStopReply.TestGdbRemoteThreadsInStopReply)
Executing tearDown hook:         def shutdown_socket():
            if sock:
                try:
                    # send the kill packet so lldb-server shuts down gracefully
                    sock.sendall(GdbRemoteTestCaseBase._GDBREMOTE_KILL_PACKET)
                except:
                    logger.warning(
                        "failed to send kill packet to debug monitor: {}; ignoring".format(
                            sys.exc_info()[0]))

                try:
                    sock.close()
                except:
                    logger.warning(
                        "failed to close socket to debug monitor: {}; ignoring".format(
                            sys.exc_info()[0]))


Executing tearDown hook:             def shutdown_debug_monitor():
                try:
                    server.terminate()
                except:
                    logger.warning(
                        "failed to terminate server for debug monitor: {}; ignoring".format(
                            sys.exc_info()[0]))


Executing tearDown hook:     def cleanupSubprocesses(self):
        # Ensure any subprocesses are cleaned up
        for p in self.subprocesses:
            p.terminate()
            del p
        del self.subprocesses[:]
        # Ensure any forked processes are cleaned up
        for pid in self.forkedProcessPids:
            if os.path.exists("/proc/" + str(pid)):
                os.kill(pid, signal.SIGTERM)


Executing tearDown hook:         def shutdown_named_pipe():
            # Close the pipe.
            try:
                named_pipe.close()
            except:
                print("failed to close named pipe")
                None

            # Delete the pipe.
            try:
                os.remove(named_pipe_path)
            except:
                print("failed to delete named pipe: {}".format(named_pipe_path))
                None

            # Delete the temp directory.
            try:
                os.rmdir(temp_dir)
            except:
                print(
                    "failed to delete temp dir: {}, directory contents: '{}'".format(
                        temp_dir, os.listdir(temp_dir)))
                None


runCmd: settings set symbols.enable-external-lookup false
output: 

runCmd: settings set plugin.process.gdb-remote.packet-timeout 60
output: 

runCmd: settings set symbols.clang-modules-cache-path "/Users/buildslave/jenkins/workspace/lldb-cmake-matrix/lldb-build/tools/lldb/lldb-test-build.noindex/module-cache-lldb"
output: 

runCmd: settings set use-color false
output: 

UNSUPPORTED: LLDB (/Users/buildslave/jenkins/workspace/lldb-cmake-matrix/clang_701_build/bin/clang-7-x86_64) :: test_no_QListThreadsInStopReply_supplies_no_threads_llgs (TestGdbRemoteThreadsInStopReply.TestGdbRemoteThreadsInStopReply) (llgs tests) 
runCmd: settings set symbols.enable-external-lookup false
output: 

runCmd: settings set plugin.process.gdb-remote.packet-timeout 60
output: 

runCmd: settings set symbols.clang-modules-cache-path "/Users/buildslave/jenkins/workspace/lldb-cmake-matrix/lldb-build/tools/lldb/lldb-test-build.noindex/module-cache-lldb"
output: 

runCmd: settings set use-color false
output: 

Adding tearDown hook:         def shutdown_named_pipe():
            # Close the pipe.
            try:
                named_pipe.close()
            except:
                print("failed to close named pipe")
                None

            # Delete the pipe.
            try:
                os.remove(named_pipe_path)
            except:
                print("failed to delete named pipe: {}".format(named_pipe_path))
                None

            # Delete the temp directory.
            try:
                os.rmdir(temp_dir)
            except:
                print(
                    "failed to delete temp dir: {}, directory contents: '{}'".format(
                        temp_dir, os.listdir(temp_dir)))
                None


Adding tearDown hook:     def cleanupSubprocesses(self):
        # Ensure any subprocesses are cleaned up
        for p in self.subprocesses:
            p.terminate()
            del p
        del self.subprocesses[:]
        # Ensure any forked processes are cleaned up
        for pid in self.forkedProcessPids:
            if os.path.exists("/proc/" + str(pid)):
                os.kill(pid, signal.SIGTERM)


Adding tearDown hook:             def shutdown_debug_monitor():
                try:
                    server.terminate()
                except:
                    logger.warning(
                        "failed to terminate server for debug monitor: {}; ignoring".format(
                            sys.exc_info()[0]))


Adding tearDown hook:         def shutdown_socket():
            if sock:
                try:
                    # send the kill packet so lldb-server shuts down gracefully
                    sock.sendall(GdbRemoteTestCaseBase._GDBREMOTE_KILL_PACKET)
                except:
                    logger.warning(
                        "failed to send kill packet to debug monitor: {}; ignoring".format(
                            sys.exc_info()[0]))

                try:
                    sock.close()
                except:
                    logger.warning(
                        "failed to close socket to debug monitor: {}; ignoring".format(
                            sys.exc_info()[0]))


FAIL: LLDB (/Users/buildslave/jenkins/workspace/lldb-cmake-matrix/clang_701_build/bin/clang-7-x86_64) :: test_stop_reply_contains_thread_pcs_debugserver (TestGdbRemoteThreadsInStopReply.TestGdbRemoteThreadsInStopReply)
Executing tearDown hook:         def shutdown_socket():
            if sock:
                try:
                    # send the kill packet so lldb-server shuts down gracefully
                    sock.sendall(GdbRemoteTestCaseBase._GDBREMOTE_KILL_PACKET)
                except:
                    logger.warning(
                        "failed to send kill packet to debug monitor: {}; ignoring".format(
                            sys.exc_info()[0]))

                try:
                    sock.close()
                except:
                    logger.warning(
                        "failed to close socket to debug monitor: {}; ignoring".format(
                            sys.exc_info()[0]))


Executing tearDown hook:             def shutdown_debug_monitor():
                try:
                    server.terminate()
                except:
                    logger.warning(
                        "failed to terminate server for debug monitor: {}; ignoring".format(
                            sys.exc_info()[0]))


Executing tearDown hook:     def cleanupSubprocesses(self):
        # Ensure any subprocesses are cleaned up
        for p in self.subprocesses:
            p.terminate()
            del p
        del self.subprocesses[:]
        # Ensure any forked processes are cleaned up
        for pid in self.forkedProcessPids:
            if os.path.exists("/proc/" + str(pid)):
                os.kill(pid, signal.SIGTERM)


Executing tearDown hook:         def shutdown_named_pipe():
            # Close the pipe.
            try:
                named_pipe.close()
            except:
                print("failed to close named pipe")
                None

            # Delete the pipe.
            try:
                os.remove(named_pipe_path)
            except:
                print("failed to delete named pipe: {}".format(named_pipe_path))
                None

            # Delete the temp directory.
            try:
                os.rmdir(temp_dir)
            except:
                print(
                    "failed to delete temp dir: {}, directory contents: '{}'".format(
                        temp_dir, os.listdir(temp_dir)))
                None


runCmd: settings set symbols.enable-external-lookup false
output: 

runCmd: settings set plugin.process.gdb-remote.packet-timeout 60
output: 

runCmd: settings set symbols.clang-modules-cache-path "/Users/buildslave/jenkins/workspace/lldb-cmake-matrix/lldb-build/tools/lldb/lldb-test-build.noindex/module-cache-lldb"
output: 

runCmd: settings set use-color false
output: 

UNSUPPORTED: LLDB (/Users/buildslave/jenkins/workspace/lldb-cmake-matrix/clang_701_build/bin/clang-7-x86_64) :: test_stop_reply_contains_thread_pcs_llgs (TestGdbRemoteThreadsInStopReply.TestGdbRemoteThreadsInStopReply) (llgs tests) 
runCmd: settings set symbols.enable-external-lookup false
output: 

runCmd: settings set plugin.process.gdb-remote.packet-timeout 60
output: 

runCmd: settings set symbols.clang-modules-cache-path "/Users/buildslave/jenkins/workspace/lldb-cmake-matrix/lldb-build/tools/lldb/lldb-test-build.noindex/module-cache-lldb"
output: 

runCmd: settings set use-color false
output: 

Adding tearDown hook:         def shutdown_named_pipe():
            # Close the pipe.
            try:
                named_pipe.close()
            except:
                print("failed to close named pipe")
                None

            # Delete the pipe.
            try:
                os.remove(named_pipe_path)
            except:
                print("failed to delete named pipe: {}".format(named_pipe_path))
                None

            # Delete the temp directory.
            try:
                os.rmdir(temp_dir)
            except:
                print(
                    "failed to delete temp dir: {}, directory contents: '{}'".format(
                        temp_dir, os.listdir(temp_dir)))
                None


Adding tearDown hook:     def cleanupSubprocesses(self):
        # Ensure any subprocesses are cleaned up
        for p in self.subprocesses:
            p.terminate()
            del p
        del self.subprocesses[:]
        # Ensure any forked processes are cleaned up
        for pid in self.forkedProcessPids:
            if os.path.exists("/proc/" + str(pid)):
                os.kill(pid, signal.SIGTERM)


Adding tearDown hook:             def shutdown_debug_monitor():
                try:
                    server.terminate()
                except:
                    logger.warning(
                        "failed to terminate server for debug monitor: {}; ignoring".format(
                            sys.exc_info()[0]))


Adding tearDown hook:         def shutdown_socket():
            if sock:
                try:
                    # send the kill packet so lldb-server shuts down gracefully
                    sock.sendall(GdbRemoteTestCaseBase._GDBREMOTE_KILL_PACKET)
                except:
                    logger.warning(
                        "failed to send kill packet to debug monitor: {}; ignoring".format(
                            sys.exc_info()[0]))

                try:
                    sock.close()
                except:
                    logger.warning(
                        "failed to close socket to debug monitor: {}; ignoring".format(
                            sys.exc_info()[0]))


FAIL: LLDB (/Users/buildslave/jenkins/workspace/lldb-cmake-matrix/clang_701_build/bin/clang-7-x86_64) :: test_stop_reply_reports_correct_threads_debugserver (TestGdbRemoteThreadsInStopReply.TestGdbRemoteThreadsInStopReply)
Executing tearDown hook:         def shutdown_socket():
            if sock:
                try:
                    # send the kill packet so lldb-server shuts down gracefully
                    sock.sendall(GdbRemoteTestCaseBase._GDBREMOTE_KILL_PACKET)
                except:
                    logger.warning(
                        "failed to send kill packet to debug monitor: {}; ignoring".format(
                            sys.exc_info()[0]))

                try:
                    sock.close()
                except:
                    logger.warning(
                        "failed to close socket to debug monitor: {}; ignoring".format(
                            sys.exc_info()[0]))


Executing tearDown hook:             def shutdown_debug_monitor():
                try:
                    server.terminate()
                except:
                    logger.warning(
                        "failed to terminate server for debug monitor: {}; ignoring".format(
                            sys.exc_info()[0]))


Executing tearDown hook:     def cleanupSubprocesses(self):
        # Ensure any subprocesses are cleaned up
        for p in self.subprocesses:
            p.terminate()
            del p
        del self.subprocesses[:]
        # Ensure any forked processes are cleaned up
        for pid in self.forkedProcessPids:
            if os.path.exists("/proc/" + str(pid)):
                os.kill(pid, signal.SIGTERM)


Executing tearDown hook:         def shutdown_named_pipe():
            # Close the pipe.
            try:
                named_pipe.close()
            except:
                print("failed to close named pipe")
                None

            # Delete the pipe.
            try:
                os.remove(named_pipe_path)
            except:
                print("failed to delete named pipe: {}".format(named_pipe_path))
                None

            # Delete the temp directory.
            try:
                os.rmdir(temp_dir)
            except:
                print(
                    "failed to delete temp dir: {}, directory contents: '{}'".format(
                        temp_dir, os.listdir(temp_dir)))
                None


runCmd: settings set symbols.enable-external-lookup false
output: 

runCmd: settings set plugin.process.gdb-remote.packet-timeout 60
output: 

runCmd: settings set symbols.clang-modules-cache-path "/Users/buildslave/jenkins/workspace/lldb-cmake-matrix/lldb-build/tools/lldb/lldb-test-build.noindex/module-cache-lldb"
output: 

runCmd: settings set use-color false
output: 

UNSUPPORTED: LLDB (/Users/buildslave/jenkins/workspace/lldb-cmake-matrix/clang_701_build/bin/clang-7-x86_64) :: test_stop_reply_reports_correct_threads_llgs (TestGdbRemoteThreadsInStopReply.TestGdbRemoteThreadsInStopReply) (llgs tests) 
runCmd: settings set symbols.enable-external-lookup false
output: 

runCmd: settings set plugin.process.gdb-remote.packet-timeout 60
output: 

runCmd: settings set symbols.clang-modules-cache-path "/Users/buildslave/jenkins/workspace/lldb-cmake-matrix/lldb-build/tools/lldb/lldb-test-build.noindex/module-cache-lldb"
output: 

runCmd: settings set use-color false
output: 

Adding tearDown hook:         def shutdown_named_pipe():
            # Close the pipe.
            try:
                named_pipe.close()
            except:
                print("failed to close named pipe")
                None

            # Delete the pipe.
            try:
                os.remove(named_pipe_path)
            except:
                print("failed to delete named pipe: {}".format(named_pipe_path))
                None

            # Delete the temp directory.
            try:
                os.rmdir(temp_dir)
            except:
                print(
                    "failed to delete temp dir: {}, directory contents: '{}'".format(
                        temp_dir, os.listdir(temp_dir)))
                None


Adding tearDown hook:     def cleanupSubprocesses(self):
        # Ensure any subprocesses are cleaned up
        for p in self.subprocesses:
            p.terminate()
            del p
        del self.subprocesses[:]
        # Ensure any forked processes are cleaned up
        for pid in self.forkedProcessPids:
            if os.path.exists("/proc/" + str(pid)):
                os.kill(pid, signal.SIGTERM)


Adding tearDown hook:             def shutdown_debug_monitor():
                try:
                    server.terminate()
                except:
                    logger.warning(
                        "failed to terminate server for debug monitor: {}; ignoring".format(
                            sys.exc_info()[0]))


Adding tearDown hook:         def shutdown_socket():
            if sock:
                try:
                    # send the kill packet so lldb-server shuts down gracefully
                    sock.sendall(GdbRemoteTestCaseBase._GDBREMOTE_KILL_PACKET)
                except:
                    logger.warning(
                        "failed to send kill packet to debug monitor: {}; ignoring".format(
                            sys.exc_info()[0]))

                try:
                    sock.close()
                except:
                    logger.warning(
                        "failed to close socket to debug monitor: {}; ignoring".format(
                            sys.exc_info()[0]))


FAIL: LLDB (/Users/buildslave/jenkins/workspace/lldb-cmake-matrix/clang_701_build/bin/clang-7-x86_64) :: test_stop_reply_reports_multiple_threads_debugserver (TestGdbRemoteThreadsInStopReply.TestGdbRemoteThreadsInStopReply)
Executing tearDown hook:         def shutdown_socket():
            if sock:
                try:
                    # send the kill packet so lldb-server shuts down gracefully
                    sock.sendall(GdbRemoteTestCaseBase._GDBREMOTE_KILL_PACKET)
                except:
                    logger.warning(
                        "failed to send kill packet to debug monitor: {}; ignoring".format(
                            sys.exc_info()[0]))

                try:
                    sock.close()
                except:
                    logger.warning(
                        "failed to close socket to debug monitor: {}; ignoring".format(
                            sys.exc_info()[0]))


Executing tearDown hook:             def shutdown_debug_monitor():
                try:
                    server.terminate()
                except:
                    logger.warning(
                        "failed to terminate server for debug monitor: {}; ignoring".format(
                            sys.exc_info()[0]))


Executing tearDown hook:     def cleanupSubprocesses(self):
        # Ensure any subprocesses are cleaned up
        for p in self.subprocesses:
            p.terminate()
            del p
        del self.subprocesses[:]
        # Ensure any forked processes are cleaned up
        for pid in self.forkedProcessPids:
            if os.path.exists("/proc/" + str(pid)):
                os.kill(pid, signal.SIGTERM)


Executing tearDown hook:         def shutdown_named_pipe():
            # Close the pipe.
            try:
                named_pipe.close()
            except:
                print("failed to close named pipe")
                None

            # Delete the pipe.
            try:
                os.remove(named_pipe_path)
            except:
                print("failed to delete named pipe: {}".format(named_pipe_path))
                None

            # Delete the temp directory.
            try:
                os.rmdir(temp_dir)
            except:
                print(
                    "failed to delete temp dir: {}, directory contents: '{}'".format(
                        temp_dir, os.listdir(temp_dir)))
                None


runCmd: settings set symbols.enable-external-lookup false
output: 

runCmd: settings set plugin.process.gdb-remote.packet-timeout 60
output: 

runCmd: settings set symbols.clang-modules-cache-path "/Users/buildslave/jenkins/workspace/lldb-cmake-matrix/lldb-build/tools/lldb/lldb-test-build.noindex/module-cache-lldb"
output: 

runCmd: settings set use-color false
output: 

UNSUPPORTED: LLDB (/Users/buildslave/jenkins/workspace/lldb-cmake-matrix/clang_701_build/bin/clang-7-x86_64) :: test_stop_reply_reports_multiple_threads_llgs (TestGdbRemoteThreadsInStopReply.TestGdbRemoteThreadsInStopReply) (llgs tests) 
Restore dir to: /Users/buildslave/jenkins/workspace/lldb-cmake-matrix/lldb-build/tools/lldb/lit
======================================================================
FAIL: test_QListThreadsInStopReply_supported_debugserver (TestGdbRemoteThreadsInStopReply.TestGdbRemoteThreadsInStopReply)
----------------------------------------------------------------------
Traceback (most recent call last):
  File "/Users/buildslave/jenkins/workspace/lldb-cmake-matrix/llvm-project/lldb/packages/Python/lldbsuite/test/decorators.py", line 141, in wrapper
    func(*args, **kwargs)
  File "/Users/buildslave/jenkins/workspace/lldb-cmake-matrix/llvm-project/lldb/packages/Python/lldbsuite/test/tools/lldb-server/TestGdbRemoteThreadsInStopReply.py", line 184, in test_QListThreadsInStopReply_supported_debugserver
    self.QListThreadsInStopReply_supported()
  File "/Users/buildslave/jenkins/workspace/lldb-cmake-matrix/llvm-project/lldb/packages/Python/lldbsuite/test/tools/lldb-server/TestGdbRemoteThreadsInStopReply.py", line 175, in QListThreadsInStopReply_supported
    context = self.expect_gdbremote_sequence()
  File "/Users/buildslave/jenkins/workspace/lldb-cmake-matrix/llvm-project/lldb/packages/Python/lldbsuite/test/tools/lldb-server/gdbremote_testcase.py", line 735, in expect_gdbremote_sequence
    self.logger)
  File "/Users/buildslave/jenkins/workspace/lldb-cmake-matrix/llvm-project/lldb/packages/Python/lldbsuite/test/tools/lldb-server/lldbgdbserverutils.py", line 260, in expect_lldb_gdbserver_replay
    asserter, content, context=context)
  File "/Users/buildslave/jenkins/workspace/lldb-cmake-matrix/llvm-project/lldb/packages/Python/lldbsuite/test/tools/lldb-server/lldbgdbserverutils.py", line 563, in assert_match
    self._assert_exact_payload_match(asserter, actual_packet)
  File "/Users/buildslave/jenkins/workspace/lldb-cmake-matrix/llvm-project/lldb/packages/Python/lldbsuite/test/tools/lldb-server/lldbgdbserverutils.py", line 517, in _assert_exact_payload_match
    assert_packets_equal(asserter, actual_packet, self.exact_payload)
  File "/Users/buildslave/jenkins/workspace/lldb-cmake-matrix/llvm-project/lldb/packages/Python/lldbsuite/test/tools/lldb-server/lldbgdbserverutils.py", line 158, in assert_packets_equal
    asserter.assertEqual(actual_stripped, expected_stripped)
AssertionError: '$Efailed to get the task for process 13368' != '$OK'
Config=x86_64-/Users/buildslave/jenkins/workspace/lldb-cmake-matrix/clang_701_build/bin/clang-7
======================================================================
FAIL: test_no_QListThreadsInStopReply_supplies_no_threads_debugserver (TestGdbRemoteThreadsInStopReply.TestGdbRemoteThreadsInStopReply)
----------------------------------------------------------------------
Traceback (most recent call last):
  File "/Users/buildslave/jenkins/workspace/lldb-cmake-matrix/llvm-project/lldb/packages/Python/lldbsuite/test/decorators.py", line 141, in wrapper
    func(*args, **kwargs)
  File "/Users/buildslave/jenkins/workspace/lldb-cmake-matrix/llvm-project/lldb/packages/Python/lldbsuite/test/tools/lldb-server/TestGdbRemoteThreadsInStopReply.py", line 232, in test_no_QListThreadsInStopReply_supplies_no_threads_debugserver
    self.no_QListThreadsInStopReply_supplies_no_threads(5)
  File "/Users/buildslave/jenkins/workspace/lldb-cmake-matrix/llvm-project/lldb/packages/Python/lldbsuite/test/tools/lldb-server/TestGdbRemoteThreadsInStopReply.py", line 223, in no_QListThreadsInStopReply_supplies_no_threads
    stop_reply_threads = self.gather_stop_reply_threads(None, thread_count)
  File "/Users/buildslave/jenkins/workspace/lldb-cmake-matrix/llvm-project/lldb/packages/Python/lldbsuite/test/tools/lldb-server/TestGdbRemoteThreadsInStopReply.py", line 98, in gather_stop_reply_threads
    post_startup_log_lines, thread_count, ["threads"])["threads"]
  File "/Users/buildslave/jenkins/workspace/lldb-cmake-matrix/llvm-project/lldb/packages/Python/lldbsuite/test/tools/lldb-server/TestGdbRemoteThreadsInStopReply.py", line 41, in gather_stop_reply_fields
    context = self.expect_gdbremote_sequence()
  File "/Users/buildslave/jenkins/workspace/lldb-cmake-matrix/llvm-project/lldb/packages/Python/lldbsuite/test/tools/lldb-server/gdbremote_testcase.py", line 735, in expect_gdbremote_sequence
    self.logger)
  File "/Users/buildslave/jenkins/workspace/lldb-cmake-matrix/llvm-project/lldb/packages/Python/lldbsuite/test/tools/lldb-server/lldbgdbserverutils.py", line 260, in expect_lldb_gdbserver_replay
    asserter, content, context=context)
  File "/Users/buildslave/jenkins/workspace/lldb-cmake-matrix/llvm-project/lldb/packages/Python/lldbsuite/test/tools/lldb-server/lldbgdbserverutils.py", line 563, in assert_match
    self._assert_exact_payload_match(asserter, actual_packet)
  File "/Users/buildslave/jenkins/workspace/lldb-cmake-matrix/llvm-project/lldb/packages/Python/lldbsuite/test/tools/lldb-server/lldbgdbserverutils.py", line 517, in _assert_exact_payload_match
    assert_packets_equal(asserter, actual_packet, self.exact_payload)
  File "/Users/buildslave/jenkins/workspace/lldb-cmake-matrix/llvm-project/lldb/packages/Python/lldbsuite/test/tools/lldb-server/lldbgdbserverutils.py", line 158, in assert_packets_equal
    asserter.assertEqual(actual_stripped, expected_stripped)
AssertionError: '$Efailed to get the task for process 13471' != '$OK'
Config=x86_64-/Users/buildslave/jenkins/workspace/lldb-cmake-matrix/clang_701_build/bin/clang-7
======================================================================
FAIL: test_stop_reply_contains_thread_pcs_debugserver (TestGdbRemoteThreadsInStopReply.TestGdbRemoteThreadsInStopReply)
----------------------------------------------------------------------
Traceback (most recent call last):
  File "/Users/buildslave/jenkins/workspace/lldb-cmake-matrix/llvm-project/lldb/packages/Python/lldbsuite/test/decorators.py", line 141, in wrapper
    func(*args, **kwargs)
  File "/Users/buildslave/jenkins/workspace/lldb-cmake-matrix/llvm-project/lldb/packages/Python/lldbsuite/test/tools/lldb-server/TestGdbRemoteThreadsInStopReply.py", line 311, in test_stop_reply_contains_thread_pcs_debugserver
    self.stop_reply_contains_thread_pcs(5)
  File "/Users/buildslave/jenkins/workspace/lldb-cmake-matrix/llvm-project/lldb/packages/Python/lldbsuite/test/tools/lldb-server/TestGdbRemoteThreadsInStopReply.py", line 282, in stop_reply_contains_thread_pcs
    self.ENABLE_THREADS_IN_STOP_REPLY_ENTRIES, thread_count)
  File "/Users/buildslave/jenkins/workspace/lldb-cmake-matrix/llvm-project/lldb/packages/Python/lldbsuite/test/tools/lldb-server/TestGdbRemoteThreadsInStopReply.py", line 107, in gather_stop_reply_pcs
    thread_count, ["threads", "thread-pcs"])
  File "/Users/buildslave/jenkins/workspace/lldb-cmake-matrix/llvm-project/lldb/packages/Python/lldbsuite/test/tools/lldb-server/TestGdbRemoteThreadsInStopReply.py", line 41, in gather_stop_reply_fields
    context = self.expect_gdbremote_sequence()
  File "/Users/buildslave/jenkins/workspace/lldb-cmake-matrix/llvm-project/lldb/packages/Python/lldbsuite/test/tools/lldb-server/gdbremote_testcase.py", line 735, in expect_gdbremote_sequence
    self.logger)
  File "/Users/buildslave/jenkins/workspace/lldb-cmake-matrix/llvm-project/lldb/packages/Python/lldbsuite/test/tools/lldb-server/lldbgdbserverutils.py", line 260, in expect_lldb_gdbserver_replay
    asserter, content, context=context)
  File "/Users/buildslave/jenkins/workspace/lldb-cmake-matrix/llvm-project/lldb/packages/Python/lldbsuite/test/tools/lldb-server/lldbgdbserverutils.py", line 563, in assert_match
    self._assert_exact_payload_match(asserter, actual_packet)
  File "/Users/buildslave/jenkins/workspace/lldb-cmake-matrix/llvm-project/lldb/packages/Python/lldbsuite/test/tools/lldb-server/lldbgdbserverutils.py", line 517, in _assert_exact_payload_match
    assert_packets_equal(asserter, actual_packet, self.exact_payload)
  File "/Users/buildslave/jenkins/workspace/lldb-cmake-matrix/llvm-project/lldb/packages/Python/lldbsuite/test/tools/lldb-server/lldbgdbserverutils.py", line 158, in assert_packets_equal
    asserter.assertEqual(actual_stripped, expected_stripped)
AssertionError: '$Efailed to get the task for process 13694' != '$OK'
Config=x86_64-/Users/buildslave/jenkins/workspace/lldb-cmake-matrix/clang_701_build/bin/clang-7
======================================================================
FAIL: test_stop_reply_reports_correct_threads_debugserver (TestGdbRemoteThreadsInStopReply.TestGdbRemoteThreadsInStopReply)
----------------------------------------------------------------------
Traceback (most recent call last):
  File "/Users/buildslave/jenkins/workspace/lldb-cmake-matrix/llvm-project/lldb/packages/Python/lldbsuite/test/decorators.py", line 141, in wrapper
    func(*args, **kwargs)
  File "/Users/buildslave/jenkins/workspace/lldb-cmake-matrix/llvm-project/lldb/packages/Python/lldbsuite/test/tools/lldb-server/TestGdbRemoteThreadsInStopReply.py", line 270, in test_stop_reply_reports_correct_threads_debugserver
    self.stop_reply_reports_correct_threads(5)
  File "/Users/buildslave/jenkins/workspace/lldb-cmake-matrix/llvm-project/lldb/packages/Python/lldbsuite/test/tools/lldb-server/TestGdbRemoteThreadsInStopReply.py", line 246, in stop_reply_reports_correct_threads
    self.ENABLE_THREADS_IN_STOP_REPLY_ENTRIES, thread_count)
  File "/Users/buildslave/jenkins/workspace/lldb-cmake-matrix/llvm-project/lldb/packages/Python/lldbsuite/test/tools/lldb-server/TestGdbRemoteThreadsInStopReply.py", line 98, in gather_stop_reply_threads
    post_startup_log_lines, thread_count, ["threads"])["threads"]
  File "/Users/buildslave/jenkins/workspace/lldb-cmake-matrix/llvm-project/lldb/packages/Python/lldbsuite/test/tools/lldb-server/TestGdbRemoteThreadsInStopReply.py", line 41, in gather_stop_reply_fields
    context = self.expect_gdbremote_sequence()
  File "/Users/buildslave/jenkins/workspace/lldb-cmake-matrix/llvm-project/lldb/packages/Python/lldbsuite/test/tools/lldb-server/gdbremote_testcase.py", line 735, in expect_gdbremote_sequence
    self.logger)
  File "/Users/buildslave/jenkins/workspace/lldb-cmake-matrix/llvm-project/lldb/packages/Python/lldbsuite/test/tools/lldb-server/lldbgdbserverutils.py", line 260, in expect_lldb_gdbserver_replay
    asserter, content, context=context)
  File "/Users/buildslave/jenkins/workspace/lldb-cmake-matrix/llvm-project/lldb/packages/Python/lldbsuite/test/tools/lldb-server/lldbgdbserverutils.py", line 563, in assert_match
    self._assert_exact_payload_match(asserter, actual_packet)
  File "/Users/buildslave/jenkins/workspace/lldb-cmake-matrix/llvm-project/lldb/packages/Python/lldbsuite/test/tools/lldb-server/lldbgdbserverutils.py", line 517, in _assert_exact_payload_match
    assert_packets_equal(asserter, actual_packet, self.exact_payload)
  File "/Users/buildslave/jenkins/workspace/lldb-cmake-matrix/llvm-project/lldb/packages/Python/lldbsuite/test/tools/lldb-server/lldbgdbserverutils.py", line 158, in assert_packets_equal
    asserter.assertEqual(actual_stripped, expected_stripped)
AssertionError: '$Efailed to get the task for process 13904' != '$OK'
Config=x86_64-/Users/buildslave/jenkins/workspace/lldb-cmake-matrix/clang_701_build/bin/clang-7
======================================================================
FAIL: test_stop_reply_reports_multiple_threads_debugserver (TestGdbRemoteThreadsInStopReply.TestGdbRemoteThreadsInStopReply)
----------------------------------------------------------------------
Traceback (most recent call last):
  File "/Users/buildslave/jenkins/workspace/lldb-cmake-matrix/llvm-project/lldb/packages/Python/lldbsuite/test/decorators.py", line 141, in wrapper
    func(*args, **kwargs)
  File "/Users/buildslave/jenkins/workspace/lldb-cmake-matrix/llvm-project/lldb/packages/Python/lldbsuite/test/tools/lldb-server/TestGdbRemoteThreadsInStopReply.py", line 206, in test_stop_reply_reports_multiple_threads_debugserver
    self.stop_reply_reports_multiple_threads(5)
  File "/Users/buildslave/jenkins/workspace/lldb-cmake-matrix/llvm-project/lldb/packages/Python/lldbsuite/test/tools/lldb-server/TestGdbRemoteThreadsInStopReply.py", line 197, in stop_reply_reports_multiple_threads
    self.ENABLE_THREADS_IN_STOP_REPLY_ENTRIES, thread_count)
  File "/Users/buildslave/jenkins/workspace/lldb-cmake-matrix/llvm-project/lldb/packages/Python/lldbsuite/test/tools/lldb-server/TestGdbRemoteThreadsInStopReply.py", line 98, in gather_stop_reply_threads
    post_startup_log_lines, thread_count, ["threads"])["threads"]
  File "/Users/buildslave/jenkins/workspace/lldb-cmake-matrix/llvm-project/lldb/packages/Python/lldbsuite/test/tools/lldb-server/TestGdbRemoteThreadsInStopReply.py", line 41, in gather_stop_reply_fields
    context = self.expect_gdbremote_sequence()
  File "/Users/buildslave/jenkins/workspace/lldb-cmake-matrix/llvm-project/lldb/packages/Python/lldbsuite/test/tools/lldb-server/gdbremote_testcase.py", line 735, in expect_gdbremote_sequence
    self.logger)
  File "/Users/buildslave/jenkins/workspace/lldb-cmake-matrix/llvm-project/lldb/packages/Python/lldbsuite/test/tools/lldb-server/lldbgdbserverutils.py", line 260, in expect_lldb_gdbserver_replay
    asserter, content, context=context)
  File "/Users/buildslave/jenkins/workspace/lldb-cmake-matrix/llvm-project/lldb/packages/Python/lldbsuite/test/tools/lldb-server/lldbgdbserverutils.py", line 563, in assert_match
    self._assert_exact_payload_match(asserter, actual_packet)
  File "/Users/buildslave/jenkins/workspace/lldb-cmake-matrix/llvm-project/lldb/packages/Python/lldbsuite/test/tools/lldb-server/lldbgdbserverutils.py", line 517, in _assert_exact_payload_match
    assert_packets_equal(asserter, actual_packet, self.exact_payload)
  File "/Users/buildslave/jenkins/workspace/lldb-cmake-matrix/llvm-project/lldb/packages/Python/lldbsuite/test/tools/lldb-server/lldbgdbserverutils.py", line 158, in assert_packets_equal
    asserter.assertEqual(actual_stripped, expected_stripped)
AssertionError: '$Efailed to get the task for process 14120' != '$OK'
Config=x86_64-/Users/buildslave/jenkins/workspace/lldb-cmake-matrix/clang_701_build/bin/clang-7
----------------------------------------------------------------------
Ran 10 tests in 13.625s

RESULT: FAILED (0 passes, 5 failures, 0 errors, 5 skipped, 0 expected failures, 0 unexpected successes)