Regression

Test Clang 7.0.1 / lldb-Suite.types.TestDoubleTypesExpr.py (from lldb-Suite)

Failing for the past 1 build (Since Unstable#270 )
Took 7.5 sec.

Stacktrace

lldb version 10.0.99 (http://labmaster3.local/git/llvm-project.git revision 1a3dd638c4a9173e53628b497a1aadc31c32eb50)
  clang revision daa79c5338228a746a7eba0cf2f2f356e1d45a5b
  llvm revision daa79c5338228a746a7eba0cf2f2f356e1d45a5b
LLDB library dir: /Users/buildslave/jenkins/workspace/lldb-cmake-matrix/lldb-build/bin
LLDB import library dir: /Users/buildslave/jenkins/workspace/lldb-cmake-matrix/lldb-build/bin
libstdcxx tests will not be run because: Don't know how to build with libstdcxx on macosx
Skipping following debug info categories: ['dwo']

Session logs for test failures/errors/unexpected successes will go into directory '/Users/buildslave/jenkins/workspace/lldb-cmake-matrix/test/logs'
Command invoked: /Users/buildslave/jenkins/workspace/lldb-cmake-matrix/llvm-project/lldb/test/dotest.py --arch=x86_64 -s /Users/buildslave/jenkins/workspace/lldb-cmake-matrix/lldb-build/lldb-test-traces -S nm -u CXXFLAGS -u CFLAGS --executable /Users/buildslave/jenkins/workspace/lldb-cmake-matrix/lldb-build/./bin/lldb --dsymutil /Users/buildslave/jenkins/workspace/lldb-cmake-matrix/lldb-build/./bin/dsymutil --filecheck /Users/buildslave/jenkins/workspace/lldb-cmake-matrix/lldb-build/./bin/FileCheck -C /Users/buildslave/jenkins/workspace/lldb-cmake-matrix/clang_701_build/bin/clang --codesign-identity lldb_codesign --server /Users/buildslave/jenkins/workspace/lldb-cmake-matrix/lldb-build/./bin/debugserver --arch x86_64 --build-dir /Users/buildslave/jenkins/workspace/lldb-cmake-matrix/lldb-build/lldb-test-build.noindex -s=/Users/buildslave/jenkins/workspace/lldb-cmake-matrix/test/logs -t --env TERM=vt100 --skip-category gmodules --skip-category watchpoint --arch=x86_64 --env LLVM_LIBS_DIR=/Users/buildslave/jenkins/workspace/lldb-cmake-matrix/lldb-build/./lib --build-dir /Users/buildslave/jenkins/workspace/lldb-cmake-matrix/lldb-build/tools/lldb/lldb-test-build.noindex --module-cache-dir /Users/buildslave/jenkins/workspace/lldb-cmake-matrix/lldb-build/tools/lldb/lldb-test-build.noindex/module-cache-lldb /Users/buildslave/jenkins/workspace/lldb-cmake-matrix/llvm-project/lldb/packages/Python/lldbsuite/test/types -p TestDoubleTypesExpr.py
Change dir to: /Users/buildslave/jenkins/workspace/lldb-cmake-matrix/llvm-project/lldb/packages/Python/lldbsuite/test/types
runCmd: settings set symbols.enable-external-lookup false
output: 

runCmd: settings set plugin.process.gdb-remote.packet-timeout 60
output: 

runCmd: settings set symbols.clang-modules-cache-path "/Users/buildslave/jenkins/workspace/lldb-cmake-matrix/lldb-build/tools/lldb/lldb-test-build.noindex/module-cache-lldb"
output: 

runCmd: settings set use-color false
output: 

runCmd: file /Users/buildslave/jenkins/workspace/lldb-cmake-matrix/lldb-build/tools/lldb/lldb-test-build.noindex/types/TestDoubleTypesExpr.test_double_type_dsym/test_double_type_dsym
output: Current executable set to '/Users/buildslave/jenkins/workspace/lldb-cmake-matrix/lldb-build/tools/lldb/lldb-test-build.noindex/types/TestDoubleTypesExpr.test_double_type_dsym/test_double_type_dsym' (x86_64).


runCmd: process launch -o "/Users/buildslave/jenkins/workspace/lldb-cmake-matrix/lldb-build/tools/lldb/lldb-test-build.noindex/types/TestDoubleTypesExpr.test_double_type_dsym/golden-output.txt"
runCmd failed!
error: process exited with status -1 (Error 1)


Command 'process launch -o "/Users/buildslave/jenkins/workspace/lldb-cmake-matrix/lldb-build/tools/lldb/lldb-test-build.noindex/types/TestDoubleTypesExpr.test_double_type_dsym/golden-output.txt"' failed!

FAIL: LLDB (/Users/buildslave/jenkins/workspace/lldb-cmake-matrix/clang_701_build/bin/clang-7-x86_64) :: test_double_type_dsym (TestDoubleTypesExpr.DoubleTypesExprTestCase)
<bound method SBProcess.Kill of <lldb.SBProcess; proxy of <Swig Object of type 'lldb::SBProcess *' at 0x115ae9bd0> >>: success

runCmd: settings set symbols.enable-external-lookup false
output: 

runCmd: settings set plugin.process.gdb-remote.packet-timeout 60
output: 

runCmd: settings set symbols.clang-modules-cache-path "/Users/buildslave/jenkins/workspace/lldb-cmake-matrix/lldb-build/tools/lldb/lldb-test-build.noindex/module-cache-lldb"
output: 

runCmd: settings set use-color false
output: 

runCmd: file /Users/buildslave/jenkins/workspace/lldb-cmake-matrix/lldb-build/tools/lldb/lldb-test-build.noindex/types/TestDoubleTypesExpr.test_double_type_dwarf/test_double_type_dwarf
output: Current executable set to '/Users/buildslave/jenkins/workspace/lldb-cmake-matrix/lldb-build/tools/lldb/lldb-test-build.noindex/types/TestDoubleTypesExpr.test_double_type_dwarf/test_double_type_dwarf' (x86_64).


runCmd: process launch -o "/Users/buildslave/jenkins/workspace/lldb-cmake-matrix/lldb-build/tools/lldb/lldb-test-build.noindex/types/TestDoubleTypesExpr.test_double_type_dwarf/golden-output.txt"
runCmd failed!
error: process exited with status -1 (Error 1)


Command 'process launch -o "/Users/buildslave/jenkins/workspace/lldb-cmake-matrix/lldb-build/tools/lldb/lldb-test-build.noindex/types/TestDoubleTypesExpr.test_double_type_dwarf/golden-output.txt"' failed!

FAIL: LLDB (/Users/buildslave/jenkins/workspace/lldb-cmake-matrix/clang_701_build/bin/clang-7-x86_64) :: test_double_type_dwarf (TestDoubleTypesExpr.DoubleTypesExprTestCase)
<bound method SBProcess.Kill of <lldb.SBProcess; proxy of <Swig Object of type 'lldb::SBProcess *' at 0x11594d090> >>: success

UNSUPPORTED: LLDB (/Users/buildslave/jenkins/workspace/lldb-cmake-matrix/clang_701_build/bin/clang-7-x86_64) :: test_double_type_dwo (TestDoubleTypesExpr.DoubleTypesExprTestCase) (test case does not fall in any category of interest for this run) 
runCmd: settings set symbols.enable-external-lookup false
output: 

runCmd: settings set plugin.process.gdb-remote.packet-timeout 60
output: 

runCmd: settings set symbols.clang-modules-cache-path "/Users/buildslave/jenkins/workspace/lldb-cmake-matrix/lldb-build/tools/lldb/lldb-test-build.noindex/module-cache-lldb"
output: 

runCmd: settings set use-color false
output: 

runCmd: file /Users/buildslave/jenkins/workspace/lldb-cmake-matrix/lldb-build/tools/lldb/lldb-test-build.noindex/types/TestDoubleTypesExpr.test_double_type_from_block_dsym/test_double_type_from_block_dsym
output: Current executable set to '/Users/buildslave/jenkins/workspace/lldb-cmake-matrix/lldb-build/tools/lldb/lldb-test-build.noindex/types/TestDoubleTypesExpr.test_double_type_from_block_dsym/test_double_type_from_block_dsym' (x86_64).


runCmd: process launch -o "/Users/buildslave/jenkins/workspace/lldb-cmake-matrix/lldb-build/tools/lldb/lldb-test-build.noindex/types/TestDoubleTypesExpr.test_double_type_from_block_dsym/golden-output.txt"
runCmd failed!
error: process exited with status -1 (Error 1)


Command 'process launch -o "/Users/buildslave/jenkins/workspace/lldb-cmake-matrix/lldb-build/tools/lldb/lldb-test-build.noindex/types/TestDoubleTypesExpr.test_double_type_from_block_dsym/golden-output.txt"' failed!

FAIL: LLDB (/Users/buildslave/jenkins/workspace/lldb-cmake-matrix/clang_701_build/bin/clang-7-x86_64) :: test_double_type_from_block_dsym (TestDoubleTypesExpr.DoubleTypesExprTestCase)
<bound method SBProcess.Kill of <lldb.SBProcess; proxy of <Swig Object of type 'lldb::SBProcess *' at 0x115ae9d80> >>: success

runCmd: settings set symbols.enable-external-lookup false
output: 

runCmd: settings set plugin.process.gdb-remote.packet-timeout 60
output: 

runCmd: settings set symbols.clang-modules-cache-path "/Users/buildslave/jenkins/workspace/lldb-cmake-matrix/lldb-build/tools/lldb/lldb-test-build.noindex/module-cache-lldb"
output: 

runCmd: settings set use-color false
output: 

runCmd: file /Users/buildslave/jenkins/workspace/lldb-cmake-matrix/lldb-build/tools/lldb/lldb-test-build.noindex/types/TestDoubleTypesExpr.test_double_type_from_block_dwarf/test_double_type_from_block_dwarf
output: Current executable set to '/Users/buildslave/jenkins/workspace/lldb-cmake-matrix/lldb-build/tools/lldb/lldb-test-build.noindex/types/TestDoubleTypesExpr.test_double_type_from_block_dwarf/test_double_type_from_block_dwarf' (x86_64).


runCmd: process launch -o "/Users/buildslave/jenkins/workspace/lldb-cmake-matrix/lldb-build/tools/lldb/lldb-test-build.noindex/types/TestDoubleTypesExpr.test_double_type_from_block_dwarf/golden-output.txt"
runCmd failed!
error: process exited with status -1 (Error 1)


Command 'process launch -o "/Users/buildslave/jenkins/workspace/lldb-cmake-matrix/lldb-build/tools/lldb/lldb-test-build.noindex/types/TestDoubleTypesExpr.test_double_type_from_block_dwarf/golden-output.txt"' failed!

FAIL: LLDB (/Users/buildslave/jenkins/workspace/lldb-cmake-matrix/clang_701_build/bin/clang-7-x86_64) :: test_double_type_from_block_dwarf (TestDoubleTypesExpr.DoubleTypesExprTestCase)
<bound method SBProcess.Kill of <lldb.SBProcess; proxy of <Swig Object of type 'lldb::SBProcess *' at 0x11594d030> >>: success

UNSUPPORTED: LLDB (/Users/buildslave/jenkins/workspace/lldb-cmake-matrix/clang_701_build/bin/clang-7-x86_64) :: test_double_type_from_block_dwo (TestDoubleTypesExpr.DoubleTypesExprTestCase) (test case does not fall in any category of interest for this run) 
UNSUPPORTED: LLDB (/Users/buildslave/jenkins/workspace/lldb-cmake-matrix/clang_701_build/bin/clang-7-x86_64) :: test_double_type_from_block_gmodules (TestDoubleTypesExpr.DoubleTypesExprTestCase) (test case does not fall in any category of interest for this run) 
UNSUPPORTED: LLDB (/Users/buildslave/jenkins/workspace/lldb-cmake-matrix/clang_701_build/bin/clang-7-x86_64) :: test_double_type_gmodules (TestDoubleTypesExpr.DoubleTypesExprTestCase) (test case does not fall in any category of interest for this run) 
Restore dir to: /Users/buildslave/jenkins/workspace/lldb-cmake-matrix/lldb-build/tools/lldb/lit
======================================================================
FAIL: test_double_type_dsym (TestDoubleTypesExpr.DoubleTypesExprTestCase)
   Test that double-type variable expressions are evaluated correctly.
----------------------------------------------------------------------
Traceback (most recent call last):
  File "/Users/buildslave/jenkins/workspace/lldb-cmake-matrix/llvm-project/lldb/packages/Python/lldbsuite/test/lldbtest.py", line 1748, in test_method
    return attrvalue(self)
  File "/Users/buildslave/jenkins/workspace/lldb-cmake-matrix/llvm-project/lldb/packages/Python/lldbsuite/test/types/TestDoubleTypesExpr.py", line 26, in test_double_type
    self.build_and_run_expr('double.cpp', set(['double']))
  File "/Users/buildslave/jenkins/workspace/lldb-cmake-matrix/llvm-project/lldb/packages/Python/lldbsuite/test/types/AbstractBase.py", line 69, in build_and_run_expr
    source, atoms, expr=True, bc=bc, qd=qd)
  File "/Users/buildslave/jenkins/workspace/lldb-cmake-matrix/llvm-project/lldb/packages/Python/lldbsuite/test/types/AbstractBase.py", line 83, in build_and_run_with_source_atoms_expr
    self.exe_name, atoms, blockCaptured=bc, quotedDisplay=qd)
  File "/Users/buildslave/jenkins/workspace/lldb-cmake-matrix/llvm-project/lldb/packages/Python/lldbsuite/test/types/AbstractBase.py", line 217, in generic_type_expr_tester
    self.process_launch_o(self.golden_filename)
  File "/Users/buildslave/jenkins/workspace/lldb-cmake-matrix/llvm-project/lldb/packages/Python/lldbsuite/test/types/AbstractBase.py", line 106, in process_launch_o
    'process launch -o "{local}"'.format(local=self.golden_filename))
  File "/Users/buildslave/jenkins/workspace/lldb-cmake-matrix/llvm-project/lldb/packages/Python/lldbsuite/test/lldbtest.py", line 2068, in runCmd
    msg if (msg) else CMD_MSG(cmd))
AssertionError: False is not True : Command 'process launch -o "/Users/buildslave/jenkins/workspace/lldb-cmake-matrix/lldb-build/tools/lldb/lldb-test-build.noindex/types/TestDoubleTypesExpr.test_double_type_dsym/golden-output.txt"
Error output:
error: process exited with status -1 (Error 1)
' returns successfully
Config=x86_64-/Users/buildslave/jenkins/workspace/lldb-cmake-matrix/clang_701_build/bin/clang-7
======================================================================
FAIL: test_double_type_dwarf (TestDoubleTypesExpr.DoubleTypesExprTestCase)
   Test that double-type variable expressions are evaluated correctly.
----------------------------------------------------------------------
Traceback (most recent call last):
  File "/Users/buildslave/jenkins/workspace/lldb-cmake-matrix/llvm-project/lldb/packages/Python/lldbsuite/test/lldbtest.py", line 1748, in test_method
    return attrvalue(self)
  File "/Users/buildslave/jenkins/workspace/lldb-cmake-matrix/llvm-project/lldb/packages/Python/lldbsuite/test/types/TestDoubleTypesExpr.py", line 26, in test_double_type
    self.build_and_run_expr('double.cpp', set(['double']))
  File "/Users/buildslave/jenkins/workspace/lldb-cmake-matrix/llvm-project/lldb/packages/Python/lldbsuite/test/types/AbstractBase.py", line 69, in build_and_run_expr
    source, atoms, expr=True, bc=bc, qd=qd)
  File "/Users/buildslave/jenkins/workspace/lldb-cmake-matrix/llvm-project/lldb/packages/Python/lldbsuite/test/types/AbstractBase.py", line 83, in build_and_run_with_source_atoms_expr
    self.exe_name, atoms, blockCaptured=bc, quotedDisplay=qd)
  File "/Users/buildslave/jenkins/workspace/lldb-cmake-matrix/llvm-project/lldb/packages/Python/lldbsuite/test/types/AbstractBase.py", line 217, in generic_type_expr_tester
    self.process_launch_o(self.golden_filename)
  File "/Users/buildslave/jenkins/workspace/lldb-cmake-matrix/llvm-project/lldb/packages/Python/lldbsuite/test/types/AbstractBase.py", line 106, in process_launch_o
    'process launch -o "{local}"'.format(local=self.golden_filename))
  File "/Users/buildslave/jenkins/workspace/lldb-cmake-matrix/llvm-project/lldb/packages/Python/lldbsuite/test/lldbtest.py", line 2068, in runCmd
    msg if (msg) else CMD_MSG(cmd))
AssertionError: False is not True : Command 'process launch -o "/Users/buildslave/jenkins/workspace/lldb-cmake-matrix/lldb-build/tools/lldb/lldb-test-build.noindex/types/TestDoubleTypesExpr.test_double_type_dwarf/golden-output.txt"
Error output:
error: process exited with status -1 (Error 1)
' returns successfully
Config=x86_64-/Users/buildslave/jenkins/workspace/lldb-cmake-matrix/clang_701_build/bin/clang-7
======================================================================
FAIL: test_double_type_from_block_dsym (TestDoubleTypesExpr.DoubleTypesExprTestCase)
   Test that double-type variables are displayed correctly from a block.
----------------------------------------------------------------------
Traceback (most recent call last):
  File "/Users/buildslave/jenkins/workspace/lldb-cmake-matrix/llvm-project/lldb/packages/Python/lldbsuite/test/lldbtest.py", line 1748, in test_method
    return attrvalue(self)
  File "/Users/buildslave/jenkins/workspace/lldb-cmake-matrix/llvm-project/lldb/packages/Python/lldbsuite/test/types/TestDoubleTypesExpr.py", line 31, in test_double_type_from_block
    self.build_and_run_expr('double.cpp', set(['double']), bc=True)
  File "/Users/buildslave/jenkins/workspace/lldb-cmake-matrix/llvm-project/lldb/packages/Python/lldbsuite/test/types/AbstractBase.py", line 69, in build_and_run_expr
    source, atoms, expr=True, bc=bc, qd=qd)
  File "/Users/buildslave/jenkins/workspace/lldb-cmake-matrix/llvm-project/lldb/packages/Python/lldbsuite/test/types/AbstractBase.py", line 83, in build_and_run_with_source_atoms_expr
    self.exe_name, atoms, blockCaptured=bc, quotedDisplay=qd)
  File "/Users/buildslave/jenkins/workspace/lldb-cmake-matrix/llvm-project/lldb/packages/Python/lldbsuite/test/types/AbstractBase.py", line 217, in generic_type_expr_tester
    self.process_launch_o(self.golden_filename)
  File "/Users/buildslave/jenkins/workspace/lldb-cmake-matrix/llvm-project/lldb/packages/Python/lldbsuite/test/types/AbstractBase.py", line 106, in process_launch_o
    'process launch -o "{local}"'.format(local=self.golden_filename))
  File "/Users/buildslave/jenkins/workspace/lldb-cmake-matrix/llvm-project/lldb/packages/Python/lldbsuite/test/lldbtest.py", line 2068, in runCmd
    msg if (msg) else CMD_MSG(cmd))
AssertionError: False is not True : Command 'process launch -o "/Users/buildslave/jenkins/workspace/lldb-cmake-matrix/lldb-build/tools/lldb/lldb-test-build.noindex/types/TestDoubleTypesExpr.test_double_type_from_block_dsym/golden-output.txt"
Error output:
error: process exited with status -1 (Error 1)
' returns successfully
Config=x86_64-/Users/buildslave/jenkins/workspace/lldb-cmake-matrix/clang_701_build/bin/clang-7
======================================================================
FAIL: test_double_type_from_block_dwarf (TestDoubleTypesExpr.DoubleTypesExprTestCase)
   Test that double-type variables are displayed correctly from a block.
----------------------------------------------------------------------
Traceback (most recent call last):
  File "/Users/buildslave/jenkins/workspace/lldb-cmake-matrix/llvm-project/lldb/packages/Python/lldbsuite/test/lldbtest.py", line 1748, in test_method
    return attrvalue(self)
  File "/Users/buildslave/jenkins/workspace/lldb-cmake-matrix/llvm-project/lldb/packages/Python/lldbsuite/test/types/TestDoubleTypesExpr.py", line 31, in test_double_type_from_block
    self.build_and_run_expr('double.cpp', set(['double']), bc=True)
  File "/Users/buildslave/jenkins/workspace/lldb-cmake-matrix/llvm-project/lldb/packages/Python/lldbsuite/test/types/AbstractBase.py", line 69, in build_and_run_expr
    source, atoms, expr=True, bc=bc, qd=qd)
  File "/Users/buildslave/jenkins/workspace/lldb-cmake-matrix/llvm-project/lldb/packages/Python/lldbsuite/test/types/AbstractBase.py", line 83, in build_and_run_with_source_atoms_expr
    self.exe_name, atoms, blockCaptured=bc, quotedDisplay=qd)
  File "/Users/buildslave/jenkins/workspace/lldb-cmake-matrix/llvm-project/lldb/packages/Python/lldbsuite/test/types/AbstractBase.py", line 217, in generic_type_expr_tester
    self.process_launch_o(self.golden_filename)
  File "/Users/buildslave/jenkins/workspace/lldb-cmake-matrix/llvm-project/lldb/packages/Python/lldbsuite/test/types/AbstractBase.py", line 106, in process_launch_o
    'process launch -o "{local}"'.format(local=self.golden_filename))
  File "/Users/buildslave/jenkins/workspace/lldb-cmake-matrix/llvm-project/lldb/packages/Python/lldbsuite/test/lldbtest.py", line 2068, in runCmd
    msg if (msg) else CMD_MSG(cmd))
AssertionError: False is not True : Command 'process launch -o "/Users/buildslave/jenkins/workspace/lldb-cmake-matrix/lldb-build/tools/lldb/lldb-test-build.noindex/types/TestDoubleTypesExpr.test_double_type_from_block_dwarf/golden-output.txt"
Error output:
error: process exited with status -1 (Error 1)
' returns successfully
Config=x86_64-/Users/buildslave/jenkins/workspace/lldb-cmake-matrix/clang_701_build/bin/clang-7
----------------------------------------------------------------------
Ran 8 tests in 7.009s

RESULT: FAILED (0 passes, 4 failures, 0 errors, 4 skipped, 0 expected failures, 0 unexpected successes)