Regression

Test Clang 7.0.1 / lldb-Unit.tools/lldb-server/tests/_/LLDBServerTests.StandardStartupTest.TestStopReplyContainsThreadPcs (from lldb-Unit)

Failing for the past 1 build (Since Unstable#270 )
Took 2.3 sec.

Stacktrace

Note: Google Test filter = StandardStartupTest.TestStopReplyContainsThreadPcs
[==========] Running 1 test from 1 test case.
[----------] Global test environment set-up.
[----------] 1 test from StandardStartupTest
[ RUN      ] StandardStartupTest.TestStopReplyContainsThreadPcs
/Users/buildslave/jenkins/workspace/lldb-cmake-matrix/llvm-project/lldb/unittests/tools/lldb-server/tests/ThreadIdsInJstopinfoTest.cpp:29: Failure
Value of: llvm::detail::TakeError(Client->SetInferior({getInferiorPath("thread_inferior"), "4"}))
Expected: succeeded
  Actual: failed  (Error sending message `qProcessInfo`: ErrorDisconnected)
[  FAILED  ] StandardStartupTest.TestStopReplyContainsThreadPcs (2275 ms)
[----------] 1 test from StandardStartupTest (2275 ms total)

[----------] Global test environment tear-down
[==========] 1 test from 1 test case ran. (2276 ms total)
[  PASSED  ] 0 tests.
[  FAILED  ] 1 test, listed below:
[  FAILED  ] StandardStartupTest.TestStopReplyContainsThreadPcs

 1 FAILED TEST

[  INFO ] /Users/buildslave/jenkins/workspace/lldb-cmake-matrix/llvm-project/lldb/unittests/tools/lldb-server/tests/TestClient.cpp:195:: Send Packet: QStartNoAckMode

[  INFO ] /Users/buildslave/jenkins/workspace/lldb-cmake-matrix/llvm-project/lldb/unittests/tools/lldb-server/tests/TestClient.cpp:198:: Read Packet: OK

[  INFO ] /Users/buildslave/jenkins/workspace/lldb-cmake-matrix/llvm-project/lldb/unittests/tools/lldb-server/tests/TestClient.cpp:195:: Send Packet: A242,0,2F55736572732F6275696C64736C6176652F6A656E6B696E732F776F726B73706163652F6C6C64622D636D616B652D6D61747269782F6C6C64622D6275696C642F746F6F6C732F6C6C64622F756E697474657374732F746F6F6C732F6C6C64622D7365727665722F2E2F7468726561645F696E666572696F72,2,1,34

[  INFO ] /Users/buildslave/jenkins/workspace/lldb-cmake-matrix/llvm-project/lldb/unittests/tools/lldb-server/tests/TestClient.cpp:198:: Read Packet: OK

[  INFO ] /Users/buildslave/jenkins/workspace/lldb-cmake-matrix/llvm-project/lldb/unittests/tools/lldb-server/tests/TestClient.cpp:195:: Send Packet: qLaunchSuccess

[  INFO ] /Users/buildslave/jenkins/workspace/lldb-cmake-matrix/llvm-project/lldb/unittests/tools/lldb-server/tests/TestClient.cpp:198:: Read Packet: Efailed to get the task for process 4329

[  INFO ] /Users/buildslave/jenkins/workspace/lldb-cmake-matrix/llvm-project/lldb/unittests/tools/lldb-server/tests/TestClient.cpp:195:: Send Packet: qProcessInfo

[  INFO ] /Users/buildslave/jenkins/workspace/lldb-cmake-matrix/llvm-project/lldb/unittests/tools/lldb-server/tests/TestClient.cpp:198:: Read Packet: