Regression

Test Clang 7.0.1 / lldb-Suite.macosx/find-dsym/bundle-with-dot-in-filename.TestBundleWithDotInFilename.py (from lldb-Suite)

Failing for the past 1 build (Since Unstable#270 )
Took 12 sec.

Stacktrace

lldb version 10.0.99 (http://labmaster3.local/git/llvm-project.git revision 1a3dd638c4a9173e53628b497a1aadc31c32eb50)
  clang revision daa79c5338228a746a7eba0cf2f2f356e1d45a5b
  llvm revision daa79c5338228a746a7eba0cf2f2f356e1d45a5b
LLDB library dir: /Users/buildslave/jenkins/workspace/lldb-cmake-matrix/lldb-build/bin
LLDB import library dir: /Users/buildslave/jenkins/workspace/lldb-cmake-matrix/lldb-build/bin
libstdcxx tests will not be run because: Don't know how to build with libstdcxx on macosx
Skipping following debug info categories: ['dwo']

Session logs for test failures/errors/unexpected successes will go into directory '/Users/buildslave/jenkins/workspace/lldb-cmake-matrix/test/logs'
Command invoked: /Users/buildslave/jenkins/workspace/lldb-cmake-matrix/llvm-project/lldb/test/dotest.py --arch=x86_64 -s /Users/buildslave/jenkins/workspace/lldb-cmake-matrix/lldb-build/lldb-test-traces -S nm -u CXXFLAGS -u CFLAGS --executable /Users/buildslave/jenkins/workspace/lldb-cmake-matrix/lldb-build/./bin/lldb --dsymutil /Users/buildslave/jenkins/workspace/lldb-cmake-matrix/lldb-build/./bin/dsymutil --filecheck /Users/buildslave/jenkins/workspace/lldb-cmake-matrix/lldb-build/./bin/FileCheck -C /Users/buildslave/jenkins/workspace/lldb-cmake-matrix/clang_701_build/bin/clang --codesign-identity lldb_codesign --server /Users/buildslave/jenkins/workspace/lldb-cmake-matrix/lldb-build/./bin/debugserver --arch x86_64 --build-dir /Users/buildslave/jenkins/workspace/lldb-cmake-matrix/lldb-build/lldb-test-build.noindex -s=/Users/buildslave/jenkins/workspace/lldb-cmake-matrix/test/logs -t --env TERM=vt100 --skip-category gmodules --skip-category watchpoint --arch=x86_64 --env LLVM_LIBS_DIR=/Users/buildslave/jenkins/workspace/lldb-cmake-matrix/lldb-build/./lib --build-dir /Users/buildslave/jenkins/workspace/lldb-cmake-matrix/lldb-build/tools/lldb/lldb-test-build.noindex --module-cache-dir /Users/buildslave/jenkins/workspace/lldb-cmake-matrix/lldb-build/tools/lldb/lldb-test-build.noindex/module-cache-lldb /Users/buildslave/jenkins/workspace/lldb-cmake-matrix/llvm-project/lldb/packages/Python/lldbsuite/test/macosx/find-dsym/bundle-with-dot-in-filename -p TestBundleWithDotInFilename.py
Change dir to: /Users/buildslave/jenkins/workspace/lldb-cmake-matrix/llvm-project/lldb/packages/Python/lldbsuite/test/macosx/find-dsym/bundle-with-dot-in-filename
runCmd: settings set symbols.enable-external-lookup false
output: 

runCmd: settings set plugin.process.gdb-remote.packet-timeout 60
output: 

runCmd: settings set symbols.clang-modules-cache-path "/Users/buildslave/jenkins/workspace/lldb-cmake-matrix/lldb-build/tools/lldb/lldb-test-build.noindex/module-cache-lldb"
output: 

runCmd: settings set use-color false
output: 

Adding tearDown hook:     def cleanupSubprocesses(self):
        # Ensure any subprocesses are cleaned up
        for p in self.subprocesses:
            p.terminate()
            del p
        del self.subprocesses[:]
        # Ensure any forked processes are cleaned up
        for pid in self.forkedProcessPids:
            if os.path.exists("/proc/" + str(pid)):
                os.kill(pid, signal.SIGTERM)


runCmd: settings set target.exec-search-paths /Users/buildslave/jenkins/workspace/lldb-cmake-matrix/lldb-build/tools/lldb/lldb-test-build.noindex/macosx/find-dsym/bundle-with-dot-in-filename/TestBundleWithDotInFilename.test_attach_and_check_dsyms_dsym/hide.app
output: 

runCmd: process attach -p 88399
output: Process 88399 stopped
* thread #1, queue = 'com.apple.main-thread', stop reason = signal SIGSTOP
    frame #0: 0x00007fff727dc876 libsystem_kernel.dylib`__semwait_signal + 10
libsystem_kernel.dylib`__semwait_signal:
->  0x7fff727dc876 <+10>: jae    0x7fff727dc880            ; <+20>
    0x7fff727dc878 <+12>: movq   %rax, %rdi
    0x7fff727dc87b <+15>: jmp    0x7fff727d8e31            ; cerror
    0x7fff727dc880 <+20>: retq   

Executable module set to "/Users/buildslave/jenkins/workspace/lldb-cmake-matrix/lldb-build/tools/lldb/lldb-test-build.noindex/macosx/find-dsym/bundle-with-dot-in-filename/TestBundleWithDotInFilename.test_attach_and_check_dsyms_dsym/find-bundle-with-dots-in-fn".
Architecture set to: x86_64-apple-macosx-.


<bound method SBProcess.Kill of <lldb.SBProcess; proxy of <Swig Object of type 'lldb::SBProcess *' at 0x10f26a390> >>: success

Executing tearDown hook:     def cleanupSubprocesses(self):
        # Ensure any subprocesses are cleaned up
        for p in self.subprocesses:
            p.terminate()
            del p
        del self.subprocesses[:]
        # Ensure any forked processes are cleaned up
        for pid in self.forkedProcessPids:
            if os.path.exists("/proc/" + str(pid)):
                os.kill(pid, signal.SIGTERM)


PASS: LLDB (/Users/buildslave/jenkins/workspace/lldb-cmake-matrix/clang_701_build/bin/clang-7-x86_64) :: test_attach_and_check_dsyms_dsym (TestBundleWithDotInFilename.BundleWithDotInFilenameTestCase)
runCmd: settings set symbols.enable-external-lookup false
output: 

runCmd: settings set plugin.process.gdb-remote.packet-timeout 60
output: 

runCmd: settings set symbols.clang-modules-cache-path "/Users/buildslave/jenkins/workspace/lldb-cmake-matrix/lldb-build/tools/lldb/lldb-test-build.noindex/module-cache-lldb"
output: 

runCmd: settings set use-color false
output: 

Adding tearDown hook:     def cleanupSubprocesses(self):
        # Ensure any subprocesses are cleaned up
        for p in self.subprocesses:
            p.terminate()
            del p
        del self.subprocesses[:]
        # Ensure any forked processes are cleaned up
        for pid in self.forkedProcessPids:
            if os.path.exists("/proc/" + str(pid)):
                os.kill(pid, signal.SIGTERM)


runCmd: settings set target.exec-search-paths /Users/buildslave/jenkins/workspace/lldb-cmake-matrix/lldb-build/tools/lldb/lldb-test-build.noindex/macosx/find-dsym/bundle-with-dot-in-filename/TestBundleWithDotInFilename.test_attach_and_check_dsyms_dwarf/hide.app
output: 

runCmd: process attach -p 91320
runCmd failed!
error: attach failed: Error 1


FAIL: LLDB (/Users/buildslave/jenkins/workspace/lldb-cmake-matrix/clang_701_build/bin/clang-7-x86_64) :: test_attach_and_check_dsyms_dwarf (TestBundleWithDotInFilename.BundleWithDotInFilenameTestCase)
<bound method SBProcess.Kill of <lldb.SBProcess; proxy of <Swig Object of type 'lldb::SBProcess *' at 0x10a8f8c90> >>: success

Executing tearDown hook:     def cleanupSubprocesses(self):
        # Ensure any subprocesses are cleaned up
        for p in self.subprocesses:
            p.terminate()
            del p
        del self.subprocesses[:]
        # Ensure any forked processes are cleaned up
        for pid in self.forkedProcessPids:
            if os.path.exists("/proc/" + str(pid)):
                os.kill(pid, signal.SIGTERM)


UNSUPPORTED: LLDB (/Users/buildslave/jenkins/workspace/lldb-cmake-matrix/clang_701_build/bin/clang-7-x86_64) :: test_attach_and_check_dsyms_dwo (TestBundleWithDotInFilename.BundleWithDotInFilenameTestCase) (test case does not fall in any category of interest for this run) 
UNSUPPORTED: LLDB (/Users/buildslave/jenkins/workspace/lldb-cmake-matrix/clang_701_build/bin/clang-7-x86_64) :: test_attach_and_check_dsyms_gmodules (TestBundleWithDotInFilename.BundleWithDotInFilenameTestCase) (test case does not fall in any category of interest for this run) 
Restore dir to: /Users/buildslave/jenkins/workspace/lldb-cmake-matrix/lldb-build/tools/lldb/lit
======================================================================
FAIL: test_attach_and_check_dsyms_dwarf (TestBundleWithDotInFilename.BundleWithDotInFilenameTestCase)
   Test attach to binary, see if the bundle dSYM is found
----------------------------------------------------------------------
Traceback (most recent call last):
  File "/Users/buildslave/jenkins/workspace/lldb-cmake-matrix/llvm-project/lldb/packages/Python/lldbsuite/test/lldbtest.py", line 1748, in test_method
    return attrvalue(self)
  File "/Users/buildslave/jenkins/workspace/lldb-cmake-matrix/llvm-project/lldb/packages/Python/lldbsuite/test/macosx/find-dsym/bundle-with-dot-in-filename/TestBundleWithDotInFilename.py", line 54, in test_attach_and_check_dsyms
    self.runCmd("process attach -p " + str(popen.pid))
  File "/Users/buildslave/jenkins/workspace/lldb-cmake-matrix/llvm-project/lldb/packages/Python/lldbsuite/test/lldbtest.py", line 2068, in runCmd
    msg if (msg) else CMD_MSG(cmd))
AssertionError: False is not True : Command 'process attach -p 91320
Error output:
error: attach failed: Error 1
' returns successfully
Config=x86_64-/Users/buildslave/jenkins/workspace/lldb-cmake-matrix/clang_701_build/bin/clang-7
----------------------------------------------------------------------
Ran 4 tests in 11.614s

RESULT: FAILED (1 passes, 1 failures, 0 errors, 2 skipped, 0 expected failures, 0 unexpected successes)