Regression

Test Clang 7.0.1 / lldb-Suite.tools/lldb-server.TestLldbGdbServer.py (from lldb-Suite)

Failing for the past 1 build (Since Unstable#270 )
Took 1 min 7 sec.

Stacktrace

lldb version 10.0.99 (http://labmaster3.local/git/llvm-project.git revision 1a3dd638c4a9173e53628b497a1aadc31c32eb50)
  clang revision daa79c5338228a746a7eba0cf2f2f356e1d45a5b
  llvm revision daa79c5338228a746a7eba0cf2f2f356e1d45a5b
LLDB library dir: /Users/buildslave/jenkins/workspace/lldb-cmake-matrix/lldb-build/bin
LLDB import library dir: /Users/buildslave/jenkins/workspace/lldb-cmake-matrix/lldb-build/bin
libstdcxx tests will not be run because: Don't know how to build with libstdcxx on macosx
Skipping following debug info categories: ['dwo']
warning: packet queue entries still exist:
$T1ethread:2771426;00:0400000000000000;01:0000000000000000;02:18dc6deafe7f0000;03:0100000000000000;04:0314000000000000;05:0000000000000000;06:50dc6deafe7f0000;07:18dc6deafe7f0000;08:0a00000000000000;09:0000000000000000;0a:0100000000000000;0b:4602000000000000;0c:0000000000000000;0d:0000000000000000;0e:68dc6deafe7f0000;0f:68dc6deafe7f0000;10:76c87d72ff7f0000;11:4702000000000000;12:0700000000000000;13:0000000000000000;14:0000000000000000;metype:5;mecount:2;medata:10003;medata:1e;memory:0x7ffeea6ddc50=80dc6deafe7f0000e12fd86fff7f0000;memory:0x7ffeea6ddc80=50e06deafe7f0000324c520501000000;#00


from here:

Session logs for test failures/errors/unexpected successes will go into directory '/Users/buildslave/jenkins/workspace/lldb-cmake-matrix/test/logs'
Command invoked: /Users/buildslave/jenkins/workspace/lldb-cmake-matrix/llvm-project/lldb/test/dotest.py --arch=x86_64 -s /Users/buildslave/jenkins/workspace/lldb-cmake-matrix/lldb-build/lldb-test-traces -S nm -u CXXFLAGS -u CFLAGS --executable /Users/buildslave/jenkins/workspace/lldb-cmake-matrix/lldb-build/./bin/lldb --dsymutil /Users/buildslave/jenkins/workspace/lldb-cmake-matrix/lldb-build/./bin/dsymutil --filecheck /Users/buildslave/jenkins/workspace/lldb-cmake-matrix/lldb-build/./bin/FileCheck -C /Users/buildslave/jenkins/workspace/lldb-cmake-matrix/clang_701_build/bin/clang --codesign-identity lldb_codesign --server /Users/buildslave/jenkins/workspace/lldb-cmake-matrix/lldb-build/./bin/debugserver --arch x86_64 --build-dir /Users/buildslave/jenkins/workspace/lldb-cmake-matrix/lldb-build/lldb-test-build.noindex -s=/Users/buildslave/jenkins/workspace/lldb-cmake-matrix/test/logs -t --env TERM=vt100 --skip-category gmodules --skip-category watchpoint --arch=x86_64 --env LLVM_LIBS_DIR=/Users/buildslave/jenkins/workspace/lldb-cmake-matrix/lldb-build/./lib --build-dir /Users/buildslave/jenkins/workspace/lldb-cmake-matrix/lldb-build/tools/lldb/lldb-test-build.noindex --module-cache-dir /Users/buildslave/jenkins/workspace/lldb-cmake-matrix/lldb-build/tools/lldb/lldb-test-build.noindex/module-cache-lldb /Users/buildslave/jenkins/workspace/lldb-cmake-matrix/llvm-project/lldb/packages/Python/lldbsuite/test/tools/lldb-server -p TestLldbGdbServer.py
Change dir to: /Users/buildslave/jenkins/workspace/lldb-cmake-matrix/llvm-project/lldb/packages/Python/lldbsuite/test/tools/lldb-server
runCmd: settings set symbols.enable-external-lookup false
output: 

runCmd: settings set plugin.process.gdb-remote.packet-timeout 60
output: 

runCmd: settings set symbols.clang-modules-cache-path "/Users/buildslave/jenkins/workspace/lldb-cmake-matrix/lldb-build/tools/lldb/lldb-test-build.noindex/module-cache-lldb"
output: 

runCmd: settings set use-color false
output: 

Adding tearDown hook:         def shutdown_named_pipe():
            # Close the pipe.
            try:
                named_pipe.close()
            except:
                print("failed to close named pipe")
                None

            # Delete the pipe.
            try:
                os.remove(named_pipe_path)
            except:
                print("failed to delete named pipe: {}".format(named_pipe_path))
                None

            # Delete the temp directory.
            try:
                os.rmdir(temp_dir)
            except:
                print(
                    "failed to delete temp dir: {}, directory contents: '{}'".format(
                        temp_dir, os.listdir(temp_dir)))
                None


Adding tearDown hook:     def cleanupSubprocesses(self):
        # Ensure any subprocesses are cleaned up
        for p in self.subprocesses:
            p.terminate()
            del p
        del self.subprocesses[:]
        # Ensure any forked processes are cleaned up
        for pid in self.forkedProcessPids:
            if os.path.exists("/proc/" + str(pid)):
                os.kill(pid, signal.SIGTERM)


Adding tearDown hook:             def shutdown_debug_monitor():
                try:
                    server.terminate()
                except:
                    logger.warning(
                        "failed to terminate server for debug monitor: {}; ignoring".format(
                            sys.exc_info()[0]))


Adding tearDown hook:         def shutdown_socket():
            if sock:
                try:
                    # send the kill packet so lldb-server shuts down gracefully
                    sock.sendall(GdbRemoteTestCaseBase._GDBREMOTE_KILL_PACKET)
                except:
                    logger.warning(
                        "failed to send kill packet to debug monitor: {}; ignoring".format(
                            sys.exc_info()[0]))

                try:
                    sock.close()
                except:
                    logger.warning(
                        "failed to close socket to debug monitor: {}; ignoring".format(
                            sys.exc_info()[0]))


2019-09-09 20:59:14,499 WARNING  timeout waiting for stub output (accumulated output:)
XFAIL: LLDB (/Users/buildslave/jenkins/workspace/lldb-cmake-matrix/clang_701_build/bin/clang-7-x86_64) :: test_Hc_then_Csignal_signals_correct_thread_launch_debugserver (TestLldbGdbServer.LldbGdbServerTestCase)
  File "/Users/buildslave/jenkins/workspace/lldb-cmake-matrix/llvm-project/lldb/test/dotest.py", line 7, in <module>
    lldbsuite.test.run_suite()
  File "/Users/buildslave/jenkins/workspace/lldb-cmake-matrix/llvm-project/lldb/packages/Python/lldbsuite/test/dotest.py", line 1077, in run_suite
    configuration.suite)
  File "/Users/buildslave/jenkins/workspace/lldb-cmake-matrix/llvm-project/lldb/third_party/Python/module/unittest2/unittest2/runner.py", line 165, in run
    test(result)
  File "/Users/buildslave/jenkins/workspace/lldb-cmake-matrix/llvm-project/lldb/third_party/Python/module/unittest2/unittest2/suite.py", line 66, in __call__
    return self.run(*args, **kwds)
  File "/Users/buildslave/jenkins/workspace/lldb-cmake-matrix/llvm-project/lldb/third_party/Python/module/unittest2/unittest2/suite.py", line 85, in run
    self._wrapped_run(result)
  File "/Users/buildslave/jenkins/workspace/lldb-cmake-matrix/llvm-project/lldb/third_party/Python/module/unittest2/unittest2/suite.py", line 115, in _wrapped_run
    test._wrapped_run(result, debug)
  File "/Users/buildslave/jenkins/workspace/lldb-cmake-matrix/llvm-project/lldb/third_party/Python/module/unittest2/unittest2/suite.py", line 117, in _wrapped_run
    test(result)
  File "/Users/buildslave/jenkins/workspace/lldb-cmake-matrix/llvm-project/lldb/third_party/Python/module/unittest2/unittest2/case.py", line 458, in __call__
    return self.run(*args, **kwds)
  File "/Users/buildslave/jenkins/workspace/lldb-cmake-matrix/llvm-project/lldb/third_party/Python/module/unittest2/unittest2/case.py", line 386, in run
    self.tearDown()
  File "/Users/buildslave/jenkins/workspace/lldb-cmake-matrix/llvm-project/lldb/packages/Python/lldbsuite/test/tools/lldb-server/gdbremote_testcase.py", line 121, in tearDown
    self._pump_queues.verify_queues_empty()
  File "/Users/buildslave/jenkins/workspace/lldb-cmake-matrix/llvm-project/lldb/packages/Python/lldbsuite/test/tools/lldb-server/socket_packet_pump.py", line 57, in verify_queues_empty
    traceback.print_stack()
Executing tearDown hook:         def shutdown_socket():
            if sock:
                try:
                    # send the kill packet so lldb-server shuts down gracefully
                    sock.sendall(GdbRemoteTestCaseBase._GDBREMOTE_KILL_PACKET)
                except:
                    logger.warning(
                        "failed to send kill packet to debug monitor: {}; ignoring".format(
                            sys.exc_info()[0]))

                try:
                    sock.close()
                except:
                    logger.warning(
                        "failed to close socket to debug monitor: {}; ignoring".format(
                            sys.exc_info()[0]))


Executing tearDown hook:             def shutdown_debug_monitor():
                try:
                    server.terminate()
                except:
                    logger.warning(
                        "failed to terminate server for debug monitor: {}; ignoring".format(
                            sys.exc_info()[0]))


Executing tearDown hook:     def cleanupSubprocesses(self):
        # Ensure any subprocesses are cleaned up
        for p in self.subprocesses:
            p.terminate()
            del p
        del self.subprocesses[:]
        # Ensure any forked processes are cleaned up
        for pid in self.forkedProcessPids:
            if os.path.exists("/proc/" + str(pid)):
                os.kill(pid, signal.SIGTERM)


Executing tearDown hook:         def shutdown_named_pipe():
            # Close the pipe.
            try:
                named_pipe.close()
            except:
                print("failed to close named pipe")
                None

            # Delete the pipe.
            try:
                os.remove(named_pipe_path)
            except:
                print("failed to delete named pipe: {}".format(named_pipe_path))
                None

            # Delete the temp directory.
            try:
                os.rmdir(temp_dir)
            except:
                print(
                    "failed to delete temp dir: {}, directory contents: '{}'".format(
                        temp_dir, os.listdir(temp_dir)))
                None


runCmd: settings set symbols.enable-external-lookup false
output: 

runCmd: settings set plugin.process.gdb-remote.packet-timeout 60
output: 

runCmd: settings set symbols.clang-modules-cache-path "/Users/buildslave/jenkins/workspace/lldb-cmake-matrix/lldb-build/tools/lldb/lldb-test-build.noindex/module-cache-lldb"
output: 

runCmd: settings set use-color false
output: 

UNSUPPORTED: LLDB (/Users/buildslave/jenkins/workspace/lldb-cmake-matrix/clang_701_build/bin/clang-7-x86_64) :: test_Hc_then_Csignal_signals_correct_thread_launch_llgs (TestLldbGdbServer.LldbGdbServerTestCase) (llgs tests) 
runCmd: settings set symbols.enable-external-lookup false
output: 

runCmd: settings set plugin.process.gdb-remote.packet-timeout 60
output: 

runCmd: settings set symbols.clang-modules-cache-path "/Users/buildslave/jenkins/workspace/lldb-cmake-matrix/lldb-build/tools/lldb/lldb-test-build.noindex/module-cache-lldb"
output: 

runCmd: settings set use-color false
output: 

Adding tearDown hook:         def shutdown_named_pipe():
            # Close the pipe.
            try:
                named_pipe.close()
            except:
                print("failed to close named pipe")
                None

            # Delete the pipe.
            try:
                os.remove(named_pipe_path)
            except:
                print("failed to delete named pipe: {}".format(named_pipe_path))
                None

            # Delete the temp directory.
            try:
                os.rmdir(temp_dir)
            except:
                print(
                    "failed to delete temp dir: {}, directory contents: '{}'".format(
                        temp_dir, os.listdir(temp_dir)))
                None


Adding tearDown hook:         def shutdown_process_for_attach():
            try:
                inferior.terminate()
            except:
                logger.warning(
                    "failed to terminate inferior process for attach: {}; ignoring".format(
                        sys.exc_info()[0]))


Adding tearDown hook:     def cleanupSubprocesses(self):
        # Ensure any subprocesses are cleaned up
        for p in self.subprocesses:
            p.terminate()
            del p
        del self.subprocesses[:]
        # Ensure any forked processes are cleaned up
        for pid in self.forkedProcessPids:
            if os.path.exists("/proc/" + str(pid)):
                os.kill(pid, signal.SIGTERM)


Adding tearDown hook:             def shutdown_debug_monitor():
                try:
                    server.terminate()
                except:
                    logger.warning(
                        "failed to terminate server for debug monitor: {}; ignoring".format(
                            sys.exc_info()[0]))


Adding tearDown hook:         def shutdown_socket():
            if sock:
                try:
                    # send the kill packet so lldb-server shuts down gracefully
                    sock.sendall(GdbRemoteTestCaseBase._GDBREMOTE_KILL_PACKET)
                except:
                    logger.warning(
                        "failed to send kill packet to debug monitor: {}; ignoring".format(
                            sys.exc_info()[0]))

                try:
                    sock.close()
                except:
                    logger.warning(
                        "failed to close socket to debug monitor: {}; ignoring".format(
                            sys.exc_info()[0]))


Executing tearDown hook:         def shutdown_socket():
            if sock:
                try:
                    # send the kill packet so lldb-server shuts down gracefully
                    sock.sendall(GdbRemoteTestCaseBase._GDBREMOTE_KILL_PACKET)
                except:
                    logger.warning(
                        "failed to send kill packet to debug monitor: {}; ignoring".format(
                            sys.exc_info()[0]))

                try:
                    sock.close()
                except:
                    logger.warning(
                        "failed to close socket to debug monitor: {}; ignoring".format(
                            sys.exc_info()[0]))


Executing tearDown hook:             def shutdown_debug_monitor():
                try:
                    server.terminate()
                except:
                    logger.warning(
                        "failed to terminate server for debug monitor: {}; ignoring".format(
                            sys.exc_info()[0]))


Executing tearDown hook:     def cleanupSubprocesses(self):
        # Ensure any subprocesses are cleaned up
        for p in self.subprocesses:
            p.terminate()
            del p
        del self.subprocesses[:]
        # Ensure any forked processes are cleaned up
        for pid in self.forkedProcessPids:
            if os.path.exists("/proc/" + str(pid)):
                os.kill(pid, signal.SIGTERM)


Executing tearDown hook:         def shutdown_process_for_attach():
            try:
                inferior.terminate()
            except:
                logger.warning(
                    "failed to terminate inferior process for attach: {}; ignoring".format(
                        sys.exc_info()[0]))


Executing tearDown hook:         def shutdown_named_pipe():
            # Close the pipe.
            try:
                named_pipe.close()
            except:
                print("failed to close named pipe")
                None

            # Delete the pipe.
            try:
                os.remove(named_pipe_path)
            except:
                print("failed to delete named pipe: {}".format(named_pipe_path))
                None

            # Delete the temp directory.
            try:
                os.rmdir(temp_dir)
            except:
                print(
                    "failed to delete temp dir: {}, directory contents: '{}'".format(
                        temp_dir, os.listdir(temp_dir)))
                None


PASS: LLDB (/Users/buildslave/jenkins/workspace/lldb-cmake-matrix/clang_701_build/bin/clang-7-x86_64) :: test_Hg_switches_to_3_threads_attach_debugserver (TestLldbGdbServer.LldbGdbServerTestCase)
runCmd: settings set symbols.enable-external-lookup false
output: 

runCmd: settings set plugin.process.gdb-remote.packet-timeout 60
output: 

runCmd: settings set symbols.clang-modules-cache-path "/Users/buildslave/jenkins/workspace/lldb-cmake-matrix/lldb-build/tools/lldb/lldb-test-build.noindex/module-cache-lldb"
output: 

runCmd: settings set use-color false
output: 

UNSUPPORTED: LLDB (/Users/buildslave/jenkins/workspace/lldb-cmake-matrix/clang_701_build/bin/clang-7-x86_64) :: test_Hg_switches_to_3_threads_attach_llgs (TestLldbGdbServer.LldbGdbServerTestCase) (llgs tests) 
runCmd: settings set symbols.enable-external-lookup false
output: 

runCmd: settings set plugin.process.gdb-remote.packet-timeout 60
output: 

runCmd: settings set symbols.clang-modules-cache-path "/Users/buildslave/jenkins/workspace/lldb-cmake-matrix/lldb-build/tools/lldb/lldb-test-build.noindex/module-cache-lldb"
output: 

runCmd: settings set use-color false
output: 

Adding tearDown hook:         def shutdown_named_pipe():
            # Close the pipe.
            try:
                named_pipe.close()
            except:
                print("failed to close named pipe")
                None

            # Delete the pipe.
            try:
                os.remove(named_pipe_path)
            except:
                print("failed to delete named pipe: {}".format(named_pipe_path))
                None

            # Delete the temp directory.
            try:
                os.rmdir(temp_dir)
            except:
                print(
                    "failed to delete temp dir: {}, directory contents: '{}'".format(
                        temp_dir, os.listdir(temp_dir)))
                None


Adding tearDown hook:     def cleanupSubprocesses(self):
        # Ensure any subprocesses are cleaned up
        for p in self.subprocesses:
            p.terminate()
            del p
        del self.subprocesses[:]
        # Ensure any forked processes are cleaned up
        for pid in self.forkedProcessPids:
            if os.path.exists("/proc/" + str(pid)):
                os.kill(pid, signal.SIGTERM)


Adding tearDown hook:             def shutdown_debug_monitor():
                try:
                    server.terminate()
                except:
                    logger.warning(
                        "failed to terminate server for debug monitor: {}; ignoring".format(
                            sys.exc_info()[0]))


Adding tearDown hook:         def shutdown_socket():
            if sock:
                try:
                    # send the kill packet so lldb-server shuts down gracefully
                    sock.sendall(GdbRemoteTestCaseBase._GDBREMOTE_KILL_PACKET)
                except:
                    logger.warning(
                        "failed to send kill packet to debug monitor: {}; ignoring".format(
                            sys.exc_info()[0]))

                try:
                    sock.close()
                except:
                    logger.warning(
                        "failed to close socket to debug monitor: {}; ignoring".format(
                            sys.exc_info()[0]))


Executing tearDown hook:         def shutdown_socket():
            if sock:
                try:
                    # send the kill packet so lldb-server shuts down gracefully
                    sock.sendall(GdbRemoteTestCaseBase._GDBREMOTE_KILL_PACKET)
                except:
                    logger.warning(
                        "failed to send kill packet to debug monitor: {}; ignoring".format(
                            sys.exc_info()[0]))

                try:
                    sock.close()
                except:
                    logger.warning(
                        "failed to close socket to debug monitor: {}; ignoring".format(
                            sys.exc_info()[0]))


Executing tearDown hook:             def shutdown_debug_monitor():
                try:
                    server.terminate()
                except:
                    logger.warning(
                        "failed to terminate server for debug monitor: {}; ignoring".format(
                            sys.exc_info()[0]))


Executing tearDown hook:     def cleanupSubprocesses(self):
        # Ensure any subprocesses are cleaned up
        for p in self.subprocesses:
            p.terminate()
            del p
        del self.subprocesses[:]
        # Ensure any forked processes are cleaned up
        for pid in self.forkedProcessPids:
            if os.path.exists("/proc/" + str(pid)):
                os.kill(pid, signal.SIGTERM)


Executing tearDown hook:         def shutdown_named_pipe():
            # Close the pipe.
            try:
                named_pipe.close()
            except:
                print("failed to close named pipe")
                None

            # Delete the pipe.
            try:
                os.remove(named_pipe_path)
            except:
                print("failed to delete named pipe: {}".format(named_pipe_path))
                None

            # Delete the temp directory.
            try:
                os.rmdir(temp_dir)
            except:
                print(
                    "failed to delete temp dir: {}, directory contents: '{}'".format(
                        temp_dir, os.listdir(temp_dir)))
                None


PASS: LLDB (/Users/buildslave/jenkins/workspace/lldb-cmake-matrix/clang_701_build/bin/clang-7-x86_64) :: test_Hg_switches_to_3_threads_launch_debugserver (TestLldbGdbServer.LldbGdbServerTestCase)
runCmd: settings set symbols.enable-external-lookup false
output: 

runCmd: settings set plugin.process.gdb-remote.packet-timeout 60
output: 

runCmd: settings set symbols.clang-modules-cache-path "/Users/buildslave/jenkins/workspace/lldb-cmake-matrix/lldb-build/tools/lldb/lldb-test-build.noindex/module-cache-lldb"
output: 

runCmd: settings set use-color false
output: 

UNSUPPORTED: LLDB (/Users/buildslave/jenkins/workspace/lldb-cmake-matrix/clang_701_build/bin/clang-7-x86_64) :: test_Hg_switches_to_3_threads_launch_llgs (TestLldbGdbServer.LldbGdbServerTestCase) (llgs tests) 
runCmd: settings set symbols.enable-external-lookup false
output: 

runCmd: settings set plugin.process.gdb-remote.packet-timeout 60
output: 

runCmd: settings set symbols.clang-modules-cache-path "/Users/buildslave/jenkins/workspace/lldb-cmake-matrix/lldb-build/tools/lldb/lldb-test-build.noindex/module-cache-lldb"
output: 

runCmd: settings set use-color false
output: 

Adding tearDown hook:         def shutdown_named_pipe():
            # Close the pipe.
            try:
                named_pipe.close()
            except:
                print("failed to close named pipe")
                None

            # Delete the pipe.
            try:
                os.remove(named_pipe_path)
            except:
                print("failed to delete named pipe: {}".format(named_pipe_path))
                None

            # Delete the temp directory.
            try:
                os.rmdir(temp_dir)
            except:
                print(
                    "failed to delete temp dir: {}, directory contents: '{}'".format(
                        temp_dir, os.listdir(temp_dir)))
                None


Adding tearDown hook:     def cleanupSubprocesses(self):
        # Ensure any subprocesses are cleaned up
        for p in self.subprocesses:
            p.terminate()
            del p
        del self.subprocesses[:]
        # Ensure any forked processes are cleaned up
        for pid in self.forkedProcessPids:
            if os.path.exists("/proc/" + str(pid)):
                os.kill(pid, signal.SIGTERM)


Adding tearDown hook:             def shutdown_debug_monitor():
                try:
                    server.terminate()
                except:
                    logger.warning(
                        "failed to terminate server for debug monitor: {}; ignoring".format(
                            sys.exc_info()[0]))


Adding tearDown hook:         def shutdown_socket():
            if sock:
                try:
                    # send the kill packet so lldb-server shuts down gracefully
                    sock.sendall(GdbRemoteTestCaseBase._GDBREMOTE_KILL_PACKET)
                except:
                    logger.warning(
                        "failed to send kill packet to debug monitor: {}; ignoring".format(
                            sys.exc_info()[0]))

                try:
                    sock.close()
                except:
                    logger.warning(
                        "failed to close socket to debug monitor: {}; ignoring".format(
                            sys.exc_info()[0]))


FAIL: LLDB (/Users/buildslave/jenkins/workspace/lldb-cmake-matrix/clang_701_build/bin/clang-7-x86_64) :: test_P_and_p_thread_suffix_work_debugserver (TestLldbGdbServer.LldbGdbServerTestCase)
Executing tearDown hook:         def shutdown_socket():
            if sock:
                try:
                    # send the kill packet so lldb-server shuts down gracefully
                    sock.sendall(GdbRemoteTestCaseBase._GDBREMOTE_KILL_PACKET)
                except:
                    logger.warning(
                        "failed to send kill packet to debug monitor: {}; ignoring".format(
                            sys.exc_info()[0]))

                try:
                    sock.close()
                except:
                    logger.warning(
                        "failed to close socket to debug monitor: {}; ignoring".format(
                            sys.exc_info()[0]))


Executing tearDown hook:             def shutdown_debug_monitor():
                try:
                    server.terminate()
                except:
                    logger.warning(
                        "failed to terminate server for debug monitor: {}; ignoring".format(
                            sys.exc_info()[0]))


Executing tearDown hook:     def cleanupSubprocesses(self):
        # Ensure any subprocesses are cleaned up
        for p in self.subprocesses:
            p.terminate()
            del p
        del self.subprocesses[:]
        # Ensure any forked processes are cleaned up
        for pid in self.forkedProcessPids:
            if os.path.exists("/proc/" + str(pid)):
                os.kill(pid, signal.SIGTERM)


Executing tearDown hook:         def shutdown_named_pipe():
            # Close the pipe.
            try:
                named_pipe.close()
            except:
                print("failed to close named pipe")
                None

            # Delete the pipe.
            try:
                os.remove(named_pipe_path)
            except:
                print("failed to delete named pipe: {}".format(named_pipe_path))
                None

            # Delete the temp directory.
            try:
                os.rmdir(temp_dir)
            except:
                print(
                    "failed to delete temp dir: {}, directory contents: '{}'".format(
                        temp_dir, os.listdir(temp_dir)))
                None


runCmd: settings set symbols.enable-external-lookup false
output: 

runCmd: settings set plugin.process.gdb-remote.packet-timeout 60
output: 

runCmd: settings set symbols.clang-modules-cache-path "/Users/buildslave/jenkins/workspace/lldb-cmake-matrix/lldb-build/tools/lldb/lldb-test-build.noindex/module-cache-lldb"
output: 

runCmd: settings set use-color false
output: 

UNSUPPORTED: LLDB (/Users/buildslave/jenkins/workspace/lldb-cmake-matrix/clang_701_build/bin/clang-7-x86_64) :: test_P_and_p_thread_suffix_work_llgs (TestLldbGdbServer.LldbGdbServerTestCase) (llgs tests) 
runCmd: settings set symbols.enable-external-lookup false
output: 

runCmd: settings set plugin.process.gdb-remote.packet-timeout 60
output: 

runCmd: settings set symbols.clang-modules-cache-path "/Users/buildslave/jenkins/workspace/lldb-cmake-matrix/lldb-build/tools/lldb/lldb-test-build.noindex/module-cache-lldb"
output: 

runCmd: settings set use-color false
output: 

Adding tearDown hook:         def shutdown_named_pipe():
            # Close the pipe.
            try:
                named_pipe.close()
            except:
                print("failed to close named pipe")
                None

            # Delete the pipe.
            try:
                os.remove(named_pipe_path)
            except:
                print("failed to delete named pipe: {}".format(named_pipe_path))
                None

            # Delete the temp directory.
            try:
                os.rmdir(temp_dir)
            except:
                print(
                    "failed to delete temp dir: {}, directory contents: '{}'".format(
                        temp_dir, os.listdir(temp_dir)))
                None


Adding tearDown hook:     def cleanupSubprocesses(self):
        # Ensure any subprocesses are cleaned up
        for p in self.subprocesses:
            p.terminate()
            del p
        del self.subprocesses[:]
        # Ensure any forked processes are cleaned up
        for pid in self.forkedProcessPids:
            if os.path.exists("/proc/" + str(pid)):
                os.kill(pid, signal.SIGTERM)


Adding tearDown hook:             def shutdown_debug_monitor():
                try:
                    server.terminate()
                except:
                    logger.warning(
                        "failed to terminate server for debug monitor: {}; ignoring".format(
                            sys.exc_info()[0]))


Adding tearDown hook:         def shutdown_socket():
            if sock:
                try:
                    # send the kill packet so lldb-server shuts down gracefully
                    sock.sendall(GdbRemoteTestCaseBase._GDBREMOTE_KILL_PACKET)
                except:
                    logger.warning(
                        "failed to send kill packet to debug monitor: {}; ignoring".format(
                            sys.exc_info()[0]))

                try:
                    sock.close()
                except:
                    logger.warning(
                        "failed to close socket to debug monitor: {}; ignoring".format(
                            sys.exc_info()[0]))


FAIL: LLDB (/Users/buildslave/jenkins/workspace/lldb-cmake-matrix/clang_701_build/bin/clang-7-x86_64) :: test_P_writes_all_gpr_registers_debugserver (TestLldbGdbServer.LldbGdbServerTestCase)
Executing tearDown hook:         def shutdown_socket():
            if sock:
                try:
                    # send the kill packet so lldb-server shuts down gracefully
                    sock.sendall(GdbRemoteTestCaseBase._GDBREMOTE_KILL_PACKET)
                except:
                    logger.warning(
                        "failed to send kill packet to debug monitor: {}; ignoring".format(
                            sys.exc_info()[0]))

                try:
                    sock.close()
                except:
                    logger.warning(
                        "failed to close socket to debug monitor: {}; ignoring".format(
                            sys.exc_info()[0]))


Executing tearDown hook:             def shutdown_debug_monitor():
                try:
                    server.terminate()
                except:
                    logger.warning(
                        "failed to terminate server for debug monitor: {}; ignoring".format(
                            sys.exc_info()[0]))


Executing tearDown hook:     def cleanupSubprocesses(self):
        # Ensure any subprocesses are cleaned up
        for p in self.subprocesses:
            p.terminate()
            del p
        del self.subprocesses[:]
        # Ensure any forked processes are cleaned up
        for pid in self.forkedProcessPids:
            if os.path.exists("/proc/" + str(pid)):
                os.kill(pid, signal.SIGTERM)


Executing tearDown hook:         def shutdown_named_pipe():
            # Close the pipe.
            try:
                named_pipe.close()
            except:
                print("failed to close named pipe")
                None

            # Delete the pipe.
            try:
                os.remove(named_pipe_path)
            except:
                print("failed to delete named pipe: {}".format(named_pipe_path))
                None

            # Delete the temp directory.
            try:
                os.rmdir(temp_dir)
            except:
                print(
                    "failed to delete temp dir: {}, directory contents: '{}'".format(
                        temp_dir, os.listdir(temp_dir)))
                None


runCmd: settings set symbols.enable-external-lookup false
output: 

runCmd: settings set plugin.process.gdb-remote.packet-timeout 60
output: 

runCmd: settings set symbols.clang-modules-cache-path "/Users/buildslave/jenkins/workspace/lldb-cmake-matrix/lldb-build/tools/lldb/lldb-test-build.noindex/module-cache-lldb"
output: 

runCmd: settings set use-color false
output: 

UNSUPPORTED: LLDB (/Users/buildslave/jenkins/workspace/lldb-cmake-matrix/clang_701_build/bin/clang-7-x86_64) :: test_P_writes_all_gpr_registers_llgs (TestLldbGdbServer.LldbGdbServerTestCase) (llgs tests) 
runCmd: settings set symbols.enable-external-lookup false
output: 

runCmd: settings set plugin.process.gdb-remote.packet-timeout 60
output: 

runCmd: settings set symbols.clang-modules-cache-path "/Users/buildslave/jenkins/workspace/lldb-cmake-matrix/lldb-build/tools/lldb/lldb-test-build.noindex/module-cache-lldb"
output: 

runCmd: settings set use-color false
output: 

Adding tearDown hook:         def shutdown_named_pipe():
            # Close the pipe.
            try:
                named_pipe.close()
            except:
                print("failed to close named pipe")
                None

            # Delete the pipe.
            try:
                os.remove(named_pipe_path)
            except:
                print("failed to delete named pipe: {}".format(named_pipe_path))
                None

            # Delete the temp directory.
            try:
                os.rmdir(temp_dir)
            except:
                print(
                    "failed to delete temp dir: {}, directory contents: '{}'".format(
                        temp_dir, os.listdir(temp_dir)))
                None


FAIL: LLDB (/Users/buildslave/jenkins/workspace/lldb-cmake-matrix/clang_701_build/bin/clang-7-x86_64) :: test_attach_commandline_continue_app_exits_debugserver (TestLldbGdbServer.LldbGdbServerTestCase)
Executing tearDown hook:         def shutdown_named_pipe():
            # Close the pipe.
            try:
                named_pipe.close()
            except:
                print("failed to close named pipe")
                None

            # Delete the pipe.
            try:
                os.remove(named_pipe_path)
            except:
                print("failed to delete named pipe: {}".format(named_pipe_path))
                None

            # Delete the temp directory.
            try:
                os.rmdir(temp_dir)
            except:
                print(
                    "failed to delete temp dir: {}, directory contents: '{}'".format(
                        temp_dir, os.listdir(temp_dir)))
                None


runCmd: settings set symbols.enable-external-lookup false
output: 

runCmd: settings set plugin.process.gdb-remote.packet-timeout 60
output: 

runCmd: settings set symbols.clang-modules-cache-path "/Users/buildslave/jenkins/workspace/lldb-cmake-matrix/lldb-build/tools/lldb/lldb-test-build.noindex/module-cache-lldb"
output: 

runCmd: settings set use-color false
output: 

UNSUPPORTED: LLDB (/Users/buildslave/jenkins/workspace/lldb-cmake-matrix/clang_701_build/bin/clang-7-x86_64) :: test_attach_commandline_continue_app_exits_llgs (TestLldbGdbServer.LldbGdbServerTestCase) (llgs tests) 
runCmd: settings set symbols.enable-external-lookup false
output: 

runCmd: settings set plugin.process.gdb-remote.packet-timeout 60
output: 

runCmd: settings set symbols.clang-modules-cache-path "/Users/buildslave/jenkins/workspace/lldb-cmake-matrix/lldb-build/tools/lldb/lldb-test-build.noindex/module-cache-lldb"
output: 

runCmd: settings set use-color false
output: 

Adding tearDown hook:         def shutdown_named_pipe():
            # Close the pipe.
            try:
                named_pipe.close()
            except:
                print("failed to close named pipe")
                None

            # Delete the pipe.
            try:
                os.remove(named_pipe_path)
            except:
                print("failed to delete named pipe: {}".format(named_pipe_path))
                None

            # Delete the temp directory.
            try:
                os.rmdir(temp_dir)
            except:
                print(
                    "failed to delete temp dir: {}, directory contents: '{}'".format(
                        temp_dir, os.listdir(temp_dir)))
                None


FAIL: LLDB (/Users/buildslave/jenkins/workspace/lldb-cmake-matrix/clang_701_build/bin/clang-7-x86_64) :: test_c_packet_works_debugserver (TestLldbGdbServer.LldbGdbServerTestCase)
Executing tearDown hook:         def shutdown_named_pipe():
            # Close the pipe.
            try:
                named_pipe.close()
            except:
                print("failed to close named pipe")
                None

            # Delete the pipe.
            try:
                os.remove(named_pipe_path)
            except:
                print("failed to delete named pipe: {}".format(named_pipe_path))
                None

            # Delete the temp directory.
            try:
                os.rmdir(temp_dir)
            except:
                print(
                    "failed to delete temp dir: {}, directory contents: '{}'".format(
                        temp_dir, os.listdir(temp_dir)))
                None


runCmd: settings set symbols.enable-external-lookup false
output: 

runCmd: settings set plugin.process.gdb-remote.packet-timeout 60
output: 

runCmd: settings set symbols.clang-modules-cache-path "/Users/buildslave/jenkins/workspace/lldb-cmake-matrix/lldb-build/tools/lldb/lldb-test-build.noindex/module-cache-lldb"
output: 

runCmd: settings set use-color false
output: 

UNSUPPORTED: LLDB (/Users/buildslave/jenkins/workspace/lldb-cmake-matrix/clang_701_build/bin/clang-7-x86_64) :: test_c_packet_works_llgs (TestLldbGdbServer.LldbGdbServerTestCase) (llgs tests) 
runCmd: settings set symbols.enable-external-lookup false
output: 

runCmd: settings set plugin.process.gdb-remote.packet-timeout 60
output: 

runCmd: settings set symbols.clang-modules-cache-path "/Users/buildslave/jenkins/workspace/lldb-cmake-matrix/lldb-build/tools/lldb/lldb-test-build.noindex/module-cache-lldb"
output: 

runCmd: settings set use-color false
output: 

Adding tearDown hook:         def shutdown_named_pipe():
            # Close the pipe.
            try:
                named_pipe.close()
            except:
                print("failed to close named pipe")
                None

            # Delete the pipe.
            try:
                os.remove(named_pipe_path)
            except:
                print("failed to delete named pipe: {}".format(named_pipe_path))
                None

            # Delete the temp directory.
            try:
                os.rmdir(temp_dir)
            except:
                print(
                    "failed to delete temp dir: {}, directory contents: '{}'".format(
                        temp_dir, os.listdir(temp_dir)))
                None


Adding tearDown hook:     def cleanupSubprocesses(self):
        # Ensure any subprocesses are cleaned up
        for p in self.subprocesses:
            p.terminate()
            del p
        del self.subprocesses[:]
        # Ensure any forked processes are cleaned up
        for pid in self.forkedProcessPids:
            if os.path.exists("/proc/" + str(pid)):
                os.kill(pid, signal.SIGTERM)


Adding tearDown hook:             def shutdown_debug_monitor():
                try:
                    server.terminate()
                except:
                    logger.warning(
                        "failed to terminate server for debug monitor: {}; ignoring".format(
                            sys.exc_info()[0]))


Adding tearDown hook:         def shutdown_socket():
            if sock:
                try:
                    # send the kill packet so lldb-server shuts down gracefully
                    sock.sendall(GdbRemoteTestCaseBase._GDBREMOTE_KILL_PACKET)
                except:
                    logger.warning(
                        "failed to send kill packet to debug monitor: {}; ignoring".format(
                            sys.exc_info()[0]))

                try:
                    sock.close()
                except:
                    logger.warning(
                        "failed to close socket to debug monitor: {}; ignoring".format(
                            sys.exc_info()[0]))


Executing tearDown hook:         def shutdown_socket():
            if sock:
                try:
                    # send the kill packet so lldb-server shuts down gracefully
                    sock.sendall(GdbRemoteTestCaseBase._GDBREMOTE_KILL_PACKET)
                except:
                    logger.warning(
                        "failed to send kill packet to debug monitor: {}; ignoring".format(
                            sys.exc_info()[0]))

                try:
                    sock.close()
                except:
                    logger.warning(
                        "failed to close socket to debug monitor: {}; ignoring".format(
                            sys.exc_info()[0]))


Executing tearDown hook:             def shutdown_debug_monitor():
                try:
                    server.terminate()
                except:
                    logger.warning(
                        "failed to terminate server for debug monitor: {}; ignoring".format(
                            sys.exc_info()[0]))


Executing tearDown hook:     def cleanupSubprocesses(self):
        # Ensure any subprocesses are cleaned up
        for p in self.subprocesses:
            p.terminate()
            del p
        del self.subprocesses[:]
        # Ensure any forked processes are cleaned up
        for pid in self.forkedProcessPids:
            if os.path.exists("/proc/" + str(pid)):
                os.kill(pid, signal.SIGTERM)


Executing tearDown hook:         def shutdown_named_pipe():
            # Close the pipe.
            try:
                named_pipe.close()
            except:
                print("failed to close named pipe")
                None

            # Delete the pipe.
            try:
                os.remove(named_pipe_path)
            except:
                print("failed to delete named pipe: {}".format(named_pipe_path))
                None

            # Delete the temp directory.
            try:
                os.rmdir(temp_dir)
            except:
                print(
                    "failed to delete temp dir: {}, directory contents: '{}'".format(
                        temp_dir, os.listdir(temp_dir)))
                None


PASS: LLDB (/Users/buildslave/jenkins/workspace/lldb-cmake-matrix/clang_701_build/bin/clang-7-x86_64) :: test_exe_starts_debugserver (TestLldbGdbServer.LldbGdbServerTestCase)
runCmd: settings set symbols.enable-external-lookup false
output: 

runCmd: settings set plugin.process.gdb-remote.packet-timeout 60
output: 

runCmd: settings set symbols.clang-modules-cache-path "/Users/buildslave/jenkins/workspace/lldb-cmake-matrix/lldb-build/tools/lldb/lldb-test-build.noindex/module-cache-lldb"
output: 

runCmd: settings set use-color false
output: 

UNSUPPORTED: LLDB (/Users/buildslave/jenkins/workspace/lldb-cmake-matrix/clang_701_build/bin/clang-7-x86_64) :: test_exe_starts_llgs (TestLldbGdbServer.LldbGdbServerTestCase) (llgs tests) 
runCmd: settings set symbols.enable-external-lookup false
output: 

runCmd: settings set plugin.process.gdb-remote.packet-timeout 60
output: 

runCmd: settings set symbols.clang-modules-cache-path "/Users/buildslave/jenkins/workspace/lldb-cmake-matrix/lldb-build/tools/lldb/lldb-test-build.noindex/module-cache-lldb"
output: 

runCmd: settings set use-color false
output: 

Adding tearDown hook:         def shutdown_named_pipe():
            # Close the pipe.
            try:
                named_pipe.close()
            except:
                print("failed to close named pipe")
                None

            # Delete the pipe.
            try:
                os.remove(named_pipe_path)
            except:
                print("failed to delete named pipe: {}".format(named_pipe_path))
                None

            # Delete the temp directory.
            try:
                os.rmdir(temp_dir)
            except:
                print(
                    "failed to delete temp dir: {}, directory contents: '{}'".format(
                        temp_dir, os.listdir(temp_dir)))
                None


FAIL: LLDB (/Users/buildslave/jenkins/workspace/lldb-cmake-matrix/clang_701_build/bin/clang-7-x86_64) :: test_first_launch_stop_reply_thread_matches_first_qC_debugserver (TestLldbGdbServer.LldbGdbServerTestCase)
Executing tearDown hook:         def shutdown_named_pipe():
            # Close the pipe.
            try:
                named_pipe.close()
            except:
                print("failed to close named pipe")
                None

            # Delete the pipe.
            try:
                os.remove(named_pipe_path)
            except:
                print("failed to delete named pipe: {}".format(named_pipe_path))
                None

            # Delete the temp directory.
            try:
                os.rmdir(temp_dir)
            except:
                print(
                    "failed to delete temp dir: {}, directory contents: '{}'".format(
                        temp_dir, os.listdir(temp_dir)))
                None


runCmd: settings set symbols.enable-external-lookup false
output: 

runCmd: settings set plugin.process.gdb-remote.packet-timeout 60
output: 

runCmd: settings set symbols.clang-modules-cache-path "/Users/buildslave/jenkins/workspace/lldb-cmake-matrix/lldb-build/tools/lldb/lldb-test-build.noindex/module-cache-lldb"
output: 

runCmd: settings set use-color false
output: 

UNSUPPORTED: LLDB (/Users/buildslave/jenkins/workspace/lldb-cmake-matrix/clang_701_build/bin/clang-7-x86_64) :: test_first_launch_stop_reply_thread_matches_first_qC_llgs (TestLldbGdbServer.LldbGdbServerTestCase) (llgs tests) 
UNSUPPORTED: LLDB (/Users/buildslave/jenkins/workspace/lldb-cmake-matrix/clang_701_build/bin/clang-7-x86_64) :: test_hardware_breakpoint_set_and_remove_work_debugserver (TestLldbGdbServer.LldbGdbServerTestCase) (requires one of linux) 
UNSUPPORTED: LLDB (/Users/buildslave/jenkins/workspace/lldb-cmake-matrix/clang_701_build/bin/clang-7-x86_64) :: test_hardware_breakpoint_set_and_remove_work_llgs (TestLldbGdbServer.LldbGdbServerTestCase) (requires one of linux) 
runCmd: settings set symbols.enable-external-lookup false
output: 

runCmd: settings set plugin.process.gdb-remote.packet-timeout 60
output: 

runCmd: settings set symbols.clang-modules-cache-path "/Users/buildslave/jenkins/workspace/lldb-cmake-matrix/lldb-build/tools/lldb/lldb-test-build.noindex/module-cache-lldb"
output: 

runCmd: settings set use-color false
output: 

Adding tearDown hook:         def shutdown_named_pipe():
            # Close the pipe.
            try:
                named_pipe.close()
            except:
                print("failed to close named pipe")
                None

            # Delete the pipe.
            try:
                os.remove(named_pipe_path)
            except:
                print("failed to delete named pipe: {}".format(named_pipe_path))
                None

            # Delete the temp directory.
            try:
                os.rmdir(temp_dir)
            except:
                print(
                    "failed to delete temp dir: {}, directory contents: '{}'".format(
                        temp_dir, os.listdir(temp_dir)))
                None


FAIL: LLDB (/Users/buildslave/jenkins/workspace/lldb-cmake-matrix/clang_701_build/bin/clang-7-x86_64) :: test_inferior_print_exit_debugserver (TestLldbGdbServer.LldbGdbServerTestCase)
Executing tearDown hook:         def shutdown_named_pipe():
            # Close the pipe.
            try:
                named_pipe.close()
            except:
                print("failed to close named pipe")
                None

            # Delete the pipe.
            try:
                os.remove(named_pipe_path)
            except:
                print("failed to delete named pipe: {}".format(named_pipe_path))
                None

            # Delete the temp directory.
            try:
                os.rmdir(temp_dir)
            except:
                print(
                    "failed to delete temp dir: {}, directory contents: '{}'".format(
                        temp_dir, os.listdir(temp_dir)))
                None


runCmd: settings set symbols.enable-external-lookup false
output: 

runCmd: settings set plugin.process.gdb-remote.packet-timeout 60
output: 

runCmd: settings set symbols.clang-modules-cache-path "/Users/buildslave/jenkins/workspace/lldb-cmake-matrix/lldb-build/tools/lldb/lldb-test-build.noindex/module-cache-lldb"
output: 

runCmd: settings set use-color false
output: 

UNSUPPORTED: LLDB (/Users/buildslave/jenkins/workspace/lldb-cmake-matrix/clang_701_build/bin/clang-7-x86_64) :: test_inferior_print_exit_llgs (TestLldbGdbServer.LldbGdbServerTestCase) (llgs tests) 
runCmd: settings set symbols.enable-external-lookup false
output: 

runCmd: settings set plugin.process.gdb-remote.packet-timeout 60
output: 

runCmd: settings set symbols.clang-modules-cache-path "/Users/buildslave/jenkins/workspace/lldb-cmake-matrix/lldb-build/tools/lldb/lldb-test-build.noindex/module-cache-lldb"
output: 

runCmd: settings set use-color false
output: 

Adding tearDown hook:         def shutdown_named_pipe():
            # Close the pipe.
            try:
                named_pipe.close()
            except:
                print("failed to close named pipe")
                None

            # Delete the pipe.
            try:
                os.remove(named_pipe_path)
            except:
                print("failed to delete named pipe: {}".format(named_pipe_path))
                None

            # Delete the temp directory.
            try:
                os.rmdir(temp_dir)
            except:
                print(
                    "failed to delete temp dir: {}, directory contents: '{}'".format(
                        temp_dir, os.listdir(temp_dir)))
                None


Adding tearDown hook:     def cleanupSubprocesses(self):
        # Ensure any subprocesses are cleaned up
        for p in self.subprocesses:
            p.terminate()
            del p
        del self.subprocesses[:]
        # Ensure any forked processes are cleaned up
        for pid in self.forkedProcessPids:
            if os.path.exists("/proc/" + str(pid)):
                os.kill(pid, signal.SIGTERM)


Adding tearDown hook:             def shutdown_debug_monitor():
                try:
                    server.terminate()
                except:
                    logger.warning(
                        "failed to terminate server for debug monitor: {}; ignoring".format(
                            sys.exc_info()[0]))


Adding tearDown hook:         def shutdown_socket():
            if sock:
                try:
                    # send the kill packet so lldb-server shuts down gracefully
                    sock.sendall(GdbRemoteTestCaseBase._GDBREMOTE_KILL_PACKET)
                except:
                    logger.warning(
                        "failed to send kill packet to debug monitor: {}; ignoring".format(
                            sys.exc_info()[0]))

                try:
                    sock.close()
                except:
                    logger.warning(
                        "failed to close socket to debug monitor: {}; ignoring".format(
                            sys.exc_info()[0]))


Executing tearDown hook:         def shutdown_socket():
            if sock:
                try:
                    # send the kill packet so lldb-server shuts down gracefully
                    sock.sendall(GdbRemoteTestCaseBase._GDBREMOTE_KILL_PACKET)
                except:
                    logger.warning(
                        "failed to send kill packet to debug monitor: {}; ignoring".format(
                            sys.exc_info()[0]))

                try:
                    sock.close()
                except:
                    logger.warning(
                        "failed to close socket to debug monitor: {}; ignoring".format(
                            sys.exc_info()[0]))


Executing tearDown hook:             def shutdown_debug_monitor():
                try:
                    server.terminate()
                except:
                    logger.warning(
                        "failed to terminate server for debug monitor: {}; ignoring".format(
                            sys.exc_info()[0]))


Executing tearDown hook:     def cleanupSubprocesses(self):
        # Ensure any subprocesses are cleaned up
        for p in self.subprocesses:
            p.terminate()
            del p
        del self.subprocesses[:]
        # Ensure any forked processes are cleaned up
        for pid in self.forkedProcessPids:
            if os.path.exists("/proc/" + str(pid)):
                os.kill(pid, signal.SIGTERM)


Executing tearDown hook:         def shutdown_named_pipe():
            # Close the pipe.
            try:
                named_pipe.close()
            except:
                print("failed to close named pipe")
                None

            # Delete the pipe.
            try:
                os.remove(named_pipe_path)
            except:
                print("failed to delete named pipe: {}".format(named_pipe_path))
                None

            # Delete the temp directory.
            try:
                os.rmdir(temp_dir)
            except:
                print(
                    "failed to delete temp dir: {}, directory contents: '{}'".format(
                        temp_dir, os.listdir(temp_dir)))
                None


PASS: LLDB (/Users/buildslave/jenkins/workspace/lldb-cmake-matrix/clang_701_build/bin/clang-7-x86_64) :: test_list_threads_in_stop_reply_supported_debugserver (TestLldbGdbServer.LldbGdbServerTestCase)
runCmd: settings set symbols.enable-external-lookup false
output: 

runCmd: settings set plugin.process.gdb-remote.packet-timeout 60
output: 

runCmd: settings set symbols.clang-modules-cache-path "/Users/buildslave/jenkins/workspace/lldb-cmake-matrix/lldb-build/tools/lldb/lldb-test-build.noindex/module-cache-lldb"
output: 

runCmd: settings set use-color false
output: 

UNSUPPORTED: LLDB (/Users/buildslave/jenkins/workspace/lldb-cmake-matrix/clang_701_build/bin/clang-7-x86_64) :: test_list_threads_in_stop_reply_supported_llgs (TestLldbGdbServer.LldbGdbServerTestCase) (llgs tests) 
runCmd: settings set symbols.enable-external-lookup false
output: 

runCmd: settings set plugin.process.gdb-remote.packet-timeout 60
output: 

runCmd: settings set symbols.clang-modules-cache-path "/Users/buildslave/jenkins/workspace/lldb-cmake-matrix/lldb-build/tools/lldb/lldb-test-build.noindex/module-cache-lldb"
output: 

runCmd: settings set use-color false
output: 

Adding tearDown hook:         def shutdown_named_pipe():
            # Close the pipe.
            try:
                named_pipe.close()
            except:
                print("failed to close named pipe")
                None

            # Delete the pipe.
            try:
                os.remove(named_pipe_path)
            except:
                print("failed to delete named pipe: {}".format(named_pipe_path))
                None

            # Delete the temp directory.
            try:
                os.rmdir(temp_dir)
            except:
                print(
                    "failed to delete temp dir: {}, directory contents: '{}'".format(
                        temp_dir, os.listdir(temp_dir)))
                None


FAIL: LLDB (/Users/buildslave/jenkins/workspace/lldb-cmake-matrix/clang_701_build/bin/clang-7-x86_64) :: test_m_packet_reads_memory_debugserver (TestLldbGdbServer.LldbGdbServerTestCase)
Executing tearDown hook:         def shutdown_named_pipe():
            # Close the pipe.
            try:
                named_pipe.close()
            except:
                print("failed to close named pipe")
                None

            # Delete the pipe.
            try:
                os.remove(named_pipe_path)
            except:
                print("failed to delete named pipe: {}".format(named_pipe_path))
                None

            # Delete the temp directory.
            try:
                os.rmdir(temp_dir)
            except:
                print(
                    "failed to delete temp dir: {}, directory contents: '{}'".format(
                        temp_dir, os.listdir(temp_dir)))
                None


runCmd: settings set symbols.enable-external-lookup false
output: 

runCmd: settings set plugin.process.gdb-remote.packet-timeout 60
output: 

runCmd: settings set symbols.clang-modules-cache-path "/Users/buildslave/jenkins/workspace/lldb-cmake-matrix/lldb-build/tools/lldb/lldb-test-build.noindex/module-cache-lldb"
output: 

runCmd: settings set use-color false
output: 

UNSUPPORTED: LLDB (/Users/buildslave/jenkins/workspace/lldb-cmake-matrix/clang_701_build/bin/clang-7-x86_64) :: test_m_packet_reads_memory_llgs (TestLldbGdbServer.LldbGdbServerTestCase) (llgs tests) 
runCmd: settings set symbols.enable-external-lookup false
output: 

runCmd: settings set plugin.process.gdb-remote.packet-timeout 60
output: 

runCmd: settings set symbols.clang-modules-cache-path "/Users/buildslave/jenkins/workspace/lldb-cmake-matrix/lldb-build/tools/lldb/lldb-test-build.noindex/module-cache-lldb"
output: 

runCmd: settings set use-color false
output: 

Adding tearDown hook:         def shutdown_named_pipe():
            # Close the pipe.
            try:
                named_pipe.close()
            except:
                print("failed to close named pipe")
                None

            # Delete the pipe.
            try:
                os.remove(named_pipe_path)
            except:
                print("failed to delete named pipe: {}".format(named_pipe_path))
                None

            # Delete the temp directory.
            try:
                os.rmdir(temp_dir)
            except:
                print(
                    "failed to delete temp dir: {}, directory contents: '{}'".format(
                        temp_dir, os.listdir(temp_dir)))
                None


FAIL: LLDB (/Users/buildslave/jenkins/workspace/lldb-cmake-matrix/clang_701_build/bin/clang-7-x86_64) :: test_p_returns_correct_data_size_for_each_qRegisterInfo_attach_debugserver (TestLldbGdbServer.LldbGdbServerTestCase)
Executing tearDown hook:         def shutdown_named_pipe():
            # Close the pipe.
            try:
                named_pipe.close()
            except:
                print("failed to close named pipe")
                None

            # Delete the pipe.
            try:
                os.remove(named_pipe_path)
            except:
                print("failed to delete named pipe: {}".format(named_pipe_path))
                None

            # Delete the temp directory.
            try:
                os.rmdir(temp_dir)
            except:
                print(
                    "failed to delete temp dir: {}, directory contents: '{}'".format(
                        temp_dir, os.listdir(temp_dir)))
                None


runCmd: settings set symbols.enable-external-lookup false
output: 

runCmd: settings set plugin.process.gdb-remote.packet-timeout 60
output: 

runCmd: settings set symbols.clang-modules-cache-path "/Users/buildslave/jenkins/workspace/lldb-cmake-matrix/lldb-build/tools/lldb/lldb-test-build.noindex/module-cache-lldb"
output: 

runCmd: settings set use-color false
output: 

UNSUPPORTED: LLDB (/Users/buildslave/jenkins/workspace/lldb-cmake-matrix/clang_701_build/bin/clang-7-x86_64) :: test_p_returns_correct_data_size_for_each_qRegisterInfo_attach_llgs (TestLldbGdbServer.LldbGdbServerTestCase) (llgs tests) 
runCmd: settings set symbols.enable-external-lookup false
output: 

runCmd: settings set plugin.process.gdb-remote.packet-timeout 60
output: 

runCmd: settings set symbols.clang-modules-cache-path "/Users/buildslave/jenkins/workspace/lldb-cmake-matrix/lldb-build/tools/lldb/lldb-test-build.noindex/module-cache-lldb"
output: 

runCmd: settings set use-color false
output: 

Adding tearDown hook:         def shutdown_named_pipe():
            # Close the pipe.
            try:
                named_pipe.close()
            except:
                print("failed to close named pipe")
                None

            # Delete the pipe.
            try:
                os.remove(named_pipe_path)
            except:
                print("failed to delete named pipe: {}".format(named_pipe_path))
                None

            # Delete the temp directory.
            try:
                os.rmdir(temp_dir)
            except:
                print(
                    "failed to delete temp dir: {}, directory contents: '{}'".format(
                        temp_dir, os.listdir(temp_dir)))
                None


FAIL: LLDB (/Users/buildslave/jenkins/workspace/lldb-cmake-matrix/clang_701_build/bin/clang-7-x86_64) :: test_p_returns_correct_data_size_for_each_qRegisterInfo_launch_debugserver (TestLldbGdbServer.LldbGdbServerTestCase)
Executing tearDown hook:         def shutdown_named_pipe():
            # Close the pipe.
            try:
                named_pipe.close()
            except:
                print("failed to close named pipe")
                None

            # Delete the pipe.
            try:
                os.remove(named_pipe_path)
            except:
                print("failed to delete named pipe: {}".format(named_pipe_path))
                None

            # Delete the temp directory.
            try:
                os.rmdir(temp_dir)
            except:
                print(
                    "failed to delete temp dir: {}, directory contents: '{}'".format(
                        temp_dir, os.listdir(temp_dir)))
                None


runCmd: settings set symbols.enable-external-lookup false
output: 

runCmd: settings set plugin.process.gdb-remote.packet-timeout 60
output: 

runCmd: settings set symbols.clang-modules-cache-path "/Users/buildslave/jenkins/workspace/lldb-cmake-matrix/lldb-build/tools/lldb/lldb-test-build.noindex/module-cache-lldb"
output: 

runCmd: settings set use-color false
output: 

UNSUPPORTED: LLDB (/Users/buildslave/jenkins/workspace/lldb-cmake-matrix/clang_701_build/bin/clang-7-x86_64) :: test_p_returns_correct_data_size_for_each_qRegisterInfo_launch_llgs (TestLldbGdbServer.LldbGdbServerTestCase) (llgs tests) 
runCmd: settings set symbols.enable-external-lookup false
output: 

runCmd: settings set plugin.process.gdb-remote.packet-timeout 60
output: 

runCmd: settings set symbols.clang-modules-cache-path "/Users/buildslave/jenkins/workspace/lldb-cmake-matrix/lldb-build/tools/lldb/lldb-test-build.noindex/module-cache-lldb"
output: 

runCmd: settings set use-color false
output: 

Adding tearDown hook:         def shutdown_named_pipe():
            # Close the pipe.
            try:
                named_pipe.close()
            except:
                print("failed to close named pipe")
                None

            # Delete the pipe.
            try:
                os.remove(named_pipe_path)
            except:
                print("failed to delete named pipe: {}".format(named_pipe_path))
                None

            # Delete the temp directory.
            try:
                os.rmdir(temp_dir)
            except:
                print(
                    "failed to delete temp dir: {}, directory contents: '{}'".format(
                        temp_dir, os.listdir(temp_dir)))
                None


FAIL: LLDB (/Users/buildslave/jenkins/workspace/lldb-cmake-matrix/clang_701_build/bin/clang-7-x86_64) :: test_qMemoryRegionInfo_is_supported_debugserver (TestLldbGdbServer.LldbGdbServerTestCase)
Executing tearDown hook:         def shutdown_named_pipe():
            # Close the pipe.
            try:
                named_pipe.close()
            except:
                print("failed to close named pipe")
                None

            # Delete the pipe.
            try:
                os.remove(named_pipe_path)
            except:
                print("failed to delete named pipe: {}".format(named_pipe_path))
                None

            # Delete the temp directory.
            try:
                os.rmdir(temp_dir)
            except:
                print(
                    "failed to delete temp dir: {}, directory contents: '{}'".format(
                        temp_dir, os.listdir(temp_dir)))
                None


runCmd: settings set symbols.enable-external-lookup false
output: 

runCmd: settings set plugin.process.gdb-remote.packet-timeout 60
output: 

runCmd: settings set symbols.clang-modules-cache-path "/Users/buildslave/jenkins/workspace/lldb-cmake-matrix/lldb-build/tools/lldb/lldb-test-build.noindex/module-cache-lldb"
output: 

runCmd: settings set use-color false
output: 

UNSUPPORTED: LLDB (/Users/buildslave/jenkins/workspace/lldb-cmake-matrix/clang_701_build/bin/clang-7-x86_64) :: test_qMemoryRegionInfo_is_supported_llgs (TestLldbGdbServer.LldbGdbServerTestCase) (llgs tests) 
runCmd: settings set symbols.enable-external-lookup false
output: 

runCmd: settings set plugin.process.gdb-remote.packet-timeout 60
output: 

runCmd: settings set symbols.clang-modules-cache-path "/Users/buildslave/jenkins/workspace/lldb-cmake-matrix/lldb-build/tools/lldb/lldb-test-build.noindex/module-cache-lldb"
output: 

runCmd: settings set use-color false
output: 

Adding tearDown hook:         def shutdown_named_pipe():
            # Close the pipe.
            try:
                named_pipe.close()
            except:
                print("failed to close named pipe")
                None

            # Delete the pipe.
            try:
                os.remove(named_pipe_path)
            except:
                print("failed to delete named pipe: {}".format(named_pipe_path))
                None

            # Delete the temp directory.
            try:
                os.rmdir(temp_dir)
            except:
                print(
                    "failed to delete temp dir: {}, directory contents: '{}'".format(
                        temp_dir, os.listdir(temp_dir)))
                None


Adding tearDown hook:     def cleanupSubprocesses(self):
        # Ensure any subprocesses are cleaned up
        for p in self.subprocesses:
            p.terminate()
            del p
        del self.subprocesses[:]
        # Ensure any forked processes are cleaned up
        for pid in self.forkedProcessPids:
            if os.path.exists("/proc/" + str(pid)):
                os.kill(pid, signal.SIGTERM)


Adding tearDown hook:             def shutdown_debug_monitor():
                try:
                    server.terminate()
                except:
                    logger.warning(
                        "failed to terminate server for debug monitor: {}; ignoring".format(
                            sys.exc_info()[0]))


Adding tearDown hook:         def shutdown_socket():
            if sock:
                try:
                    # send the kill packet so lldb-server shuts down gracefully
                    sock.sendall(GdbRemoteTestCaseBase._GDBREMOTE_KILL_PACKET)
                except:
                    logger.warning(
                        "failed to send kill packet to debug monitor: {}; ignoring".format(
                            sys.exc_info()[0]))

                try:
                    sock.close()
                except:
                    logger.warning(
                        "failed to close socket to debug monitor: {}; ignoring".format(
                            sys.exc_info()[0]))


FAIL: LLDB (/Users/buildslave/jenkins/workspace/lldb-cmake-matrix/clang_701_build/bin/clang-7-x86_64) :: test_qMemoryRegionInfo_reports_code_address_as_executable_debugserver (TestLldbGdbServer.LldbGdbServerTestCase)
Executing tearDown hook:         def shutdown_socket():
            if sock:
                try:
                    # send the kill packet so lldb-server shuts down gracefully
                    sock.sendall(GdbRemoteTestCaseBase._GDBREMOTE_KILL_PACKET)
                except:
                    logger.warning(
                        "failed to send kill packet to debug monitor: {}; ignoring".format(
                            sys.exc_info()[0]))

                try:
                    sock.close()
                except:
                    logger.warning(
                        "failed to close socket to debug monitor: {}; ignoring".format(
                            sys.exc_info()[0]))


Executing tearDown hook:             def shutdown_debug_monitor():
                try:
                    server.terminate()
                except:
                    logger.warning(
                        "failed to terminate server for debug monitor: {}; ignoring".format(
                            sys.exc_info()[0]))


Executing tearDown hook:     def cleanupSubprocesses(self):
        # Ensure any subprocesses are cleaned up
        for p in self.subprocesses:
            p.terminate()
            del p
        del self.subprocesses[:]
        # Ensure any forked processes are cleaned up
        for pid in self.forkedProcessPids:
            if os.path.exists("/proc/" + str(pid)):
                os.kill(pid, signal.SIGTERM)


Executing tearDown hook:         def shutdown_named_pipe():
            # Close the pipe.
            try:
                named_pipe.close()
            except:
                print("failed to close named pipe")
                None

            # Delete the pipe.
            try:
                os.remove(named_pipe_path)
            except:
                print("failed to delete named pipe: {}".format(named_pipe_path))
                None

            # Delete the temp directory.
            try:
                os.rmdir(temp_dir)
            except:
                print(
                    "failed to delete temp dir: {}, directory contents: '{}'".format(
                        temp_dir, os.listdir(temp_dir)))
                None


runCmd: settings set symbols.enable-external-lookup false
output: 

runCmd: settings set plugin.process.gdb-remote.packet-timeout 60
output: 

runCmd: settings set symbols.clang-modules-cache-path "/Users/buildslave/jenkins/workspace/lldb-cmake-matrix/lldb-build/tools/lldb/lldb-test-build.noindex/module-cache-lldb"
output: 

runCmd: settings set use-color false
output: 

UNSUPPORTED: LLDB (/Users/buildslave/jenkins/workspace/lldb-cmake-matrix/clang_701_build/bin/clang-7-x86_64) :: test_qMemoryRegionInfo_reports_code_address_as_executable_llgs (TestLldbGdbServer.LldbGdbServerTestCase) (llgs tests) 
runCmd: settings set symbols.enable-external-lookup false
output: 

runCmd: settings set plugin.process.gdb-remote.packet-timeout 60
output: 

runCmd: settings set symbols.clang-modules-cache-path "/Users/buildslave/jenkins/workspace/lldb-cmake-matrix/lldb-build/tools/lldb/lldb-test-build.noindex/module-cache-lldb"
output: 

runCmd: settings set use-color false
output: 

Adding tearDown hook:         def shutdown_named_pipe():
            # Close the pipe.
            try:
                named_pipe.close()
            except:
                print("failed to close named pipe")
                None

            # Delete the pipe.
            try:
                os.remove(named_pipe_path)
            except:
                print("failed to delete named pipe: {}".format(named_pipe_path))
                None

            # Delete the temp directory.
            try:
                os.rmdir(temp_dir)
            except:
                print(
                    "failed to delete temp dir: {}, directory contents: '{}'".format(
                        temp_dir, os.listdir(temp_dir)))
                None


Adding tearDown hook:     def cleanupSubprocesses(self):
        # Ensure any subprocesses are cleaned up
        for p in self.subprocesses:
            p.terminate()
            del p
        del self.subprocesses[:]
        # Ensure any forked processes are cleaned up
        for pid in self.forkedProcessPids:
            if os.path.exists("/proc/" + str(pid)):
                os.kill(pid, signal.SIGTERM)


Adding tearDown hook:             def shutdown_debug_monitor():
                try:
                    server.terminate()
                except:
                    logger.warning(
                        "failed to terminate server for debug monitor: {}; ignoring".format(
                            sys.exc_info()[0]))


Adding tearDown hook:         def shutdown_socket():
            if sock:
                try:
                    # send the kill packet so lldb-server shuts down gracefully
                    sock.sendall(GdbRemoteTestCaseBase._GDBREMOTE_KILL_PACKET)
                except:
                    logger.warning(
                        "failed to send kill packet to debug monitor: {}; ignoring".format(
                            sys.exc_info()[0]))

                try:
                    sock.close()
                except:
                    logger.warning(
                        "failed to close socket to debug monitor: {}; ignoring".format(
                            sys.exc_info()[0]))


FAIL: LLDB (/Users/buildslave/jenkins/workspace/lldb-cmake-matrix/clang_701_build/bin/clang-7-x86_64) :: test_qMemoryRegionInfo_reports_heap_address_as_readable_writeable_debugserver (TestLldbGdbServer.LldbGdbServerTestCase)
Executing tearDown hook:         def shutdown_socket():
            if sock:
                try:
                    # send the kill packet so lldb-server shuts down gracefully
                    sock.sendall(GdbRemoteTestCaseBase._GDBREMOTE_KILL_PACKET)
                except:
                    logger.warning(
                        "failed to send kill packet to debug monitor: {}; ignoring".format(
                            sys.exc_info()[0]))

                try:
                    sock.close()
                except:
                    logger.warning(
                        "failed to close socket to debug monitor: {}; ignoring".format(
                            sys.exc_info()[0]))


Executing tearDown hook:             def shutdown_debug_monitor():
                try:
                    server.terminate()
                except:
                    logger.warning(
                        "failed to terminate server for debug monitor: {}; ignoring".format(
                            sys.exc_info()[0]))


Executing tearDown hook:     def cleanupSubprocesses(self):
        # Ensure any subprocesses are cleaned up
        for p in self.subprocesses:
            p.terminate()
            del p
        del self.subprocesses[:]
        # Ensure any forked processes are cleaned up
        for pid in self.forkedProcessPids:
            if os.path.exists("/proc/" + str(pid)):
                os.kill(pid, signal.SIGTERM)


Executing tearDown hook:         def shutdown_named_pipe():
            # Close the pipe.
            try:
                named_pipe.close()
            except:
                print("failed to close named pipe")
                None

            # Delete the pipe.
            try:
                os.remove(named_pipe_path)
            except:
                print("failed to delete named pipe: {}".format(named_pipe_path))
                None

            # Delete the temp directory.
            try:
                os.rmdir(temp_dir)
            except:
                print(
                    "failed to delete temp dir: {}, directory contents: '{}'".format(
                        temp_dir, os.listdir(temp_dir)))
                None


runCmd: settings set symbols.enable-external-lookup false
output: 

runCmd: settings set plugin.process.gdb-remote.packet-timeout 60
output: 

runCmd: settings set symbols.clang-modules-cache-path "/Users/buildslave/jenkins/workspace/lldb-cmake-matrix/lldb-build/tools/lldb/lldb-test-build.noindex/module-cache-lldb"
output: 

runCmd: settings set use-color false
output: 

UNSUPPORTED: LLDB (/Users/buildslave/jenkins/workspace/lldb-cmake-matrix/clang_701_build/bin/clang-7-x86_64) :: test_qMemoryRegionInfo_reports_heap_address_as_readable_writeable_llgs (TestLldbGdbServer.LldbGdbServerTestCase) (llgs tests) 
runCmd: settings set symbols.enable-external-lookup false
output: 

runCmd: settings set plugin.process.gdb-remote.packet-timeout 60
output: 

runCmd: settings set symbols.clang-modules-cache-path "/Users/buildslave/jenkins/workspace/lldb-cmake-matrix/lldb-build/tools/lldb/lldb-test-build.noindex/module-cache-lldb"
output: 

runCmd: settings set use-color false
output: 

Adding tearDown hook:         def shutdown_named_pipe():
            # Close the pipe.
            try:
                named_pipe.close()
            except:
                print("failed to close named pipe")
                None

            # Delete the pipe.
            try:
                os.remove(named_pipe_path)
            except:
                print("failed to delete named pipe: {}".format(named_pipe_path))
                None

            # Delete the temp directory.
            try:
                os.rmdir(temp_dir)
            except:
                print(
                    "failed to delete temp dir: {}, directory contents: '{}'".format(
                        temp_dir, os.listdir(temp_dir)))
                None


FAIL: LLDB (/Users/buildslave/jenkins/workspace/lldb-cmake-matrix/clang_701_build/bin/clang-7-x86_64) :: test_qMemoryRegionInfo_reports_stack_address_as_readable_writeable_debugserver (TestLldbGdbServer.LldbGdbServerTestCase)
Executing tearDown hook:         def shutdown_named_pipe():
            # Close the pipe.
            try:
                named_pipe.close()
            except:
                print("failed to close named pipe")
                None

            # Delete the pipe.
            try:
                os.remove(named_pipe_path)
            except:
                print("failed to delete named pipe: {}".format(named_pipe_path))
                None

            # Delete the temp directory.
            try:
                os.rmdir(temp_dir)
            except:
                print(
                    "failed to delete temp dir: {}, directory contents: '{}'".format(
                        temp_dir, os.listdir(temp_dir)))
                None


runCmd: settings set symbols.enable-external-lookup false
output: 

runCmd: settings set plugin.process.gdb-remote.packet-timeout 60
output: 

runCmd: settings set symbols.clang-modules-cache-path "/Users/buildslave/jenkins/workspace/lldb-cmake-matrix/lldb-build/tools/lldb/lldb-test-build.noindex/module-cache-lldb"
output: 

runCmd: settings set use-color false
output: 

UNSUPPORTED: LLDB (/Users/buildslave/jenkins/workspace/lldb-cmake-matrix/clang_701_build/bin/clang-7-x86_64) :: test_qMemoryRegionInfo_reports_stack_address_as_readable_writeable_llgs (TestLldbGdbServer.LldbGdbServerTestCase) (llgs tests) 
runCmd: settings set symbols.enable-external-lookup false
output: 

runCmd: settings set plugin.process.gdb-remote.packet-timeout 60
output: 

runCmd: settings set symbols.clang-modules-cache-path "/Users/buildslave/jenkins/workspace/lldb-cmake-matrix/lldb-build/tools/lldb/lldb-test-build.noindex/module-cache-lldb"
output: 

runCmd: settings set use-color false
output: 

Adding tearDown hook:         def shutdown_named_pipe():
            # Close the pipe.
            try:
                named_pipe.close()
            except:
                print("failed to close named pipe")
                None

            # Delete the pipe.
            try:
                os.remove(named_pipe_path)
            except:
                print("failed to delete named pipe: {}".format(named_pipe_path))
                None

            # Delete the temp directory.
            try:
                os.rmdir(temp_dir)
            except:
                print(
                    "failed to delete temp dir: {}, directory contents: '{}'".format(
                        temp_dir, os.listdir(temp_dir)))
                None


Adding tearDown hook:     def cleanupSubprocesses(self):
        # Ensure any subprocesses are cleaned up
        for p in self.subprocesses:
            p.terminate()
            del p
        del self.subprocesses[:]
        # Ensure any forked processes are cleaned up
        for pid in self.forkedProcessPids:
            if os.path.exists("/proc/" + str(pid)):
                os.kill(pid, signal.SIGTERM)


Adding tearDown hook:             def shutdown_debug_monitor():
                try:
                    server.terminate()
                except:
                    logger.warning(
                        "failed to terminate server for debug monitor: {}; ignoring".format(
                            sys.exc_info()[0]))


Adding tearDown hook:         def shutdown_socket():
            if sock:
                try:
                    # send the kill packet so lldb-server shuts down gracefully
                    sock.sendall(GdbRemoteTestCaseBase._GDBREMOTE_KILL_PACKET)
                except:
                    logger.warning(
                        "failed to send kill packet to debug monitor: {}; ignoring".format(
                            sys.exc_info()[0]))

                try:
                    sock.close()
                except:
                    logger.warning(
                        "failed to close socket to debug monitor: {}; ignoring".format(
                            sys.exc_info()[0]))


FAIL: LLDB (/Users/buildslave/jenkins/workspace/lldb-cmake-matrix/clang_701_build/bin/clang-7-x86_64) :: test_qRegisterInfo_contains_at_least_one_register_set_debugserver (TestLldbGdbServer.LldbGdbServerTestCase)
Executing tearDown hook:         def shutdown_socket():
            if sock:
                try:
                    # send the kill packet so lldb-server shuts down gracefully
                    sock.sendall(GdbRemoteTestCaseBase._GDBREMOTE_KILL_PACKET)
                except:
                    logger.warning(
                        "failed to send kill packet to debug monitor: {}; ignoring".format(
                            sys.exc_info()[0]))

                try:
                    sock.close()
                except:
                    logger.warning(
                        "failed to close socket to debug monitor: {}; ignoring".format(
                            sys.exc_info()[0]))


Executing tearDown hook:             def shutdown_debug_monitor():
                try:
                    server.terminate()
                except:
                    logger.warning(
                        "failed to terminate server for debug monitor: {}; ignoring".format(
                            sys.exc_info()[0]))


Executing tearDown hook:     def cleanupSubprocesses(self):
        # Ensure any subprocesses are cleaned up
        for p in self.subprocesses:
            p.terminate()
            del p
        del self.subprocesses[:]
        # Ensure any forked processes are cleaned up
        for pid in self.forkedProcessPids:
            if os.path.exists("/proc/" + str(pid)):
                os.kill(pid, signal.SIGTERM)


Executing tearDown hook:         def shutdown_named_pipe():
            # Close the pipe.
            try:
                named_pipe.close()
            except:
                print("failed to close named pipe")
                None

            # Delete the pipe.
            try:
                os.remove(named_pipe_path)
            except:
                print("failed to delete named pipe: {}".format(named_pipe_path))
                None

            # Delete the temp directory.
            try:
                os.rmdir(temp_dir)
            except:
                print(
                    "failed to delete temp dir: {}, directory contents: '{}'".format(
                        temp_dir, os.listdir(temp_dir)))
                None


runCmd: settings set symbols.enable-external-lookup false
output: 

runCmd: settings set plugin.process.gdb-remote.packet-timeout 60
output: 

runCmd: settings set symbols.clang-modules-cache-path "/Users/buildslave/jenkins/workspace/lldb-cmake-matrix/lldb-build/tools/lldb/lldb-test-build.noindex/module-cache-lldb"
output: 

runCmd: settings set use-color false
output: 

UNSUPPORTED: LLDB (/Users/buildslave/jenkins/workspace/lldb-cmake-matrix/clang_701_build/bin/clang-7-x86_64) :: test_qRegisterInfo_contains_at_least_one_register_set_llgs (TestLldbGdbServer.LldbGdbServerTestCase) (llgs tests) 
runCmd: settings set symbols.enable-external-lookup false
output: 

runCmd: settings set plugin.process.gdb-remote.packet-timeout 60
output: 

runCmd: settings set symbols.clang-modules-cache-path "/Users/buildslave/jenkins/workspace/lldb-cmake-matrix/lldb-build/tools/lldb/lldb-test-build.noindex/module-cache-lldb"
output: 

runCmd: settings set use-color false
output: 

UNSUPPORTED: LLDB (/Users/buildslave/jenkins/workspace/lldb-cmake-matrix/clang_701_build/bin/clang-7-x86_64) :: test_qRegisterInfo_contains_avx_registers_llgs (TestLldbGdbServer.LldbGdbServerTestCase) (llgs tests) 
runCmd: settings set symbols.enable-external-lookup false
output: 

runCmd: settings set plugin.process.gdb-remote.packet-timeout 60
output: 

runCmd: settings set symbols.clang-modules-cache-path "/Users/buildslave/jenkins/workspace/lldb-cmake-matrix/lldb-build/tools/lldb/lldb-test-build.noindex/module-cache-lldb"
output: 

runCmd: settings set use-color false
output: 

Adding tearDown hook:         def shutdown_named_pipe():
            # Close the pipe.
            try:
                named_pipe.close()
            except:
                print("failed to close named pipe")
                None

            # Delete the pipe.
            try:
                os.remove(named_pipe_path)
            except:
                print("failed to delete named pipe: {}".format(named_pipe_path))
                None

            # Delete the temp directory.
            try:
                os.rmdir(temp_dir)
            except:
                print(
                    "failed to delete temp dir: {}, directory contents: '{}'".format(
                        temp_dir, os.listdir(temp_dir)))
                None


Adding tearDown hook:     def cleanupSubprocesses(self):
        # Ensure any subprocesses are cleaned up
        for p in self.subprocesses:
            p.terminate()
            del p
        del self.subprocesses[:]
        # Ensure any forked processes are cleaned up
        for pid in self.forkedProcessPids:
            if os.path.exists("/proc/" + str(pid)):
                os.kill(pid, signal.SIGTERM)


Adding tearDown hook:             def shutdown_debug_monitor():
                try:
                    server.terminate()
                except:
                    logger.warning(
                        "failed to terminate server for debug monitor: {}; ignoring".format(
                            sys.exc_info()[0]))


Adding tearDown hook:         def shutdown_socket():
            if sock:
                try:
                    # send the kill packet so lldb-server shuts down gracefully
                    sock.sendall(GdbRemoteTestCaseBase._GDBREMOTE_KILL_PACKET)
                except:
                    logger.warning(
                        "failed to send kill packet to debug monitor: {}; ignoring".format(
                            sys.exc_info()[0]))

                try:
                    sock.close()
                except:
                    logger.warning(
                        "failed to close socket to debug monitor: {}; ignoring".format(
                            sys.exc_info()[0]))


FAIL: LLDB (/Users/buildslave/jenkins/workspace/lldb-cmake-matrix/clang_701_build/bin/clang-7-x86_64) :: test_qRegisterInfo_contains_required_generics_debugserver (TestLldbGdbServer.LldbGdbServerTestCase)
Executing tearDown hook:         def shutdown_socket():
            if sock:
                try:
                    # send the kill packet so lldb-server shuts down gracefully
                    sock.sendall(GdbRemoteTestCaseBase._GDBREMOTE_KILL_PACKET)
                except:
                    logger.warning(
                        "failed to send kill packet to debug monitor: {}; ignoring".format(
                            sys.exc_info()[0]))

                try:
                    sock.close()
                except:
                    logger.warning(
                        "failed to close socket to debug monitor: {}; ignoring".format(
                            sys.exc_info()[0]))


Executing tearDown hook:             def shutdown_debug_monitor():
                try:
                    server.terminate()
                except:
                    logger.warning(
                        "failed to terminate server for debug monitor: {}; ignoring".format(
                            sys.exc_info()[0]))


Executing tearDown hook:     def cleanupSubprocesses(self):
        # Ensure any subprocesses are cleaned up
        for p in self.subprocesses:
            p.terminate()
            del p
        del self.subprocesses[:]
        # Ensure any forked processes are cleaned up
        for pid in self.forkedProcessPids:
            if os.path.exists("/proc/" + str(pid)):
                os.kill(pid, signal.SIGTERM)


Executing tearDown hook:         def shutdown_named_pipe():
            # Close the pipe.
            try:
                named_pipe.close()
            except:
                print("failed to close named pipe")
                None

            # Delete the pipe.
            try:
                os.remove(named_pipe_path)
            except:
                print("failed to delete named pipe: {}".format(named_pipe_path))
                None

            # Delete the temp directory.
            try:
                os.rmdir(temp_dir)
            except:
                print(
                    "failed to delete temp dir: {}, directory contents: '{}'".format(
                        temp_dir, os.listdir(temp_dir)))
                None


runCmd: settings set symbols.enable-external-lookup false
output: 

runCmd: settings set plugin.process.gdb-remote.packet-timeout 60
output: 

runCmd: settings set symbols.clang-modules-cache-path "/Users/buildslave/jenkins/workspace/lldb-cmake-matrix/lldb-build/tools/lldb/lldb-test-build.noindex/module-cache-lldb"
output: 

runCmd: settings set use-color false
output: 

UNSUPPORTED: LLDB (/Users/buildslave/jenkins/workspace/lldb-cmake-matrix/clang_701_build/bin/clang-7-x86_64) :: test_qRegisterInfo_contains_required_generics_llgs (TestLldbGdbServer.LldbGdbServerTestCase) (llgs tests) 
runCmd: settings set symbols.enable-external-lookup false
output: 

runCmd: settings set plugin.process.gdb-remote.packet-timeout 60
output: 

runCmd: settings set symbols.clang-modules-cache-path "/Users/buildslave/jenkins/workspace/lldb-cmake-matrix/lldb-build/tools/lldb/lldb-test-build.noindex/module-cache-lldb"
output: 

runCmd: settings set use-color false
output: 

Adding tearDown hook:         def shutdown_named_pipe():
            # Close the pipe.
            try:
                named_pipe.close()
            except:
                print("failed to close named pipe")
                None

            # Delete the pipe.
            try:
                os.remove(named_pipe_path)
            except:
                print("failed to delete named pipe: {}".format(named_pipe_path))
                None

            # Delete the temp directory.
            try:
                os.rmdir(temp_dir)
            except:
                print(
                    "failed to delete temp dir: {}, directory contents: '{}'".format(
                        temp_dir, os.listdir(temp_dir)))
                None


FAIL: LLDB (/Users/buildslave/jenkins/workspace/lldb-cmake-matrix/clang_701_build/bin/clang-7-x86_64) :: test_qRegisterInfo_returns_all_valid_results_debugserver (TestLldbGdbServer.LldbGdbServerTestCase)
Executing tearDown hook:         def shutdown_named_pipe():
            # Close the pipe.
            try:
                named_pipe.close()
            except:
                print("failed to close named pipe")
                None

            # Delete the pipe.
            try:
                os.remove(named_pipe_path)
            except:
                print("failed to delete named pipe: {}".format(named_pipe_path))
                None

            # Delete the temp directory.
            try:
                os.rmdir(temp_dir)
            except:
                print(
                    "failed to delete temp dir: {}, directory contents: '{}'".format(
                        temp_dir, os.listdir(temp_dir)))
                None


runCmd: settings set symbols.enable-external-lookup false
output: 

runCmd: settings set plugin.process.gdb-remote.packet-timeout 60
output: 

runCmd: settings set symbols.clang-modules-cache-path "/Users/buildslave/jenkins/workspace/lldb-cmake-matrix/lldb-build/tools/lldb/lldb-test-build.noindex/module-cache-lldb"
output: 

runCmd: settings set use-color false
output: 

UNSUPPORTED: LLDB (/Users/buildslave/jenkins/workspace/lldb-cmake-matrix/clang_701_build/bin/clang-7-x86_64) :: test_qRegisterInfo_returns_all_valid_results_llgs (TestLldbGdbServer.LldbGdbServerTestCase) (llgs tests) 
runCmd: settings set symbols.enable-external-lookup false
output: 

runCmd: settings set plugin.process.gdb-remote.packet-timeout 60
output: 

runCmd: settings set symbols.clang-modules-cache-path "/Users/buildslave/jenkins/workspace/lldb-cmake-matrix/lldb-build/tools/lldb/lldb-test-build.noindex/module-cache-lldb"
output: 

runCmd: settings set use-color false
output: 

Adding tearDown hook:         def shutdown_named_pipe():
            # Close the pipe.
            try:
                named_pipe.close()
            except:
                print("failed to close named pipe")
                None

            # Delete the pipe.
            try:
                os.remove(named_pipe_path)
            except:
                print("failed to delete named pipe: {}".format(named_pipe_path))
                None

            # Delete the temp directory.
            try:
                os.rmdir(temp_dir)
            except:
                print(
                    "failed to delete temp dir: {}, directory contents: '{}'".format(
                        temp_dir, os.listdir(temp_dir)))
                None


FAIL: LLDB (/Users/buildslave/jenkins/workspace/lldb-cmake-matrix/clang_701_build/bin/clang-7-x86_64) :: test_qRegisterInfo_returns_one_valid_result_debugserver (TestLldbGdbServer.LldbGdbServerTestCase)
Executing tearDown hook:         def shutdown_named_pipe():
            # Close the pipe.
            try:
                named_pipe.close()
            except:
                print("failed to close named pipe")
                None

            # Delete the pipe.
            try:
                os.remove(named_pipe_path)
            except:
                print("failed to delete named pipe: {}".format(named_pipe_path))
                None

            # Delete the temp directory.
            try:
                os.rmdir(temp_dir)
            except:
                print(
                    "failed to delete temp dir: {}, directory contents: '{}'".format(
                        temp_dir, os.listdir(temp_dir)))
                None


runCmd: settings set symbols.enable-external-lookup false
output: 

runCmd: settings set plugin.process.gdb-remote.packet-timeout 60
output: 

runCmd: settings set symbols.clang-modules-cache-path "/Users/buildslave/jenkins/workspace/lldb-cmake-matrix/lldb-build/tools/lldb/lldb-test-build.noindex/module-cache-lldb"
output: 

runCmd: settings set use-color false
output: 

UNSUPPORTED: LLDB (/Users/buildslave/jenkins/workspace/lldb-cmake-matrix/clang_701_build/bin/clang-7-x86_64) :: test_qRegisterInfo_returns_one_valid_result_llgs (TestLldbGdbServer.LldbGdbServerTestCase) (llgs tests) 
runCmd: settings set symbols.enable-external-lookup false
output: 

runCmd: settings set plugin.process.gdb-remote.packet-timeout 60
output: 

runCmd: settings set symbols.clang-modules-cache-path "/Users/buildslave/jenkins/workspace/lldb-cmake-matrix/lldb-build/tools/lldb/lldb-test-build.noindex/module-cache-lldb"
output: 

runCmd: settings set use-color false
output: 

Adding tearDown hook:         def shutdown_named_pipe():
            # Close the pipe.
            try:
                named_pipe.close()
            except:
                print("failed to close named pipe")
                None

            # Delete the pipe.
            try:
                os.remove(named_pipe_path)
            except:
                print("failed to delete named pipe: {}".format(named_pipe_path))
                None

            # Delete the temp directory.
            try:
                os.rmdir(temp_dir)
            except:
                print(
                    "failed to delete temp dir: {}, directory contents: '{}'".format(
                        temp_dir, os.listdir(temp_dir)))
                None


FAIL: LLDB (/Users/buildslave/jenkins/workspace/lldb-cmake-matrix/clang_701_build/bin/clang-7-x86_64) :: test_qSupported_returns_known_stub_features_debugserver (TestLldbGdbServer.LldbGdbServerTestCase)
Executing tearDown hook:         def shutdown_named_pipe():
            # Close the pipe.
            try:
                named_pipe.close()
            except:
                print("failed to close named pipe")
                None

            # Delete the pipe.
            try:
                os.remove(named_pipe_path)
            except:
                print("failed to delete named pipe: {}".format(named_pipe_path))
                None

            # Delete the temp directory.
            try:
                os.rmdir(temp_dir)
            except:
                print(
                    "failed to delete temp dir: {}, directory contents: '{}'".format(
                        temp_dir, os.listdir(temp_dir)))
                None


runCmd: settings set symbols.enable-external-lookup false
output: 

runCmd: settings set plugin.process.gdb-remote.packet-timeout 60
output: 

runCmd: settings set symbols.clang-modules-cache-path "/Users/buildslave/jenkins/workspace/lldb-cmake-matrix/lldb-build/tools/lldb/lldb-test-build.noindex/module-cache-lldb"
output: 

runCmd: settings set use-color false
output: 

UNSUPPORTED: LLDB (/Users/buildslave/jenkins/workspace/lldb-cmake-matrix/clang_701_build/bin/clang-7-x86_64) :: test_qSupported_returns_known_stub_features_llgs (TestLldbGdbServer.LldbGdbServerTestCase) (llgs tests) 
runCmd: settings set symbols.enable-external-lookup false
output: 

runCmd: settings set plugin.process.gdb-remote.packet-timeout 60
output: 

runCmd: settings set symbols.clang-modules-cache-path "/Users/buildslave/jenkins/workspace/lldb-cmake-matrix/lldb-build/tools/lldb/lldb-test-build.noindex/module-cache-lldb"
output: 

runCmd: settings set use-color false
output: 

Adding tearDown hook:         def shutdown_named_pipe():
            # Close the pipe.
            try:
                named_pipe.close()
            except:
                print("failed to close named pipe")
                None

            # Delete the pipe.
            try:
                os.remove(named_pipe_path)
            except:
                print("failed to delete named pipe: {}".format(named_pipe_path))
                None

            # Delete the temp directory.
            try:
                os.rmdir(temp_dir)
            except:
                print(
                    "failed to delete temp dir: {}, directory contents: '{}'".format(
                        temp_dir, os.listdir(temp_dir)))
                None


Adding tearDown hook:         def shutdown_process_for_attach():
            try:
                inferior.terminate()
            except:
                logger.warning(
                    "failed to terminate inferior process for attach: {}; ignoring".format(
                        sys.exc_info()[0]))


Adding tearDown hook:     def cleanupSubprocesses(self):
        # Ensure any subprocesses are cleaned up
        for p in self.subprocesses:
            p.terminate()
            del p
        del self.subprocesses[:]
        # Ensure any forked processes are cleaned up
        for pid in self.forkedProcessPids:
            if os.path.exists("/proc/" + str(pid)):
                os.kill(pid, signal.SIGTERM)


FAIL: LLDB (/Users/buildslave/jenkins/workspace/lldb-cmake-matrix/clang_701_build/bin/clang-7-x86_64) :: test_qThreadInfo_contains_thread_attach_debugserver (TestLldbGdbServer.LldbGdbServerTestCase)
Executing tearDown hook:     def cleanupSubprocesses(self):
        # Ensure any subprocesses are cleaned up
        for p in self.subprocesses:
            p.terminate()
            del p
        del self.subprocesses[:]
        # Ensure any forked processes are cleaned up
        for pid in self.forkedProcessPids:
            if os.path.exists("/proc/" + str(pid)):
                os.kill(pid, signal.SIGTERM)


Executing tearDown hook:         def shutdown_process_for_attach():
            try:
                inferior.terminate()
            except:
                logger.warning(
                    "failed to terminate inferior process for attach: {}; ignoring".format(
                        sys.exc_info()[0]))


Executing tearDown hook:         def shutdown_named_pipe():
            # Close the pipe.
            try:
                named_pipe.close()
            except:
                print("failed to close named pipe")
                None

            # Delete the pipe.
            try:
                os.remove(named_pipe_path)
            except:
                print("failed to delete named pipe: {}".format(named_pipe_path))
                None

            # Delete the temp directory.
            try:
                os.rmdir(temp_dir)
            except:
                print(
                    "failed to delete temp dir: {}, directory contents: '{}'".format(
                        temp_dir, os.listdir(temp_dir)))
                None


runCmd: settings set symbols.enable-external-lookup false
output: 

runCmd: settings set plugin.process.gdb-remote.packet-timeout 60
output: 

runCmd: settings set symbols.clang-modules-cache-path "/Users/buildslave/jenkins/workspace/lldb-cmake-matrix/lldb-build/tools/lldb/lldb-test-build.noindex/module-cache-lldb"
output: 

runCmd: settings set use-color false
output: 

UNSUPPORTED: LLDB (/Users/buildslave/jenkins/workspace/lldb-cmake-matrix/clang_701_build/bin/clang-7-x86_64) :: test_qThreadInfo_contains_thread_attach_llgs (TestLldbGdbServer.LldbGdbServerTestCase) (llgs tests) 
runCmd: settings set symbols.enable-external-lookup false
output: 

runCmd: settings set plugin.process.gdb-remote.packet-timeout 60
output: 

runCmd: settings set symbols.clang-modules-cache-path "/Users/buildslave/jenkins/workspace/lldb-cmake-matrix/lldb-build/tools/lldb/lldb-test-build.noindex/module-cache-lldb"
output: 

runCmd: settings set use-color false
output: 

Adding tearDown hook:         def shutdown_named_pipe():
            # Close the pipe.
            try:
                named_pipe.close()
            except:
                print("failed to close named pipe")
                None

            # Delete the pipe.
            try:
                os.remove(named_pipe_path)
            except:
                print("failed to delete named pipe: {}".format(named_pipe_path))
                None

            # Delete the temp directory.
            try:
                os.rmdir(temp_dir)
            except:
                print(
                    "failed to delete temp dir: {}, directory contents: '{}'".format(
                        temp_dir, os.listdir(temp_dir)))
                None


Adding tearDown hook:     def cleanupSubprocesses(self):
        # Ensure any subprocesses are cleaned up
        for p in self.subprocesses:
            p.terminate()
            del p
        del self.subprocesses[:]
        # Ensure any forked processes are cleaned up
        for pid in self.forkedProcessPids:
            if os.path.exists("/proc/" + str(pid)):
                os.kill(pid, signal.SIGTERM)


Adding tearDown hook:             def shutdown_debug_monitor():
                try:
                    server.terminate()
                except:
                    logger.warning(
                        "failed to terminate server for debug monitor: {}; ignoring".format(
                            sys.exc_info()[0]))


Adding tearDown hook:         def shutdown_socket():
            if sock:
                try:
                    # send the kill packet so lldb-server shuts down gracefully
                    sock.sendall(GdbRemoteTestCaseBase._GDBREMOTE_KILL_PACKET)
                except:
                    logger.warning(
                        "failed to send kill packet to debug monitor: {}; ignoring".format(
                            sys.exc_info()[0]))

                try:
                    sock.close()
                except:
                    logger.warning(
                        "failed to close socket to debug monitor: {}; ignoring".format(
                            sys.exc_info()[0]))


FAIL: LLDB (/Users/buildslave/jenkins/workspace/lldb-cmake-matrix/clang_701_build/bin/clang-7-x86_64) :: test_qThreadInfo_contains_thread_launch_debugserver (TestLldbGdbServer.LldbGdbServerTestCase)
Executing tearDown hook:         def shutdown_socket():
            if sock:
                try:
                    # send the kill packet so lldb-server shuts down gracefully
                    sock.sendall(GdbRemoteTestCaseBase._GDBREMOTE_KILL_PACKET)
                except:
                    logger.warning(
                        "failed to send kill packet to debug monitor: {}; ignoring".format(
                            sys.exc_info()[0]))

                try:
                    sock.close()
                except:
                    logger.warning(
                        "failed to close socket to debug monitor: {}; ignoring".format(
                            sys.exc_info()[0]))


Executing tearDown hook:             def shutdown_debug_monitor():
                try:
                    server.terminate()
                except:
                    logger.warning(
                        "failed to terminate server for debug monitor: {}; ignoring".format(
                            sys.exc_info()[0]))


Executing tearDown hook:     def cleanupSubprocesses(self):
        # Ensure any subprocesses are cleaned up
        for p in self.subprocesses:
            p.terminate()
            del p
        del self.subprocesses[:]
        # Ensure any forked processes are cleaned up
        for pid in self.forkedProcessPids:
            if os.path.exists("/proc/" + str(pid)):
                os.kill(pid, signal.SIGTERM)


Executing tearDown hook:         def shutdown_named_pipe():
            # Close the pipe.
            try:
                named_pipe.close()
            except:
                print("failed to close named pipe")
                None

            # Delete the pipe.
            try:
                os.remove(named_pipe_path)
            except:
                print("failed to delete named pipe: {}".format(named_pipe_path))
                None

            # Delete the temp directory.
            try:
                os.rmdir(temp_dir)
            except:
                print(
                    "failed to delete temp dir: {}, directory contents: '{}'".format(
                        temp_dir, os.listdir(temp_dir)))
                None


runCmd: settings set symbols.enable-external-lookup false
output: 

runCmd: settings set plugin.process.gdb-remote.packet-timeout 60
output: 

runCmd: settings set symbols.clang-modules-cache-path "/Users/buildslave/jenkins/workspace/lldb-cmake-matrix/lldb-build/tools/lldb/lldb-test-build.noindex/module-cache-lldb"
output: 

runCmd: settings set use-color false
output: 

UNSUPPORTED: LLDB (/Users/buildslave/jenkins/workspace/lldb-cmake-matrix/clang_701_build/bin/clang-7-x86_64) :: test_qThreadInfo_contains_thread_launch_llgs (TestLldbGdbServer.LldbGdbServerTestCase) (llgs tests) 
runCmd: settings set symbols.enable-external-lookup false
output: 

runCmd: settings set plugin.process.gdb-remote.packet-timeout 60
output: 

runCmd: settings set symbols.clang-modules-cache-path "/Users/buildslave/jenkins/workspace/lldb-cmake-matrix/lldb-build/tools/lldb/lldb-test-build.noindex/module-cache-lldb"
output: 

runCmd: settings set use-color false
output: 

Adding tearDown hook:         def shutdown_named_pipe():
            # Close the pipe.
            try:
                named_pipe.close()
            except:
                print("failed to close named pipe")
                None

            # Delete the pipe.
            try:
                os.remove(named_pipe_path)
            except:
                print("failed to delete named pipe: {}".format(named_pipe_path))
                None

            # Delete the temp directory.
            try:
                os.rmdir(temp_dir)
            except:
                print(
                    "failed to delete temp dir: {}, directory contents: '{}'".format(
                        temp_dir, os.listdir(temp_dir)))
                None


Adding tearDown hook:         def shutdown_process_for_attach():
            try:
                inferior.terminate()
            except:
                logger.warning(
                    "failed to terminate inferior process for attach: {}; ignoring".format(
                        sys.exc_info()[0]))


Adding tearDown hook:     def cleanupSubprocesses(self):
        # Ensure any subprocesses are cleaned up
        for p in self.subprocesses:
            p.terminate()
            del p
        del self.subprocesses[:]
        # Ensure any forked processes are cleaned up
        for pid in self.forkedProcessPids:
            if os.path.exists("/proc/" + str(pid)):
                os.kill(pid, signal.SIGTERM)


FAIL: LLDB (/Users/buildslave/jenkins/workspace/lldb-cmake-matrix/clang_701_build/bin/clang-7-x86_64) :: test_qThreadInfo_matches_qC_attach_debugserver (TestLldbGdbServer.LldbGdbServerTestCase)
Executing tearDown hook:     def cleanupSubprocesses(self):
        # Ensure any subprocesses are cleaned up
        for p in self.subprocesses:
            p.terminate()
            del p
        del self.subprocesses[:]
        # Ensure any forked processes are cleaned up
        for pid in self.forkedProcessPids:
            if os.path.exists("/proc/" + str(pid)):
                os.kill(pid, signal.SIGTERM)


Executing tearDown hook:         def shutdown_process_for_attach():
            try:
                inferior.terminate()
            except:
                logger.warning(
                    "failed to terminate inferior process for attach: {}; ignoring".format(
                        sys.exc_info()[0]))


Executing tearDown hook:         def shutdown_named_pipe():
            # Close the pipe.
            try:
                named_pipe.close()
            except:
                print("failed to close named pipe")
                None

            # Delete the pipe.
            try:
                os.remove(named_pipe_path)
            except:
                print("failed to delete named pipe: {}".format(named_pipe_path))
                None

            # Delete the temp directory.
            try:
                os.rmdir(temp_dir)
            except:
                print(
                    "failed to delete temp dir: {}, directory contents: '{}'".format(
                        temp_dir, os.listdir(temp_dir)))
                None


runCmd: settings set symbols.enable-external-lookup false
output: 

runCmd: settings set plugin.process.gdb-remote.packet-timeout 60
output: 

runCmd: settings set symbols.clang-modules-cache-path "/Users/buildslave/jenkins/workspace/lldb-cmake-matrix/lldb-build/tools/lldb/lldb-test-build.noindex/module-cache-lldb"
output: 

runCmd: settings set use-color false
output: 

UNSUPPORTED: LLDB (/Users/buildslave/jenkins/workspace/lldb-cmake-matrix/clang_701_build/bin/clang-7-x86_64) :: test_qThreadInfo_matches_qC_attach_llgs (TestLldbGdbServer.LldbGdbServerTestCase) (llgs tests) 
runCmd: settings set symbols.enable-external-lookup false
output: 

runCmd: settings set plugin.process.gdb-remote.packet-timeout 60
output: 

runCmd: settings set symbols.clang-modules-cache-path "/Users/buildslave/jenkins/workspace/lldb-cmake-matrix/lldb-build/tools/lldb/lldb-test-build.noindex/module-cache-lldb"
output: 

runCmd: settings set use-color false
output: 

Adding tearDown hook:         def shutdown_named_pipe():
            # Close the pipe.
            try:
                named_pipe.close()
            except:
                print("failed to close named pipe")
                None

            # Delete the pipe.
            try:
                os.remove(named_pipe_path)
            except:
                print("failed to delete named pipe: {}".format(named_pipe_path))
                None

            # Delete the temp directory.
            try:
                os.rmdir(temp_dir)
            except:
                print(
                    "failed to delete temp dir: {}, directory contents: '{}'".format(
                        temp_dir, os.listdir(temp_dir)))
                None


Adding tearDown hook:     def cleanupSubprocesses(self):
        # Ensure any subprocesses are cleaned up
        for p in self.subprocesses:
            p.terminate()
            del p
        del self.subprocesses[:]
        # Ensure any forked processes are cleaned up
        for pid in self.forkedProcessPids:
            if os.path.exists("/proc/" + str(pid)):
                os.kill(pid, signal.SIGTERM)


Adding tearDown hook:             def shutdown_debug_monitor():
                try:
                    server.terminate()
                except:
                    logger.warning(
                        "failed to terminate server for debug monitor: {}; ignoring".format(
                            sys.exc_info()[0]))


Adding tearDown hook:         def shutdown_socket():
            if sock:
                try:
                    # send the kill packet so lldb-server shuts down gracefully
                    sock.sendall(GdbRemoteTestCaseBase._GDBREMOTE_KILL_PACKET)
                except:
                    logger.warning(
                        "failed to send kill packet to debug monitor: {}; ignoring".format(
                            sys.exc_info()[0]))

                try:
                    sock.close()
                except:
                    logger.warning(
                        "failed to close socket to debug monitor: {}; ignoring".format(
                            sys.exc_info()[0]))


FAIL: LLDB (/Users/buildslave/jenkins/workspace/lldb-cmake-matrix/clang_701_build/bin/clang-7-x86_64) :: test_qThreadInfo_matches_qC_launch_debugserver (TestLldbGdbServer.LldbGdbServerTestCase)
Executing tearDown hook:         def shutdown_socket():
            if sock:
                try:
                    # send the kill packet so lldb-server shuts down gracefully
                    sock.sendall(GdbRemoteTestCaseBase._GDBREMOTE_KILL_PACKET)
                except:
                    logger.warning(
                        "failed to send kill packet to debug monitor: {}; ignoring".format(
                            sys.exc_info()[0]))

                try:
                    sock.close()
                except:
                    logger.warning(
                        "failed to close socket to debug monitor: {}; ignoring".format(
                            sys.exc_info()[0]))


Executing tearDown hook:             def shutdown_debug_monitor():
                try:
                    server.terminate()
                except:
                    logger.warning(
                        "failed to terminate server for debug monitor: {}; ignoring".format(
                            sys.exc_info()[0]))


Executing tearDown hook:     def cleanupSubprocesses(self):
        # Ensure any subprocesses are cleaned up
        for p in self.subprocesses:
            p.terminate()
            del p
        del self.subprocesses[:]
        # Ensure any forked processes are cleaned up
        for pid in self.forkedProcessPids:
            if os.path.exists("/proc/" + str(pid)):
                os.kill(pid, signal.SIGTERM)


Executing tearDown hook:         def shutdown_named_pipe():
            # Close the pipe.
            try:
                named_pipe.close()
            except:
                print("failed to close named pipe")
                None

            # Delete the pipe.
            try:
                os.remove(named_pipe_path)
            except:
                print("failed to delete named pipe: {}".format(named_pipe_path))
                None

            # Delete the temp directory.
            try:
                os.rmdir(temp_dir)
            except:
                print(
                    "failed to delete temp dir: {}, directory contents: '{}'".format(
                        temp_dir, os.listdir(temp_dir)))
                None


runCmd: settings set symbols.enable-external-lookup false
output: 

runCmd: settings set plugin.process.gdb-remote.packet-timeout 60
output: 

runCmd: settings set symbols.clang-modules-cache-path "/Users/buildslave/jenkins/workspace/lldb-cmake-matrix/lldb-build/tools/lldb/lldb-test-build.noindex/module-cache-lldb"
output: 

runCmd: settings set use-color false
output: 

UNSUPPORTED: LLDB (/Users/buildslave/jenkins/workspace/lldb-cmake-matrix/clang_701_build/bin/clang-7-x86_64) :: test_qThreadInfo_matches_qC_launch_llgs (TestLldbGdbServer.LldbGdbServerTestCase) (llgs tests) 
runCmd: settings set symbols.enable-external-lookup false
output: 

runCmd: settings set plugin.process.gdb-remote.packet-timeout 60
output: 

runCmd: settings set symbols.clang-modules-cache-path "/Users/buildslave/jenkins/workspace/lldb-cmake-matrix/lldb-build/tools/lldb/lldb-test-build.noindex/module-cache-lldb"
output: 

runCmd: settings set use-color false
output: 

Adding tearDown hook:         def shutdown_named_pipe():
            # Close the pipe.
            try:
                named_pipe.close()
            except:
                print("failed to close named pipe")
                None

            # Delete the pipe.
            try:
                os.remove(named_pipe_path)
            except:
                print("failed to delete named pipe: {}".format(named_pipe_path))
                None

            # Delete the temp directory.
            try:
                os.rmdir(temp_dir)
            except:
                print(
                    "failed to delete temp dir: {}, directory contents: '{}'".format(
                        temp_dir, os.listdir(temp_dir)))
                None


Adding tearDown hook:     def cleanupSubprocesses(self):
        # Ensure any subprocesses are cleaned up
        for p in self.subprocesses:
            p.terminate()
            del p
        del self.subprocesses[:]
        # Ensure any forked processes are cleaned up
        for pid in self.forkedProcessPids:
            if os.path.exists("/proc/" + str(pid)):
                os.kill(pid, signal.SIGTERM)


Adding tearDown hook:             def shutdown_debug_monitor():
                try:
                    server.terminate()
                except:
                    logger.warning(
                        "failed to terminate server for debug monitor: {}; ignoring".format(
                            sys.exc_info()[0]))


Adding tearDown hook:         def shutdown_socket():
            if sock:
                try:
                    # send the kill packet so lldb-server shuts down gracefully
                    sock.sendall(GdbRemoteTestCaseBase._GDBREMOTE_KILL_PACKET)
                except:
                    logger.warning(
                        "failed to send kill packet to debug monitor: {}; ignoring".format(
                            sys.exc_info()[0]))

                try:
                    sock.close()
                except:
                    logger.warning(
                        "failed to close socket to debug monitor: {}; ignoring".format(
                            sys.exc_info()[0]))


FAIL: LLDB (/Users/buildslave/jenkins/workspace/lldb-cmake-matrix/clang_701_build/bin/clang-7-x86_64) :: test_software_breakpoint_set_and_remove_work_debugserver (TestLldbGdbServer.LldbGdbServerTestCase)
Executing tearDown hook:         def shutdown_socket():
            if sock:
                try:
                    # send the kill packet so lldb-server shuts down gracefully
                    sock.sendall(GdbRemoteTestCaseBase._GDBREMOTE_KILL_PACKET)
                except:
                    logger.warning(
                        "failed to send kill packet to debug monitor: {}; ignoring".format(
                            sys.exc_info()[0]))

                try:
                    sock.close()
                except:
                    logger.warning(
                        "failed to close socket to debug monitor: {}; ignoring".format(
                            sys.exc_info()[0]))


Executing tearDown hook:             def shutdown_debug_monitor():
                try:
                    server.terminate()
                except:
                    logger.warning(
                        "failed to terminate server for debug monitor: {}; ignoring".format(
                            sys.exc_info()[0]))


Executing tearDown hook:     def cleanupSubprocesses(self):
        # Ensure any subprocesses are cleaned up
        for p in self.subprocesses:
            p.terminate()
            del p
        del self.subprocesses[:]
        # Ensure any forked processes are cleaned up
        for pid in self.forkedProcessPids:
            if os.path.exists("/proc/" + str(pid)):
                os.kill(pid, signal.SIGTERM)


Executing tearDown hook:         def shutdown_named_pipe():
            # Close the pipe.
            try:
                named_pipe.close()
            except:
                print("failed to close named pipe")
                None

            # Delete the pipe.
            try:
                os.remove(named_pipe_path)
            except:
                print("failed to delete named pipe: {}".format(named_pipe_path))
                None

            # Delete the temp directory.
            try:
                os.rmdir(temp_dir)
            except:
                print(
                    "failed to delete temp dir: {}, directory contents: '{}'".format(
                        temp_dir, os.listdir(temp_dir)))
                None


runCmd: settings set symbols.enable-external-lookup false
output: 

runCmd: settings set plugin.process.gdb-remote.packet-timeout 60
output: 

runCmd: settings set symbols.clang-modules-cache-path "/Users/buildslave/jenkins/workspace/lldb-cmake-matrix/lldb-build/tools/lldb/lldb-test-build.noindex/module-cache-lldb"
output: 

runCmd: settings set use-color false
output: 

UNSUPPORTED: LLDB (/Users/buildslave/jenkins/workspace/lldb-cmake-matrix/clang_701_build/bin/clang-7-x86_64) :: test_software_breakpoint_set_and_remove_work_llgs (TestLldbGdbServer.LldbGdbServerTestCase) (llgs tests) 
runCmd: settings set symbols.enable-external-lookup false
output: 

runCmd: settings set plugin.process.gdb-remote.packet-timeout 60
output: 

runCmd: settings set symbols.clang-modules-cache-path "/Users/buildslave/jenkins/workspace/lldb-cmake-matrix/lldb-build/tools/lldb/lldb-test-build.noindex/module-cache-lldb"
output: 

runCmd: settings set use-color false
output: 

Adding tearDown hook:         def shutdown_named_pipe():
            # Close the pipe.
            try:
                named_pipe.close()
            except:
                print("failed to close named pipe")
                None

            # Delete the pipe.
            try:
                os.remove(named_pipe_path)
            except:
                print("failed to delete named pipe: {}".format(named_pipe_path))
                None

            # Delete the temp directory.
            try:
                os.rmdir(temp_dir)
            except:
                print(
                    "failed to delete temp dir: {}, directory contents: '{}'".format(
                        temp_dir, os.listdir(temp_dir)))
                None


Adding tearDown hook:     def cleanupSubprocesses(self):
        # Ensure any subprocesses are cleaned up
        for p in self.subprocesses:
            p.terminate()
            del p
        del self.subprocesses[:]
        # Ensure any forked processes are cleaned up
        for pid in self.forkedProcessPids:
            if os.path.exists("/proc/" + str(pid)):
                os.kill(pid, signal.SIGTERM)


Adding tearDown hook:             def shutdown_debug_monitor():
                try:
                    server.terminate()
                except:
                    logger.warning(
                        "failed to terminate server for debug monitor: {}; ignoring".format(
                            sys.exc_info()[0]))


Adding tearDown hook:         def shutdown_socket():
            if sock:
                try:
                    # send the kill packet so lldb-server shuts down gracefully
                    sock.sendall(GdbRemoteTestCaseBase._GDBREMOTE_KILL_PACKET)
                except:
                    logger.warning(
                        "failed to send kill packet to debug monitor: {}; ignoring".format(
                            sys.exc_info()[0]))

                try:
                    sock.close()
                except:
                    logger.warning(
                        "failed to close socket to debug monitor: {}; ignoring".format(
                            sys.exc_info()[0]))


Executing tearDown hook:         def shutdown_socket():
            if sock:
                try:
                    # send the kill packet so lldb-server shuts down gracefully
                    sock.sendall(GdbRemoteTestCaseBase._GDBREMOTE_KILL_PACKET)
                except:
                    logger.warning(
                        "failed to send kill packet to debug monitor: {}; ignoring".format(
                            sys.exc_info()[0]))

                try:
                    sock.close()
                except:
                    logger.warning(
                        "failed to close socket to debug monitor: {}; ignoring".format(
                            sys.exc_info()[0]))


Executing tearDown hook:             def shutdown_debug_monitor():
                try:
                    server.terminate()
                except:
                    logger.warning(
                        "failed to terminate server for debug monitor: {}; ignoring".format(
                            sys.exc_info()[0]))


Executing tearDown hook:     def cleanupSubprocesses(self):
        # Ensure any subprocesses are cleaned up
        for p in self.subprocesses:
            p.terminate()
            del p
        del self.subprocesses[:]
        # Ensure any forked processes are cleaned up
        for pid in self.forkedProcessPids:
            if os.path.exists("/proc/" + str(pid)):
                os.kill(pid, signal.SIGTERM)


Executing tearDown hook:         def shutdown_named_pipe():
            # Close the pipe.
            try:
                named_pipe.close()
            except:
                print("failed to close named pipe")
                None

            # Delete the pipe.
            try:
                os.remove(named_pipe_path)
            except:
                print("failed to delete named pipe: {}".format(named_pipe_path))
                None

            # Delete the temp directory.
            try:
                os.rmdir(temp_dir)
            except:
                print(
                    "failed to delete temp dir: {}, directory contents: '{}'".format(
                        temp_dir, os.listdir(temp_dir)))
                None


PASS: LLDB (/Users/buildslave/jenkins/workspace/lldb-cmake-matrix/clang_701_build/bin/clang-7-x86_64) :: test_start_no_ack_mode_debugserver (TestLldbGdbServer.LldbGdbServerTestCase)
runCmd: settings set symbols.enable-external-lookup false
output: 

runCmd: settings set plugin.process.gdb-remote.packet-timeout 60
output: 

runCmd: settings set symbols.clang-modules-cache-path "/Users/buildslave/jenkins/workspace/lldb-cmake-matrix/lldb-build/tools/lldb/lldb-test-build.noindex/module-cache-lldb"
output: 

runCmd: settings set use-color false
output: 

UNSUPPORTED: LLDB (/Users/buildslave/jenkins/workspace/lldb-cmake-matrix/clang_701_build/bin/clang-7-x86_64) :: test_start_no_ack_mode_llgs (TestLldbGdbServer.LldbGdbServerTestCase) (llgs tests) 
runCmd: settings set symbols.enable-external-lookup false
output: 

runCmd: settings set plugin.process.gdb-remote.packet-timeout 60
output: 

runCmd: settings set symbols.clang-modules-cache-path "/Users/buildslave/jenkins/workspace/lldb-cmake-matrix/lldb-build/tools/lldb/lldb-test-build.noindex/module-cache-lldb"
output: 

runCmd: settings set use-color false
output: 

Adding tearDown hook:         def shutdown_named_pipe():
            # Close the pipe.
            try:
                named_pipe.close()
            except:
                print("failed to close named pipe")
                None

            # Delete the pipe.
            try:
                os.remove(named_pipe_path)
            except:
                print("failed to delete named pipe: {}".format(named_pipe_path))
                None

            # Delete the temp directory.
            try:
                os.rmdir(temp_dir)
            except:
                print(
                    "failed to delete temp dir: {}, directory contents: '{}'".format(
                        temp_dir, os.listdir(temp_dir)))
                None


Adding tearDown hook:     def cleanupSubprocesses(self):
        # Ensure any subprocesses are cleaned up
        for p in self.subprocesses:
            p.terminate()
            del p
        del self.subprocesses[:]
        # Ensure any forked processes are cleaned up
        for pid in self.forkedProcessPids:
            if os.path.exists("/proc/" + str(pid)):
                os.kill(pid, signal.SIGTERM)


Adding tearDown hook:             def shutdown_debug_monitor():
                try:
                    server.terminate()
                except:
                    logger.warning(
                        "failed to terminate server for debug monitor: {}; ignoring".format(
                            sys.exc_info()[0]))


Adding tearDown hook:         def shutdown_socket():
            if sock:
                try:
                    # send the kill packet so lldb-server shuts down gracefully
                    sock.sendall(GdbRemoteTestCaseBase._GDBREMOTE_KILL_PACKET)
                except:
                    logger.warning(
                        "failed to send kill packet to debug monitor: {}; ignoring".format(
                            sys.exc_info()[0]))

                try:
                    sock.close()
                except:
                    logger.warning(
                        "failed to close socket to debug monitor: {}; ignoring".format(
                            sys.exc_info()[0]))


Executing tearDown hook:         def shutdown_socket():
            if sock:
                try:
                    # send the kill packet so lldb-server shuts down gracefully
                    sock.sendall(GdbRemoteTestCaseBase._GDBREMOTE_KILL_PACKET)
                except:
                    logger.warning(
                        "failed to send kill packet to debug monitor: {}; ignoring".format(
                            sys.exc_info()[0]))

                try:
                    sock.close()
                except:
                    logger.warning(
                        "failed to close socket to debug monitor: {}; ignoring".format(
                            sys.exc_info()[0]))


Executing tearDown hook:             def shutdown_debug_monitor():
                try:
                    server.terminate()
                except:
                    logger.warning(
                        "failed to terminate server for debug monitor: {}; ignoring".format(
                            sys.exc_info()[0]))


Executing tearDown hook:     def cleanupSubprocesses(self):
        # Ensure any subprocesses are cleaned up
        for p in self.subprocesses:
            p.terminate()
            del p
        del self.subprocesses[:]
        # Ensure any forked processes are cleaned up
        for pid in self.forkedProcessPids:
            if os.path.exists("/proc/" + str(pid)):
                os.kill(pid, signal.SIGTERM)


Executing tearDown hook:         def shutdown_named_pipe():
            # Close the pipe.
            try:
                named_pipe.close()
            except:
                print("failed to close named pipe")
                None

            # Delete the pipe.
            try:
                os.remove(named_pipe_path)
            except:
                print("failed to delete named pipe: {}".format(named_pipe_path))
                None

            # Delete the temp directory.
            try:
                os.rmdir(temp_dir)
            except:
                print(
                    "failed to delete temp dir: {}, directory contents: '{}'".format(
                        temp_dir, os.listdir(temp_dir)))
                None


PASS: LLDB (/Users/buildslave/jenkins/workspace/lldb-cmake-matrix/clang_701_build/bin/clang-7-x86_64) :: test_thread_suffix_supported_debugserver (TestLldbGdbServer.LldbGdbServerTestCase)
runCmd: settings set symbols.enable-external-lookup false
output: 

runCmd: settings set plugin.process.gdb-remote.packet-timeout 60
output: 

runCmd: settings set symbols.clang-modules-cache-path "/Users/buildslave/jenkins/workspace/lldb-cmake-matrix/lldb-build/tools/lldb/lldb-test-build.noindex/module-cache-lldb"
output: 

runCmd: settings set use-color false
output: 

UNSUPPORTED: LLDB (/Users/buildslave/jenkins/workspace/lldb-cmake-matrix/clang_701_build/bin/clang-7-x86_64) :: test_thread_suffix_supported_llgs (TestLldbGdbServer.LldbGdbServerTestCase) (llgs tests) 
runCmd: settings set symbols.enable-external-lookup false
output: 

runCmd: settings set plugin.process.gdb-remote.packet-timeout 60
output: 

runCmd: settings set symbols.clang-modules-cache-path "/Users/buildslave/jenkins/workspace/lldb-cmake-matrix/lldb-build/tools/lldb/lldb-test-build.noindex/module-cache-lldb"
output: 

runCmd: settings set use-color false
output: 

Adding tearDown hook:         def shutdown_named_pipe():
            # Close the pipe.
            try:
                named_pipe.close()
            except:
                print("failed to close named pipe")
                None

            # Delete the pipe.
            try:
                os.remove(named_pipe_path)
            except:
                print("failed to delete named pipe: {}".format(named_pipe_path))
                None

            # Delete the temp directory.
            try:
                os.rmdir(temp_dir)
            except:
                print(
                    "failed to delete temp dir: {}, directory contents: '{}'".format(
                        temp_dir, os.listdir(temp_dir)))
                None


Adding tearDown hook:     def cleanupSubprocesses(self):
        # Ensure any subprocesses are cleaned up
        for p in self.subprocesses:
            p.terminate()
            del p
        del self.subprocesses[:]
        # Ensure any forked processes are cleaned up
        for pid in self.forkedProcessPids:
            if os.path.exists("/proc/" + str(pid)):
                os.kill(pid, signal.SIGTERM)


Adding tearDown hook:             def shutdown_debug_monitor():
                try:
                    server.terminate()
                except:
                    logger.warning(
                        "failed to terminate server for debug monitor: {}; ignoring".format(
                            sys.exc_info()[0]))


Adding tearDown hook:         def shutdown_socket():
            if sock:
                try:
                    # send the kill packet so lldb-server shuts down gracefully
                    sock.sendall(GdbRemoteTestCaseBase._GDBREMOTE_KILL_PACKET)
                except:
                    logger.warning(
                        "failed to send kill packet to debug monitor: {}; ignoring".format(
                            sys.exc_info()[0]))

                try:
                    sock.close()
                except:
                    logger.warning(
                        "failed to close socket to debug monitor: {}; ignoring".format(
                            sys.exc_info()[0]))


FAIL: LLDB (/Users/buildslave/jenkins/workspace/lldb-cmake-matrix/clang_701_build/bin/clang-7-x86_64) :: test_written_M_content_reads_back_correctly_debugserver (TestLldbGdbServer.LldbGdbServerTestCase)
Executing tearDown hook:         def shutdown_socket():
            if sock:
                try:
                    # send the kill packet so lldb-server shuts down gracefully
                    sock.sendall(GdbRemoteTestCaseBase._GDBREMOTE_KILL_PACKET)
                except:
                    logger.warning(
                        "failed to send kill packet to debug monitor: {}; ignoring".format(
                            sys.exc_info()[0]))

                try:
                    sock.close()
                except:
                    logger.warning(
                        "failed to close socket to debug monitor: {}; ignoring".format(
                            sys.exc_info()[0]))


Executing tearDown hook:             def shutdown_debug_monitor():
                try:
                    server.terminate()
                except:
                    logger.warning(
                        "failed to terminate server for debug monitor: {}; ignoring".format(
                            sys.exc_info()[0]))


Executing tearDown hook:     def cleanupSubprocesses(self):
        # Ensure any subprocesses are cleaned up
        for p in self.subprocesses:
            p.terminate()
            del p
        del self.subprocesses[:]
        # Ensure any forked processes are cleaned up
        for pid in self.forkedProcessPids:
            if os.path.exists("/proc/" + str(pid)):
                os.kill(pid, signal.SIGTERM)


Executing tearDown hook:         def shutdown_named_pipe():
            # Close the pipe.
            try:
                named_pipe.close()
            except:
                print("failed to close named pipe")
                None

            # Delete the pipe.
            try:
                os.remove(named_pipe_path)
            except:
                print("failed to delete named pipe: {}".format(named_pipe_path))
                None

            # Delete the temp directory.
            try:
                os.rmdir(temp_dir)
            except:
                print(
                    "failed to delete temp dir: {}, directory contents: '{}'".format(
                        temp_dir, os.listdir(temp_dir)))
                None


runCmd: settings set symbols.enable-external-lookup false
output: 

runCmd: settings set plugin.process.gdb-remote.packet-timeout 60
output: 

runCmd: settings set symbols.clang-modules-cache-path "/Users/buildslave/jenkins/workspace/lldb-cmake-matrix/lldb-build/tools/lldb/lldb-test-build.noindex/module-cache-lldb"
output: 

runCmd: settings set use-color false
output: 

UNSUPPORTED: LLDB (/Users/buildslave/jenkins/workspace/lldb-cmake-matrix/clang_701_build/bin/clang-7-x86_64) :: test_written_M_content_reads_back_correctly_llgs (TestLldbGdbServer.LldbGdbServerTestCase) (llgs tests) 
Restore dir to: /Users/buildslave/jenkins/workspace/lldb-cmake-matrix/lldb-build/tools/lldb/lit
======================================================================
ERROR: test_attach_commandline_continue_app_exits_debugserver (TestLldbGdbServer.LldbGdbServerTestCase)
----------------------------------------------------------------------
Error when building test subject.

Build Command:
make VPATH=/Users/buildslave/jenkins/workspace/lldb-cmake-matrix/llvm-project/lldb/packages/Python/lldbsuite/test/tools/lldb-server -C /Users/buildslave/jenkins/workspace/lldb-cmake-matrix/lldb-build/tools/lldb/lldb-test-build.noindex/tools/lldb-server/TestLldbGdbServer.test_attach_commandline_continue_app_exits_debugserver -I /Users/buildslave/jenkins/workspace/lldb-cmake-matrix/llvm-project/lldb/packages/Python/lldbsuite/test/tools/lldb-server -I /Users/buildslave/jenkins/workspace/lldb-cmake-matrix/llvm-project/lldb/packages/Python/lldbsuite/test/make -f /Users/buildslave/jenkins/workspace/lldb-cmake-matrix/llvm-project/lldb/packages/Python/lldbsuite/test/tools/lldb-server/Makefile all ARCH=x86_64 CC="/Users/buildslave/jenkins/workspace/lldb-cmake-matrix/clang_701_build/bin/clang-7" 

Build Command Output:
make: *** [main.o] Killed: 9

Test Directory:
/Users/buildslave/jenkins/workspace/lldb-cmake-matrix/llvm-project/lldb/packages/Python/lldbsuite/test/tools/lldb-server
======================================================================
ERROR: test_c_packet_works_debugserver (TestLldbGdbServer.LldbGdbServerTestCase)
----------------------------------------------------------------------
Error when building test subject.

Build Command:
make VPATH=/Users/buildslave/jenkins/workspace/lldb-cmake-matrix/llvm-project/lldb/packages/Python/lldbsuite/test/tools/lldb-server -C /Users/buildslave/jenkins/workspace/lldb-cmake-matrix/lldb-build/tools/lldb/lldb-test-build.noindex/tools/lldb-server/TestLldbGdbServer.test_c_packet_works_debugserver -I /Users/buildslave/jenkins/workspace/lldb-cmake-matrix/llvm-project/lldb/packages/Python/lldbsuite/test/tools/lldb-server -I /Users/buildslave/jenkins/workspace/lldb-cmake-matrix/llvm-project/lldb/packages/Python/lldbsuite/test/make -f /Users/buildslave/jenkins/workspace/lldb-cmake-matrix/llvm-project/lldb/packages/Python/lldbsuite/test/tools/lldb-server/Makefile all ARCH=x86_64 CC="/Users/buildslave/jenkins/workspace/lldb-cmake-matrix/clang_701_build/bin/clang-7" 

Build Command Output:
clang-7: error: unable to execute command: Killed: 9
clang-7: error: clang frontend command failed due to signal (use -v to see invocation)
clang version 7.0.1 
Target: x86_64-apple-darwin18.0.0
Thread model: posix
InstalledDir: /Users/buildslave/jenkins/workspace/lldb-cmake-matrix/clang_701_build/bin
clang-7: note: diagnostic msg: PLEASE submit a bug report to https://bugs.llvm.org/ and include the crash backtrace, preprocessed source, and associated run script.
clang-7: note: diagnostic msg: 
********************

PLEASE ATTACH THE FOLLOWING FILES TO THE BUG REPORT:
Preprocessed source(s) and associated run script(s) are located at:
clang-7: note: diagnostic msg: /var/folders/09/r4vw4v8n5kb67jl66zvlbljw0000gn/T/lit_tmp_bT7Zaw/main-67f779.d
clang-7: note: diagnostic msg: /var/folders/09/r4vw4v8n5kb67jl66zvlbljw0000gn/T/lit_tmp_bT7Zaw/main-67f779.sh
clang-7: note: diagnostic msg: Crash backtrace is located in
clang-7: note: diagnostic msg: /Users/buildslave/Library/Logs/DiagnosticReports/clang-7_<YYYY-MM-DD-HHMMSS>_<hostname>.crash
clang-7: note: diagnostic msg: (choose the .crash file that corresponds to your crash)
clang-7: note: diagnostic msg: 

********************
make: *** [a.out] Killed: 9

Test Directory:
/Users/buildslave/jenkins/workspace/lldb-cmake-matrix/llvm-project/lldb/packages/Python/lldbsuite/test/tools/lldb-server
======================================================================
ERROR: test_first_launch_stop_reply_thread_matches_first_qC_debugserver (TestLldbGdbServer.LldbGdbServerTestCase)
----------------------------------------------------------------------
Error when building test subject.

Build Command:
make VPATH=/Users/buildslave/jenkins/workspace/lldb-cmake-matrix/llvm-project/lldb/packages/Python/lldbsuite/test/tools/lldb-server -C /Users/buildslave/jenkins/workspace/lldb-cmake-matrix/lldb-build/tools/lldb/lldb-test-build.noindex/tools/lldb-server/TestLldbGdbServer.test_first_launch_stop_reply_thread_matches_first_qC_debugserver -I /Users/buildslave/jenkins/workspace/lldb-cmake-matrix/llvm-project/lldb/packages/Python/lldbsuite/test/tools/lldb-server -I /Users/buildslave/jenkins/workspace/lldb-cmake-matrix/llvm-project/lldb/packages/Python/lldbsuite/test/make -f /Users/buildslave/jenkins/workspace/lldb-cmake-matrix/llvm-project/lldb/packages/Python/lldbsuite/test/tools/lldb-server/Makefile all ARCH=x86_64 CC="/Users/buildslave/jenkins/workspace/lldb-cmake-matrix/clang_701_build/bin/clang-7" 

Build Command Output:
make: *** [main.o] Killed: 9

Test Directory:
/Users/buildslave/jenkins/workspace/lldb-cmake-matrix/llvm-project/lldb/packages/Python/lldbsuite/test/tools/lldb-server
======================================================================
ERROR: test_inferior_print_exit_debugserver (TestLldbGdbServer.LldbGdbServerTestCase)
----------------------------------------------------------------------
Error when building test subject.

Build Command:
make VPATH=/Users/buildslave/jenkins/workspace/lldb-cmake-matrix/llvm-project/lldb/packages/Python/lldbsuite/test/tools/lldb-server -C /Users/buildslave/jenkins/workspace/lldb-cmake-matrix/lldb-build/tools/lldb/lldb-test-build.noindex/tools/lldb-server/TestLldbGdbServer.test_inferior_print_exit_debugserver -I /Users/buildslave/jenkins/workspace/lldb-cmake-matrix/llvm-project/lldb/packages/Python/lldbsuite/test/tools/lldb-server -I /Users/buildslave/jenkins/workspace/lldb-cmake-matrix/llvm-project/lldb/packages/Python/lldbsuite/test/make -f /Users/buildslave/jenkins/workspace/lldb-cmake-matrix/llvm-project/lldb/packages/Python/lldbsuite/test/tools/lldb-server/Makefile all ARCH=x86_64 CC="/Users/buildslave/jenkins/workspace/lldb-cmake-matrix/clang_701_build/bin/clang-7" 

Build Command Output:
clang-7: error: unable to execute command: Killed: 9
clang-7: error: clang frontend command failed due to signal (use -v to see invocation)
clang version 7.0.1 
Target: x86_64-apple-darwin18.0.0
Thread model: posix
InstalledDir: /Users/buildslave/jenkins/workspace/lldb-cmake-matrix/clang_701_build/bin
clang-7: note: diagnostic msg: PLEASE submit a bug report to https://bugs.llvm.org/ and include the crash backtrace, preprocessed source, and associated run script.
clang-7: note: diagnostic msg: 
********************

PLEASE ATTACH THE FOLLOWING FILES TO THE BUG REPORT:
Preprocessed source(s) and associated run script(s) are located at:
clang-7: note: diagnostic msg: /var/folders/09/r4vw4v8n5kb67jl66zvlbljw0000gn/T/lit_tmp_bT7Zaw/main-9d72a4.cpp
clang-7: note: diagnostic msg: /var/folders/09/r4vw4v8n5kb67jl66zvlbljw0000gn/T/lit_tmp_bT7Zaw/main-9d72a4.sh
clang-7: note: diagnostic msg: Crash backtrace is located in
clang-7: note: diagnostic msg: /Users/buildslave/Library/Logs/DiagnosticReports/clang-7_<YYYY-MM-DD-HHMMSS>_<hostname>.crash
clang-7: note: diagnostic msg: (choose the .crash file that corresponds to your crash)
clang-7: note: diagnostic msg: 

********************
make: *** [main.o] Error 254

Test Directory:
/Users/buildslave/jenkins/workspace/lldb-cmake-matrix/llvm-project/lldb/packages/Python/lldbsuite/test/tools/lldb-server
======================================================================
ERROR: test_m_packet_reads_memory_debugserver (TestLldbGdbServer.LldbGdbServerTestCase)
----------------------------------------------------------------------
Error when building test subject.

Build Command:
make VPATH=/Users/buildslave/jenkins/workspace/lldb-cmake-matrix/llvm-project/lldb/packages/Python/lldbsuite/test/tools/lldb-server -C /Users/buildslave/jenkins/workspace/lldb-cmake-matrix/lldb-build/tools/lldb/lldb-test-build.noindex/tools/lldb-server/TestLldbGdbServer.test_m_packet_reads_memory_debugserver -I /Users/buildslave/jenkins/workspace/lldb-cmake-matrix/llvm-project/lldb/packages/Python/lldbsuite/test/tools/lldb-server -I /Users/buildslave/jenkins/workspace/lldb-cmake-matrix/llvm-project/lldb/packages/Python/lldbsuite/test/make -f /Users/buildslave/jenkins/workspace/lldb-cmake-matrix/llvm-project/lldb/packages/Python/lldbsuite/test/tools/lldb-server/Makefile all ARCH=x86_64 CC="/Users/buildslave/jenkins/workspace/lldb-cmake-matrix/clang_701_build/bin/clang-7" 

Build Command Output:
/bin/sh: line 1: 94806 Killed: 9               /Users/buildslave/jenkins/workspace/lldb-cmake-matrix/clang_701_build/bin/clang-7 -M -std=c++11 -g -O0 -fno-builtin -isysroot "/Applications/Xcode.app/Contents/Developer/Platforms/MacOSX.platform/Developer/SDKs/MacOSX10.14.sdk" -arch x86_64 -I/Users/buildslave/jenkins/workspace/lldb-cmake-matrix/llvm-project/lldb/packages/Python/lldbsuite/test/make/../../../../../include -I/Users/buildslave/jenkins/workspace/lldb-cmake-matrix/llvm-project/lldb/packages/Python/lldbsuite/test/tools/lldb-server -I/Users/buildslave/jenkins/workspace/lldb-cmake-matrix/llvm-project/lldb/packages/Python/lldbsuite/test/make -include /Users/buildslave/jenkins/workspace/lldb-cmake-matrix/llvm-project/lldb/packages/Python/lldbsuite/test/make/test_common.h -fno-limit-debug-info -D__STDC_LIMIT_MACROS -D__STDC_FORMAT_MACROS --driver-mode=g++ /Users/buildslave/jenkins/workspace/lldb-cmake-matrix/llvm-project/lldb/packages/Python/lldbsuite/test/tools/lldb-server/main.cpp > main.d.tmp
make: *** [main.o] Killed: 9

Test Directory:
/Users/buildslave/jenkins/workspace/lldb-cmake-matrix/llvm-project/lldb/packages/Python/lldbsuite/test/tools/lldb-server
======================================================================
ERROR: test_p_returns_correct_data_size_for_each_qRegisterInfo_attach_debugserver (TestLldbGdbServer.LldbGdbServerTestCase)
----------------------------------------------------------------------
Error when building test subject.

Build Command:
make VPATH=/Users/buildslave/jenkins/workspace/lldb-cmake-matrix/llvm-project/lldb/packages/Python/lldbsuite/test/tools/lldb-server -C /Users/buildslave/jenkins/workspace/lldb-cmake-matrix/lldb-build/tools/lldb/lldb-test-build.noindex/tools/lldb-server/TestLldbGdbServer.test_p_returns_correct_data_size_for_each_qRegisterInfo_attach_debugserver -I /Users/buildslave/jenkins/workspace/lldb-cmake-matrix/llvm-project/lldb/packages/Python/lldbsuite/test/tools/lldb-server -I /Users/buildslave/jenkins/workspace/lldb-cmake-matrix/llvm-project/lldb/packages/Python/lldbsuite/test/make -f /Users/buildslave/jenkins/workspace/lldb-cmake-matrix/llvm-project/lldb/packages/Python/lldbsuite/test/tools/lldb-server/Makefile all ARCH=x86_64 CC="/Users/buildslave/jenkins/workspace/lldb-cmake-matrix/clang_701_build/bin/clang-7" 

Build Command Output:
make: *** [a.out] Killed: 9

Test Directory:
/Users/buildslave/jenkins/workspace/lldb-cmake-matrix/llvm-project/lldb/packages/Python/lldbsuite/test/tools/lldb-server
======================================================================
ERROR: test_p_returns_correct_data_size_for_each_qRegisterInfo_launch_debugserver (TestLldbGdbServer.LldbGdbServerTestCase)
----------------------------------------------------------------------
Error when building test subject.

Build Command:
make VPATH=/Users/buildslave/jenkins/workspace/lldb-cmake-matrix/llvm-project/lldb/packages/Python/lldbsuite/test/tools/lldb-server -C /Users/buildslave/jenkins/workspace/lldb-cmake-matrix/lldb-build/tools/lldb/lldb-test-build.noindex/tools/lldb-server/TestLldbGdbServer.test_p_returns_correct_data_size_for_each_qRegisterInfo_launch_debugserver -I /Users/buildslave/jenkins/workspace/lldb-cmake-matrix/llvm-project/lldb/packages/Python/lldbsuite/test/tools/lldb-server -I /Users/buildslave/jenkins/workspace/lldb-cmake-matrix/llvm-project/lldb/packages/Python/lldbsuite/test/make -f /Users/buildslave/jenkins/workspace/lldb-cmake-matrix/llvm-project/lldb/packages/Python/lldbsuite/test/tools/lldb-server/Makefile all ARCH=x86_64 CC="/Users/buildslave/jenkins/workspace/lldb-cmake-matrix/clang_701_build/bin/clang-7" 

Build Command Output:
make: *** [main.o] Killed: 9

Test Directory:
/Users/buildslave/jenkins/workspace/lldb-cmake-matrix/llvm-project/lldb/packages/Python/lldbsuite/test/tools/lldb-server
======================================================================
ERROR: test_qMemoryRegionInfo_is_supported_debugserver (TestLldbGdbServer.LldbGdbServerTestCase)
----------------------------------------------------------------------
Error when building test subject.

Build Command:
make VPATH=/Users/buildslave/jenkins/workspace/lldb-cmake-matrix/llvm-project/lldb/packages/Python/lldbsuite/test/tools/lldb-server -C /Users/buildslave/jenkins/workspace/lldb-cmake-matrix/lldb-build/tools/lldb/lldb-test-build.noindex/tools/lldb-server/TestLldbGdbServer.test_qMemoryRegionInfo_is_supported_debugserver -I /Users/buildslave/jenkins/workspace/lldb-cmake-matrix/llvm-project/lldb/packages/Python/lldbsuite/test/tools/lldb-server -I /Users/buildslave/jenkins/workspace/lldb-cmake-matrix/llvm-project/lldb/packages/Python/lldbsuite/test/make -f /Users/buildslave/jenkins/workspace/lldb-cmake-matrix/llvm-project/lldb/packages/Python/lldbsuite/test/tools/lldb-server/Makefile all ARCH=x86_64 CC="/Users/buildslave/jenkins/workspace/lldb-cmake-matrix/clang_701_build/bin/clang-7" 

Build Command Output:
clang-7: error: unable to execute command: Killed: 9
clang-7: error: clang frontend command failed due to signal (use -v to see invocation)
clang version 7.0.1 
Target: x86_64-apple-darwin18.0.0
Thread model: posix
InstalledDir: /Users/buildslave/jenkins/workspace/lldb-cmake-matrix/clang_701_build/bin
clang-7: note: diagnostic msg: PLEASE submit a bug report to https://bugs.llvm.org/ and include the crash backtrace, preprocessed source, and associated run script.
clang-7: note: diagnostic msg: 
********************

PLEASE ATTACH THE FOLLOWING FILES TO THE BUG REPORT:
Preprocessed source(s) and associated run script(s) are located at:
clang-7: note: diagnostic msg: /var/folders/09/r4vw4v8n5kb67jl66zvlbljw0000gn/T/lit_tmp_bT7Zaw/main-7df7e6.cpp
clang-7: note: diagnostic msg: /var/folders/09/r4vw4v8n5kb67jl66zvlbljw0000gn/T/lit_tmp_bT7Zaw/main-7df7e6.sh
clang-7: note: diagnostic msg: Crash backtrace is located in
clang-7: note: diagnostic msg: /Users/buildslave/Library/Logs/DiagnosticReports/clang-7_<YYYY-MM-DD-HHMMSS>_<hostname>.crash
clang-7: note: diagnostic msg: (choose the .crash file that corresponds to your crash)
clang-7: note: diagnostic msg: 

********************
make: *** [main.o] Error 254

Test Directory:
/Users/buildslave/jenkins/workspace/lldb-cmake-matrix/llvm-project/lldb/packages/Python/lldbsuite/test/tools/lldb-server
======================================================================
ERROR: test_qMemoryRegionInfo_reports_stack_address_as_readable_writeable_debugserver (TestLldbGdbServer.LldbGdbServerTestCase)
----------------------------------------------------------------------
Error when building test subject.

Build Command:
make VPATH=/Users/buildslave/jenkins/workspace/lldb-cmake-matrix/llvm-project/lldb/packages/Python/lldbsuite/test/tools/lldb-server -C /Users/buildslave/jenkins/workspace/lldb-cmake-matrix/lldb-build/tools/lldb/lldb-test-build.noindex/tools/lldb-server/TestLldbGdbServer.test_qMemoryRegionInfo_reports_stack_address_as_readable_writeable_debugserver -I /Users/buildslave/jenkins/workspace/lldb-cmake-matrix/llvm-project/lldb/packages/Python/lldbsuite/test/tools/lldb-server -I /Users/buildslave/jenkins/workspace/lldb-cmake-matrix/llvm-project/lldb/packages/Python/lldbsuite/test/make -f /Users/buildslave/jenkins/workspace/lldb-cmake-matrix/llvm-project/lldb/packages/Python/lldbsuite/test/tools/lldb-server/Makefile all ARCH=x86_64 CC="/Users/buildslave/jenkins/workspace/lldb-cmake-matrix/clang_701_build/bin/clang-7" 

Build Command Output:
clang-7: error: unable to execute command: Killed: 9
clang-7: error: clang frontend command failed due to signal (use -v to see invocation)
clang version 7.0.1 
Target: x86_64-apple-darwin18.0.0
Thread model: posix
InstalledDir: /Users/buildslave/jenkins/workspace/lldb-cmake-matrix/clang_701_build/bin
clang-7: note: diagnostic msg: PLEASE submit a bug report to https://bugs.llvm.org/ and include the crash backtrace, preprocessed source, and associated run script.
clang-7: note: diagnostic msg: 
********************

PLEASE ATTACH THE FOLLOWING FILES TO THE BUG REPORT:
Preprocessed source(s) and associated run script(s) are located at:
clang-7: note: diagnostic msg: /var/folders/09/r4vw4v8n5kb67jl66zvlbljw0000gn/T/lit_tmp_bT7Zaw/main-04a229.cpp
clang-7: note: diagnostic msg: /var/folders/09/r4vw4v8n5kb67jl66zvlbljw0000gn/T/lit_tmp_bT7Zaw/main-04a229.sh
clang-7: note: diagnostic msg: Crash backtrace is located in
clang-7: note: diagnostic msg: /Users/buildslave/Library/Logs/DiagnosticReports/clang-7_<YYYY-MM-DD-HHMMSS>_<hostname>.crash
clang-7: note: diagnostic msg: (choose the .crash file that corresponds to your crash)
clang-7: note: diagnostic msg: 

********************
make: *** [main.o] Error 254

Test Directory:
/Users/buildslave/jenkins/workspace/lldb-cmake-matrix/llvm-project/lldb/packages/Python/lldbsuite/test/tools/lldb-server
======================================================================
ERROR: test_qRegisterInfo_returns_all_valid_results_debugserver (TestLldbGdbServer.LldbGdbServerTestCase)
----------------------------------------------------------------------
Error when building test subject.

Build Command:
make VPATH=/Users/buildslave/jenkins/workspace/lldb-cmake-matrix/llvm-project/lldb/packages/Python/lldbsuite/test/tools/lldb-server -C /Users/buildslave/jenkins/workspace/lldb-cmake-matrix/lldb-build/tools/lldb/lldb-test-build.noindex/tools/lldb-server/TestLldbGdbServer.test_qRegisterInfo_returns_all_valid_results_debugserver -I /Users/buildslave/jenkins/workspace/lldb-cmake-matrix/llvm-project/lldb/packages/Python/lldbsuite/test/tools/lldb-server -I /Users/buildslave/jenkins/workspace/lldb-cmake-matrix/llvm-project/lldb/packages/Python/lldbsuite/test/make -f /Users/buildslave/jenkins/workspace/lldb-cmake-matrix/llvm-project/lldb/packages/Python/lldbsuite/test/tools/lldb-server/Makefile all ARCH=x86_64 CC="/Users/buildslave/jenkins/workspace/lldb-cmake-matrix/clang_701_build/bin/clang-7" 

Build Command Output:
make: *** [main.o] Killed: 9

Test Directory:
/Users/buildslave/jenkins/workspace/lldb-cmake-matrix/llvm-project/lldb/packages/Python/lldbsuite/test/tools/lldb-server
======================================================================
ERROR: test_qRegisterInfo_returns_one_valid_result_debugserver (TestLldbGdbServer.LldbGdbServerTestCase)
----------------------------------------------------------------------
Error when building test subject.

Build Command:
make VPATH=/Users/buildslave/jenkins/workspace/lldb-cmake-matrix/llvm-project/lldb/packages/Python/lldbsuite/test/tools/lldb-server -C /Users/buildslave/jenkins/workspace/lldb-cmake-matrix/lldb-build/tools/lldb/lldb-test-build.noindex/tools/lldb-server/TestLldbGdbServer.test_qRegisterInfo_returns_one_valid_result_debugserver -I /Users/buildslave/jenkins/workspace/lldb-cmake-matrix/llvm-project/lldb/packages/Python/lldbsuite/test/tools/lldb-server -I /Users/buildslave/jenkins/workspace/lldb-cmake-matrix/llvm-project/lldb/packages/Python/lldbsuite/test/make -f /Users/buildslave/jenkins/workspace/lldb-cmake-matrix/llvm-project/lldb/packages/Python/lldbsuite/test/tools/lldb-server/Makefile all ARCH=x86_64 CC="/Users/buildslave/jenkins/workspace/lldb-cmake-matrix/clang_701_build/bin/clang-7" 

Build Command Output:
clang-7: error: unable to execute command: Killed: 9
clang-7: error: clang frontend command failed due to signal (use -v to see invocation)
clang version 7.0.1 
Target: x86_64-apple-darwin18.0.0
Thread model: posix
InstalledDir: /Users/buildslave/jenkins/workspace/lldb-cmake-matrix/clang_701_build/bin
clang-7: note: diagnostic msg: PLEASE submit a bug report to https://bugs.llvm.org/ and include the crash backtrace, preprocessed source, and associated run script.
clang-7: note: diagnostic msg: 
********************

PLEASE ATTACH THE FOLLOWING FILES TO THE BUG REPORT:
Preprocessed source(s) and associated run script(s) are located at:
clang-7: note: diagnostic msg: /var/folders/09/r4vw4v8n5kb67jl66zvlbljw0000gn/T/lit_tmp_bT7Zaw/main-40dc7e.cpp
clang-7: note: diagnostic msg: /var/folders/09/r4vw4v8n5kb67jl66zvlbljw0000gn/T/lit_tmp_bT7Zaw/main-40dc7e.sh
clang-7: note: diagnostic msg: Crash backtrace is located in
clang-7: note: diagnostic msg: /Users/buildslave/Library/Logs/DiagnosticReports/clang-7_<YYYY-MM-DD-HHMMSS>_<hostname>.crash
clang-7: note: diagnostic msg: (choose the .crash file that corresponds to your crash)
clang-7: note: diagnostic msg: 

********************
make: *** [main.o] Error 254

Test Directory:
/Users/buildslave/jenkins/workspace/lldb-cmake-matrix/llvm-project/lldb/packages/Python/lldbsuite/test/tools/lldb-server
======================================================================
ERROR: test_qSupported_returns_known_stub_features_debugserver (TestLldbGdbServer.LldbGdbServerTestCase)
----------------------------------------------------------------------
Error when building test subject.

Build Command:
make VPATH=/Users/buildslave/jenkins/workspace/lldb-cmake-matrix/llvm-project/lldb/packages/Python/lldbsuite/test/tools/lldb-server -C /Users/buildslave/jenkins/workspace/lldb-cmake-matrix/lldb-build/tools/lldb/lldb-test-build.noindex/tools/lldb-server/TestLldbGdbServer.test_qSupported_returns_known_stub_features_debugserver -I /Users/buildslave/jenkins/workspace/lldb-cmake-matrix/llvm-project/lldb/packages/Python/lldbsuite/test/tools/lldb-server -I /Users/buildslave/jenkins/workspace/lldb-cmake-matrix/llvm-project/lldb/packages/Python/lldbsuite/test/make -f /Users/buildslave/jenkins/workspace/lldb-cmake-matrix/llvm-project/lldb/packages/Python/lldbsuite/test/tools/lldb-server/Makefile all ARCH=x86_64 CC="/Users/buildslave/jenkins/workspace/lldb-cmake-matrix/clang_701_build/bin/clang-7" 

Build Command Output:
make: *** [a.out] Killed: 9

Test Directory:
/Users/buildslave/jenkins/workspace/lldb-cmake-matrix/llvm-project/lldb/packages/Python/lldbsuite/test/tools/lldb-server
======================================================================
FAIL: test_P_and_p_thread_suffix_work_debugserver (TestLldbGdbServer.LldbGdbServerTestCase)
----------------------------------------------------------------------
Traceback (most recent call last):
  File "/Users/buildslave/jenkins/workspace/lldb-cmake-matrix/llvm-project/lldb/packages/Python/lldbsuite/test/decorators.py", line 141, in wrapper
    func(*args, **kwargs)
  File "/Users/buildslave/jenkins/workspace/lldb-cmake-matrix/llvm-project/lldb/packages/Python/lldbsuite/test/tools/lldb-server/TestLldbGdbServer.py", line 1573, in test_P_and_p_thread_suffix_work_debugserver
    self.P_and_p_thread_suffix_work()
  File "/Users/buildslave/jenkins/workspace/lldb-cmake-matrix/llvm-project/lldb/packages/Python/lldbsuite/test/tools/lldb-server/TestLldbGdbServer.py", line 1465, in P_and_p_thread_suffix_work
    context = self.expect_gdbremote_sequence()
  File "/Users/buildslave/jenkins/workspace/lldb-cmake-matrix/llvm-project/lldb/packages/Python/lldbsuite/test/tools/lldb-server/gdbremote_testcase.py", line 735, in expect_gdbremote_sequence
    self.logger)
  File "/Users/buildslave/jenkins/workspace/lldb-cmake-matrix/llvm-project/lldb/packages/Python/lldbsuite/test/tools/lldb-server/lldbgdbserverutils.py", line 260, in expect_lldb_gdbserver_replay
    asserter, content, context=context)
  File "/Users/buildslave/jenkins/workspace/lldb-cmake-matrix/llvm-project/lldb/packages/Python/lldbsuite/test/tools/lldb-server/lldbgdbserverutils.py", line 563, in assert_match
    self._assert_exact_payload_match(asserter, actual_packet)
  File "/Users/buildslave/jenkins/workspace/lldb-cmake-matrix/llvm-project/lldb/packages/Python/lldbsuite/test/tools/lldb-server/lldbgdbserverutils.py", line 517, in _assert_exact_payload_match
    assert_packets_equal(asserter, actual_packet, self.exact_payload)
  File "/Users/buildslave/jenkins/workspace/lldb-cmake-matrix/llvm-project/lldb/packages/Python/lldbsuite/test/tools/lldb-server/lldbgdbserverutils.py", line 158, in assert_packets_equal
    asserter.assertEqual(actual_stripped, expected_stripped)
AssertionError: '$Efailed to get the task for process 91736' != '$OK'
Config=x86_64-/Users/buildslave/jenkins/workspace/lldb-cmake-matrix/clang_701_build/bin/clang-7
======================================================================
FAIL: test_P_writes_all_gpr_registers_debugserver (TestLldbGdbServer.LldbGdbServerTestCase)
----------------------------------------------------------------------
Traceback (most recent call last):
  File "/Users/buildslave/jenkins/workspace/lldb-cmake-matrix/llvm-project/lldb/packages/Python/lldbsuite/test/decorators.py", line 141, in wrapper
    func(*args, **kwargs)
  File "/Users/buildslave/jenkins/workspace/lldb-cmake-matrix/llvm-project/lldb/packages/Python/lldbsuite/test/tools/lldb-server/TestLldbGdbServer.py", line 1448, in test_P_writes_all_gpr_registers_debugserver
    self.P_writes_all_gpr_registers()
  File "/Users/buildslave/jenkins/workspace/lldb-cmake-matrix/llvm-project/lldb/packages/Python/lldbsuite/test/tools/lldb-server/TestLldbGdbServer.py", line 1414, in P_writes_all_gpr_registers
    context = self.expect_gdbremote_sequence()
  File "/Users/buildslave/jenkins/workspace/lldb-cmake-matrix/llvm-project/lldb/packages/Python/lldbsuite/test/tools/lldb-server/gdbremote_testcase.py", line 735, in expect_gdbremote_sequence
    self.logger)
  File "/Users/buildslave/jenkins/workspace/lldb-cmake-matrix/llvm-project/lldb/packages/Python/lldbsuite/test/tools/lldb-server/lldbgdbserverutils.py", line 260, in expect_lldb_gdbserver_replay
    asserter, content, context=context)
  File "/Users/buildslave/jenkins/workspace/lldb-cmake-matrix/llvm-project/lldb/packages/Python/lldbsuite/test/tools/lldb-server/lldbgdbserverutils.py", line 563, in assert_match
    self._assert_exact_payload_match(asserter, actual_packet)
  File "/Users/buildslave/jenkins/workspace/lldb-cmake-matrix/llvm-project/lldb/packages/Python/lldbsuite/test/tools/lldb-server/lldbgdbserverutils.py", line 517, in _assert_exact_payload_match
    assert_packets_equal(asserter, actual_packet, self.exact_payload)
  File "/Users/buildslave/jenkins/workspace/lldb-cmake-matrix/llvm-project/lldb/packages/Python/lldbsuite/test/tools/lldb-server/lldbgdbserverutils.py", line 158, in assert_packets_equal
    asserter.assertEqual(actual_stripped, expected_stripped)
AssertionError: '$Efailed to get the task for process 92773' != '$OK'
Config=x86_64-/Users/buildslave/jenkins/workspace/lldb-cmake-matrix/clang_701_build/bin/clang-7
======================================================================
FAIL: test_qMemoryRegionInfo_reports_code_address_as_executable_debugserver (TestLldbGdbServer.LldbGdbServerTestCase)
----------------------------------------------------------------------
Traceback (most recent call last):
  File "/Users/buildslave/jenkins/workspace/lldb-cmake-matrix/llvm-project/lldb/packages/Python/lldbsuite/test/decorators.py", line 141, in wrapper
    func(*args, **kwargs)
  File "/Users/buildslave/jenkins/workspace/lldb-cmake-matrix/llvm-project/lldb/packages/Python/lldbsuite/test/tools/lldb-server/TestLldbGdbServer.py", line 975, in test_qMemoryRegionInfo_reports_code_address_as_executable_debugserver
    self.qMemoryRegionInfo_reports_code_address_as_executable()
  File "/Users/buildslave/jenkins/workspace/lldb-cmake-matrix/llvm-project/lldb/packages/Python/lldbsuite/test/tools/lldb-server/TestLldbGdbServer.py", line 941, in qMemoryRegionInfo_reports_code_address_as_executable
    context = self.expect_gdbremote_sequence()
  File "/Users/buildslave/jenkins/workspace/lldb-cmake-matrix/llvm-project/lldb/packages/Python/lldbsuite/test/tools/lldb-server/gdbremote_testcase.py", line 735, in expect_gdbremote_sequence
    self.logger)
  File "/Users/buildslave/jenkins/workspace/lldb-cmake-matrix/llvm-project/lldb/packages/Python/lldbsuite/test/tools/lldb-server/lldbgdbserverutils.py", line 260, in expect_lldb_gdbserver_replay
    asserter, content, context=context)
  File "/Users/buildslave/jenkins/workspace/lldb-cmake-matrix/llvm-project/lldb/packages/Python/lldbsuite/test/tools/lldb-server/lldbgdbserverutils.py", line 563, in assert_match
    self._assert_exact_payload_match(asserter, actual_packet)
  File "/Users/buildslave/jenkins/workspace/lldb-cmake-matrix/llvm-project/lldb/packages/Python/lldbsuite/test/tools/lldb-server/lldbgdbserverutils.py", line 517, in _assert_exact_payload_match
    assert_packets_equal(asserter, actual_packet, self.exact_payload)
  File "/Users/buildslave/jenkins/workspace/lldb-cmake-matrix/llvm-project/lldb/packages/Python/lldbsuite/test/tools/lldb-server/lldbgdbserverutils.py", line 158, in assert_packets_equal
    asserter.assertEqual(actual_stripped, expected_stripped)
AssertionError: '$Efailed to get the task for process 96795' != '$OK'
Config=x86_64-/Users/buildslave/jenkins/workspace/lldb-cmake-matrix/clang_701_build/bin/clang-7
======================================================================
FAIL: test_qMemoryRegionInfo_reports_heap_address_as_readable_writeable_debugserver (TestLldbGdbServer.LldbGdbServerTestCase)
----------------------------------------------------------------------
Traceback (most recent call last):
  File "/Users/buildslave/jenkins/workspace/lldb-cmake-matrix/llvm-project/lldb/packages/Python/lldbsuite/test/decorators.py", line 141, in wrapper
    func(*args, **kwargs)
  File "/Users/buildslave/jenkins/workspace/lldb-cmake-matrix/llvm-project/lldb/packages/Python/lldbsuite/test/tools/lldb-server/TestLldbGdbServer.py", line 1107, in test_qMemoryRegionInfo_reports_heap_address_as_readable_writeable_debugserver
    self.qMemoryRegionInfo_reports_heap_address_as_readable_writeable()
  File "/Users/buildslave/jenkins/workspace/lldb-cmake-matrix/llvm-project/lldb/packages/Python/lldbsuite/test/tools/lldb-server/TestLldbGdbServer.py", line 1073, in qMemoryRegionInfo_reports_heap_address_as_readable_writeable
    context = self.expect_gdbremote_sequence()
  File "/Users/buildslave/jenkins/workspace/lldb-cmake-matrix/llvm-project/lldb/packages/Python/lldbsuite/test/tools/lldb-server/gdbremote_testcase.py", line 735, in expect_gdbremote_sequence
    self.logger)
  File "/Users/buildslave/jenkins/workspace/lldb-cmake-matrix/llvm-project/lldb/packages/Python/lldbsuite/test/tools/lldb-server/lldbgdbserverutils.py", line 260, in expect_lldb_gdbserver_replay
    asserter, content, context=context)
  File "/Users/buildslave/jenkins/workspace/lldb-cmake-matrix/llvm-project/lldb/packages/Python/lldbsuite/test/tools/lldb-server/lldbgdbserverutils.py", line 563, in assert_match
    self._assert_exact_payload_match(asserter, actual_packet)
  File "/Users/buildslave/jenkins/workspace/lldb-cmake-matrix/llvm-project/lldb/packages/Python/lldbsuite/test/tools/lldb-server/lldbgdbserverutils.py", line 517, in _assert_exact_payload_match
    assert_packets_equal(asserter, actual_packet, self.exact_payload)
  File "/Users/buildslave/jenkins/workspace/lldb-cmake-matrix/llvm-project/lldb/packages/Python/lldbsuite/test/tools/lldb-server/lldbgdbserverutils.py", line 158, in assert_packets_equal
    asserter.assertEqual(actual_stripped, expected_stripped)
AssertionError: '$Efailed to get the task for process 98992' != '$OK'
Config=x86_64-/Users/buildslave/jenkins/workspace/lldb-cmake-matrix/clang_701_build/bin/clang-7
======================================================================
FAIL: test_qRegisterInfo_contains_at_least_one_register_set_debugserver (TestLldbGdbServer.LldbGdbServerTestCase)
----------------------------------------------------------------------
Traceback (most recent call last):
  File "/Users/buildslave/jenkins/workspace/lldb-cmake-matrix/llvm-project/lldb/packages/Python/lldbsuite/test/decorators.py", line 141, in wrapper
    func(*args, **kwargs)
  File "/Users/buildslave/jenkins/workspace/lldb-cmake-matrix/llvm-project/lldb/packages/Python/lldbsuite/test/tools/lldb-server/TestLldbGdbServer.py", line 385, in test_qRegisterInfo_contains_at_least_one_register_set_debugserver
    self.qRegisterInfo_contains_at_least_one_register_set()
  File "/Users/buildslave/jenkins/workspace/lldb-cmake-matrix/llvm-project/lldb/packages/Python/lldbsuite/test/tools/lldb-server/TestLldbGdbServer.py", line 368, in qRegisterInfo_contains_at_least_one_register_set
    context = self.expect_gdbremote_sequence()
  File "/Users/buildslave/jenkins/workspace/lldb-cmake-matrix/llvm-project/lldb/packages/Python/lldbsuite/test/tools/lldb-server/gdbremote_testcase.py", line 735, in expect_gdbremote_sequence
    self.logger)
  File "/Users/buildslave/jenkins/workspace/lldb-cmake-matrix/llvm-project/lldb/packages/Python/lldbsuite/test/tools/lldb-server/lldbgdbserverutils.py", line 260, in expect_lldb_gdbserver_replay
    asserter, content, context=context)
  File "/Users/buildslave/jenkins/workspace/lldb-cmake-matrix/llvm-project/lldb/packages/Python/lldbsuite/test/tools/lldb-server/lldbgdbserverutils.py", line 563, in assert_match
    self._assert_exact_payload_match(asserter, actual_packet)
  File "/Users/buildslave/jenkins/workspace/lldb-cmake-matrix/llvm-project/lldb/packages/Python/lldbsuite/test/tools/lldb-server/lldbgdbserverutils.py", line 517, in _assert_exact_payload_match
    assert_packets_equal(asserter, actual_packet, self.exact_payload)
  File "/Users/buildslave/jenkins/workspace/lldb-cmake-matrix/llvm-project/lldb/packages/Python/lldbsuite/test/tools/lldb-server/lldbgdbserverutils.py", line 158, in assert_packets_equal
    asserter.assertEqual(actual_stripped, expected_stripped)
AssertionError: '$Efailed to get the task for process 598' != '$OK'
Config=x86_64-/Users/buildslave/jenkins/workspace/lldb-cmake-matrix/clang_701_build/bin/clang-7
======================================================================
FAIL: test_qRegisterInfo_contains_required_generics_debugserver (TestLldbGdbServer.LldbGdbServerTestCase)
----------------------------------------------------------------------
Traceback (most recent call last):
  File "/Users/buildslave/jenkins/workspace/lldb-cmake-matrix/llvm-project/lldb/packages/Python/lldbsuite/test/decorators.py", line 141, in wrapper
    func(*args, **kwargs)
  File "/Users/buildslave/jenkins/workspace/lldb-cmake-matrix/llvm-project/lldb/packages/Python/lldbsuite/test/tools/lldb-server/TestLldbGdbServer.py", line 348, in test_qRegisterInfo_contains_required_generics_debugserver
    self.qRegisterInfo_contains_required_generics()
  File "/Users/buildslave/jenkins/workspace/lldb-cmake-matrix/llvm-project/lldb/packages/Python/lldbsuite/test/tools/lldb-server/TestLldbGdbServer.py", line 320, in qRegisterInfo_contains_required_generics
    context = self.expect_gdbremote_sequence()
  File "/Users/buildslave/jenkins/workspace/lldb-cmake-matrix/llvm-project/lldb/packages/Python/lldbsuite/test/tools/lldb-server/gdbremote_testcase.py", line 735, in expect_gdbremote_sequence
    self.logger)
  File "/Users/buildslave/jenkins/workspace/lldb-cmake-matrix/llvm-project/lldb/packages/Python/lldbsuite/test/tools/lldb-server/lldbgdbserverutils.py", line 260, in expect_lldb_gdbserver_replay
    asserter, content, context=context)
  File "/Users/buildslave/jenkins/workspace/lldb-cmake-matrix/llvm-project/lldb/packages/Python/lldbsuite/test/tools/lldb-server/lldbgdbserverutils.py", line 563, in assert_match
    self._assert_exact_payload_match(asserter, actual_packet)
  File "/Users/buildslave/jenkins/workspace/lldb-cmake-matrix/llvm-project/lldb/packages/Python/lldbsuite/test/tools/lldb-server/lldbgdbserverutils.py", line 517, in _assert_exact_payload_match
    assert_packets_equal(asserter, actual_packet, self.exact_payload)
  File "/Users/buildslave/jenkins/workspace/lldb-cmake-matrix/llvm-project/lldb/packages/Python/lldbsuite/test/tools/lldb-server/lldbgdbserverutils.py", line 158, in assert_packets_equal
    asserter.assertEqual(actual_stripped, expected_stripped)
AssertionError: '$Efailed to get the task for process 1161' != '$OK'
Config=x86_64-/Users/buildslave/jenkins/workspace/lldb-cmake-matrix/clang_701_build/bin/clang-7
======================================================================
FAIL: test_qThreadInfo_contains_thread_attach_debugserver (TestLldbGdbServer.LldbGdbServerTestCase)
----------------------------------------------------------------------
Traceback (most recent call last):
  File "/Users/buildslave/jenkins/workspace/lldb-cmake-matrix/llvm-project/lldb/packages/Python/lldbsuite/test/decorators.py", line 141, in wrapper
    func(*args, **kwargs)
  File "/Users/buildslave/jenkins/workspace/lldb-cmake-matrix/llvm-project/lldb/packages/Python/lldbsuite/test/tools/lldb-server/TestLldbGdbServer.py", line 481, in test_qThreadInfo_contains_thread_attach_debugserver
    self.qThreadInfo_contains_thread()
  File "/Users/buildslave/jenkins/workspace/lldb-cmake-matrix/llvm-project/lldb/packages/Python/lldbsuite/test/tools/lldb-server/TestLldbGdbServer.py", line 446, in qThreadInfo_contains_thread
    procs = self.prep_debug_monitor_and_inferior()
  File "/Users/buildslave/jenkins/workspace/lldb-cmake-matrix/llvm-project/lldb/packages/Python/lldbsuite/test/tools/lldb-server/gdbremote_testcase.py", line 581, in prep_debug_monitor_and_inferior
    server = self.connect_to_debug_monitor(attach_pid=attach_pid)
  File "/Users/buildslave/jenkins/workspace/lldb-cmake-matrix/llvm-project/lldb/packages/Python/lldbsuite/test/tools/lldb-server/gdbremote_testcase.py", line 415, in connect_to_debug_monitor
    server = self.launch_debug_monitor(attach_pid=attach_pid)
  File "/Users/buildslave/jenkins/workspace/lldb-cmake-matrix/llvm-project/lldb/packages/Python/lldbsuite/test/tools/lldb-server/gdbremote_testcase.py", line 408, in launch_debug_monitor
    self.port = self.get_stub_port_from_named_socket()
  File "/Users/buildslave/jenkins/workspace/lldb-cmake-matrix/llvm-project/lldb/packages/Python/lldbsuite/test/tools/lldb-server/gdbremote_testcase.py", line 214, in get_stub_port_from_named_socket
    "write side of pipe has not written anything - stub isn't writing to pipe.")
AssertionError: 0 == 0 : write side of pipe has not written anything - stub isn't writing to pipe.
Config=x86_64-/Users/buildslave/jenkins/workspace/lldb-cmake-matrix/clang_701_build/bin/clang-7
======================================================================
FAIL: test_qThreadInfo_contains_thread_launch_debugserver (TestLldbGdbServer.LldbGdbServerTestCase)
----------------------------------------------------------------------
Traceback (most recent call last):
  File "/Users/buildslave/jenkins/workspace/lldb-cmake-matrix/llvm-project/lldb/packages/Python/lldbsuite/test/decorators.py", line 141, in wrapper
    func(*args, **kwargs)
  File "/Users/buildslave/jenkins/workspace/lldb-cmake-matrix/llvm-project/lldb/packages/Python/lldbsuite/test/tools/lldb-server/TestLldbGdbServer.py", line 466, in test_qThreadInfo_contains_thread_launch_debugserver
    self.qThreadInfo_contains_thread()
  File "/Users/buildslave/jenkins/workspace/lldb-cmake-matrix/llvm-project/lldb/packages/Python/lldbsuite/test/tools/lldb-server/TestLldbGdbServer.py", line 450, in qThreadInfo_contains_thread
    context = self.expect_gdbremote_sequence()
  File "/Users/buildslave/jenkins/workspace/lldb-cmake-matrix/llvm-project/lldb/packages/Python/lldbsuite/test/tools/lldb-server/gdbremote_testcase.py", line 735, in expect_gdbremote_sequence
    self.logger)
  File "/Users/buildslave/jenkins/workspace/lldb-cmake-matrix/llvm-project/lldb/packages/Python/lldbsuite/test/tools/lldb-server/lldbgdbserverutils.py", line 260, in expect_lldb_gdbserver_replay
    asserter, content, context=context)
  File "/Users/buildslave/jenkins/workspace/lldb-cmake-matrix/llvm-project/lldb/packages/Python/lldbsuite/test/tools/lldb-server/lldbgdbserverutils.py", line 563, in assert_match
    self._assert_exact_payload_match(asserter, actual_packet)
  File "/Users/buildslave/jenkins/workspace/lldb-cmake-matrix/llvm-project/lldb/packages/Python/lldbsuite/test/tools/lldb-server/lldbgdbserverutils.py", line 517, in _assert_exact_payload_match
    assert_packets_equal(asserter, actual_packet, self.exact_payload)
  File "/Users/buildslave/jenkins/workspace/lldb-cmake-matrix/llvm-project/lldb/packages/Python/lldbsuite/test/tools/lldb-server/lldbgdbserverutils.py", line 158, in assert_packets_equal
    asserter.assertEqual(actual_stripped, expected_stripped)
AssertionError: '$Efailed to get the task for process 5024' != '$OK'
Config=x86_64-/Users/buildslave/jenkins/workspace/lldb-cmake-matrix/clang_701_build/bin/clang-7
======================================================================
FAIL: test_qThreadInfo_matches_qC_attach_debugserver (TestLldbGdbServer.LldbGdbServerTestCase)
----------------------------------------------------------------------
Traceback (most recent call last):
  File "/Users/buildslave/jenkins/workspace/lldb-cmake-matrix/llvm-project/lldb/packages/Python/lldbsuite/test/decorators.py", line 141, in wrapper
    func(*args, **kwargs)
  File "/Users/buildslave/jenkins/workspace/lldb-cmake-matrix/llvm-project/lldb/packages/Python/lldbsuite/test/tools/lldb-server/TestLldbGdbServer.py", line 540, in test_qThreadInfo_matches_qC_attach_debugserver
    self.qThreadInfo_matches_qC()
  File "/Users/buildslave/jenkins/workspace/lldb-cmake-matrix/llvm-project/lldb/packages/Python/lldbsuite/test/tools/lldb-server/TestLldbGdbServer.py", line 492, in qThreadInfo_matches_qC
    procs = self.prep_debug_monitor_and_inferior()
  File "/Users/buildslave/jenkins/workspace/lldb-cmake-matrix/llvm-project/lldb/packages/Python/lldbsuite/test/tools/lldb-server/gdbremote_testcase.py", line 581, in prep_debug_monitor_and_inferior
    server = self.connect_to_debug_monitor(attach_pid=attach_pid)
  File "/Users/buildslave/jenkins/workspace/lldb-cmake-matrix/llvm-project/lldb/packages/Python/lldbsuite/test/tools/lldb-server/gdbremote_testcase.py", line 415, in connect_to_debug_monitor
    server = self.launch_debug_monitor(attach_pid=attach_pid)
  File "/Users/buildslave/jenkins/workspace/lldb-cmake-matrix/llvm-project/lldb/packages/Python/lldbsuite/test/tools/lldb-server/gdbremote_testcase.py", line 408, in launch_debug_monitor
    self.port = self.get_stub_port_from_named_socket()
  File "/Users/buildslave/jenkins/workspace/lldb-cmake-matrix/llvm-project/lldb/packages/Python/lldbsuite/test/tools/lldb-server/gdbremote_testcase.py", line 214, in get_stub_port_from_named_socket
    "write side of pipe has not written anything - stub isn't writing to pipe.")
AssertionError: 0 == 0 : write side of pipe has not written anything - stub isn't writing to pipe.
Config=x86_64-/Users/buildslave/jenkins/workspace/lldb-cmake-matrix/clang_701_build/bin/clang-7
======================================================================
FAIL: test_qThreadInfo_matches_qC_launch_debugserver (TestLldbGdbServer.LldbGdbServerTestCase)
----------------------------------------------------------------------
Traceback (most recent call last):
  File "/Users/buildslave/jenkins/workspace/lldb-cmake-matrix/llvm-project/lldb/packages/Python/lldbsuite/test/decorators.py", line 141, in wrapper
    func(*args, **kwargs)
  File "/Users/buildslave/jenkins/workspace/lldb-cmake-matrix/llvm-project/lldb/packages/Python/lldbsuite/test/tools/lldb-server/TestLldbGdbServer.py", line 525, in test_qThreadInfo_matches_qC_launch_debugserver
    self.qThreadInfo_matches_qC()
  File "/Users/buildslave/jenkins/workspace/lldb-cmake-matrix/llvm-project/lldb/packages/Python/lldbsuite/test/tools/lldb-server/TestLldbGdbServer.py", line 501, in qThreadInfo_matches_qC
    context = self.expect_gdbremote_sequence()
  File "/Users/buildslave/jenkins/workspace/lldb-cmake-matrix/llvm-project/lldb/packages/Python/lldbsuite/test/tools/lldb-server/gdbremote_testcase.py", line 735, in expect_gdbremote_sequence
    self.logger)
  File "/Users/buildslave/jenkins/workspace/lldb-cmake-matrix/llvm-project/lldb/packages/Python/lldbsuite/test/tools/lldb-server/lldbgdbserverutils.py", line 260, in expect_lldb_gdbserver_replay
    asserter, content, context=context)
  File "/Users/buildslave/jenkins/workspace/lldb-cmake-matrix/llvm-project/lldb/packages/Python/lldbsuite/test/tools/lldb-server/lldbgdbserverutils.py", line 563, in assert_match
    self._assert_exact_payload_match(asserter, actual_packet)
  File "/Users/buildslave/jenkins/workspace/lldb-cmake-matrix/llvm-project/lldb/packages/Python/lldbsuite/test/tools/lldb-server/lldbgdbserverutils.py", line 517, in _assert_exact_payload_match
    assert_packets_equal(asserter, actual_packet, self.exact_payload)
  File "/Users/buildslave/jenkins/workspace/lldb-cmake-matrix/llvm-project/lldb/packages/Python/lldbsuite/test/tools/lldb-server/lldbgdbserverutils.py", line 158, in assert_packets_equal
    asserter.assertEqual(actual_stripped, expected_stripped)
AssertionError: '$Efailed to get the task for process 7245' != '$OK'
Config=x86_64-/Users/buildslave/jenkins/workspace/lldb-cmake-matrix/clang_701_build/bin/clang-7
======================================================================
FAIL: test_software_breakpoint_set_and_remove_work_debugserver (TestLldbGdbServer.LldbGdbServerTestCase)
----------------------------------------------------------------------
Traceback (most recent call last):
  File "/Users/buildslave/jenkins/workspace/lldb-cmake-matrix/llvm-project/lldb/packages/Python/lldbsuite/test/decorators.py", line 141, in wrapper
    func(*args, **kwargs)
  File "/Users/buildslave/jenkins/workspace/lldb-cmake-matrix/llvm-project/lldb/packages/Python/lldbsuite/test/tools/lldb-server/TestLldbGdbServer.py", line 1260, in test_software_breakpoint_set_and_remove_work_debugserver
    self.breakpoint_set_and_remove_work(want_hardware=False)
  File "/Users/buildslave/jenkins/workspace/lldb-cmake-matrix/llvm-project/lldb/packages/Python/lldbsuite/test/tools/lldb-server/TestLldbGdbServer.py", line 1143, in breakpoint_set_and_remove_work
    context = self.expect_gdbremote_sequence()
  File "/Users/buildslave/jenkins/workspace/lldb-cmake-matrix/llvm-project/lldb/packages/Python/lldbsuite/test/tools/lldb-server/gdbremote_testcase.py", line 735, in expect_gdbremote_sequence
    self.logger)
  File "/Users/buildslave/jenkins/workspace/lldb-cmake-matrix/llvm-project/lldb/packages/Python/lldbsuite/test/tools/lldb-server/lldbgdbserverutils.py", line 260, in expect_lldb_gdbserver_replay
    asserter, content, context=context)
  File "/Users/buildslave/jenkins/workspace/lldb-cmake-matrix/llvm-project/lldb/packages/Python/lldbsuite/test/tools/lldb-server/lldbgdbserverutils.py", line 563, in assert_match
    self._assert_exact_payload_match(asserter, actual_packet)
  File "/Users/buildslave/jenkins/workspace/lldb-cmake-matrix/llvm-project/lldb/packages/Python/lldbsuite/test/tools/lldb-server/lldbgdbserverutils.py", line 517, in _assert_exact_payload_match
    assert_packets_equal(asserter, actual_packet, self.exact_payload)
  File "/Users/buildslave/jenkins/workspace/lldb-cmake-matrix/llvm-project/lldb/packages/Python/lldbsuite/test/tools/lldb-server/lldbgdbserverutils.py", line 158, in assert_packets_equal
    asserter.assertEqual(actual_stripped, expected_stripped)
AssertionError: '$Efailed to get the task for process 7738' != '$OK'
Config=x86_64-/Users/buildslave/jenkins/workspace/lldb-cmake-matrix/clang_701_build/bin/clang-7
======================================================================
FAIL: test_written_M_content_reads_back_correctly_debugserver (TestLldbGdbServer.LldbGdbServerTestCase)
----------------------------------------------------------------------
Traceback (most recent call last):
  File "/Users/buildslave/jenkins/workspace/lldb-cmake-matrix/llvm-project/lldb/packages/Python/lldbsuite/test/decorators.py", line 141, in wrapper
    func(*args, **kwargs)
  File "/Users/buildslave/jenkins/workspace/lldb-cmake-matrix/llvm-project/lldb/packages/Python/lldbsuite/test/tools/lldb-server/TestLldbGdbServer.py", line 1397, in test_written_M_content_reads_back_correctly_debugserver
    self.written_M_content_reads_back_correctly()
  File "/Users/buildslave/jenkins/workspace/lldb-cmake-matrix/llvm-project/lldb/packages/Python/lldbsuite/test/tools/lldb-server/TestLldbGdbServer.py", line 1355, in written_M_content_reads_back_correctly
    context = self.expect_gdbremote_sequence()
  File "/Users/buildslave/jenkins/workspace/lldb-cmake-matrix/llvm-project/lldb/packages/Python/lldbsuite/test/tools/lldb-server/gdbremote_testcase.py", line 735, in expect_gdbremote_sequence
    self.logger)
  File "/Users/buildslave/jenkins/workspace/lldb-cmake-matrix/llvm-project/lldb/packages/Python/lldbsuite/test/tools/lldb-server/lldbgdbserverutils.py", line 260, in expect_lldb_gdbserver_replay
    asserter, content, context=context)
  File "/Users/buildslave/jenkins/workspace/lldb-cmake-matrix/llvm-project/lldb/packages/Python/lldbsuite/test/tools/lldb-server/lldbgdbserverutils.py", line 563, in assert_match
    self._assert_exact_payload_match(asserter, actual_packet)
  File "/Users/buildslave/jenkins/workspace/lldb-cmake-matrix/llvm-project/lldb/packages/Python/lldbsuite/test/tools/lldb-server/lldbgdbserverutils.py", line 517, in _assert_exact_payload_match
    assert_packets_equal(asserter, actual_packet, self.exact_payload)
  File "/Users/buildslave/jenkins/workspace/lldb-cmake-matrix/llvm-project/lldb/packages/Python/lldbsuite/test/tools/lldb-server/lldbgdbserverutils.py", line 158, in assert_packets_equal
    asserter.assertEqual(actual_stripped, expected_stripped)
AssertionError: '$Efailed to get the task for process 8232' != '$OK'
Config=x86_64-/Users/buildslave/jenkins/workspace/lldb-cmake-matrix/clang_701_build/bin/clang-7
----------------------------------------------------------------------
Ran 65 tests in 66.538s

RESULT: FAILED (6 passes, 12 failures, 12 errors, 34 skipped, 1 expected failures, 0 unexpected successes)