SuccessConsole Output

Skipping 20,926 KB.. Full Log
project/lldb/test/API/dotest.py --arch=x86_64 -s /Users/buildslave/jenkins/workspace/lldb-cmake-matrix/lldb-build/lldb-test-traces -S nm -u CXXFLAGS -u CFLAGS --executable /Users/buildslave/jenkins/workspace/lldb-cmake-matrix/lldb-build/./bin/lldb --dsymutil /Users/buildslave/jenkins/workspace/lldb-cmake-matrix/lldb-build/./bin/dsymutil --filecheck /Users/buildslave/jenkins/workspace/lldb-cmake-matrix/lldb-build/./bin/FileCheck -C /Users/buildslave/jenkins/workspace/lldb-cmake-matrix/lldb-build/./bin/clang --codesign-identity lldb_codesign --server /Users/buildslave/jenkins/workspace/lldb-cmake-matrix/lldb-build/./bin/debugserver --arch x86_64 --build-dir /Users/buildslave/jenkins/workspace/lldb-cmake-matrix/lldb-build/lldb-test-build.noindex -s=/Users/buildslave/jenkins/workspace/lldb-cmake-matrix/test/logs -t --env TERM=vt100 --skip-category gmodules --skip-category watchpoint --arch=x86_64 --dwarf-version=5 --env LLVM_LIBS_DIR=/Users/buildslave/jenkins/workspace/lldb-cmake-matrix/lldb-build/./lib --build-dir /Users/buildslave/jenkins/workspace/lldb-cmake-matrix/lldb-build/tools/lldb/lldb-test-build.noindex --lldb-module-cache-dir /Users/buildslave/jenkins/workspace/lldb-cmake-matrix/lldb-build/tools/lldb/lldb-test-build.noindex/module-cache-lldb/lldb-api --clang-module-cache-dir /Users/buildslave/jenkins/workspace/lldb-cmake-matrix/lldb-build/tools/lldb/lldb-test-build.noindex/module-cache-clang/lldb-api /Users/buildslave/jenkins/workspace/lldb-cmake-matrix/llvm-project/lldb/packages/Python/lldbsuite/test/commands/expression/call-function -p TestCallStdStringFunction.py
Change dir to: /Users/buildslave/jenkins/workspace/lldb-cmake-matrix/llvm-project/lldb/packages/Python/lldbsuite/test/commands/expression/call-function
runCmd: settings set symbols.enable-external-lookup false
output: 

runCmd: settings set plugin.process.gdb-remote.packet-timeout 60
output: 

runCmd: settings set symbols.clang-modules-cache-path "/Users/buildslave/jenkins/workspace/lldb-cmake-matrix/lldb-build/tools/lldb/lldb-test-build.noindex/module-cache-lldb/lldb-api"
output: 

runCmd: settings set use-color false
output: 

warning: (x86_64) /Users/buildslave/jenkins/workspace/lldb-cmake-matrix/lldb-build/tools/lldb/lldb-test-build.noindex/commands/expression/call-function/TestCallStdStringFunction.test_with_dsym/a.out empty dSYM file detected, dSYM was created with an executable with no debug info.
runCmd: file /Users/buildslave/jenkins/workspace/lldb-cmake-matrix/lldb-build/tools/lldb/lldb-test-build.noindex/commands/expression/call-function/TestCallStdStringFunction.test_with_dsym/a.out
output: Current executable set to '/Users/buildslave/jenkins/workspace/lldb-cmake-matrix/lldb-build/tools/lldb/lldb-test-build.noindex/commands/expression/call-function/TestCallStdStringFunction.test_with_dsym/a.out' (x86_64).


runCmd: breakpoint set -f "main.cpp" -l 52
output: Breakpoint 1: no locations (pending).
WARNING:  Unable to resolve breakpoint to any actual locations.


Expecting pattern: ^Breakpoint (?P<bpno>[0-9]+): (?P<num_locations>[0-9]+) locations\.$
Not matched

Expecting pattern: ^Breakpoint (?P<bpno>[0-9]+): (?P<num_locations>no) locations \(pending\)\.
Matched

FAIL: LLDB (/Users/buildslave/jenkins/workspace/lldb-cmake-matrix/lldb-build/bin/clang-10-x86_64) :: test_with_dsym (TestCallStdStringFunction.ExprCommandCallFunctionTestCase)
runCmd: settings set symbols.enable-external-lookup false
output: 

runCmd: settings set plugin.process.gdb-remote.packet-timeout 60
output: 

runCmd: settings set symbols.clang-modules-cache-path "/Users/buildslave/jenkins/workspace/lldb-cmake-matrix/lldb-build/tools/lldb/lldb-test-build.noindex/module-cache-lldb/lldb-api"
output: 

runCmd: settings set use-color false
output: 

runCmd: file /Users/buildslave/jenkins/workspace/lldb-cmake-matrix/lldb-build/tools/lldb/lldb-test-build.noindex/commands/expression/call-function/TestCallStdStringFunction.test_with_dwarf/a.out
output: Current executable set to '/Users/buildslave/jenkins/workspace/lldb-cmake-matrix/lldb-build/tools/lldb/lldb-test-build.noindex/commands/expression/call-function/TestCallStdStringFunction.test_with_dwarf/a.out' (x86_64).


runCmd: breakpoint set -f "main.cpp" -l 52
output: Breakpoint 1: no locations (pending).
WARNING:  Unable to resolve breakpoint to any actual locations.


Expecting pattern: ^Breakpoint (?P<bpno>[0-9]+): (?P<num_locations>[0-9]+) locations\.$
Not matched

Expecting pattern: ^Breakpoint (?P<bpno>[0-9]+): (?P<num_locations>no) locations \(pending\)\.
Matched

FAIL: LLDB (/Users/buildslave/jenkins/workspace/lldb-cmake-matrix/lldb-build/bin/clang-10-x86_64) :: test_with_dwarf (TestCallStdStringFunction.ExprCommandCallFunctionTestCase)
UNSUPPORTED: LLDB (/Users/buildslave/jenkins/workspace/lldb-cmake-matrix/lldb-build/bin/clang-10-x86_64) :: test_with_dwo (TestCallStdStringFunction.ExprCommandCallFunctionTestCase) (test case does not fall in any category of interest for this run) 
UNSUPPORTED: LLDB (/Users/buildslave/jenkins/workspace/lldb-cmake-matrix/lldb-build/bin/clang-10-x86_64) :: test_with_gmodules (TestCallStdStringFunction.ExprCommandCallFunctionTestCase) (test case does not fall in any category of interest for this run) 
Restore dir to: /Users/buildslave/jenkins/workspace/lldb-cmake-matrix/lldb-build/tools/lldb/test
======================================================================
FAIL: test_with_dsym (TestCallStdStringFunction.ExprCommandCallFunctionTestCase)
   Test calling std::String member function.
----------------------------------------------------------------------
Traceback (most recent call last):
  File "/Users/buildslave/jenkins/workspace/lldb-cmake-matrix/llvm-project/lldb/packages/Python/lldbsuite/test/lldbtest.py", line 1748, in test_method
    return attrvalue(self)
  File "/Users/buildslave/jenkins/workspace/lldb-cmake-matrix/llvm-project/lldb/packages/Python/lldbsuite/test/decorators.py", line 111, in wrapper
    func(*args, **kwargs)
  File "/Users/buildslave/jenkins/workspace/lldb-cmake-matrix/llvm-project/lldb/packages/Python/lldbsuite/test/decorators.py", line 111, in wrapper
    func(*args, **kwargs)
  File "/Users/buildslave/jenkins/workspace/lldb-cmake-matrix/llvm-project/lldb/packages/Python/lldbsuite/test/commands/expression/call-function/TestCallStdStringFunction.py", line 39, in test_with
    self, "main.cpp", self.line, num_expected_locations=-1, loc_exact=True)
  File "/Users/buildslave/jenkins/workspace/lldb-cmake-matrix/llvm-project/lldb/packages/Python/lldbsuite/test/lldbutil.py", line 388, in run_break_set_by_file_and_line
    num_locations=num_expected_locations)
  File "/Users/buildslave/jenkins/workspace/lldb-cmake-matrix/llvm-project/lldb/packages/Python/lldbsuite/test/lldbutil.py", line 578, in check_breakpoint_result
    "Expecting one or more locations, got none.")
AssertionError: False is not True : Expecting one or more locations, got none.
Config=x86_64-/Users/buildslave/jenkins/workspace/lldb-cmake-matrix/lldb-build/bin/clang-10
======================================================================
FAIL: test_with_dwarf (TestCallStdStringFunction.ExprCommandCallFunctionTestCase)
   Test calling std::String member function.
----------------------------------------------------------------------
Traceback (most recent call last):
  File "/Users/buildslave/jenkins/workspace/lldb-cmake-matrix/llvm-project/lldb/packages/Python/lldbsuite/test/lldbtest.py", line 1748, in test_method
    return attrvalue(self)
  File "/Users/buildslave/jenkins/workspace/lldb-cmake-matrix/llvm-project/lldb/packages/Python/lldbsuite/test/decorators.py", line 111, in wrapper
    func(*args, **kwargs)
  File "/Users/buildslave/jenkins/workspace/lldb-cmake-matrix/llvm-project/lldb/packages/Python/lldbsuite/test/decorators.py", line 111, in wrapper
    func(*args, **kwargs)
  File "/Users/buildslave/jenkins/workspace/lldb-cmake-matrix/llvm-project/lldb/packages/Python/lldbsuite/test/commands/expression/call-function/TestCallStdStringFunction.py", line 39, in test_with
    self, "main.cpp", self.line, num_expected_locations=-1, loc_exact=True)
  File "/Users/buildslave/jenkins/workspace/lldb-cmake-matrix/llvm-project/lldb/packages/Python/lldbsuite/test/lldbutil.py", line 388, in run_break_set_by_file_and_line
    num_locations=num_expected_locations)
  File "/Users/buildslave/jenkins/workspace/lldb-cmake-matrix/llvm-project/lldb/packages/Python/lldbsuite/test/lldbutil.py", line 578, in check_breakpoint_result
    "Expecting one or more locations, got none.")
AssertionError: False is not True : Expecting one or more locations, got none.
Config=x86_64-/Users/buildslave/jenkins/workspace/lldb-cmake-matrix/lldb-build/bin/clang-10
----------------------------------------------------------------------
Ran 4 tests in 3.943s

RESULT: FAILED (0 passes, 2 failures, 0 errors, 2 skipped, 0 expected failures, 0 unexpected successes)

********************
UNSUPPORTED: lldb-api :: lang/objc/objc-dynamic-value/TestObjCDynamicValue.py (1778 of 1788)
UNSUPPORTED: lldb-api :: functionalities/thread/multi_break/TestMultipleBreakpoints.py (1779 of 1788)
FAIL: lldb-api :: functionalities/data-formatter/data-formatter-stl/libcxx/variant/TestDataFormatterLibcxxVariant.py (1780 of 1788)
******************** TEST 'lldb-api :: functionalities/data-formatter/data-formatter-stl/libcxx/variant/TestDataFormatterLibcxxVariant.py' FAILED ********************
lldb version 10.0.99 (http://labmaster3.local/git/llvm-project.git revision 1f20bc17d005fb37816fac95955ec4a36f9de26f)
  clang revision 1f20bc17d005fb37816fac95955ec4a36f9de26f
  llvm revision 1f20bc17d005fb37816fac95955ec4a36f9de26f
LLDB library dir: /Users/buildslave/jenkins/workspace/lldb-cmake-matrix/lldb-build/bin
LLDB import library dir: /Users/buildslave/jenkins/workspace/lldb-cmake-matrix/lldb-build/bin
libstdcxx tests will not be run because: Don't know how to build with libstdcxx on macosx
Skipping following debug info categories: ['dwo']

Session logs for test failures/errors/unexpected successes will go into directory '/Users/buildslave/jenkins/workspace/lldb-cmake-matrix/test/logs'
Command invoked: /Users/buildslave/jenkins/workspace/lldb-cmake-matrix/llvm-project/lldb/test/API/dotest.py --arch=x86_64 -s /Users/buildslave/jenkins/workspace/lldb-cmake-matrix/lldb-build/lldb-test-traces -S nm -u CXXFLAGS -u CFLAGS --executable /Users/buildslave/jenkins/workspace/lldb-cmake-matrix/lldb-build/./bin/lldb --dsymutil /Users/buildslave/jenkins/workspace/lldb-cmake-matrix/lldb-build/./bin/dsymutil --filecheck /Users/buildslave/jenkins/workspace/lldb-cmake-matrix/lldb-build/./bin/FileCheck -C /Users/buildslave/jenkins/workspace/lldb-cmake-matrix/lldb-build/./bin/clang --codesign-identity lldb_codesign --server /Users/buildslave/jenkins/workspace/lldb-cmake-matrix/lldb-build/./bin/debugserver --arch x86_64 --build-dir /Users/buildslave/jenkins/workspace/lldb-cmake-matrix/lldb-build/lldb-test-build.noindex -s=/Users/buildslave/jenkins/workspace/lldb-cmake-matrix/test/logs -t --env TERM=vt100 --skip-category gmodules --skip-category watchpoint --arch=x86_64 --dwarf-version=5 --env LLVM_LIBS_DIR=/Users/buildslave/jenkins/workspace/lldb-cmake-matrix/lldb-build/./lib --build-dir /Users/buildslave/jenkins/workspace/lldb-cmake-matrix/lldb-build/tools/lldb/lldb-test-build.noindex --lldb-module-cache-dir /Users/buildslave/jenkins/workspace/lldb-cmake-matrix/lldb-build/tools/lldb/lldb-test-build.noindex/module-cache-lldb/lldb-api --clang-module-cache-dir /Users/buildslave/jenkins/workspace/lldb-cmake-matrix/lldb-build/tools/lldb/lldb-test-build.noindex/module-cache-clang/lldb-api /Users/buildslave/jenkins/workspace/lldb-cmake-matrix/llvm-project/lldb/packages/Python/lldbsuite/test/functionalities/data-formatter/data-formatter-stl/libcxx/variant -p TestDataFormatterLibcxxVariant.py
Change dir to: /Users/buildslave/jenkins/workspace/lldb-cmake-matrix/llvm-project/lldb/packages/Python/lldbsuite/test/functionalities/data-formatter/data-formatter-stl/libcxx/variant
runCmd: settings set symbols.enable-external-lookup false
output: 

runCmd: settings set plugin.process.gdb-remote.packet-timeout 60
output: 

runCmd: settings set symbols.clang-modules-cache-path "/Users/buildslave/jenkins/workspace/lldb-cmake-matrix/lldb-build/tools/lldb/lldb-test-build.noindex/module-cache-lldb/lldb-api"
output: 

runCmd: settings set use-color false
output: 

warning: (x86_64) /Users/buildslave/jenkins/workspace/lldb-cmake-matrix/lldb-build/tools/lldb/lldb-test-build.noindex/functionalities/data-formatter/data-formatter-stl/libcxx/variant/TestDataFormatterLibcxxVariant.test_with_run_command_dsym/a.out empty dSYM file detected, dSYM was created with an executable with no debug info.
FAIL: LLDB (/Users/buildslave/jenkins/workspace/lldb-cmake-matrix/lldb-build/bin/clang-10-x86_64) :: test_with_run_command_dsym (TestDataFormatterLibcxxVariant.LibcxxVariantDataFormatterTestCase)
runCmd: settings set symbols.enable-external-lookup false
output: 

runCmd: settings set plugin.process.gdb-remote.packet-timeout 60
output: 

runCmd: settings set symbols.clang-modules-cache-path "/Users/buildslave/jenkins/workspace/lldb-cmake-matrix/lldb-build/tools/lldb/lldb-test-build.noindex/module-cache-lldb/lldb-api"
output: 

runCmd: settings set use-color false
output: 

FAIL: LLDB (/Users/buildslave/jenkins/workspace/lldb-cmake-matrix/lldb-build/bin/clang-10-x86_64) :: test_with_run_command_dwarf (TestDataFormatterLibcxxVariant.LibcxxVariantDataFormatterTestCase)
UNSUPPORTED: LLDB (/Users/buildslave/jenkins/workspace/lldb-cmake-matrix/lldb-build/bin/clang-10-x86_64) :: test_with_run_command_dwo (TestDataFormatterLibcxxVariant.LibcxxVariantDataFormatterTestCase) (test case does not fall in any category of interest for this run) 
UNSUPPORTED: LLDB (/Users/buildslave/jenkins/workspace/lldb-cmake-matrix/lldb-build/bin/clang-10-x86_64) :: test_with_run_command_gmodules (TestDataFormatterLibcxxVariant.LibcxxVariantDataFormatterTestCase) (test case does not fall in any category of interest for this run) 
Restore dir to: /Users/buildslave/jenkins/workspace/lldb-cmake-matrix/lldb-build/tools/lldb/test
======================================================================
FAIL: test_with_run_command_dsym (TestDataFormatterLibcxxVariant.LibcxxVariantDataFormatterTestCase)
   Test that that file and class static variables display correctly.
----------------------------------------------------------------------
Traceback (most recent call last):
  File "/Users/buildslave/jenkins/workspace/lldb-cmake-matrix/llvm-project/lldb/packages/Python/lldbsuite/test/lldbtest.py", line 1748, in test_method
    return attrvalue(self)
  File "/Users/buildslave/jenkins/workspace/lldb-cmake-matrix/llvm-project/lldb/packages/Python/lldbsuite/test/decorators.py", line 141, in wrapper
    func(*args, **kwargs)
  File "/Users/buildslave/jenkins/workspace/lldb-cmake-matrix/llvm-project/lldb/packages/Python/lldbsuite/test/decorators.py", line 141, in wrapper
    func(*args, **kwargs)
  File "/Users/buildslave/jenkins/workspace/lldb-cmake-matrix/llvm-project/lldb/packages/Python/lldbsuite/test/decorators.py", line 141, in wrapper
    func(*args, **kwargs)
  File "/Users/buildslave/jenkins/workspace/lldb-cmake-matrix/llvm-project/lldb/packages/Python/lldbsuite/test/functionalities/data-formatter/data-formatter-stl/libcxx/variant/TestDataFormatterLibcxxVariant.py", line 30, in test_with_run_command
    lldb.SBFileSpec("main.cpp", False))
  File "/Users/buildslave/jenkins/workspace/lldb-cmake-matrix/llvm-project/lldb/packages/Python/lldbsuite/test/lldbutil.py", line 837, in run_to_source_breakpoint
    %(bkpt_pattern, source_spec.GetFilename(), source_spec.GetDirectory()))
AssertionError: False is not True : No locations found for source breakpoint: "// break here", file: "main.cpp", dir: "None"
Config=x86_64-/Users/buildslave/jenkins/workspace/lldb-cmake-matrix/lldb-build/bin/clang-10
======================================================================
FAIL: test_with_run_command_dwarf (TestDataFormatterLibcxxVariant.LibcxxVariantDataFormatterTestCase)
   Test that that file and class static variables display correctly.
----------------------------------------------------------------------
Traceback (most recent call last):
  File "/Users/buildslave/jenkins/workspace/lldb-cmake-matrix/llvm-project/lldb/packages/Python/lldbsuite/test/lldbtest.py", line 1748, in test_method
    return attrvalue(self)
  File "/Users/buildslave/jenkins/workspace/lldb-cmake-matrix/llvm-project/lldb/packages/Python/lldbsuite/test/decorators.py", line 141, in wrapper
    func(*args, **kwargs)
  File "/Users/buildslave/jenkins/workspace/lldb-cmake-matrix/llvm-project/lldb/packages/Python/lldbsuite/test/decorators.py", line 141, in wrapper
    func(*args, **kwargs)
  File "/Users/buildslave/jenkins/workspace/lldb-cmake-matrix/llvm-project/lldb/packages/Python/lldbsuite/test/decorators.py", line 141, in wrapper
    func(*args, **kwargs)
  File "/Users/buildslave/jenkins/workspace/lldb-cmake-matrix/llvm-project/lldb/packages/Python/lldbsuite/test/functionalities/data-formatter/data-formatter-stl/libcxx/variant/TestDataFormatterLibcxxVariant.py", line 30, in test_with_run_command
    lldb.SBFileSpec("main.cpp", False))
  File "/Users/buildslave/jenkins/workspace/lldb-cmake-matrix/llvm-project/lldb/packages/Python/lldbsuite/test/lldbutil.py", line 837, in run_to_source_breakpoint
    %(bkpt_pattern, source_spec.GetFilename(), source_spec.GetDirectory()))
AssertionError: False is not True : No locations found for source breakpoint: "// break here", file: "main.cpp", dir: "None"
Config=x86_64-/Users/buildslave/jenkins/workspace/lldb-cmake-matrix/lldb-build/bin/clang-10
----------------------------------------------------------------------
Ran 4 tests in 3.164s

RESULT: FAILED (0 passes, 2 failures, 0 errors, 2 skipped, 0 expected failures, 0 unexpected successes)

********************
FAIL: lldb-api :: python_api/thread/TestThreadAPI.py (1781 of 1788)
******************** TEST 'lldb-api :: python_api/thread/TestThreadAPI.py' FAILED ********************
lldb version 10.0.99 (http://labmaster3.local/git/llvm-project.git revision 1f20bc17d005fb37816fac95955ec4a36f9de26f)
  clang revision 1f20bc17d005fb37816fac95955ec4a36f9de26f
  llvm revision 1f20bc17d005fb37816fac95955ec4a36f9de26f
LLDB library dir: /Users/buildslave/jenkins/workspace/lldb-cmake-matrix/lldb-build/bin
LLDB import library dir: /Users/buildslave/jenkins/workspace/lldb-cmake-matrix/lldb-build/bin
libstdcxx tests will not be run because: Don't know how to build with libstdcxx on macosx
Skipping following debug info categories: ['dwo']

Session logs for test failures/errors/unexpected successes will go into directory '/Users/buildslave/jenkins/workspace/lldb-cmake-matrix/test/logs'
Command invoked: /Users/buildslave/jenkins/workspace/lldb-cmake-matrix/llvm-project/lldb/test/API/dotest.py --arch=x86_64 -s /Users/buildslave/jenkins/workspace/lldb-cmake-matrix/lldb-build/lldb-test-traces -S nm -u CXXFLAGS -u CFLAGS --executable /Users/buildslave/jenkins/workspace/lldb-cmake-matrix/lldb-build/./bin/lldb --dsymutil /Users/buildslave/jenkins/workspace/lldb-cmake-matrix/lldb-build/./bin/dsymutil --filecheck /Users/buildslave/jenkins/workspace/lldb-cmake-matrix/lldb-build/./bin/FileCheck -C /Users/buildslave/jenkins/workspace/lldb-cmake-matrix/lldb-build/./bin/clang --codesign-identity lldb_codesign --server /Users/buildslave/jenkins/workspace/lldb-cmake-matrix/lldb-build/./bin/debugserver --arch x86_64 --build-dir /Users/buildslave/jenkins/workspace/lldb-cmake-matrix/lldb-build/lldb-test-build.noindex -s=/Users/buildslave/jenkins/workspace/lldb-cmake-matrix/test/logs -t --env TERM=vt100 --skip-category gmodules --skip-category watchpoint --arch=x86_64 --dwarf-version=5 --env LLVM_LIBS_DIR=/Users/buildslave/jenkins/workspace/lldb-cmake-matrix/lldb-build/./lib --build-dir /Users/buildslave/jenkins/workspace/lldb-cmake-matrix/lldb-build/tools/lldb/lldb-test-build.noindex --lldb-module-cache-dir /Users/buildslave/jenkins/workspace/lldb-cmake-matrix/lldb-build/tools/lldb/lldb-test-build.noindex/module-cache-lldb/lldb-api --clang-module-cache-dir /Users/buildslave/jenkins/workspace/lldb-cmake-matrix/lldb-build/tools/lldb/lldb-test-build.noindex/module-cache-clang/lldb-api /Users/buildslave/jenkins/workspace/lldb-cmake-matrix/llvm-project/lldb/packages/Python/lldbsuite/test/python_api/thread -p TestThreadAPI.py
Change dir to: /Users/buildslave/jenkins/workspace/lldb-cmake-matrix/llvm-project/lldb/packages/Python/lldbsuite/test/python_api/thread
runCmd: settings set symbols.enable-external-lookup false
output: 

runCmd: settings set plugin.process.gdb-remote.packet-timeout 60
output: 

runCmd: settings set symbols.clang-modules-cache-path "/Users/buildslave/jenkins/workspace/lldb-cmake-matrix/lldb-build/tools/lldb/lldb-test-build.noindex/module-cache-lldb/lldb-api"
output: 

runCmd: settings set use-color false
output: 

warning: (x86_64) /Users/buildslave/jenkins/workspace/lldb-cmake-matrix/lldb-build/tools/lldb/lldb-test-build.noindex/python_api/thread/TestThreadAPI.test_get_process_dsym/a.out empty dSYM file detected, dSYM was created with an executable with no debug info.
runCmd: breakpoint list
output: Current breakpoints:
1: file = 'main.cpp', line = 24, exact_match = 0, locations = 0 (pending)



FAIL: LLDB (/Users/buildslave/jenkins/workspace/lldb-cmake-matrix/lldb-build/bin/clang-10-x86_64) :: test_get_process_dsym (TestThreadAPI.ThreadAPITestCase)
<bound method SBProcess.Kill of <lldb.SBProcess; proxy of <Swig Object of type 'lldb::SBProcess *' at 0x1349d1300> >>: success

runCmd: settings set symbols.enable-external-lookup false
output: 

runCmd: settings set plugin.process.gdb-remote.packet-timeout 60
output: 

runCmd: settings set symbols.clang-modules-cache-path "/Users/buildslave/jenkins/workspace/lldb-cmake-matrix/lldb-build/tools/lldb/lldb-test-build.noindex/module-cache-lldb/lldb-api"
output: 

runCmd: settings set use-color false
output: 

runCmd: breakpoint list
output: Current breakpoints:
1: file = 'main.cpp', line = 24, exact_match = 0, locations = 0 (pending)



FAIL: LLDB (/Users/buildslave/jenkins/workspace/lldb-cmake-matrix/lldb-build/bin/clang-10-x86_64) :: test_get_process_dwarf (TestThreadAPI.ThreadAPITestCase)
<bound method SBProcess.Kill of <lldb.SBProcess; proxy of <Swig Object of type 'lldb::SBProcess *' at 0x1349d1360> >>: success

UNSUPPORTED: LLDB (/Users/buildslave/jenkins/workspace/lldb-cmake-matrix/lldb-build/bin/clang-10-x86_64) :: test_get_process_dwo (TestThreadAPI.ThreadAPITestCase) (test case does not fall in any category of interest for this run) 
UNSUPPORTED: LLDB (/Users/buildslave/jenkins/workspace/lldb-cmake-matrix/lldb-build/bin/clang-10-x86_64) :: test_get_process_gmodules (TestThreadAPI.ThreadAPITestCase) (test case does not fall in any category of interest for this run) 
runCmd: settings set symbols.enable-external-lookup false
output: 

runCmd: settings set plugin.process.gdb-remote.packet-timeout 60
output: 

runCmd: settings set symbols.clang-modules-cache-path "/Users/buildslave/jenkins/workspace/lldb-cmake-matrix/lldb-build/tools/lldb/lldb-test-build.noindex/module-cache-lldb/lldb-api"
output: 

runCmd: settings set use-color false
output: 

warning: (x86_64) /Users/buildslave/jenkins/workspace/lldb-cmake-matrix/lldb-build/tools/lldb/lldb-test-build.noindex/python_api/thread/TestThreadAPI.test_get_stop_description_dsym/a.out empty dSYM file detected, dSYM was created with an executable with no debug info.
FAIL: LLDB (/Users/buildslave/jenkins/workspace/lldb-cmake-matrix/lldb-build/bin/clang-10-x86_64) :: test_get_stop_description_dsym (TestThreadAPI.ThreadAPITestCase)
<bound method SBProcess.Kill of <lldb.SBProcess; proxy of <Swig Object of type 'lldb::SBProcess *' at 0x1349d1330> >>: success

runCmd: settings set symbols.enable-external-lookup false
output: 

runCmd: settings set plugin.process.gdb-remote.packet-timeout 60
output: 

runCmd: settings set symbols.clang-modules-cache-path "/Users/buildslave/jenkins/workspace/lldb-cmake-matrix/lldb-build/tools/lldb/lldb-test-build.noindex/module-cache-lldb/lldb-api"
output: 

runCmd: settings set use-color false
output: 

FAIL: LLDB (/Users/buildslave/jenkins/workspace/lldb-cmake-matrix/lldb-build/bin/clang-10-x86_64) :: test_get_stop_description_dwarf (TestThreadAPI.ThreadAPITestCase)
<bound method SBProcess.Kill of <lldb.SBProcess; proxy of <Swig Object of type 'lldb::SBProcess *' at 0x1349d11b0> >>: success

UNSUPPORTED: LLDB (/Users/buildslave/jenkins/workspace/lldb-cmake-matrix/lldb-build/bin/clang-10-x86_64) :: test_get_stop_description_dwo (TestThreadAPI.ThreadAPITestCase) (test case does not fall in any category of interest for this run) 
UNSUPPORTED: LLDB (/Users/buildslave/jenkins/workspace/lldb-cmake-matrix/lldb-build/bin/clang-10-x86_64) :: test_get_stop_description_gmodules (TestThreadAPI.ThreadAPITestCase) (test case does not fall in any category of interest for this run) 
runCmd: settings set symbols.enable-external-lookup false
output: 

runCmd: settings set plugin.process.gdb-remote.packet-timeout 60
output: 

runCmd: settings set symbols.clang-modules-cache-path "/Users/buildslave/jenkins/workspace/lldb-cmake-matrix/lldb-build/tools/lldb/lldb-test-build.noindex/module-cache-lldb/lldb-api"
output: 

runCmd: settings set use-color false
output: 

warning: (x86_64) /Users/buildslave/jenkins/workspace/lldb-cmake-matrix/lldb-build/tools/lldb/lldb-test-build.noindex/python_api/thread/TestThreadAPI.test_run_to_address_dsym/test_run_to_address_dsym empty dSYM file detected, dSYM was created with an executable with no debug info.
runCmd: breakpoint list
output: Current breakpoints:
1: file = 'main2.cpp', line = 28, exact_match = 0, locations = 0 (pending)



FAIL: LLDB (/Users/buildslave/jenkins/workspace/lldb-cmake-matrix/lldb-build/bin/clang-10-x86_64) :: test_run_to_address_dsym (TestThreadAPI.ThreadAPITestCase)
<bound method SBProcess.Kill of <lldb.SBProcess; proxy of <Swig Object of type 'lldb::SBProcess *' at 0x1349d1300> >>: success

runCmd: settings set symbols.enable-external-lookup false
output: 

runCmd: settings set plugin.process.gdb-remote.packet-timeout 60
output: 

runCmd: settings set symbols.clang-modules-cache-path "/Users/buildslave/jenkins/workspace/lldb-cmake-matrix/lldb-build/tools/lldb/lldb-test-build.noindex/module-cache-lldb/lldb-api"
output: 

runCmd: settings set use-color false
output: 

runCmd: breakpoint list
output: Current breakpoints:
1: file = 'main2.cpp', line = 28, exact_match = 0, locations = 0 (pending)



FAIL: LLDB (/Users/buildslave/jenkins/workspace/lldb-cmake-matrix/lldb-build/bin/clang-10-x86_64) :: test_run_to_address_dwarf (TestThreadAPI.ThreadAPITestCase)
<bound method SBProcess.Kill of <lldb.SBProcess; proxy of <Swig Object of type 'lldb::SBProcess *' at 0x1349d1180> >>: success

UNSUPPORTED: LLDB (/Users/buildslave/jenkins/workspace/lldb-cmake-matrix/lldb-build/bin/clang-10-x86_64) :: test_run_to_address_dwo (TestThreadAPI.ThreadAPITestCase) (test case does not fall in any category of interest for this run) 
UNSUPPORTED: LLDB (/Users/buildslave/jenkins/workspace/lldb-cmake-matrix/lldb-build/bin/clang-10-x86_64) :: test_run_to_address_gmodules (TestThreadAPI.ThreadAPITestCase) (test case does not fall in any category of interest for this run) 
runCmd: settings set symbols.enable-external-lookup false
output: 

runCmd: settings set plugin.process.gdb-remote.packet-timeout 60
output: 

runCmd: settings set symbols.clang-modules-cache-path "/Users/buildslave/jenkins/workspace/lldb-cmake-matrix/lldb-build/tools/lldb/lldb-test-build.noindex/module-cache-lldb/lldb-api"
output: 

runCmd: settings set use-color false
output: 

warning: (x86_64) /Users/buildslave/jenkins/workspace/lldb-cmake-matrix/lldb-build/tools/lldb/lldb-test-build.noindex/python_api/thread/TestThreadAPI.test_step_out_of_malloc_into_function_b_dsym/test_step_out_of_malloc_into_function_b_dsym empty dSYM file detected, dSYM was created with an executable with no debug info.
runCmd: thread backtrace
output: * thread #1, queue = 'com.apple.main-thread', stop reason = step out

  * frame #0: 0x000000010bc48e70 test_step_out_of_malloc_into_function_b_dsym`b(int) + 32
    frame #1: 0x000000010bc48e0d test_step_out_of_malloc_into_function_b_dsym`a(int) + 29
    frame #2: 0x000000010bc48ee0 test_step_out_of_malloc_into_function_b_dsym`main + 32
    frame #3: 0x00007fff60f94085 libdyld.dylib`start + 1
    frame #4: 0x00007fff60f94085 libdyld.dylib`start + 1


FAIL: LLDB (/Users/buildslave/jenkins/workspace/lldb-cmake-matrix/lldb-build/bin/clang-10-x86_64) :: test_step_out_of_malloc_into_function_b_dsym (TestThreadAPI.ThreadAPITestCase)
<bound method SBProcess.Kill of <lldb.SBProcess; proxy of <Swig Object of type 'lldb::SBProcess *' at 0x1349d11e0> >>: success

runCmd: settings set symbols.enable-external-lookup false
output: 

runCmd: settings set plugin.process.gdb-remote.packet-timeout 60
output: 

runCmd: settings set symbols.clang-modules-cache-path "/Users/buildslave/jenkins/workspace/lldb-cmake-matrix/lldb-build/tools/lldb/lldb-test-build.noindex/module-cache-lldb/lldb-api"
output: 

runCmd: settings set use-color false
output: 

runCmd: thread backtrace
output: * thread #1, queue = 'com.apple.main-thread', stop reason = step out

  * frame #0: 0x000000010f1d8e70 test_step_out_of_malloc_into_function_b_dwarf`b(int) + 32
    frame #1: 0x000000010f1d8e0d test_step_out_of_malloc_into_function_b_dwarf`a(int) + 29
    frame #2: 0x000000010f1d8ee0 test_step_out_of_malloc_into_function_b_dwarf`main + 32
    frame #3: 0x00007fff60f94085 libdyld.dylib`start + 1
    frame #4: 0x00007fff60f94085 libdyld.dylib`start + 1


FAIL: LLDB (/Users/buildslave/jenkins/workspace/lldb-cmake-matrix/lldb-build/bin/clang-10-x86_64) :: test_step_out_of_malloc_into_function_b_dwarf (TestThreadAPI.ThreadAPITestCase)
<bound method SBProcess.Kill of <lldb.SBProcess; proxy of <Swig Object of type 'lldb::SBProcess *' at 0x135897f30> >>: success

UNSUPPORTED: LLDB (/Users/buildslave/jenkins/workspace/lldb-cmake-matrix/lldb-build/bin/clang-10-x86_64) :: test_step_out_of_malloc_into_function_b_dwo (TestThreadAPI.ThreadAPITestCase) (test case does not fall in any category of interest for this run) 
UNSUPPORTED: LLDB (/Users/buildslave/jenkins/workspace/lldb-cmake-matrix/lldb-build/bin/clang-10-x86_64) :: test_step_out_of_malloc_into_function_b_gmodules (TestThreadAPI.ThreadAPITestCase) (test case does not fall in any category of interest for this run) 
runCmd: settings set symbols.enable-external-lookup false
output: 

runCmd: settings set plugin.process.gdb-remote.packet-timeout 60
output: 

runCmd: settings set symbols.clang-modules-cache-path "/Users/buildslave/jenkins/workspace/lldb-cmake-matrix/lldb-build/tools/lldb/lldb-test-build.noindex/module-cache-lldb/lldb-api"
output: 

runCmd: settings set use-color false
output: 

warning: (x86_64) /Users/buildslave/jenkins/workspace/lldb-cmake-matrix/lldb-build/tools/lldb/lldb-test-build.noindex/python_api/thread/TestThreadAPI.test_step_over_3_times_dsym/test_step_over_3_times_dsym empty dSYM file detected, dSYM was created with an executable with no debug info.
runCmd: breakpoint list
output: Current breakpoints:
1: file = 'main2.cpp', line = 28, exact_match = 0, locations = 0 (pending)



FAIL: LLDB (/Users/buildslave/jenkins/workspace/lldb-cmake-matrix/lldb-build/bin/clang-10-x86_64) :: test_step_over_3_times_dsym (TestThreadAPI.ThreadAPITestCase)
<bound method SBProcess.Kill of <lldb.SBProcess; proxy of <Swig Object of type 'lldb::SBProcess *' at 0x135897e40> >>: success

runCmd: settings set symbols.enable-external-lookup false
output: 

runCmd: settings set plugin.process.gdb-remote.packet-timeout 60
output: 

runCmd: settings set symbols.clang-modules-cache-path "/Users/buildslave/jenkins/workspace/lldb-cmake-matrix/lldb-build/tools/lldb/lldb-test-build.noindex/module-cache-lldb/lldb-api"
output: 

runCmd: settings set use-color false
output: 

runCmd: breakpoint list
output: Current breakpoints:
1: file = 'main2.cpp', line = 28, exact_match = 0, locations = 0 (pending)



FAIL: LLDB (/Users/buildslave/jenkins/workspace/lldb-cmake-matrix/lldb-build/bin/clang-10-x86_64) :: test_step_over_3_times_dwarf (TestThreadAPI.ThreadAPITestCase)
<bound method SBProcess.Kill of <lldb.SBProcess; proxy of <Swig Object of type 'lldb::SBProcess *' at 0x135897db0> >>: success

UNSUPPORTED: LLDB (/Users/buildslave/jenkins/workspace/lldb-cmake-matrix/lldb-build/bin/clang-10-x86_64) :: test_step_over_3_times_dwo (TestThreadAPI.ThreadAPITestCase) (test case does not fall in any category of interest for this run) 
UNSUPPORTED: LLDB (/Users/buildslave/jenkins/workspace/lldb-cmake-matrix/lldb-build/bin/clang-10-x86_64) :: test_step_over_3_times_gmodules (TestThreadAPI.ThreadAPITestCase) (test case does not fall in any category of interest for this run) 
Restore dir to: /Users/buildslave/jenkins/workspace/lldb-cmake-matrix/lldb-build/tools/lldb/test
======================================================================
ERROR: test_get_process_dsym (TestThreadAPI.ThreadAPITestCase)
    Test Python SBThread.GetProcess() API.
----------------------------------------------------------------------
Traceback (most recent call last):
  File "/Users/buildslave/jenkins/workspace/lldb-cmake-matrix/llvm-project/lldb/packages/Python/lldbsuite/test/lldbtest.py", line 1748, in test_method
    return attrvalue(self)
  File "/Users/buildslave/jenkins/workspace/lldb-cmake-matrix/llvm-project/lldb/packages/Python/lldbsuite/test/python_api/thread/TestThreadAPI.py", line 23, in test_get_process
    self.get_process()
  File "/Users/buildslave/jenkins/workspace/lldb-cmake-matrix/llvm-project/lldb/packages/Python/lldbsuite/test/python_api/thread/TestThreadAPI.py", line 96, in get_process
    thread.IsValid(),
AttributeError: 'NoneType' object has no attribute 'IsValid'
Config=x86_64-/Users/buildslave/jenkins/workspace/lldb-cmake-matrix/lldb-build/bin/clang-10
======================================================================
ERROR: test_get_process_dwarf (TestThreadAPI.ThreadAPITestCase)
    Test Python SBThread.GetProcess() API.
----------------------------------------------------------------------
Traceback (most recent call last):
  File "/Users/buildslave/jenkins/workspace/lldb-cmake-matrix/llvm-project/lldb/packages/Python/lldbsuite/test/lldbtest.py", line 1748, in test_method
    return attrvalue(self)
  File "/Users/buildslave/jenkins/workspace/lldb-cmake-matrix/llvm-project/lldb/packages/Python/lldbsuite/test/python_api/thread/TestThreadAPI.py", line 23, in test_get_process
    self.get_process()
  File "/Users/buildslave/jenkins/workspace/lldb-cmake-matrix/llvm-project/lldb/packages/Python/lldbsuite/test/python_api/thread/TestThreadAPI.py", line 96, in get_process
    thread.IsValid(),
AttributeError: 'NoneType' object has no attribute 'IsValid'
Config=x86_64-/Users/buildslave/jenkins/workspace/lldb-cmake-matrix/lldb-build/bin/clang-10
======================================================================
ERROR: test_get_stop_description_dsym (TestThreadAPI.ThreadAPITestCase)
    Test Python SBThread.GetStopDescription() API.
----------------------------------------------------------------------
Traceback (most recent call last):
  File "/Users/buildslave/jenkins/workspace/lldb-cmake-matrix/llvm-project/lldb/packages/Python/lldbsuite/test/lldbtest.py", line 1748, in test_method
    return attrvalue(self)
  File "/Users/buildslave/jenkins/workspace/lldb-cmake-matrix/llvm-project/lldb/packages/Python/lldbsuite/test/python_api/thread/TestThreadAPI.py", line 29, in test_get_stop_description
    self.get_stop_description()
  File "/Users/buildslave/jenkins/workspace/lldb-cmake-matrix/llvm-project/lldb/packages/Python/lldbsuite/test/python_api/thread/TestThreadAPI.py", line 123, in get_stop_description
    thread.IsValid(),
AttributeError: 'NoneType' object has no attribute 'IsValid'
Config=x86_64-/Users/buildslave/jenkins/workspace/lldb-cmake-matrix/lldb-build/bin/clang-10
======================================================================
ERROR: test_get_stop_description_dwarf (TestThreadAPI.ThreadAPITestCase)
    Test Python SBThread.GetStopDescription() API.
----------------------------------------------------------------------
Traceback (most recent call last):
  File "/Users/buildslave/jenkins/workspace/lldb-cmake-matrix/llvm-project/lldb/packages/Python/lldbsuite/test/lldbtest.py", line 1748, in test_method
    return attrvalue(self)
  File "/Users/buildslave/jenkins/workspace/lldb-cmake-matrix/llvm-project/lldb/packages/Python/lldbsuite/test/python_api/thread/TestThreadAPI.py", line 29, in test_get_stop_description
    self.get_stop_description()
  File "/Users/buildslave/jenkins/workspace/lldb-cmake-matrix/llvm-project/lldb/packages/Python/lldbsuite/test/python_api/thread/TestThreadAPI.py", line 123, in get_stop_description
    thread.IsValid(),
AttributeError: 'NoneType' object has no attribute 'IsValid'
Config=x86_64-/Users/buildslave/jenkins/workspace/lldb-cmake-matrix/lldb-build/bin/clang-10
======================================================================
FAIL: test_run_to_address_dsym (TestThreadAPI.ThreadAPITestCase)
    Test Python SBThread.RunToAddress() API.
----------------------------------------------------------------------
Traceback (most recent call last):
  File "/Users/buildslave/jenkins/workspace/lldb-cmake-matrix/llvm-project/lldb/packages/Python/lldbsuite/test/lldbtest.py", line 1748, in test_method
    return attrvalue(self)
  File "/Users/buildslave/jenkins/workspace/lldb-cmake-matrix/llvm-project/lldb/packages/Python/lldbsuite/test/python_api/thread/TestThreadAPI.py", line 38, in test_run_to_address
    self.run_to_address(self.exe_name)
  File "/Users/buildslave/jenkins/workspace/lldb-cmake-matrix/llvm-project/lldb/packages/Python/lldbsuite/test/python_api/thread/TestThreadAPI.py", line 246, in run_to_address
    self.assertTrue(process.GetState() == lldb.eStateStopped)
AssertionError: False is not True
Config=x86_64-/Users/buildslave/jenkins/workspace/lldb-cmake-matrix/lldb-build/bin/clang-10
======================================================================
FAIL: test_run_to_address_dwarf (TestThreadAPI.ThreadAPITestCase)
    Test Python SBThread.RunToAddress() API.
----------------------------------------------------------------------
Traceback (most recent call last):
  File "/Users/buildslave/jenkins/workspace/lldb-cmake-matrix/llvm-project/lldb/packages/Python/lldbsuite/test/lldbtest.py", line 1748, in test_method
    return attrvalue(self)
  File "/Users/buildslave/jenkins/workspace/lldb-cmake-matrix/llvm-project/lldb/packages/Python/lldbsuite/test/python_api/thread/TestThreadAPI.py", line 38, in test_run_to_address
    self.run_to_address(self.exe_name)
  File "/Users/buildslave/jenkins/workspace/lldb-cmake-matrix/llvm-project/lldb/packages/Python/lldbsuite/test/python_api/thread/TestThreadAPI.py", line 246, in run_to_address
    self.assertTrue(process.GetState() == lldb.eStateStopped)
AssertionError: False is not True
Config=x86_64-/Users/buildslave/jenkins/workspace/lldb-cmake-matrix/lldb-build/bin/clang-10
======================================================================
FAIL: test_step_out_of_malloc_into_function_b_dsym (TestThreadAPI.ThreadAPITestCase)
    Test Python SBThread.StepOut() API to step out of a malloc call where the call site is at function b().
----------------------------------------------------------------------
Traceback (most recent call last):
  File "/Users/buildslave/jenkins/workspace/lldb-cmake-matrix/llvm-project/lldb/packages/Python/lldbsuite/test/lldbtest.py", line 1748, in test_method
    return attrvalue(self)
  File "/Users/buildslave/jenkins/workspace/lldb-cmake-matrix/llvm-project/lldb/packages/Python/lldbsuite/test/decorators.py", line 111, in wrapper
    func(*args, **kwargs)
  File "/Users/buildslave/jenkins/workspace/lldb-cmake-matrix/llvm-project/lldb/packages/Python/lldbsuite/test/decorators.py", line 111, in wrapper
    func(*args, **kwargs)
  File "/Users/buildslave/jenkins/workspace/lldb-cmake-matrix/llvm-project/lldb/packages/Python/lldbsuite/test/decorators.py", line 111, in wrapper
    func(*args, **kwargs)
  File "/Users/buildslave/jenkins/workspace/lldb-cmake-matrix/llvm-project/lldb/packages/Python/lldbsuite/test/python_api/thread/TestThreadAPI.py", line 50, in test_step_out_of_malloc_into_function_b
    self.step_out_of_malloc_into_function_b(self.exe_name)
  File "/Users/buildslave/jenkins/workspace/lldb-cmake-matrix/llvm-project/lldb/packages/Python/lldbsuite/test/python_api/thread/TestThreadAPI.py", line 179, in step_out_of_malloc_into_function_b
    "step out of malloc into function b is successful")
AssertionError: False is not True : step out of malloc into function b is successful
Config=x86_64-/Users/buildslave/jenkins/workspace/lldb-cmake-matrix/lldb-build/bin/clang-10
======================================================================
FAIL: test_step_out_of_malloc_into_function_b_dwarf (TestThreadAPI.ThreadAPITestCase)
    Test Python SBThread.StepOut() API to step out of a malloc call where the call site is at function b().
----------------------------------------------------------------------
Traceback (most recent call last):
  File "/Users/buildslave/jenkins/workspace/lldb-cmake-matrix/llvm-project/lldb/packages/Python/lldbsuite/test/lldbtest.py", line 1748, in test_method
    return attrvalue(self)
  File "/Users/buildslave/jenkins/workspace/lldb-cmake-matrix/llvm-project/lldb/packages/Python/lldbsuite/test/decorators.py", line 111, in wrapper
    func(*args, **kwargs)
  File "/Users/buildslave/jenkins/workspace/lldb-cmake-matrix/llvm-project/lldb/packages/Python/lldbsuite/test/decorators.py", line 111, in wrapper
    func(*args, **kwargs)
  File "/Users/buildslave/jenkins/workspace/lldb-cmake-matrix/llvm-project/lldb/packages/Python/lldbsuite/test/decorators.py", line 111, in wrapper
    func(*args, **kwargs)
  File "/Users/buildslave/jenkins/workspace/lldb-cmake-matrix/llvm-project/lldb/packages/Python/lldbsuite/test/python_api/thread/TestThreadAPI.py", line 50, in test_step_out_of_malloc_into_function_b
    self.step_out_of_malloc_into_function_b(self.exe_name)
  File "/Users/buildslave/jenkins/workspace/lldb-cmake-matrix/llvm-project/lldb/packages/Python/lldbsuite/test/python_api/thread/TestThreadAPI.py", line 179, in step_out_of_malloc_into_function_b
    "step out of malloc into function b is successful")
AssertionError: False is not True : step out of malloc into function b is successful
Config=x86_64-/Users/buildslave/jenkins/workspace/lldb-cmake-matrix/lldb-build/bin/clang-10
======================================================================
FAIL: test_step_over_3_times_dsym (TestThreadAPI.ThreadAPITestCase)
    Test Python SBThread.StepOver() API.
----------------------------------------------------------------------
Traceback (most recent call last):
  File "/Users/buildslave/jenkins/workspace/lldb-cmake-matrix/llvm-project/lldb/packages/Python/lldbsuite/test/lldbtest.py", line 1748, in test_method
    return attrvalue(self)
  File "/Users/buildslave/jenkins/workspace/lldb-cmake-matrix/llvm-project/lldb/packages/Python/lldbsuite/test/python_api/thread/TestThreadAPI.py", line 59, in test_step_over_3_times
    self.step_over_3_times(self.exe_name)
  File "/Users/buildslave/jenkins/workspace/lldb-cmake-matrix/llvm-project/lldb/packages/Python/lldbsuite/test/python_api/thread/TestThreadAPI.py", line 200, in step_over_3_times
    self.assertTrue(process.GetState() == lldb.eStateStopped)
AssertionError: False is not True
Config=x86_64-/Users/buildslave/jenkins/workspace/lldb-cmake-matrix/lldb-build/bin/clang-10
======================================================================
FAIL: test_step_over_3_times_dwarf (TestThreadAPI.ThreadAPITestCase)
    Test Python SBThread.StepOver() API.
----------------------------------------------------------------------
Traceback (most recent call last):
  File "/Users/buildslave/jenkins/workspace/lldb-cmake-matrix/llvm-project/lldb/packages/Python/lldbsuite/test/lldbtest.py", line 1748, in test_method
    return attrvalue(self)
  File "/Users/buildslave/jenkins/workspace/lldb-cmake-matrix/llvm-project/lldb/packages/Python/lldbsuite/test/python_api/thread/TestThreadAPI.py", line 59, in test_step_over_3_times
    self.step_over_3_times(self.exe_name)
  File "/Users/buildslave/jenkins/workspace/lldb-cmake-matrix/llvm-project/lldb/packages/Python/lldbsuite/test/python_api/thread/TestThreadAPI.py", line 200, in step_over_3_times
    self.assertTrue(process.GetState() == lldb.eStateStopped)
AssertionError: False is not True
Config=x86_64-/Users/buildslave/jenkins/workspace/lldb-cmake-matrix/lldb-build/bin/clang-10
----------------------------------------------------------------------
Ran 20 tests in 9.731s

RESULT: FAILED (0 passes, 6 failures, 4 errors, 10 skipped, 0 expected failures, 0 unexpected successes)

********************
FAIL: lldb-api :: functionalities/inferior-crashing/recursive-inferior/TestRecursiveInferior.py (1782 of 1788)
******************** TEST 'lldb-api :: functionalities/inferior-crashing/recursive-inferior/TestRecursiveInferior.py' FAILED ********************
lldb version 10.0.99 (http://labmaster3.local/git/llvm-project.git revision 1f20bc17d005fb37816fac95955ec4a36f9de26f)
  clang revision 1f20bc17d005fb37816fac95955ec4a36f9de26f
  llvm revision 1f20bc17d005fb37816fac95955ec4a36f9de26f
LLDB library dir: /Users/buildslave/jenkins/workspace/lldb-cmake-matrix/lldb-build/bin
LLDB import library dir: /Users/buildslave/jenkins/workspace/lldb-cmake-matrix/lldb-build/bin
libstdcxx tests will not be run because: Don't know how to build with libstdcxx on macosx
Skipping following debug info categories: ['dwo']
Stack trace for thread id=0x8a4f0d name=None queue=com.apple.main-thread stop reason=exception
  frame #0: 0x00000108089f84 a.out`recursive_function + 52
  frame #1: 0x00000108089f71 a.out`recursive_function + 33
  frame #2: 0x00000108089f71 a.out`recursive_function + 33
  frame #3: 0x00000108089f71 a.out`recursive_function + 33
  frame #4: 0x00000108089f71 a.out`recursive_function + 33
  frame #5: 0x00000108089f71 a.out`recursive_function + 33
  frame #6: 0x00000108089f71 a.out`recursive_function + 33
  frame #7: 0x00000108089f71 a.out`recursive_function + 33
  frame #8: 0x00000108089f71 a.out`recursive_function + 33
  frame #9: 0x00000108089f71 a.out`recursive_function + 33
  frame #10: 0x00000108089f71 a.out`recursive_function + 33
  frame #11: 0x00000108089fae a.out`main + 30
  frame #12: 0x007fff60f94085 libdyld.dylib`start + 1
Stack trace for thread id=0x8a4fd7 name=None queue=com.apple.main-thread stop reason=exception
  frame #0: 0x0000010a77ff84 a.out`recursive_function + 52
  frame #1: 0x0000010a77ff71 a.out`recursive_function + 33
  frame #2: 0x0000010a77ff71 a.out`recursive_function + 33
  frame #3: 0x0000010a77ff71 a.out`recursive_function + 33
  frame #4: 0x0000010a77ff71 a.out`recursive_function + 33
  frame #5: 0x0000010a77ff71 a.out`recursive_function + 33
  frame #6: 0x0000010a77ff71 a.out`recursive_function + 33
  frame #7: 0x0000010a77ff71 a.out`recursive_function + 33
  frame #8: 0x0000010a77ff71 a.out`recursive_function + 33
  frame #9: 0x0000010a77ff71 a.out`recursive_function + 33
  frame #10: 0x0000010a77ff71 a.out`recursive_function + 33
  frame #11: 0x0000010a77ffae a.out`main + 30
  frame #12: 0x007fff60f94085 libdyld.dylib`start + 1

Session logs for test failures/errors/unexpected successes will go into directory '/Users/buildslave/jenkins/workspace/lldb-cmake-matrix/test/logs'
Command invoked: /Users/buildslave/jenkins/workspace/lldb-cmake-matrix/llvm-project/lldb/test/API/dotest.py --arch=x86_64 -s /Users/buildslave/jenkins/workspace/lldb-cmake-matrix/lldb-build/lldb-test-traces -S nm -u CXXFLAGS -u CFLAGS --executable /Users/buildslave/jenkins/workspace/lldb-cmake-matrix/lldb-build/./bin/lldb --dsymutil /Users/buildslave/jenkins/workspace/lldb-cmake-matrix/lldb-build/./bin/dsymutil --filecheck /Users/buildslave/jenkins/workspace/lldb-cmake-matrix/lldb-build/./bin/FileCheck -C /Users/buildslave/jenkins/workspace/lldb-cmake-matrix/lldb-build/./bin/clang --codesign-identity lldb_codesign --server /Users/buildslave/jenkins/workspace/lldb-cmake-matrix/lldb-build/./bin/debugserver --arch x86_64 --build-dir /Users/buildslave/jenkins/workspace/lldb-cmake-matrix/lldb-build/lldb-test-build.noindex -s=/Users/buildslave/jenkins/workspace/lldb-cmake-matrix/test/logs -t --env TERM=vt100 --skip-category gmodules --skip-category watchpoint --arch=x86_64 --dwarf-version=5 --env LLVM_LIBS_DIR=/Users/buildslave/jenkins/workspace/lldb-cmake-matrix/lldb-build/./lib --build-dir /Users/buildslave/jenkins/workspace/lldb-cmake-matrix/lldb-build/tools/lldb/lldb-test-build.noindex --lldb-module-cache-dir /Users/buildslave/jenkins/workspace/lldb-cmake-matrix/lldb-build/tools/lldb/lldb-test-build.noindex/module-cache-lldb/lldb-api --clang-module-cache-dir /Users/buildslave/jenkins/workspace/lldb-cmake-matrix/lldb-build/tools/lldb/lldb-test-build.noindex/module-cache-clang/lldb-api /Users/buildslave/jenkins/workspace/lldb-cmake-matrix/llvm-project/lldb/packages/Python/lldbsuite/test/functionalities/inferior-crashing/recursive-inferior -p TestRecursiveInferior.py
Change dir to: /Users/buildslave/jenkins/workspace/lldb-cmake-matrix/llvm-project/lldb/packages/Python/lldbsuite/test/functionalities/inferior-crashing/recursive-inferior
runCmd: settings set symbols.enable-external-lookup false
output: 

runCmd: settings set plugin.process.gdb-remote.packet-timeout 60
output: 

runCmd: settings set symbols.clang-modules-cache-path "/Users/buildslave/jenkins/workspace/lldb-cmake-matrix/lldb-build/tools/lldb/lldb-test-build.noindex/module-cache-lldb/lldb-api"
output: 

runCmd: settings set use-color false
output: 

warning: (x86_64) /Users/buildslave/jenkins/workspace/lldb-cmake-matrix/lldb-build/tools/lldb/lldb-test-build.noindex/functionalities/inferior-crashing/recursive-inferior/TestRecursiveInferior.test_recursive_inferior_crashing_dsym/a.out empty dSYM file detected, dSYM was created with an executable with no debug info.
runCmd: file /Users/buildslave/jenkins/workspace/lldb-cmake-matrix/lldb-build/tools/lldb/lldb-test-build.noindex/functionalities/inferior-crashing/recursive-inferior/TestRecursiveInferior.test_recursive_inferior_crashing_dsym/a.out
output: Current executable set to '/Users/buildslave/jenkins/workspace/lldb-cmake-matrix/lldb-build/tools/lldb/lldb-test-build.noindex/functionalities/inferior-crashing/recursive-inferior/TestRecursiveInferior.test_recursive_inferior_crashing_dsym/a.out' (x86_64).


runCmd: run
output: Process 32329 stopped
* thread #1, queue = 'com.apple.main-thread', stop reason = EXC_BAD_ACCESS (code=1, address=0x0)
    frame #0: 0x0000000100000f84 a.out`recursive_function + 52
a.out`recursive_function:
->  0x100000f84 <+52>: movb   $0x0, (%rax)
    0x100000f87 <+55>: addq   $0x18, %rsp
    0x100000f8b <+59>: retq   
    0x100000f8c <+60>: nopl   (%rax)

Process 32329 launched: '/Users/buildslave/jenkins/workspace/lldb-cmake-matrix/lldb-build/tools/lldb/lldb-test-build.noindex/functionalities/inferior-crashing/recursive-inferior/TestRecursiveInferior.test_recursive_inferior_crashing_dsym/a.out' (x86_64)


runCmd: thread list
output: Process 32329 stopped
* thread #1: tid = 0x8a4a2c, 0x0000000100000f84 a.out`recursive_function + 52, queue = 'com.apple.main-thread', stop reason = EXC_BAD_ACCESS (code=1, address=0x0)


Expecting sub string: stopped
Matched

Expecting sub string: stop reason = EXC_BAD_ACCESS
Matched

runCmd: thread backtrace all
output: * thread #1, queue = 'com.apple.main-thread', stop reason = EXC_BAD_ACCESS (code=1, address=0x0)
  * frame #0: 0x0000000100000f84 a.out`recursive_function + 52
    frame #1: 0x0000000100000f71 a.out`recursive_function + 33
    frame #2: 0x0000000100000f71 a.out`recursive_function + 33
    frame #3: 0x0000000100000f71 a.out`recursive_function + 33
    frame #4: 0x0000000100000f71 a.out`recursive_function + 33
    frame #5: 0x0000000100000f71 a.out`recursive_function + 33
    frame #6: 0x0000000100000f71 a.out`recursive_function + 33
    frame #7: 0x0000000100000f71 a.out`recursive_function + 33
    frame #8: 0x0000000100000f71 a.out`recursive_function + 33
    frame #9: 0x0000000100000f71 a.out`recursive_function + 33
    frame #10: 0x0000000100000f71 a.out`recursive_function + 33
    frame #11: 0x0000000100000fae a.out`main + 30
    frame #12: 0x00007fff60f94085 libdyld.dylib`start + 1
    frame #13: 0x00007fff60f94085 libdyld.dylib`start + 1


Expecting sub string: stop reason = EXC_BAD_ACCESS
Matched

Expecting sub string: main
Matched

Expecting sub string: argc
Not matched

FAIL: LLDB (/Users/buildslave/jenkins/workspace/lldb-cmake-matrix/lldb-build/bin/clang-10-x86_64) :: test_recursive_inferior_crashing_dsym (TestRecursiveInferior.CrashingRecursiveInferiorTestCase)
<bound method SBProcess.Kill of <lldb.SBProcess; proxy of <Swig Object of type 'lldb::SBProcess *' at 0x13b125270> >>: success

runCmd: settings set symbols.enable-external-lookup false
output: 

runCmd: settings set plugin.process.gdb-remote.packet-timeout 60
output: 

runCmd: settings set symbols.clang-modules-cache-path "/Users/buildslave/jenkins/workspace/lldb-cmake-matrix/lldb-build/tools/lldb/lldb-test-build.noindex/module-cache-lldb/lldb-api"
output: 

runCmd: settings set use-color false
output: 

runCmd: file /Users/buildslave/jenkins/workspace/lldb-cmake-matrix/lldb-build/tools/lldb/lldb-test-build.noindex/functionalities/inferior-crashing/recursive-inferior/TestRecursiveInferior.test_recursive_inferior_crashing_dwarf/a.out
output: Current executable set to '/Users/buildslave/jenkins/workspace/lldb-cmake-matrix/lldb-build/tools/lldb/lldb-test-build.noindex/functionalities/inferior-crashing/recursive-inferior/TestRecursiveInferior.test_recursive_inferior_crashing_dwarf/a.out' (x86_64).


runCmd: run
output: Process 32607 stopped
* thread #1, queue = 'com.apple.main-thread', stop reason = EXC_BAD_ACCESS (code=1, address=0x0)
    frame #0: 0x0000000100000f84 a.out`recursive_function + 52
a.out`recursive_function:
->  0x100000f84 <+52>: movb   $0x0, (%rax)
    0x100000f87 <+55>: addq   $0x18, %rsp
    0x100000f8b <+59>: retq   
    0x100000f8c <+60>: nopl   (%rax)

Process 32607 launched: '/Users/buildslave/jenkins/workspace/lldb-cmake-matrix/lldb-build/tools/lldb/lldb-test-build.noindex/functionalities/inferior-crashing/recursive-inferior/TestRecursiveInferior.test_recursive_inferior_crashing_dwarf/a.out' (x86_64)


runCmd: thread list
output: Process 32607 stopped
* thread #1: tid = 0x8a4bb9, 0x0000000100000f84 a.out`recursive_function + 52, queue = 'com.apple.main-thread', stop reason = EXC_BAD_ACCESS (code=1, address=0x0)


Expecting sub string: stopped
Matched

Expecting sub string: stop reason = EXC_BAD_ACCESS
Matched

runCmd: thread backtrace all
output: * thread #1, queue = 'com.apple.main-thread', stop reason = EXC_BAD_ACCESS (code=1, address=0x0)
  * frame #0: 0x0000000100000f84 a.out`recursive_function + 52
    frame #1: 0x0000000100000f71 a.out`recursive_function + 33
    frame #2: 0x0000000100000f71 a.out`recursive_function + 33
    frame #3: 0x0000000100000f71 a.out`recursive_function + 33
    frame #4: 0x0000000100000f71 a.out`recursive_function + 33
    frame #5: 0x0000000100000f71 a.out`recursive_function + 33
    frame #6: 0x0000000100000f71 a.out`recursive_function + 33
    frame #7: 0x0000000100000f71 a.out`recursive_function + 33
    frame #8: 0x0000000100000f71 a.out`recursive_function + 33
    frame #9: 0x0000000100000f71 a.out`recursive_function + 33
    frame #10: 0x0000000100000f71 a.out`recursive_function + 33
    frame #11: 0x0000000100000fae a.out`main + 30
    frame #12: 0x00007fff60f94085 libdyld.dylib`start + 1
    frame #13: 0x00007fff60f94085 libdyld.dylib`start + 1


Expecting sub string: stop reason = EXC_BAD_ACCESS
Matched

Expecting sub string: main
Matched

Expecting sub string: argc
Not matched

FAIL: LLDB (/Users/buildslave/jenkins/workspace/lldb-cmake-matrix/lldb-build/bin/clang-10-x86_64) :: test_recursive_inferior_crashing_dwarf (TestRecursiveInferior.CrashingRecursiveInferiorTestCase)
<bound method SBProcess.Kill of <lldb.SBProcess; proxy of <Swig Object of type 'lldb::SBProcess *' at 0x13b1250f0> >>: success

UNSUPPORTED: LLDB (/Users/buildslave/jenkins/workspace/lldb-cmake-matrix/lldb-build/bin/clang-10-x86_64) :: test_recursive_inferior_crashing_dwo (TestRecursiveInferior.CrashingRecursiveInferiorTestCase) (test case does not fall in any category of interest for this run) 
runCmd: settings set symbols.enable-external-lookup false
output: 

runCmd: settings set plugin.process.gdb-remote.packet-timeout 60
output: 

runCmd: settings set symbols.clang-modules-cache-path "/Users/buildslave/jenkins/workspace/lldb-cmake-matrix/lldb-build/tools/lldb/lldb-test-build.noindex/module-cache-lldb/lldb-api"
output: 

runCmd: settings set use-color false
output: 

warning: (x86_64) /Users/buildslave/jenkins/workspace/lldb-cmake-matrix/lldb-build/tools/lldb/lldb-test-build.noindex/functionalities/inferior-crashing/recursive-inferior/TestRecursiveInferior.test_recursive_inferior_crashing_expr_dsym/a.out empty dSYM file detected, dSYM was created with an executable with no debug info.
runCmd: file /Users/buildslave/jenkins/workspace/lldb-cmake-matrix/lldb-build/tools/lldb/lldb-test-build.noindex/functionalities/inferior-crashing/recursive-inferior/TestRecursiveInferior.test_recursive_inferior_crashing_expr_dsym/a.out
output: Current executable set to '/Users/buildslave/jenkins/workspace/lldb-cmake-matrix/lldb-build/tools/lldb/lldb-test-build.noindex/functionalities/inferior-crashing/recursive-inferior/TestRecursiveInferior.test_recursive_inferior_crashing_expr_dsym/a.out' (x86_64).


runCmd: run
output: Process 32866 stopped
* thread #1, queue = 'com.apple.main-thread', stop reason = EXC_BAD_ACCESS (code=1, address=0x0)
    frame #0: 0x0000000100000f84 a.out`recursive_function + 52
a.out`recursive_function:
->  0x100000f84 <+52>: movb   $0x0, (%rax)
    0x100000f87 <+55>: addq   $0x18, %rsp
    0x100000f8b <+59>: retq   
    0x100000f8c <+60>: nopl   (%rax)

Process 32866 launched: '/Users/buildslave/jenkins/workspace/lldb-cmake-matrix/lldb-build/tools/lldb/lldb-test-build.noindex/functionalities/inferior-crashing/recursive-inferior/TestRecursiveInferior.test_recursive_inferior_crashing_expr_dsym/a.out' (x86_64)


runCmd: p i
runCmd failed!
error: <user expression 0>:1:1: use of undeclared identifier 'i'
i
^


FAIL: LLDB (/Users/buildslave/jenkins/workspace/lldb-cmake-matrix/lldb-build/bin/clang-10-x86_64) :: test_recursive_inferior_crashing_expr_dsym (TestRecursiveInferior.CrashingRecursiveInferiorTestCase)
<bound method SBProcess.Kill of <lldb.SBProcess; proxy of <Swig Object of type 'lldb::SBProcess *' at 0x13b1252a0> >>: success

runCmd: settings set symbols.enable-external-lookup false
output: 

runCmd: settings set plugin.process.gdb-remote.packet-timeout 60
output: 

runCmd: settings set symbols.clang-modules-cache-path "/Users/buildslave/jenkins/workspace/lldb-cmake-matrix/lldb-build/tools/lldb/lldb-test-build.noindex/module-cache-lldb/lldb-api"
output: 

runCmd: settings set use-color false
output: 

runCmd: file /Users/buildslave/jenkins/workspace/lldb-cmake-matrix/lldb-build/tools/lldb/lldb-test-build.noindex/functionalities/inferior-crashing/recursive-inferior/TestRecursiveInferior.test_recursive_inferior_crashing_expr_dwarf/a.out
output: Current executable set to '/Users/buildslave/jenkins/workspace/lldb-cmake-matrix/lldb-build/tools/lldb/lldb-test-build.noindex/functionalities/inferior-crashing/recursive-inferior/TestRecursiveInferior.test_recursive_inferior_crashing_expr_dwarf/a.out' (x86_64).


runCmd: run
output: Process 33102 stopped
* thread #1, queue = 'com.apple.main-thread', stop reason = EXC_BAD_ACCESS (code=1, address=0x0)
    frame #0: 0x0000000100000f84 a.out`recursive_function + 52
a.out`recursive_function:
->  0x100000f84 <+52>: movb   $0x0, (%rax)
    0x100000f87 <+55>: addq   $0x18, %rsp
    0x100000f8b <+59>: retq   
    0x100000f8c <+60>: nopl   (%rax)

Process 33102 launched: '/Users/buildslave/jenkins/workspace/lldb-cmake-matrix/lldb-build/tools/lldb/lldb-test-build.noindex/functionalities/inferior-crashing/recursive-inferior/TestRecursiveInferior.test_recursive_inferior_crashing_expr_dwarf/a.out' (x86_64)


runCmd: p i
runCmd failed!
error: <user expression 0>:1:1: use of undeclared identifier 'i'
i
^


FAIL: LLDB (/Users/buildslave/jenkins/workspace/lldb-cmake-matrix/lldb-build/bin/clang-10-x86_64) :: test_recursive_inferior_crashing_expr_dwarf (TestRecursiveInferior.CrashingRecursiveInferiorTestCase)
<bound method SBProcess.Kill of <lldb.SBProcess; proxy of <Swig Object of type 'lldb::SBProcess *' at 0x13b125090> >>: success

UNSUPPORTED: LLDB (/Users/buildslave/jenkins/workspace/lldb-cmake-matrix/lldb-build/bin/clang-10-x86_64) :: test_recursive_inferior_crashing_expr_dwo (TestRecursiveInferior.CrashingRecursiveInferiorTestCase) (test case does not fall in any category of interest for this run) 
UNSUPPORTED: LLDB (/Users/buildslave/jenkins/workspace/lldb-cmake-matrix/lldb-build/bin/clang-10-x86_64) :: test_recursive_inferior_crashing_expr_gmodules (TestRecursiveInferior.CrashingRecursiveInferiorTestCase) (test case does not fall in any category of interest for this run) 
UNSUPPORTED: LLDB (/Users/buildslave/jenkins/workspace/lldb-cmake-matrix/lldb-build/bin/clang-10-x86_64) :: test_recursive_inferior_crashing_gmodules (TestRecursiveInferior.CrashingRecursiveInferiorTestCase) (test case does not fall in any category of interest for this run) 
runCmd: settings set symbols.enable-external-lookup false
output: 

runCmd: settings set plugin.process.gdb-remote.packet-timeout 60
output: 

runCmd: settings set symbols.clang-modules-cache-path "/Users/buildslave/jenkins/workspace/lldb-cmake-matrix/lldb-build/tools/lldb/lldb-test-build.noindex/module-cache-lldb/lldb-api"
output: 

runCmd: settings set use-color false
output: 

warning: (x86_64) /Users/buildslave/jenkins/workspace/lldb-cmake-matrix/lldb-build/tools/lldb/lldb-test-build.noindex/functionalities/inferior-crashing/recursive-inferior/TestRecursiveInferior.test_recursive_inferior_crashing_python_dsym/a.out empty dSYM file detected, dSYM was created with an executable with no debug info.
<bound method SBProcess.Kill of <lldb.SBProcess; proxy of <Swig Object of type 'lldb::SBProcess *' at 0x13bef7f30> >>: success

PASS: LLDB (/Users/buildslave/jenkins/workspace/lldb-cmake-matrix/lldb-build/bin/clang-10-x86_64) :: test_recursive_inferior_crashing_python_dsym (TestRecursiveInferior.CrashingRecursiveInferiorTestCase)
runCmd: settings set symbols.enable-external-lookup false
output: 

runCmd: settings set plugin.process.gdb-remote.packet-timeout 60
output: 

runCmd: settings set symbols.clang-modules-cache-path "/Users/buildslave/jenkins/workspace/lldb-cmake-matrix/lldb-build/tools/lldb/lldb-test-build.noindex/module-cache-lldb/lldb-api"
output: 

runCmd: settings set use-color false
output: 

<bound method SBProcess.Kill of <lldb.SBProcess; proxy of <Swig Object of type 'lldb::SBProcess *' at 0x13bef7f90> >>: success

PASS: LLDB (/Users/buildslave/jenkins/workspace/lldb-cmake-matrix/lldb-build/bin/clang-10-x86_64) :: test_recursive_inferior_crashing_python_dwarf (TestRecursiveInferior.CrashingRecursiveInferiorTestCase)
UNSUPPORTED: LLDB (/Users/buildslave/jenkins/workspace/lldb-cmake-matrix/lldb-build/bin/clang-10-x86_64) :: test_recursive_inferior_crashing_python_dwo (TestRecursiveInferior.CrashingRecursiveInferiorTestCase) (test case does not fall in any category of interest for this run) 
UNSUPPORTED: LLDB (/Users/buildslave/jenkins/workspace/lldb-cmake-matrix/lldb-build/bin/clang-10-x86_64) :: test_recursive_inferior_crashing_python_gmodules (TestRecursiveInferior.CrashingRecursiveInferiorTestCase) (test case does not fall in any category of interest for this run) 
runCmd: settings set symbols.enable-external-lookup false
output: 

runCmd: settings set plugin.process.gdb-remote.packet-timeout 60
output: 

runCmd: settings set symbols.clang-modules-cache-path "/Users/buildslave/jenkins/workspace/lldb-cmake-matrix/lldb-build/tools/lldb/lldb-test-build.noindex/module-cache-lldb/lldb-api"
output: 

runCmd: settings set use-color false
output: 

warning: (x86_64) /Users/buildslave/jenkins/workspace/lldb-cmake-matrix/lldb-build/tools/lldb/lldb-test-build.noindex/functionalities/inferior-crashing/recursive-inferior/TestRecursiveInferior.test_recursive_inferior_crashing_register_dsym/a.out empty dSYM file detected, dSYM was created with an executable with no debug info.
runCmd: file /Users/buildslave/jenkins/workspace/lldb-cmake-matrix/lldb-build/tools/lldb/lldb-test-build.noindex/functionalities/inferior-crashing/recursive-inferior/TestRecursiveInferior.test_recursive_inferior_crashing_register_dsym/a.out
output: Current executable set to '/Users/buildslave/jenkins/workspace/lldb-cmake-matrix/lldb-build/tools/lldb/lldb-test-build.noindex/functionalities/inferior-crashing/recursive-inferior/TestRecursiveInferior.test_recursive_inferior_crashing_register_dsym/a.out' (x86_64).


runCmd: run
output: Process 33490 stopped
* thread #1, queue = 'com.apple.main-thread', stop reason = EXC_BAD_ACCESS (code=1, address=0x0)
    frame #0: 0x0000000100000f84 a.out`recursive_function + 52
a.out`recursive_function:
->  0x100000f84 <+52>: movb   $0x0, (%rax)
    0x100000f87 <+55>: addq   $0x18, %rsp
    0x100000f8b <+59>: retq   
    0x100000f8c <+60>: nopl   (%rax)

Process 33490 launched: '/Users/buildslave/jenkins/workspace/lldb-cmake-matrix/lldb-build/tools/lldb/lldb-test-build.noindex/functionalities/inferior-crashing/recursive-inferior/TestRecursiveInferior.test_recursive_inferior_crashing_register_dsym/a.out' (x86_64)


runCmd: register read eax
output:      eax = 0x00000000


Expecting sub string: eax = 0x
Matched

<bound method SBProcess.Kill of <lldb.SBProcess; proxy of <Swig Object of type 'lldb::SBProcess *' at 0x13bef7f30> >>: success

PASS: LLDB (/Users/buildslave/jenkins/workspace/lldb-cmake-matrix/lldb-build/bin/clang-10-x86_64) :: test_recursive_inferior_crashing_register_dsym (TestRecursiveInferior.CrashingRecursiveInferiorTestCase)
runCmd: settings set symbols.enable-external-lookup false
output: 

runCmd: settings set plugin.process.gdb-remote.packet-timeout 60
output: 

runCmd: settings set symbols.clang-modules-cache-path "/Users/buildslave/jenkins/workspace/lldb-cmake-matrix/lldb-build/tools/lldb/lldb-test-build.noindex/module-cache-lldb/lldb-api"
output: 

runCmd: settings set use-color false
output: 

runCmd: file /Users/buildslave/jenkins/workspace/lldb-cmake-matrix/lldb-build/tools/lldb/lldb-test-build.noindex/functionalities/inferior-crashing/recursive-inferior/TestRecursiveInferior.test_recursive_inferior_crashing_register_dwarf/a.out
output: Current executable set to '/Users/buildslave/jenkins/workspace/lldb-cmake-matrix/lldb-build/tools/lldb/lldb-test-build.noindex/functionalities/inferior-crashing/recursive-inferior/TestRecursiveInferior.test_recursive_inferior_crashing_register_dwarf/a.out' (x86_64).


runCmd: run
output: Process 33606 stopped
* thread #1, queue = 'com.apple.main-thread', stop reason = EXC_BAD_ACCESS (code=1, address=0x0)
    frame #0: 0x0000000100000f84 a.out`recursive_function + 52
a.out`recursive_function:
->  0x100000f84 <+52>: movb   $0x0, (%rax)
    0x100000f87 <+55>: addq   $0x18, %rsp
    0x100000f8b <+59>: retq   
    0x100000f8c <+60>: nopl   (%rax)

Process 33606 launched: '/Users/buildslave/jenkins/workspace/lldb-cmake-matrix/lldb-build/tools/lldb/lldb-test-build.noindex/functionalities/inferior-crashing/recursive-inferior/TestRecursiveInferior.test_recursive_inferior_crashing_register_dwarf/a.out' (x86_64)


runCmd: register read eax
output:      eax = 0x00000000


Expecting sub string: eax = 0x
Matched

<bound method SBProcess.Kill of <lldb.SBProcess; proxy of <Swig Object of type 'lldb::SBProcess *' at 0x13b125090> >>: success

PASS: LLDB (/Users/buildslave/jenkins/workspace/lldb-cmake-matrix/lldb-build/bin/clang-10-x86_64) :: test_recursive_inferior_crashing_register_dwarf (TestRecursiveInferior.CrashingRecursiveInferiorTestCase)
UNSUPPORTED: LLDB (/Users/buildslave/jenkins/workspace/lldb-cmake-matrix/lldb-build/bin/clang-10-x86_64) :: test_recursive_inferior_crashing_register_dwo (TestRecursiveInferior.CrashingRecursiveInferiorTestCase) (test case does not fall in any category of interest for this run) 
UNSUPPORTED: LLDB (/Users/buildslave/jenkins/workspace/lldb-cmake-matrix/lldb-build/bin/clang-10-x86_64) :: test_recursive_inferior_crashing_register_gmodules (TestRecursiveInferior.CrashingRecursiveInferiorTestCase) (test case does not fall in any category of interest for this run) 
Restore dir to: /Users/buildslave/jenkins/workspace/lldb-cmake-matrix/lldb-build/tools/lldb/test
======================================================================
FAIL: test_recursive_inferior_crashing_dsym (TestRecursiveInferior.CrashingRecursiveInferiorTestCase)
    Test that lldb reliably catches the inferior crashing (command).
----------------------------------------------------------------------
Traceback (most recent call last):
  File "/Users/buildslave/jenkins/workspace/lldb-cmake-matrix/llvm-project/lldb/packages/Python/lldbsuite/test/lldbtest.py", line 1748, in test_method
    return attrvalue(self)
  File "/Users/buildslave/jenkins/workspace/lldb-cmake-matrix/llvm-project/lldb/packages/Python/lldbsuite/test/decorators.py", line 111, in wrapper
    func(*args, **kwargs)
  File "/Users/buildslave/jenkins/workspace/lldb-cmake-matrix/llvm-project/lldb/packages/Python/lldbsuite/test/decorators.py", line 111, in wrapper
    func(*args, **kwargs)
  File "/Users/buildslave/jenkins/workspace/lldb-cmake-matrix/llvm-project/lldb/packages/Python/lldbsuite/test/functionalities/inferior-crashing/recursive-inferior/TestRecursiveInferior.py", line 22, in test_recursive_inferior_crashing
    self.recursive_inferior_crashing()
  File "/Users/buildslave/jenkins/workspace/lldb-cmake-matrix/llvm-project/lldb/packages/Python/lldbsuite/test/functionalities/inferior-crashing/recursive-inferior/TestRecursiveInferior.py", line 85, in recursive_inferior_crashing
    'recursive_function'])
  File "/Users/buildslave/jenkins/workspace/lldb-cmake-matrix/llvm-project/lldb/packages/Python/lldbsuite/test/lldbtest.py", line 2374, in expect
    msg if msg else EXP_MSG(str, output, exe))
AssertionError: False is not True : 'thread backtrace all' returns expected result, got '* thread #1, queue = 'com.apple.main-thread', stop reason = EXC_BAD_ACCESS (code=1, address=0x0)
  * frame #0: 0x0000000100000f84 a.out`recursive_function + 52
    frame #1: 0x0000000100000f71 a.out`recursive_function + 33
    frame #2: 0x0000000100000f71 a.out`recursive_function + 33
    frame #3: 0x0000000100000f71 a.out`recursive_function + 33
    frame #4: 0x0000000100000f71 a.out`recursive_function + 33
    frame #5: 0x0000000100000f71 a.out`recursive_function + 33
    frame #6: 0x0000000100000f71 a.out`recursive_function + 33
    frame #7: 0x0000000100000f71 a.out`recursive_function + 33
    frame #8: 0x0000000100000f71 a.out`recursive_function + 33
    frame #9: 0x0000000100000f71 a.out`recursive_function + 33
    frame #10: 0x0000000100000f71 a.out`recursive_function + 33
    frame #11: 0x0000000100000fae a.out`main + 30
    frame #12: 0x00007fff60f94085 libdyld.dylib`start + 1
    frame #13: 0x00007fff60f94085 libdyld.dylib`start + 1'
Config=x86_64-/Users/buildslave/jenkins/workspace/lldb-cmake-matrix/lldb-build/bin/clang-10
======================================================================
FAIL: test_recursive_inferior_crashing_dwarf (TestRecursiveInferior.CrashingRecursiveInferiorTestCase)
    Test that lldb reliably catches the inferior crashing (command).
----------------------------------------------------------------------
Traceback (most recent call last):
  File "/Users/buildslave/jenkins/workspace/lldb-cmake-matrix/llvm-project/lldb/packages/Python/lldbsuite/test/lldbtest.py", line 1748, in test_method
    return attrvalue(self)
  File "/Users/buildslave/jenkins/workspace/lldb-cmake-matrix/llvm-project/lldb/packages/Python/lldbsuite/test/decorators.py", line 111, in wrapper
    func(*args, **kwargs)
  File "/Users/buildslave/jenkins/workspace/lldb-cmake-matrix/llvm-project/lldb/packages/Python/lldbsuite/test/decorators.py", line 111, in wrapper
    func(*args, **kwargs)
  File "/Users/buildslave/jenkins/workspace/lldb-cmake-matrix/llvm-project/lldb/packages/Python/lldbsuite/test/functionalities/inferior-crashing/recursive-inferior/TestRecursiveInferior.py", line 22, in test_recursive_inferior_crashing
    self.recursive_inferior_crashing()
  File "/Users/buildslave/jenkins/workspace/lldb-cmake-matrix/llvm-project/lldb/packages/Python/lldbsuite/test/functionalities/inferior-crashing/recursive-inferior/TestRecursiveInferior.py", line 85, in recursive_inferior_crashing
    'recursive_function'])
  File "/Users/buildslave/jenkins/workspace/lldb-cmake-matrix/llvm-project/lldb/packages/Python/lldbsuite/test/lldbtest.py", line 2374, in expect
    msg if msg else EXP_MSG(str, output, exe))
AssertionError: False is not True : 'thread backtrace all' returns expected result, got '* thread #1, queue = 'com.apple.main-thread', stop reason = EXC_BAD_ACCESS (code=1, address=0x0)
  * frame #0: 0x0000000100000f84 a.out`recursive_function + 52
    frame #1: 0x0000000100000f71 a.out`recursive_function + 33
    frame #2: 0x0000000100000f71 a.out`recursive_function + 33
    frame #3: 0x0000000100000f71 a.out`recursive_function + 33
    frame #4: 0x0000000100000f71 a.out`recursive_function + 33
    frame #5: 0x0000000100000f71 a.out`recursive_function + 33
    frame #6: 0x0000000100000f71 a.out`recursive_function + 33
    frame #7: 0x0000000100000f71 a.out`recursive_function + 33
    frame #8: 0x0000000100000f71 a.out`recursive_function + 33
    frame #9: 0x0000000100000f71 a.out`recursive_function + 33
    frame #10: 0x0000000100000f71 a.out`recursive_function + 33
    frame #11: 0x0000000100000fae a.out`main + 30
    frame #12: 0x00007fff60f94085 libdyld.dylib`start + 1
    frame #13: 0x00007fff60f94085 libdyld.dylib`start + 1'
Config=x86_64-/Users/buildslave/jenkins/workspace/lldb-cmake-matrix/lldb-build/bin/clang-10
======================================================================
FAIL: test_recursive_inferior_crashing_expr_dsym (TestRecursiveInferior.CrashingRecursiveInferiorTestCase)
    Test that the lldb expression interpreter can read from the inferior after crashing (command).
----------------------------------------------------------------------
Traceback (most recent call last):
  File "/Users/buildslave/jenkins/workspace/lldb-cmake-matrix/llvm-project/lldb/packages/Python/lldbsuite/test/lldbtest.py", line 1748, in test_method
    return attrvalue(self)
  File "/Users/buildslave/jenkins/workspace/lldb-cmake-matrix/llvm-project/lldb/packages/Python/lldbsuite/test/functionalities/inferior-crashing/recursive-inferior/TestRecursiveInferior.py", line 39, in test_recursive_inferior_crashing_expr
    self.recursive_inferior_crashing_expr()
  File "/Users/buildslave/jenkins/workspace/lldb-cmake-matrix/llvm-project/lldb/packages/Python/lldbsuite/test/functionalities/inferior-crashing/recursive-inferior/TestRecursiveInferior.py", line 141, in recursive_inferior_crashing_expr
    startstr='(int) $0 =')
  File "/Users/buildslave/jenkins/workspace/lldb-cmake-matrix/llvm-project/lldb/packages/Python/lldbsuite/test/lldbtest.py", line 2309, in expect
    inHistory=inHistory)
  File "/Users/buildslave/jenkins/workspace/lldb-cmake-matrix/llvm-project/lldb/packages/Python/lldbsuite/test/lldbtest.py", line 2068, in runCmd
    msg if (msg) else CMD_MSG(cmd))
AssertionError: False is not True : Command 'p i
Error output:
error: <user expression 0>:1:1: use of undeclared identifier 'i'
i
^
' returns successfully
Config=x86_64-/Users/buildslave/jenkins/workspace/lldb-cmake-matrix/lldb-build/bin/clang-10
======================================================================
FAIL: test_recursive_inferior_crashing_expr_dwarf (TestRecursiveInferior.CrashingRecursiveInferiorTestCase)
    Test that the lldb expression interpreter can read from the inferior after crashing (command).
----------------------------------------------------------------------
Traceback (most recent call last):
  File "/Users/buildslave/jenkins/workspace/lldb-cmake-matrix/llvm-project/lldb/packages/Python/lldbsuite/test/lldbtest.py", line 1748, in test_method
    return attrvalue(self)
  File "/Users/buildslave/jenkins/workspace/lldb-cmake-matrix/llvm-project/lldb/packages/Python/lldbsuite/test/functionalities/inferior-crashing/recursive-inferior/TestRecursiveInferior.py", line 39, in test_recursive_inferior_crashing_expr
    self.recursive_inferior_crashing_expr()
  File "/Users/buildslave/jenkins/workspace/lldb-cmake-matrix/llvm-project/lldb/packages/Python/lldbsuite/test/functionalities/inferior-crashing/recursive-inferior/TestRecursiveInferior.py", line 141, in recursive_inferior_crashing_expr
    startstr='(int) $0 =')
  File "/Users/buildslave/jenkins/workspace/lldb-cmake-matrix/llvm-project/lldb/packages/Python/lldbsuite/test/lldbtest.py", line 2309, in expect
    inHistory=inHistory)
  File "/Users/buildslave/jenkins/workspace/lldb-cmake-matrix/llvm-project/lldb/packages/Python/lldbsuite/test/lldbtest.py", line 2068, in runCmd
    msg if (msg) else CMD_MSG(cmd))
AssertionError: False is not True : Command 'p i
Error output:
error: <user expression 0>:1:1: use of undeclared identifier 'i'
i
^
' returns successfully
Config=x86_64-/Users/buildslave/jenkins/workspace/lldb-cmake-matrix/lldb-build/bin/clang-10
----------------------------------------------------------------------
Ran 16 tests in 6.192s

RESULT: FAILED (4 passes, 4 failures, 0 errors, 8 skipped, 0 expected failures, 0 unexpected successes)

********************
FAIL: lldb-api :: functionalities/data-formatter/data-formatter-objc/TestDataFormatterObjCCF.py (1783 of 1788)
******************** TEST 'lldb-api :: functionalities/data-formatter/data-formatter-objc/TestDataFormatterObjCCF.py' FAILED ********************
lldb version 10.0.99 (http://labmaster3.local/git/llvm-project.git revision 1f20bc17d005fb37816fac95955ec4a36f9de26f)
  clang revision 1f20bc17d005fb37816fac95955ec4a36f9de26f
  llvm revision 1f20bc17d005fb37816fac95955ec4a36f9de26f
LLDB library dir: /Users/buildslave/jenkins/workspace/lldb-cmake-matrix/lldb-build/bin
LLDB import library dir: /Users/buildslave/jenkins/workspace/lldb-cmake-matrix/lldb-build/bin
libstdcxx tests will not be run because: Don't know how to build with libstdcxx on macosx
Skipping following debug info categories: ['dwo']

Session logs for test failures/errors/unexpected successes will go into directory '/Users/buildslave/jenkins/workspace/lldb-cmake-matrix/test/logs'
Command invoked: /Users/buildslave/jenkins/workspace/lldb-cmake-matrix/llvm-project/lldb/test/API/dotest.py --arch=x86_64 -s /Users/buildslave/jenkins/workspace/lldb-cmake-matrix/lldb-build/lldb-test-traces -S nm -u CXXFLAGS -u CFLAGS --executable /Users/buildslave/jenkins/workspace/lldb-cmake-matrix/lldb-build/./bin/lldb --dsymutil /Users/buildslave/jenkins/workspace/lldb-cmake-matrix/lldb-build/./bin/dsymutil --filecheck /Users/buildslave/jenkins/workspace/lldb-cmake-matrix/lldb-build/./bin/FileCheck -C /Users/buildslave/jenkins/workspace/lldb-cmake-matrix/lldb-build/./bin/clang --codesign-identity lldb_codesign --server /Users/buildslave/jenkins/workspace/lldb-cmake-matrix/lldb-build/./bin/debugserver --arch x86_64 --build-dir /Users/buildslave/jenkins/workspace/lldb-cmake-matrix/lldb-build/lldb-test-build.noindex -s=/Users/buildslave/jenkins/workspace/lldb-cmake-matrix/test/logs -t --env TERM=vt100 --skip-category gmodules --skip-category watchpoint --arch=x86_64 --dwarf-version=5 --env LLVM_LIBS_DIR=/Users/buildslave/jenkins/workspace/lldb-cmake-matrix/lldb-build/./lib --build-dir /Users/buildslave/jenkins/workspace/lldb-cmake-matrix/lldb-build/tools/lldb/lldb-test-build.noindex --lldb-module-cache-dir /Users/buildslave/jenkins/workspace/lldb-cmake-matrix/lldb-build/tools/lldb/lldb-test-build.noindex/module-cache-lldb/lldb-api --clang-module-cache-dir /Users/buildslave/jenkins/workspace/lldb-cmake-matrix/lldb-build/tools/lldb/lldb-test-build.noindex/module-cache-clang/lldb-api /Users/buildslave/jenkins/workspace/lldb-cmake-matrix/llvm-project/lldb/packages/Python/lldbsuite/test/functionalities/data-formatter/data-formatter-objc -p TestDataFormatterObjCCF.py
Change dir to: /Users/buildslave/jenkins/workspace/lldb-cmake-matrix/llvm-project/lldb/packages/Python/lldbsuite/test/functionalities/data-formatter/data-formatter-objc
runCmd: settings set symbols.enable-external-lookup false
output: 

runCmd: settings set plugin.process.gdb-remote.packet-timeout 60
output: 

runCmd: settings set symbols.clang-modules-cache-path "/Users/buildslave/jenkins/workspace/lldb-cmake-matrix/lldb-build/tools/lldb/lldb-test-build.noindex/module-cache-lldb/lldb-api"
output: 

runCmd: settings set use-color false
output: 

warning: (x86_64) /Users/buildslave/jenkins/workspace/lldb-cmake-matrix/lldb-build/tools/lldb/lldb-test-build.noindex/functionalities/data-formatter/data-formatter-objc/TestDataFormatterObjCCF.test_coreframeworks_and_run_command_dsym/a.out empty dSYM file detected, dSYM was created with an executable with no debug info.
FAIL: LLDB (/Users/buildslave/jenkins/workspace/lldb-cmake-matrix/lldb-build/bin/clang-10-x86_64) :: test_coreframeworks_and_run_command_dsym (TestDataFormatterObjCCF.ObjCDataFormatterCF)
runCmd: settings set symbols.enable-external-lookup false
output: 

runCmd: settings set plugin.process.gdb-remote.packet-timeout 60
output: 

runCmd: settings set symbols.clang-modules-cache-path "/Users/buildslave/jenkins/workspace/lldb-cmake-matrix/lldb-build/tools/lldb/lldb-test-build.noindex/module-cache-lldb/lldb-api"
output: 

runCmd: settings set use-color false
output: 

FAIL: LLDB (/Users/buildslave/jenkins/workspace/lldb-cmake-matrix/lldb-build/bin/clang-10-x86_64) :: test_coreframeworks_and_run_command_dwarf (TestDataFormatterObjCCF.ObjCDataFormatterCF)
UNSUPPORTED: LLDB (/Users/buildslave/jenkins/workspace/lldb-cmake-matrix/lldb-build/bin/clang-10-x86_64) :: test_coreframeworks_and_run_command_dwo (TestDataFormatterObjCCF.ObjCDataFormatterCF) (test case does not fall in any category of interest for this run) 
UNSUPPORTED: LLDB (/Users/buildslave/jenkins/workspace/lldb-cmake-matrix/lldb-build/bin/clang-10-x86_64) :: test_coreframeworks_and_run_command_gmodules (TestDataFormatterObjCCF.ObjCDataFormatterCF) (test case does not fall in any category of interest for this run) 
Restore dir to: /Users/buildslave/jenkins/workspace/lldb-cmake-matrix/lldb-build/tools/lldb/test
======================================================================
FAIL: test_coreframeworks_and_run_command_dsym (TestDataFormatterObjCCF.ObjCDataFormatterCF)
   Test formatters for Core OSX frameworks.
----------------------------------------------------------------------
Traceback (most recent call last):
  File "/Users/buildslave/jenkins/workspace/lldb-cmake-matrix/llvm-project/lldb/packages/Python/lldbsuite/test/lldbtest.py", line 1748, in test_method
    return attrvalue(self)
  File "/Users/buildslave/jenkins/workspace/lldb-cmake-matrix/llvm-project/lldb/packages/Python/lldbsuite/test/functionalities/data-formatter/data-formatter-objc/TestDataFormatterObjCCF.py", line 24, in test_coreframeworks_and_run_command
    lldb.SBFileSpec('main.m', False))
  File "/Users/buildslave/jenkins/workspace/lldb-cmake-matrix/llvm-project/lldb/packages/Python/lldbsuite/test/lldbutil.py", line 837, in run_to_source_breakpoint
    %(bkpt_pattern, source_spec.GetFilename(), source_spec.GetDirectory()))
AssertionError: False is not True : No locations found for source breakpoint: "// Set break point at this line.", file: "main.m", dir: "None"
Config=x86_64-/Users/buildslave/jenkins/workspace/lldb-cmake-matrix/lldb-build/bin/clang-10
======================================================================
FAIL: test_coreframeworks_and_run_command_dwarf (TestDataFormatterObjCCF.ObjCDataFormatterCF)
   Test formatters for Core OSX frameworks.
----------------------------------------------------------------------
Traceback (most recent call last):
  File "/Users/buildslave/jenkins/workspace/lldb-cmake-matrix/llvm-project/lldb/packages/Python/lldbsuite/test/lldbtest.py", line 1748, in test_method
    return attrvalue(self)
  File "/Users/buildslave/jenkins/workspace/lldb-cmake-matrix/llvm-project/lldb/packages/Python/lldbsuite/test/functionalities/data-formatter/data-formatter-objc/TestDataFormatterObjCCF.py", line 24, in test_coreframeworks_and_run_command
    lldb.SBFileSpec('main.m', False))
  File "/Users/buildslave/jenkins/workspace/lldb-cmake-matrix/llvm-project/lldb/packages/Python/lldbsuite/test/lldbutil.py", line 837, in run_to_source_breakpoint
    %(bkpt_pattern, source_spec.GetFilename(), source_spec.GetDirectory()))
AssertionError: False is not True : No locations found for source breakpoint: "// Set break point at this line.", file: "main.m", dir: "None"
Config=x86_64-/Users/buildslave/jenkins/workspace/lldb-cmake-matrix/lldb-build/bin/clang-10
----------------------------------------------------------------------
Ran 4 tests in 5.198s

RESULT: FAILED (0 passes, 2 failures, 0 errors, 2 skipped, 0 expected failures, 0 unexpected successes)

********************
FAIL: lldb-api :: functionalities/thread/step_out/TestThreadStepOut.py (1784 of 1788)
******************** TEST 'lldb-api :: functionalities/thread/step_out/TestThreadStepOut.py' FAILED ********************
lldb version 10.0.99 (http://labmaster3.local/git/llvm-project.git revision 1f20bc17d005fb37816fac95955ec4a36f9de26f)
  clang revision 1f20bc17d005fb37816fac95955ec4a36f9de26f
  llvm revision 1f20bc17d005fb37816fac95955ec4a36f9de26f
LLDB library dir: /Users/buildslave/jenkins/workspace/lldb-cmake-matrix/lldb-build/bin
LLDB import library dir: /Users/buildslave/jenkins/workspace/lldb-cmake-matrix/lldb-build/bin
libstdcxx tests will not be run because: Don't know how to build with libstdcxx on macosx
Skipping following debug info categories: ['dwo']

Session logs for test failures/errors/unexpected successes will go into directory '/Users/buildslave/jenkins/workspace/lldb-cmake-matrix/test/logs'
Command invoked: /Users/buildslave/jenkins/workspace/lldb-cmake-matrix/llvm-project/lldb/test/API/dotest.py --arch=x86_64 -s /Users/buildslave/jenkins/workspace/lldb-cmake-matrix/lldb-build/lldb-test-traces -S nm -u CXXFLAGS -u CFLAGS --executable /Users/buildslave/jenkins/workspace/lldb-cmake-matrix/lldb-build/./bin/lldb --dsymutil /Users/buildslave/jenkins/workspace/lldb-cmake-matrix/lldb-build/./bin/dsymutil --filecheck /Users/buildslave/jenkins/workspace/lldb-cmake-matrix/lldb-build/./bin/FileCheck -C /Users/buildslave/jenkins/workspace/lldb-cmake-matrix/lldb-build/./bin/clang --codesign-identity lldb_codesign --server /Users/buildslave/jenkins/workspace/lldb-cmake-matrix/lldb-build/./bin/debugserver --arch x86_64 --build-dir /Users/buildslave/jenkins/workspace/lldb-cmake-matrix/lldb-build/lldb-test-build.noindex -s=/Users/buildslave/jenkins/workspace/lldb-cmake-matrix/test/logs -t --env TERM=vt100 --skip-category gmodules --skip-category watchpoint --arch=x86_64 --dwarf-version=5 --env LLVM_LIBS_DIR=/Users/buildslave/jenkins/workspace/lldb-cmake-matrix/lldb-build/./lib --build-dir /Users/buildslave/jenkins/workspace/lldb-cmake-matrix/lldb-build/tools/lldb/lldb-test-build.noindex --lldb-module-cache-dir /Users/buildslave/jenkins/workspace/lldb-cmake-matrix/lldb-build/tools/lldb/lldb-test-build.noindex/module-cache-lldb/lldb-api --clang-module-cache-dir /Users/buildslave/jenkins/workspace/lldb-cmake-matrix/lldb-build/tools/lldb/lldb-test-build.noindex/module-cache-clang/lldb-api /Users/buildslave/jenkins/workspace/lldb-cmake-matrix/llvm-project/lldb/packages/Python/lldbsuite/test/functionalities/thread/step_out -p TestThreadStepOut.py
Change dir to: /Users/buildslave/jenkins/workspace/lldb-cmake-matrix/llvm-project/lldb/packages/Python/lldbsuite/test/functionalities/thread/step_out
runCmd: settings set symbols.enable-external-lookup false
output: 

runCmd: settings set plugin.process.gdb-remote.packet-timeout 60
output: 

runCmd: settings set symbols.clang-modules-cache-path "/Users/buildslave/jenkins/workspace/lldb-cmake-matrix/lldb-build/tools/lldb/lldb-test-build.noindex/module-cache-lldb/lldb-api"
output: 

runCmd: settings set use-color false
output: 

warning: (x86_64) /Users/buildslave/jenkins/workspace/lldb-cmake-matrix/lldb-build/tools/lldb/lldb-test-build.noindex/functionalities/thread/step_out/TestThreadStepOut.test_python_dsym/a.out empty dSYM file detected, dSYM was created with an executable with no debug info.
runCmd: file /Users/buildslave/jenkins/workspace/lldb-cmake-matrix/lldb-build/tools/lldb/lldb-test-build.noindex/functionalities/thread/step_out/TestThreadStepOut.test_python_dsym/a.out
output: Current executable set to '/Users/buildslave/jenkins/workspace/lldb-cmake-matrix/lldb-build/tools/lldb/lldb-test-build.noindex/functionalities/thread/step_out/TestThreadStepOut.test_python_dsym/a.out' (x86_64).


runCmd: breakpoint set -f "main.cpp" -l 20
output: Breakpoint 1: no locations (pending).
WARNING:  Unable to resolve breakpoint to any actual locations.


Expecting pattern: ^Breakpoint (?P<bpno>[0-9]+): (?P<num_locations>[0-9]+) locations\.$
Not matched

Expecting pattern: ^Breakpoint (?P<bpno>[0-9]+): (?P<num_locations>no) locations \(pending\)\.
Matched

FAIL: LLDB (/Users/buildslave/jenkins/workspace/lldb-cmake-matrix/lldb-build/bin/clang-10-x86_64) :: test_python_dsym (TestThreadStepOut.ThreadStepOutTestCase)
runCmd: settings set symbols.enable-external-lookup false
output: 

runCmd: settings set plugin.process.gdb-remote.packet-timeout 60
output: 

runCmd: settings set symbols.clang-modules-cache-path "/Users/buildslave/jenkins/workspace/lldb-cmake-matrix/lldb-build/tools/lldb/lldb-test-build.noindex/module-cache-lldb/lldb-api"
output: 

runCmd: settings set use-color false
output: 

runCmd: file /Users/buildslave/jenkins/workspace/lldb-cmake-matrix/lldb-build/tools/lldb/lldb-test-build.noindex/functionalities/thread/step_out/TestThreadStepOut.test_python_dwarf/a.out
output: Current executable set to '/Users/buildslave/jenkins/workspace/lldb-cmake-matrix/lldb-build/tools/lldb/lldb-test-build.noindex/functionalities/thread/step_out/TestThreadStepOut.test_python_dwarf/a.out' (x86_64).


runCmd: breakpoint set -f "main.cpp" -l 20
output: Breakpoint 1: no locations (pending).
WARNING:  Unable to resolve breakpoint to any actual locations.


Expecting pattern: ^Breakpoint (?P<bpno>[0-9]+): (?P<num_locations>[0-9]+) locations\.$
Not matched

Expecting pattern: ^Breakpoint (?P<bpno>[0-9]+): (?P<num_locations>no) locations \(pending\)\.
Matched

FAIL: LLDB (/Users/buildslave/jenkins/workspace/lldb-cmake-matrix/lldb-build/bin/clang-10-x86_64) :: test_python_dwarf (TestThreadStepOut.ThreadStepOutTestCase)
UNSUPPORTED: LLDB (/Users/buildslave/jenkins/workspace/lldb-cmake-matrix/lldb-build/bin/clang-10-x86_64) :: test_python_dwo (TestThreadStepOut.ThreadStepOutTestCase) (test case does not fall in any category of interest for this run) 
UNSUPPORTED: LLDB (/Users/buildslave/jenkins/workspace/lldb-cmake-matrix/lldb-build/bin/clang-10-x86_64) :: test_python_gmodules (TestThreadStepOut.ThreadStepOutTestCase) (test case does not fall in any category of interest for this run) 
runCmd: settings set symbols.enable-external-lookup false
output: 

runCmd: settings set plugin.process.gdb-remote.packet-timeout 60
output: 

runCmd: settings set symbols.clang-modules-cache-path "/Users/buildslave/jenkins/workspace/lldb-cmake-matrix/lldb-build/tools/lldb/lldb-test-build.noindex/module-cache-lldb/lldb-api"
output: 

runCmd: settings set use-color false
output: 

warning: (x86_64) /Users/buildslave/jenkins/workspace/lldb-cmake-matrix/lldb-build/tools/lldb/lldb-test-build.noindex/functionalities/thread/step_out/TestThreadStepOut.test_step_all_threads_dsym/a.out empty dSYM file detected, dSYM was created with an executable with no debug info.
runCmd: file /Users/buildslave/jenkins/workspace/lldb-cmake-matrix/lldb-build/tools/lldb/lldb-test-build.noindex/functionalities/thread/step_out/TestThreadStepOut.test_step_all_threads_dsym/a.out
output: Current executable set to '/Users/buildslave/jenkins/workspace/lldb-cmake-matrix/lldb-build/tools/lldb/lldb-test-build.noindex/functionalities/thread/step_out/TestThreadStepOut.test_step_all_threads_dsym/a.out' (x86_64).


runCmd: breakpoint set -f "main.cpp" -l 20
output: Breakpoint 1: no locations (pending).
WARNING:  Unable to resolve breakpoint to any actual locations.


Expecting pattern: ^Breakpoint (?P<bpno>[0-9]+): (?P<num_locations>[0-9]+) locations\.$
Not matched

Expecting pattern: ^Breakpoint (?P<bpno>[0-9]+): (?P<num_locations>no) locations \(pending\)\.
Matched

FAIL: LLDB (/Users/buildslave/jenkins/workspace/lldb-cmake-matrix/lldb-build/bin/clang-10-x86_64) :: test_step_all_threads_dsym (TestThreadStepOut.ThreadStepOutTestCase)
runCmd: settings set symbols.enable-external-lookup false
output: 

runCmd: settings set plugin.process.gdb-remote.packet-timeout 60
output: 

runCmd: settings set symbols.clang-modules-cache-path "/Users/buildslave/jenkins/workspace/lldb-cmake-matrix/lldb-build/tools/lldb/lldb-test-build.noindex/module-cache-lldb/lldb-api"
output: 

runCmd: settings set use-color false
output: 

runCmd: file /Users/buildslave/jenkins/workspace/lldb-cmake-matrix/lldb-build/tools/lldb/lldb-test-build.noindex/functionalities/thread/step_out/TestThreadStepOut.test_step_all_threads_dwarf/a.out
output: Current executable set to '/Users/buildslave/jenkins/workspace/lldb-cmake-matrix/lldb-build/tools/lldb/lldb-test-build.noindex/functionalities/thread/step_out/TestThreadStepOut.test_step_all_threads_dwarf/a.out' (x86_64).


runCmd: breakpoint set -f "main.cpp" -l 20
output: Breakpoint 1: no locations (pending).
WARNING:  Unable to resolve breakpoint to any actual locations.


Expecting pattern: ^Breakpoint (?P<bpno>[0-9]+): (?P<num_locations>[0-9]+) locations\.$
Not matched

Expecting pattern: ^Breakpoint (?P<bpno>[0-9]+): (?P<num_locations>no) locations \(pending\)\.
Matched

FAIL: LLDB (/Users/buildslave/jenkins/workspace/lldb-cmake-matrix/lldb-build/bin/clang-10-x86_64) :: test_step_all_threads_dwarf (TestThreadStepOut.ThreadStepOutTestCase)
UNSUPPORTED: LLDB (/Users/buildslave/jenkins/workspace/lldb-cmake-matrix/lldb-build/bin/clang-10-x86_64) :: test_step_all_threads_dwo (TestThreadStepOut.ThreadStepOutTestCase) (test case does not fall in any category of interest for this run) 
UNSUPPORTED: LLDB (/Users/buildslave/jenkins/workspace/lldb-cmake-matrix/lldb-build/bin/clang-10-x86_64) :: test_step_all_threads_gmodules (TestThreadStepOut.ThreadStepOutTestCase) (test case does not fall in any category of interest for this run) 
runCmd: settings set symbols.enable-external-lookup false
output: 

runCmd: settings set plugin.process.gdb-remote.packet-timeout 60
output: 

runCmd: settings set symbols.clang-modules-cache-path "/Users/buildslave/jenkins/workspace/lldb-cmake-matrix/lldb-build/tools/lldb/lldb-test-build.noindex/module-cache-lldb/lldb-api"
output: 

runCmd: settings set use-color false
output: 

warning: (x86_64) /Users/buildslave/jenkins/workspace/lldb-cmake-matrix/lldb-build/tools/lldb/lldb-test-build.noindex/functionalities/thread/step_out/TestThreadStepOut.test_step_single_thread_dsym/a.out empty dSYM file detected, dSYM was created with an executable with no debug info.
runCmd: file /Users/buildslave/jenkins/workspace/lldb-cmake-matrix/lldb-build/tools/lldb/lldb-test-build.noindex/functionalities/thread/step_out/TestThreadStepOut.test_step_single_thread_dsym/a.out
output: Current executable set to '/Users/buildslave/jenkins/workspace/lldb-cmake-matrix/lldb-build/tools/lldb/lldb-test-build.noindex/functionalities/thread/step_out/TestThreadStepOut.test_step_single_thread_dsym/a.out' (x86_64).


runCmd: breakpoint set -f "main.cpp" -l 20
output: Breakpoint 1: no locations (pending).
WARNING:  Unable to resolve breakpoint to any actual locations.


Expecting pattern: ^Breakpoint (?P<bpno>[0-9]+): (?P<num_locations>[0-9]+) locations\.$
Not matched

Expecting pattern: ^Breakpoint (?P<bpno>[0-9]+): (?P<num_locations>no) locations \(pending\)\.
Matched

FAIL: LLDB (/Users/buildslave/jenkins/workspace/lldb-cmake-matrix/lldb-build/bin/clang-10-x86_64) :: test_step_single_thread_dsym (TestThreadStepOut.ThreadStepOutTestCase)
runCmd: settings set symbols.enable-external-lookup false
output: 

runCmd: settings set plugin.process.gdb-remote.packet-timeout 60
output: 

runCmd: settings set symbols.clang-modules-cache-path "/Users/buildslave/jenkins/workspace/lldb-cmake-matrix/lldb-build/tools/lldb/lldb-test-build.noindex/module-cache-lldb/lldb-api"
output: 

runCmd: settings set use-color false
output: 

runCmd: file /Users/buildslave/jenkins/workspace/lldb-cmake-matrix/lldb-build/tools/lldb/lldb-test-build.noindex/functionalities/thread/step_out/TestThreadStepOut.test_step_single_thread_dwarf/a.out
output: Current executable set to '/Users/buildslave/jenkins/workspace/lldb-cmake-matrix/lldb-build/tools/lldb/lldb-test-build.noindex/functionalities/thread/step_out/TestThreadStepOut.test_step_single_thread_dwarf/a.out' (x86_64).


runCmd: breakpoint set -f "main.cpp" -l 20
output: Breakpoint 1: no locations (pending).
WARNING:  Unable to resolve breakpoint to any actual locations.


Expecting pattern: ^Breakpoint (?P<bpno>[0-9]+): (?P<num_locations>[0-9]+) locations\.$
Not matched

Expecting pattern: ^Breakpoint (?P<bpno>[0-9]+): (?P<num_locations>no) locations \(pending\)\.
Matched

FAIL: LLDB (/Users/buildslave/jenkins/workspace/lldb-cmake-matrix/lldb-build/bin/clang-10-x86_64) :: test_step_single_thread_dwarf (TestThreadStepOut.ThreadStepOutTestCase)
UNSUPPORTED: LLDB (/Users/buildslave/jenkins/workspace/lldb-cmake-matrix/lldb-build/bin/clang-10-x86_64) :: test_step_single_thread_dwo (TestThreadStepOut.ThreadStepOutTestCase) (test case does not fall in any category of interest for this run) 
UNSUPPORTED: LLDB (/Users/buildslave/jenkins/workspace/lldb-cmake-matrix/lldb-build/bin/clang-10-x86_64) :: test_step_single_thread_gmodules (TestThreadStepOut.ThreadStepOutTestCase) (test case does not fall in any category of interest for this run) 
Restore dir to: /Users/buildslave/jenkins/workspace/lldb-cmake-matrix/lldb-build/tools/lldb/test
======================================================================
FAIL: test_python_dsym (TestThreadStepOut.ThreadStepOutTestCase)
    Test thread step out on one thread via Python API (dwarf).
----------------------------------------------------------------------
Traceback (most recent call last):
  File "/Users/buildslave/jenkins/workspace/lldb-cmake-matrix/llvm-project/lldb/packages/Python/lldbsuite/test/lldbtest.py", line 1748, in test_method
    return attrvalue(self)
  File "/Users/buildslave/jenkins/workspace/lldb-cmake-matrix/llvm-project/lldb/packages/Python/lldbsuite/test/decorators.py", line 111, in wrapper
    func(*args, **kwargs)
  File "/Users/buildslave/jenkins/workspace/lldb-cmake-matrix/llvm-project/lldb/packages/Python/lldbsuite/test/decorators.py", line 111, in wrapper
    func(*args, **kwargs)
  File "/Users/buildslave/jenkins/workspace/lldb-cmake-matrix/llvm-project/lldb/packages/Python/lldbsuite/test/decorators.py", line 111, in wrapper
    func(*args, **kwargs)
  File "/Users/buildslave/jenkins/workspace/lldb-cmake-matrix/llvm-project/lldb/packages/Python/lldbsuite/test/decorators.py", line 111, in wrapper
    func(*args, **kwargs)
  File "/Users/buildslave/jenkins/workspace/lldb-cmake-matrix/llvm-project/lldb/packages/Python/lldbsuite/test/functionalities/thread/step_out/TestThreadStepOut.py", line 65, in test_python
    self.step_out_test(self.step_out_with_python)
  File "/Users/buildslave/jenkins/workspace/lldb-cmake-matrix/llvm-project/lldb/packages/Python/lldbsuite/test/functionalities/thread/step_out/TestThreadStepOut.py", line 137, in step_out_test
    self, "main.cpp", self.breakpoint, num_expected_locations=1)
  File "/Users/buildslave/jenkins/workspace/lldb-cmake-matrix/llvm-project/lldb/packages/Python/lldbsuite/test/lldbutil.py", line 388, in run_break_set_by_file_and_line
    num_locations=num_expected_locations)
  File "/Users/buildslave/jenkins/workspace/lldb-cmake-matrix/llvm-project/lldb/packages/Python/lldbsuite/test/lldbutil.py", line 584, in check_breakpoint_result
    out_num_locations))
AssertionError: False is not True : Expecting 1 locations, got 0.
Config=x86_64-/Users/buildslave/jenkins/workspace/lldb-cmake-matrix/lldb-build/bin/clang-10
======================================================================
FAIL: test_python_dwarf (TestThreadStepOut.ThreadStepOutTestCase)
    Test thread step out on one thread via Python API (dwarf).
----------------------------------------------------------------------
Traceback (most recent call last):
  File "/Users/buildslave/jenkins/workspace/lldb-cmake-matrix/llvm-project/lldb/packages/Python/lldbsuite/test/lldbtest.py", line 1748, in test_method
    return attrvalue(self)
  File "/Users/buildslave/jenkins/workspace/lldb-cmake-matrix/llvm-project/lldb/packages/Python/lldbsuite/test/decorators.py", line 111, in wrapper
    func(*args, **kwargs)
  File "/Users/buildslave/jenkins/workspace/lldb-cmake-matrix/llvm-project/lldb/packages/Python/lldbsuite/test/decorators.py", line 111, in wrapper
    func(*args, **kwargs)
  File "/Users/buildslave/jenkins/workspace/lldb-cmake-matrix/llvm-project/lldb/packages/Python/lldbsuite/test/decorators.py", line 111, in wrapper
    func(*args, **kwargs)
  File "/Users/buildslave/jenkins/workspace/lldb-cmake-matrix/llvm-project/lldb/packages/Python/lldbsuite/test/decorators.py", line 111, in wrapper
    func(*args, **kwargs)
  File "/Users/buildslave/jenkins/workspace/lldb-cmake-matrix/llvm-project/lldb/packages/Python/lldbsuite/test/functionalities/thread/step_out/TestThreadStepOut.py", line 65, in test_python
    self.step_out_test(self.step_out_with_python)
  File "/Users/buildslave/jenkins/workspace/lldb-cmake-matrix/llvm-project/lldb/packages/Python/lldbsuite/test/functionalities/thread/step_out/TestThreadStepOut.py", line 137, in step_out_test
    self, "main.cpp", self.breakpoint, num_expected_locations=1)
  File "/Users/buildslave/jenkins/workspace/lldb-cmake-matrix/llvm-project/lldb/packages/Python/lldbsuite/test/lldbutil.py", line 388, in run_break_set_by_file_and_line
    num_locations=num_expected_locations)
  File "/Users/buildslave/jenkins/workspace/lldb-cmake-matrix/llvm-project/lldb/packages/Python/lldbsuite/test/lldbutil.py", line 584, in check_breakpoint_result
    out_num_locations))
AssertionError: False is not True : Expecting 1 locations, got 0.
Config=x86_64-/Users/buildslave/jenkins/workspace/lldb-cmake-matrix/lldb-build/bin/clang-10
======================================================================
FAIL: test_step_all_threads_dsym (TestThreadStepOut.ThreadStepOutTestCase)
    Test thread step out on all threads via command interpreter.
----------------------------------------------------------------------
Traceback (most recent call last):
  File "/Users/buildslave/jenkins/workspace/lldb-cmake-matrix/llvm-project/lldb/packages/Python/lldbsuite/test/lldbtest.py", line 1748, in test_method
    return attrvalue(self)
  File "/Users/buildslave/jenkins/workspace/lldb-cmake-matrix/llvm-project/lldb/packages/Python/lldbsuite/test/decorators.py", line 111, in wrapper
    func(*args, **kwargs)
  File "/Users/buildslave/jenkins/workspace/lldb-cmake-matrix/llvm-project/lldb/packages/Python/lldbsuite/test/decorators.py", line 111, in wrapper
    func(*args, **kwargs)
  File "/Users/buildslave/jenkins/workspace/lldb-cmake-matrix/llvm-project/lldb/packages/Python/lldbsuite/test/decorators.py", line 111, in wrapper
    func(*args, **kwargs)
  File "/Users/buildslave/jenkins/workspace/lldb-cmake-matrix/llvm-project/lldb/packages/Python/lldbsuite/test/decorators.py", line 111, in wrapper
    func(*args, **kwargs)
  File "/Users/buildslave/jenkins/workspace/lldb-cmake-matrix/llvm-project/lldb/packages/Python/lldbsuite/test/decorators.py", line 111, in wrapper
    func(*args, **kwargs)
  File "/Users/buildslave/jenkins/workspace/lldb-cmake-matrix/llvm-project/lldb/packages/Python/lldbsuite/test/functionalities/thread/step_out/TestThreadStepOut.py", line 49, in test_step_all_threads
    self.step_out_test(self.step_out_all_threads_with_cmd)
  File "/Users/buildslave/jenkins/workspace/lldb-cmake-matrix/llvm-project/lldb/packages/Python/lldbsuite/test/functionalities/thread/step_out/TestThreadStepOut.py", line 137, in step_out_test
    self, "main.cpp", self.breakpoint, num_expected_locations=1)
  File "/Users/buildslave/jenkins/workspace/lldb-cmake-matrix/llvm-project/lldb/packages/Python/lldbsuite/test/lldbutil.py", line 388, in run_break_set_by_file_and_line
    num_locations=num_expected_locations)
  File "/Users/buildslave/jenkins/workspace/lldb-cmake-matrix/llvm-project/lldb/packages/Python/lldbsuite/test/lldbutil.py", line 584, in check_breakpoint_result
    out_num_locations))
AssertionError: False is not True : Expecting 1 locations, got 0.
Config=x86_64-/Users/buildslave/jenkins/workspace/lldb-cmake-matrix/lldb-build/bin/clang-10
======================================================================
FAIL: test_step_all_threads_dwarf (TestThreadStepOut.ThreadStepOutTestCase)
    Test thread step out on all threads via command interpreter.
----------------------------------------------------------------------
Traceback (most recent call last):
  File "/Users/buildslave/jenkins/workspace/lldb-cmake-matrix/llvm-project/lldb/packages/Python/lldbsuite/test/lldbtest.py", line 1748, in test_method
    return attrvalue(self)
  File "/Users/buildslave/jenkins/workspace/lldb-cmake-matrix/llvm-project/lldb/packages/Python/lldbsuite/test/decorators.py", line 111, in wrapper
    func(*args, **kwargs)
  File "/Users/buildslave/jenkins/workspace/lldb-cmake-matrix/llvm-project/lldb/packages/Python/lldbsuite/test/decorators.py", line 111, in wrapper
    func(*args, **kwargs)
  File "/Users/buildslave/jenkins/workspace/lldb-cmake-matrix/llvm-project/lldb/packages/Python/lldbsuite/test/decorators.py", line 111, in wrapper
    func(*args, **kwargs)
  File "/Users/buildslave/jenkins/workspace/lldb-cmake-matrix/llvm-project/lldb/packages/Python/lldbsuite/test/decorators.py", line 111, in wrapper
    func(*args, **kwargs)
  File "/Users/buildslave/jenkins/workspace/lldb-cmake-matrix/llvm-project/lldb/packages/Python/lldbsuite/test/decorators.py", line 111, in wrapper
    func(*args, **kwargs)
  File "/Users/buildslave/jenkins/workspace/lldb-cmake-matrix/llvm-project/lldb/packages/Python/lldbsuite/test/functionalities/thread/step_out/TestThreadStepOut.py", line 49, in test_step_all_threads
    self.step_out_test(self.step_out_all_threads_with_cmd)
  File "/Users/buildslave/jenkins/workspace/lldb-cmake-matrix/llvm-project/lldb/packages/Python/lldbsuite/test/functionalities/thread/step_out/TestThreadStepOut.py", line 137, in step_out_test
    self, "main.cpp", self.breakpoint, num_expected_locations=1)
  File "/Users/buildslave/jenkins/workspace/lldb-cmake-matrix/llvm-project/lldb/packages/Python/lldbsuite/test/lldbutil.py", line 388, in run_break_set_by_file_and_line
    num_locations=num_expected_locations)
  File "/Users/buildslave/jenkins/workspace/lldb-cmake-matrix/llvm-project/lldb/packages/Python/lldbsuite/test/lldbutil.py", line 584, in check_breakpoint_result
    out_num_locations))
AssertionError: False is not True : Expecting 1 locations, got 0.
Config=x86_64-/Users/buildslave/jenkins/workspace/lldb-cmake-matrix/lldb-build/bin/clang-10
======================================================================
FAIL: test_step_single_thread_dsym (TestThreadStepOut.ThreadStepOutTestCase)
    Test thread step out on one thread via command interpreter.
----------------------------------------------------------------------
Traceback (most recent call last):
  File "/Users/buildslave/jenkins/workspace/lldb-cmake-matrix/llvm-project/lldb/packages/Python/lldbsuite/test/lldbtest.py", line 1748, in test_method
    return attrvalue(self)
  File "/Users/buildslave/jenkins/workspace/lldb-cmake-matrix/llvm-project/lldb/packages/Python/lldbsuite/test/decorators.py", line 111, in wrapper
    func(*args, **kwargs)
  File "/Users/buildslave/jenkins/workspace/lldb-cmake-matrix/llvm-project/lldb/packages/Python/lldbsuite/test/decorators.py", line 111, in wrapper
    func(*args, **kwargs)
  File "/Users/buildslave/jenkins/workspace/lldb-cmake-matrix/llvm-project/lldb/packages/Python/lldbsuite/test/decorators.py", line 111, in wrapper
    func(*args, **kwargs)
  File "/Users/buildslave/jenkins/workspace/lldb-cmake-matrix/llvm-project/lldb/packages/Python/lldbsuite/test/decorators.py", line 111, in wrapper
    func(*args, **kwargs)
  File "/Users/buildslave/jenkins/workspace/lldb-cmake-matrix/llvm-project/lldb/packages/Python/lldbsuite/test/functionalities/thread/step_out/TestThreadStepOut.py", line 32, in test_step_single_thread
    self.step_out_test(self.step_out_single_thread_with_cmd)
  File "/Users/buildslave/jenkins/workspace/lldb-cmake-matrix/llvm-project/lldb/packages/Python/lldbsuite/test/functionalities/thread/step_out/TestThreadStepOut.py", line 137, in step_out_test
    self, "main.cpp", self.breakpoint, num_expected_locations=1)
  File "/Users/buildslave/jenkins/workspace/lldb-cmake-matrix/llvm-project/lldb/packages/Python/lldbsuite/test/lldbutil.py", line 388, in run_break_set_by_file_and_line
    num_locations=num_expected_locations)
  File "/Users/buildslave/jenkins/workspace/lldb-cmake-matrix/llvm-project/lldb/packages/Python/lldbsuite/test/lldbutil.py", line 584, in check_breakpoint_result
    out_num_locations))
AssertionError: False is not True : Expecting 1 locations, got 0.
Config=x86_64-/Users/buildslave/jenkins/workspace/lldb-cmake-matrix/lldb-build/bin/clang-10
======================================================================
FAIL: test_step_single_thread_dwarf (TestThreadStepOut.ThreadStepOutTestCase)
    Test thread step out on one thread via command interpreter.
----------------------------------------------------------------------
Traceback (most recent call last):
  File "/Users/buildslave/jenkins/workspace/lldb-cmake-matrix/llvm-project/lldb/packages/Python/lldbsuite/test/lldbtest.py", line 1748, in test_method
    return attrvalue(self)
  File "/Users/buildslave/jenkins/workspace/lldb-cmake-matrix/llvm-project/lldb/packages/Python/lldbsuite/test/decorators.py", line 111, in wrapper
    func(*args, **kwargs)
  File "/Users/buildslave/jenkins/workspace/lldb-cmake-matrix/llvm-project/lldb/packages/Python/lldbsuite/test/decorators.py", line 111, in wrapper
    func(*args, **kwargs)
  File "/Users/buildslave/jenkins/workspace/lldb-cmake-matrix/llvm-project/lldb/packages/Python/lldbsuite/test/decorators.py", line 111, in wrapper
    func(*args, **kwargs)
  File "/Users/buildslave/jenkins/workspace/lldb-cmake-matrix/llvm-project/lldb/packages/Python/lldbsuite/test/decorators.py", line 111, in wrapper
    func(*args, **kwargs)
  File "/Users/buildslave/jenkins/workspace/lldb-cmake-matrix/llvm-project/lldb/packages/Python/lldbsuite/test/functionalities/thread/step_out/TestThreadStepOut.py", line 32, in test_step_single_thread
    self.step_out_test(self.step_out_single_thread_with_cmd)
  File "/Users/buildslave/jenkins/workspace/lldb-cmake-matrix/llvm-project/lldb/packages/Python/lldbsuite/test/functionalities/thread/step_out/TestThreadStepOut.py", line 137, in step_out_test
    self, "main.cpp", self.breakpoint, num_expected_locations=1)
  File "/Users/buildslave/jenkins/workspace/lldb-cmake-matrix/llvm-project/lldb/packages/Python/lldbsuite/test/lldbutil.py", line 388, in run_break_set_by_file_and_line
    num_locations=num_expected_locations)
  File "/Users/buildslave/jenkins/workspace/lldb-cmake-matrix/llvm-project/lldb/packages/Python/lldbsuite/test/lldbutil.py", line 584, in check_breakpoint_result
    out_num_locations))
AssertionError: False is not True : Expecting 1 locations, got 0.
Config=x86_64-/Users/buildslave/jenkins/workspace/lldb-cmake-matrix/lldb-build/bin/clang-10
----------------------------------------------------------------------
Ran 12 tests in 6.728s

RESULT: FAILED (0 passes, 6 failures, 0 errors, 6 skipped, 0 expected failures, 0 unexpected successes)

********************
PASS: lldb-api :: tools/lldb-server/TestLldbGdbServer.py (1785 of 1788)
TIMEOUT: lldb-api :: python_api/lldbutil/iter/TestLLDBIterator.py (1786 of 1788)
******************** TEST 'lldb-api :: python_api/lldbutil/iter/TestLLDBIterator.py' FAILED ********************
Reached timeout of 600 seconds
********************
TIMEOUT: lldb-api :: lang/objc/foundation/TestObjCMethods.py (1787 of 1788)
******************** TEST 'lldb-api :: lang/objc/foundation/TestObjCMethods.py' FAILED ********************
Reached timeout of 600 seconds
********************
TIMEOUT: lldb-api :: python_api/lldbutil/iter/TestRegistersIterator.py (1788 of 1788)
******************** TEST 'lldb-api :: python_api/lldbutil/iter/TestRegistersIterator.py' FAILED ********************
Reached timeout of 600 seconds
********************
Testing Time: 804.19s
********************
Failing Tests (476):
    lldb-api :: lang/objc/objc-optimized/TestObjcOptimized.py
    lldb-api :: commands/expression/persist_objc_pointeetype/TestPersistObjCPointeeType.py
    lldb-api :: functionalities/thread/concurrent_events/TestConcurrentSignalBreak.py
    lldb-api :: functionalities/data-formatter/nsdictionarysynth/TestNSDictionarySynthetic.py
    lldb-api :: lang/objc/objc-class-method/TestObjCClassMethod.py
    lldb-api :: lang/objc/objc-new-syntax/TestObjCNewSyntaxDictionary.py
    lldb-api :: lang/c/modules/TestCModules.py
    lldb-api :: commands/expression/unwind_expression/TestUnwindExpression.py
    lldb-api :: lang/objc/foundation/TestObjCMethodsNSError.py
    lldb-api :: functionalities/data-formatter/data-formatter-stl/libstdcpp/unique_ptr/invalid/TestDataFormatterInvalidStdUniquePtr.py
    lldb-api :: functionalities/thread/create_after_attach/TestCreateAfterAttach.py
    lldb-api :: functionalities/type_lookup/TestTypeLookup.py
    lldb-api :: lang/c/blocks/TestBlocks.py
    lldb-api :: lang/cpp/llvm-style/TestLLVMStyle.py
    lldb-api :: lang/cpp/template/TestTemplateArgs.py
    lldb-api :: lang/objcxx/class-name-clash/TestNameClash.py
    lldb-api :: commands/expression/completion-in-lambda-and-unnnamed-class/TestCompletionInLambdaAndUnnamedClass.py
    lldb-api :: lang/cpp/unsigned_types/TestUnsignedTypes.py
    lldb-api :: lang/objc/print-obj/TestPrintObj.py
    lldb-api :: lang/objc/conflicting-definition/TestConflictingDefinition.py
    lldb-api :: macosx/nslog/TestDarwinNSLogOutput.py
    lldb-api :: functionalities/thread/thread_specific_break/TestThreadSpecificBreakpoint.py
    lldb-api :: python_api/hello_world/TestHelloWorld.py
    lldb-api :: functionalities/memory/find/TestMemoryFind.py
    lldb-api :: lang/cpp/namespace/TestNamespace.py
    lldb-api :: commands/expression/vector_of_enums/TestVectorOfEnums.py
    lldb-api :: functionalities/data-formatter/data-formatter-objc/TestDataFormatterObjCNSError.py
    lldb-api :: lang/cpp/namespace/TestNamespaceLookup.py
    lldb-api :: lang/cpp/offsetof/TestOffsetofCpp.py
    lldb-api :: lang/objc/self/TestObjCSelf.py
    lldb-api :: lang/c/tls_globals/TestTlsGlobals.py
    lldb-api :: commands/expression/rdar42038760/TestScalarURem.py
    lldb-api :: commands/expression/context-object/TestContextObject.py
    lldb-api :: commands/frame/diagnose/bad-reference/TestBadReference.py
    lldb-api :: functionalities/thread/concurrent_events/TestConcurrentSignalDelayBreak.py
    lldb-api :: functionalities/avoids-fd-leak/TestFdLeak.py
    lldb-api :: lang/objc/foundation/TestObjCMethods2.py
    lldb-api :: python_api/lldbutil/process/TestPrintStackTraces.py
    lldb-api :: functionalities/data-formatter/data-formatter-stl/libcxx/vbool/TestDataFormatterLibcxxVBool.py
    lldb-api :: lang/mixed/TestMixedLanguages.py
    lldb-api :: commands/frame/diagnose/dereference-this/TestDiagnoseDereferenceThis.py
    lldb-api :: commands/expression/ir-interpreter/TestIRInterpreter.py
    lldb-api :: sample_test/TestSampleTest.py
    lldb-api :: functionalities/thread/exit_during_break/TestExitDuringBreak.py
    lldb-api :: lang/objc/objc-runtime-ivars/TestRuntimeIvars.py
    lldb-api :: lang/cpp/class_types/TestClassTypesDisassembly.py
    lldb-api :: lang/objc/foundation/TestObjCMethodsNSArray.py
    lldb-api :: commands/expression/test/TestExprs.py
    lldb-api :: lang/c/anonymous/TestAnonymous.py
    lldb-api :: lang/cpp/signed_types/TestSignedTypes.py
    lldb-api :: python_api/frame/TestFrames.py
    lldb-api :: lang/cpp/modules-import/TestCXXModulesImport.py
    lldb-api :: functionalities/data-formatter/nsarraysynth/TestNSArraySynthetic.py
    lldb-api :: commands/target/basic/TestTargetCommand.py
    lldb-api :: functionalities/data-formatter/refpointer-recursion/TestDataFormatterRefPtrRecursion.py
    lldb-api :: lang/c/forward/TestForwardDeclaration.py
    lldb-api :: functionalities/data-formatter/data-formatter-stl/libcxx/list/loop/TestDataFormatterLibcxxListLoop.py
    lldb-api :: commands/expression/issue_11588/Test11588.py
    lldb-api :: functionalities/thread/backtrace_limit/TestBacktraceLimit.py
    lldb-api :: commands/frame/diagnose/dereference-argument/TestDiagnoseDereferenceArgument.py
    lldb-api :: lang/objc/objc++/TestObjCXX.py
    lldb-api :: functionalities/breakpoint/breakpoint_by_line_and_column/TestBreakpointByLineAndColumn.py
    lldb-api :: functionalities/data-formatter/data-formatter-stl/libcxx/initializerlist/TestInitializerList.py
    lldb-api :: functionalities/data-formatter/data-formatter-stl/libcxx/atomic/TestLibCxxAtomic.py
    lldb-api :: commands/command/nested_alias/TestNestedAlias.py
    lldb-api :: functionalities/breakpoint/breakpoint_command/TestRegexpBreakCommand.py
    lldb-api :: lang/cpp/static_methods/TestCPPStaticMethods.py
    lldb-api :: functionalities/breakpoint/breakpoint_command/TestBreakpointCommand.py
    lldb-api :: commands/process/attach-resume/TestAttachResume.py
    lldb-api :: commands/expression/import-std-module/list-basic/TestBasicList.py
    lldb-api :: functionalities/data-formatter/pyobjsynthprovider/TestPyObjSynthProvider.py
    lldb-api :: lang/c/struct_types/TestStructTypes.py
    lldb-api :: commands/expression/completion/TestExprCompletion.py
    lldb-api :: commands/expression/char/TestExprsChar.py
    lldb-api :: types/TestFloatTypesExpr.py
    lldb-api :: commands/expression/import-std-module/stack/TestStack.py
    lldb-api :: commands/frame/diagnose/dereference-function-return/TestDiagnoseDereferenceFunctionReturn.py
    lldb-api :: functionalities/data-formatter/data-formatter-synthval/TestDataFormatterSynthVal.py
    lldb-api :: functionalities/data-formatter/ostypeformatting/TestFormattersOsType.py
    lldb-api :: lang/objc/unicode-string/TestUnicodeString.py
    lldb-api :: lang/cpp/operator-overload/TestOperatorOverload.py
    lldb-api :: functionalities/thread/concurrent_events/TestConcurrentDelayedCrashWithBreakpointSignal.py
    lldb-api :: commands/expression/import-std-module/unique_ptr-dbg-info-content/TestUniquePtrDbgInfoContent.py
    lldb-api :: commands/expression/import-std-module/weak_ptr-dbg-info-content/TestDbgInfoContentWeakPtr.py
    lldb-api :: functionalities/tail_call_frames/inlining_and_tail_calls/TestInliningAndTailCalls.py
    lldb-api :: functionalities/plugins/python_os_plugin/TestPythonOSPlugin.py
    lldb-api :: commands/expression/pr35310/TestExprsBug35310.py
    lldb-api :: functionalities/thread/num_threads/TestNumThreads.py
    lldb-api :: functionalities/breakpoint/breakpoint_ids/TestBreakpointIDs.py
    lldb-api :: lang/objc/forward-decl/TestForwardDecl.py
    lldb-api :: functionalities/breakpoint/auto_continue/TestBreakpointAutoContinue.py
    lldb-api :: types/TestFloatTypes.py
    lldb-api :: lang/cpp/virtual/TestVirtual.py
    lldb-api :: functionalities/tail_call_frames/disambiguate_paths_to_common_sink/TestDisambiguatePathsToCommonSink.py
    lldb-api :: commands/settings/TestSettings.py
    lldb-api :: python_api/target/TestTargetAPI.py
    lldb-api :: functionalities/data-formatter/compactvectors/TestCompactVectors.py
    lldb-api :: functionalities/tail_call_frames/unambiguous_sequence/TestUnambiguousTailCalls.py
    lldb-api :: functionalities/breakpoint/inlined_breakpoints/TestInlinedBreakpoints.py
    lldb-api :: lang/cpp/class_types/TestClassTypes.py
    lldb-api :: functionalities/modern-type-lookup/objc-modules/TestObjModulesModernTypeLookup.py
    lldb-api :: functionalities/data-formatter/format-propagation/TestFormatPropagation.py
    lldb-api :: python_api/sbvalue_persist/TestSBValuePersist.py
    lldb-api :: commands/expression/import-std-module/forward_list-basic/TestBasicForwardList.py
    lldb-api :: commands/expression/no-deadlock/TestExprDoesntBlock.py
    lldb-api :: functionalities/data-formatter/data-formatter-objc/TestDataFormatterObjCNSDate.py
    lldb-api :: lang/cpp/member-and-local-vars-with-same-name/TestMembersAndLocalsWithSameName.py
    lldb-api :: lang/cpp/frame-var-anon-unions/TestFrameVariableAnonymousUnions.py
    lldb-api :: commands/apropos/with-process/TestAproposWithProcess.py
    lldb-api :: python_api/frame/get-variables/TestGetVariables.py
    lldb-api :: lang/cpp/symbols/TestSymbols.py
    lldb-api :: functionalities/recursion/TestValueObjectRecursion.py
    lldb-api :: python_api/value/linked_list/TestValueAPILinkedList.py
    lldb-api :: commands/expression/radar_8638051/Test8638051.py
    lldb-api :: lang/c/vla/TestVLA.py
    lldb-api :: functionalities/tail_call_frames/disambiguate_call_site/TestDisambiguateCallSite.py
    lldb-api :: driver/batch_mode/TestBatchMode.py
    lldb-api :: lang/objc/objc-baseclass-sbtype/TestObjCBaseClassSBType.py
    lldb-api :: commands/source/info/TestSourceInfo.py
    lldb-api :: commands/expression/import-std-module/conflicts/TestStdModuleWithConflicts.py
    lldb-api :: functionalities/param_entry_vals/basic_entry_values_x86_64/TestBasicEntryValuesX86_64.py
    lldb-api :: functionalities/thread/crash_during_step/TestCrashDuringStep.py
    lldb-api :: functionalities/breakpoint/source_regexp/TestSourceRegexBreakpoints.py
    lldb-api :: functionalities/data-formatter/hexcaps/TestDataFormatterHexCaps.py
    lldb-api :: functionalities/step_scripted/TestStepScripted.py
    lldb-api :: functionalities/data-formatter/setvaluefromcstring/TestSetValueFromCString.py
    lldb-api :: functionalities/thread/concurrent_events/TestConcurrentTwoBreakpointsOneDelaySignal.py
    lldb-api :: functionalities/data-formatter/stringprinter/TestStringPrinter.py
    lldb-api :: functionalities/inferior-crashing/TestInferiorCrashing.py
    lldb-api :: functionalities/data-formatter/parray/TestPrintArray.py
    lldb-api :: lang/objc/objc-new-syntax/TestObjCNewSyntaxArray.py
    lldb-api :: commands/expression/import-std-module/no-std-module/TestMissingStdModule.py
    lldb-api :: functionalities/thread/thread_exit/TestThreadExit.py
    lldb-api :: python_api/objc_type/TestObjCType.py
    lldb-api :: functionalities/thread/concurrent_events/TestConcurrentCrashWithBreak.py
    lldb-api :: commands/frame/diagnose/virtual-method-call/TestDiagnoseDereferenceVirtualMethodCall.py
    lldb-api :: functionalities/dynamic_value_child_count/TestDynamicValueChildCount.py
    lldb-api :: commands/expression/import-std-module/empty-module/TestEmptyStdModule.py
    lldb-api :: functionalities/data-formatter/data-formatter-smart-array/TestDataFormatterSmartArray.py
    lldb-api :: functionalities/thread/concurrent_events/TestConcurrentBreakpointOneDelayBreakpointThreads.py
    lldb-api :: functionalities/breakpoint/debugbreak/TestDebugBreak.py
    lldb-api :: functionalities/inferior-changed/TestInferiorChanged.py
    lldb-api :: functionalities/data-formatter/dump_dynamic/TestDumpDynamic.py
    lldb-api :: functionalities/data-formatter/nssetsynth/TestNSSetSynthetic.py
    lldb-api :: functionalities/return-value/TestReturnValue.py
    lldb-api :: functionalities/inferior-crashing/TestInferiorCrashingStep.py
    lldb-api :: macosx/find-dsym/deep-bundle/TestDeepBundle.py
    lldb-api :: macosx/duplicate-archive-members/TestDuplicateMembers.py
    lldb-api :: lang/objc/foundation/TestRuntimeTypes.py
    lldb-api :: lang/objc/objc-ivar-offsets/TestObjCIvarOffsets.py
    lldb-api :: commands/frame/diagnose/local-variable/TestLocalVariable.py
    lldb-api :: functionalities/data-formatter/language_category_updates/TestDataFormatterLanguageCategoryUpdates.py
    lldb-api :: lang/objc/hidden-ivars/TestHiddenIvars.py
    lldb-api :: functionalities/data-formatter/data-formatter-objc/nsindexpath/TestDataFormatterNSIndexPath.py
    lldb-api :: lang/cpp/namespace_definitions/TestNamespaceDefinitions.py
    lldb-api :: lang/cpp/breakpoint-commands/TestCPPBreakpointCommands.py
    lldb-api :: lang/cpp/dynamic-value/TestCppValueCast.py
    lldb-api :: functionalities/memory-region/TestMemoryRegion.py
    lldb-api :: commands/expression/rdar44436068/Test128BitsInteger.py
    lldb-api :: functionalities/data-formatter/data-formatter-objc/TestDataFormatterObjCNSData.py
    lldb-api :: commands/expression/persistent_ptr_update/TestPersistentPtrUpdate.py
    lldb-api :: functionalities/data-formatter/data-formatter-objc/TestDataFormatterObjCNSURL.py
    lldb-api :: functionalities/thread/concurrent_events/TestConcurrentBreakpointDelayBreakpointOneSignal.py
    lldb-api :: commands/expression/persistent_types/TestPersistentTypes.py
    lldb-api :: sample_test/TestSampleInlineTest.py
    lldb-api :: lang/c/find_struct_type/TestFindStructTypes.py
    lldb-api :: functionalities/data-formatter/data-formatter-stl/libcxx/queue/TestDataFormatterLibcxxQueue.py
    lldb-api :: functionalities/data-formatter/typedef_array/TestTypedefArray.py
    lldb-api :: functionalities/data-formatter/data-formatter-skip-summary/TestDataFormatterSkipSummary.py
    lldb-api :: commands/expression/call-overridden-method/TestCallOverriddenMethod.py
    lldb-api :: functionalities/conditional_break/TestConditionalBreak.py
    lldb-api :: lang/cpp/trivial_abi/TestTrivialABI.py
    lldb-api :: lang/c/offsetof/TestOffsetof.py
    lldb-api :: types/TestIntegerTypes.py
    lldb-api :: functionalities/data-formatter/data-formatter-objc/TestDataFormatterObjCPlain.py
    lldb-api :: python_api/sbtype_typeclass/TestSBTypeTypeClass.py
    lldb-api :: functionalities/data-formatter/ptr_ref_typedef/TestPtrRef2Typedef.py
    lldb-api :: functionalities/data-formatter/varscript_formatting/TestDataFormatterVarScriptFormatting.py
    lldb-api :: commands/expression/call-function/TestCallStopAndContinue.py
    lldb-api :: lang/objc/modules-cache/TestClangModulesCache.py
    lldb-api :: commands/expression/import-std-module/shared_ptr/TestSharedPtr.py
    lldb-api :: functionalities/breakpoint/breakpoint_options/TestBreakpointOptions.py
    lldb-api :: lang/cpp/overloaded-functions/TestOverloadedFunctions.py
    lldb-api :: lang/objc/single-entry-dictionary/TestObjCSingleEntryDictionary.py
    lldb-api :: functionalities/tail_call_frames/thread_step_out_message/TestArtificialFrameStepOutMessage.py
    lldb-api :: functionalities/float-display/TestFloatDisplay.py
    lldb-api :: types/TestIntegerTypesExpr.py
    lldb-api :: lang/cpp/namespace_conflicts/TestNamespaceConflicts.py
    lldb-api :: lang/cpp/diamond/TestDiamond.py
    lldb-api :: lang/c/global_variables/TestGlobalVariables.py
    lldb-api :: source-manager/TestSourceManager.py
    lldb-api :: python_api/name_lookup/TestNameLookup.py
    lldb-api :: commands/disassemble/basic/TestDisassembleBreakpoint.py
    lldb-api :: lang/c/stepping/TestStepAndBreakpoints.py
    lldb-api :: lang/cpp/dynamic-value-same-basename/TestDynamicValueSameBase.py
    lldb-api :: functionalities/data-formatter/data-formatter-synthtype/TestDataFormatterSynthType.py
    lldb-api :: functionalities/unwind/sigtramp/TestSigtrampUnwind.py
    lldb-api :: functionalities/data-formatter/data-formatter-python-synth/TestDataFormatterPythonSynth.py
    lldb-api :: lang/cpp/nsimport/TestCppNsImport.py
    lldb-api :: lang/cpp/dynamic-value/TestDynamicValue.py
    lldb-api :: functionalities/data-formatter/data-formatter-objc/nsstring/TestDataFormatterNSString.py
    lldb-api :: commands/disassemble/basic/TestFrameDisassemble.py
    lldb-api :: lang/cpp/type_lookup/TestCppTypeLookup.py
    lldb-api :: functionalities/data-formatter/data-formatter-proper-plurals/TestFormattersOneIsSingular.py
    lldb-api :: commands/expression/test/TestExprs2.py
    lldb-api :: functionalities/data-formatter/data-formatter-objc/TestDataFormatterObjCKVO.py
    lldb-api :: lang/c/conflicting-symbol/TestConflictingSymbol.py
    lldb-api :: commands/statistics/basic/TestStats.py
    lldb-api :: python_api/value/empty_class/TestValueAPIEmptyClass.py
    lldb-api :: functionalities/completion/TestCompletion.py
    lldb-api :: lang/objc/ptr_refs/TestPtrRefsObjC.py
    lldb-api :: functionalities/inline-stepping/TestInlineStepping.py
    lldb-api :: lang/c/unicode/TestUnicodeSymbols.py
    lldb-api :: commands/expression/po_verbosity/TestPoVerbosity.py
    lldb-api :: functionalities/type_completion/TestTypeCompletion.py
    lldb-api :: commands/expression/import-std-module/basic/TestImportStdModule.py
    lldb-api :: commands/expression/anonymous-struct/TestCallUserAnonTypedef.py
    lldb-api :: functionalities/inferior-crashing/recursive-inferior/TestRecursiveInferiorStep.py
    lldb-api :: functionalities/signal/handle-abrt/TestHandleAbort.py
    lldb-api :: functionalities/data-formatter/data-formatter-objc/TestDataFormatterObjCNSBundle.py
    lldb-api :: functionalities/data-formatter/data-formatter-stl/libcxx/optional/TestDataFormatterLibcxxOptional.py
    lldb-api :: functionalities/memory/cache/TestMemoryCache.py
    lldb-api :: functionalities/data-formatter/data-formatter-ptr-to-array/TestPtrToArrayFormatting.py
    lldb-api :: functionalities/data-formatter/data-formatter-stl/libcxx/multimap/TestDataFormatterLibccMultiMap.py
    lldb-api :: python_api/signals/TestSignalsAPI.py
    lldb-api :: functionalities/data-formatter/vector-types/TestVectorTypesFormatting.py
    lldb-api :: functionalities/tail_call_frames/sbapi_support/TestTailCallFrameSBAPI.py
    lldb-api :: lang/cpp/bool/TestCPPBool.py
    lldb-api :: functionalities/thread/concurrent_events/TestConcurrentManyCrash.py
    lldb-api :: commands/expression/fixits/TestFixIts.py
    lldb-api :: functionalities/breakpoint/breakpoint_command/TestBreakpointCommandsFromPython.py
    lldb-api :: functionalities/breakpoint/address_breakpoints/TestBadAddressBreakpoints.py
    lldb-api :: lang/objc/objc-builtin-types/TestObjCBuiltinTypes.py
    lldb-api :: lang/cpp/operators/TestCppOperators.py
    lldb-api :: functionalities/data-formatter/data-formatter-stl/libcxx/string/TestDataFormatterLibcxxString.py
    lldb-api :: lang/c/shared_lib/TestSharedLib.py
    lldb-api :: functionalities/breakpoint/step_over_breakpoint/TestStepOverBreakpoint.py
    lldb-api :: functionalities/data-formatter/var-in-aggregate-misuse/TestVarInAggregateMisuse.py
    lldb-api :: functionalities/data-formatter/frameformat_smallstruct/TestFrameFormatSmallStruct.py
    lldb-api :: python_api/value/TestValueAPI.py
    lldb-api :: lang/objc/objc-struct-return/TestObjCStructReturn.py
    lldb-api :: commands/expression/import-std-module/vector-basic/TestBasicVector.py
    lldb-api :: lang/objc/objc-new-syntax/TestObjCNewSyntaxLiteral.py
    lldb-api :: python_api/type/TestTypeList.py
    lldb-api :: lang/objc/objc-checker/TestObjCCheckers.py
    lldb-api :: lang/objc/blocks/TestObjCIvarsInBlocks.py
    lldb-api :: functionalities/data-formatter/data-formatter-stl/libcxx/iterator/TestDataFormatterLibccIterator.py
    lldb-api :: functionalities/modern-type-lookup/libcxx/TestLibCxxModernTypeLookup.py
    lldb-api :: functionalities/data-formatter/data-formatter-stl/libcxx/bitset/TestDataFormatterLibcxxBitset.py
    lldb-api :: python_api/lldbutil/frame/TestFrameUtils.py
    lldb-api :: functionalities/breakpoint/address_breakpoints/TestAddressBreakpoints.py
    lldb-api :: functionalities/breakpoint/breakpoint_set_restart/TestBreakpointSetRestart.py
    lldb-api :: lang/c/unions/TestUnionMembers.py
    lldb-api :: lang/objc/modules/TestObjCModules.py
    lldb-api :: functionalities/load_unload/TestLoadUnload.py
    lldb-api :: functionalities/exec/TestExec.py
    lldb-api :: lang/cpp/limit-debug-info/TestWithLimitDebugInfo.py
    lldb-api :: commands/expression/context-object-objc/TestContextObjectObjc.py
    lldb-api :: lang/objc/foundation/TestObjCMethodsString.py
    lldb-api :: functionalities/value_md5_crash/TestValueMD5Crash.py
    lldb-api :: lang/c/function_types/TestFunctionTypes.py
    lldb-api :: lang/objc/objc-ivar-stripped/TestObjCIvarStripped.py
    lldb-api :: functionalities/breakpoint/cpp/TestCPPBreakpointLocations.py
    lldb-api :: functionalities/data-formatter/synthcapping/TestSyntheticCapping.py
    lldb-api :: macosx/find-dsym/bundle-with-dot-in-filename/TestBundleWithDotInFilename.py
    lldb-api :: commands/gui/basic/TestGuiBasic.py
    lldb-api :: functionalities/modern-type-lookup/basic-objc/TestBasicObjcModernTypeLookup.py
    lldb-api :: lang/cpp/gmodules-templates/TestGModules.py
    lldb-api :: functionalities/breakpoint/breakpoint_language/TestBreakpointLanguage.py
    lldb-api :: lang/objc/foundation/TestConstStrings.py
    lldb-api :: functionalities/breakpoint/move_nearest/TestMoveNearest.py
    lldb-api :: commands/expression/import-std-module/vector-dbg-info-content/TestDbgInfoContentVector.py
    lldb-api :: commands/expression/unicode-in-variable/TestUnicodeInVariable.py
    lldb-api :: functionalities/inferior-assert/TestInferiorAssert.py
    lldb-api :: functionalities/breakpoint/global_constructor/TestBreakpointInGlobalConstructor.py
    lldb-api :: functionalities/data-formatter/user-format-vs-summary/TestUserFormatVsSummary.py
    lldb-api :: functionalities/data-formatter/data-formatter-globals/TestDataFormatterGlobals.py
    lldb-api :: functionalities/data-formatter/data-formatter-stl/libcxx/forward_list/TestDataFormatterLibcxxForwardList.py
    lldb-api :: functionalities/breakpoint/breakpoint_locations/TestBreakpointLocations.py
    lldb-api :: lang/c/enum_types/TestEnumTypes.py
    lldb-api :: commands/expression/call-function/TestCallBuiltinFunction.py
    lldb-api :: lang/c/register_variables/TestRegisterVariables.py
    lldb-api :: commands/expression/persistent_variables/TestPersistentVariables.py
    lldb-api :: lang/cpp/unique-types/TestUniqueTypes.py
    lldb-api :: functionalities/data-formatter/data-formatter-stl/libcxx/multiset/TestDataFormatterLibcxxMultiSet.py
    lldb-api :: lang/cpp/function_refs/TestFunctionRefs.py
    lldb-api :: commands/expression/import-std-module/deque-basic/TestBasicDeque.py
    lldb-api :: functionalities/breakpoint/comp_dir_symlink/TestCompDirSymLink.py
    lldb-api :: functionalities/thread/step_until/TestStepUntil.py
    lldb-api :: functionalities/data-formatter/data-formatter-stl/libcxx/tuple/TestDataFormatterLibcxxTuple.py
    lldb-api :: lang/cpp/extern_c/TestExternCSymbols.py
    lldb-api :: lang/cpp/const_this/TestConstThis.py
    lldb-api :: commands/expression/function_template_specialization_temp_args/TestFunctionTemplateSpecializationTempArgs.py
    lldb-api :: lang/cpp/virtual-overload/TestVirtualOverload.py
    lldb-api :: lang/c/step-target/TestStepTarget.py
    lldb-api :: functionalities/data-formatter/data-formatter-stl/libcxx/list/TestDataFormatterLibcxxList.py
    lldb-api :: commands/expression/expr-in-syscall/TestExpressionInSyscall.py
    lldb-api :: lang/objcxx/objcxx-ivar-vector/TestIvarVector.py
    lldb-api :: commands/expression/ir-interpreter-phi-nodes/TestIRInterpreterPHINodes.py
    lldb-api :: commands/expression/dollar-in-variable/TestDollarInVariable.py
    lldb-api :: functionalities/ptr_refs/TestPtrRefs.py
    lldb-api :: commands/expression/top-level/TestTopLevelExprs.py
    lldb-api :: functionalities/data-formatter/data-formatter-advanced/TestDataFormatterAdv.py
    lldb-api :: functionalities/thread/concurrent_events/TestConcurrentTwoBreakpointsOneSignal.py
    lldb-api :: python_api/interpreter/TestCommandInterpreterAPI.py
    lldb-api :: python_api/findvalue_duplist/TestSBFrameFindValue.py
    lldb-api :: lang/c/set_values/TestSetValues.py
    lldb-api :: functionalities/data-formatter/data-formatter-stl/libcxx/set/TestDataFormatterLibcxxSet.py
    lldb-api :: functionalities/breakpoint/consecutive_breakpoints/TestConsecutiveBreakpoints.py
    lldb-api :: types/TestRecursiveTypes.py
    lldb-api :: python_api/symbol-context/TestSymbolContext.py
    lldb-api :: functionalities/signal/TestSendSignal.py
    lldb-api :: lang/cpp/rvalue-references/TestRvalueReferences.py
    lldb-api :: commands/process/launch-with-shellexpand/TestLaunchWithShellExpand.py
    lldb-api :: lang/objc/rdar-10967107/TestRdar10967107.py
    lldb-api :: commands/expression/save_jit_objects/TestSaveJITObjects.py
    lldb-api :: lang/c/const_variables/TestConstVariables.py
    lldb-api :: commands/expression/multiline-completion/TestMultilineCompletion.py
    lldb-api :: lang/c/bitfields/TestBitfields.py
    lldb-api :: commands/expression/import-std-module/sysroot/TestStdModuleSysroot.py
    lldb-api :: functionalities/set-data/TestSetData.py
    lldb-api :: lang/cpp/this/TestCPPThis.py
    lldb-api :: macosx/indirect_symbol/TestIndirectSymbols.py
    lldb-api :: python_api/symbol-context/two-files/TestSymbolContextTwoFiles.py
    lldb-api :: lang/objc/orderedset/TestOrderedSet.py
    lldb-api :: lang/c/array_types/TestArrayTypes.py
    lldb-api :: lang/cpp/global_variables/TestCPPGlobalVariables.py
    lldb-api :: python_api/function_symbol/TestSymbolAPI.py
    lldb-api :: commands/expression/import-std-module/vector-bool/TestBoolVector.py
    lldb-api :: functionalities/breakpoint/breakpoint_conditions/TestBreakpointConditions.py
    lldb-api :: functionalities/thread/backtrace_all/TestBacktraceAll.py
    lldb-api :: commands/expression/entry-bp/TestExprEntryBP.py
    lldb-api :: lang/c/inlines/TestRedefinitionsInInlines.py
    lldb-api :: lang/cpp/enum_types/TestCPP11EnumTypes.py
    lldb-api :: lang/cpp/class_static/TestStaticVariables.py
    lldb-api :: functionalities/tail_call_frames/ambiguous_tail_call_seq2/TestAmbiguousTailCallSeq2.py
    lldb-api :: python_api/function_symbol/TestDisasmAPI.py
    lldb-api :: functionalities/thread/concurrent_events/TestConcurrentManyBreakpoints.py
    lldb-api :: lang/cpp/char8_t/TestCxxChar8_t.py
    lldb-api :: commands/expression/import-std-module/vector-of-vectors/TestVectorOfVectors.py
    lldb-api :: commands/expression/call-throws/TestCallThatThrows.py
    lldb-api :: lang/objc/objc-property/TestObjCProperty.py
    lldb-api :: commands/frame/language/TestGuessLanguage.py
    lldb-api :: lang/c/strings/TestCStrings.py
    lldb-api :: macosx/find-app-in-bundle/TestFindAppInBundle.py
    lldb-api :: functionalities/thread/concurrent_events/TestConcurrentCrashWithSignal.py
    lldb-api :: functionalities/process_group/TestChangeProcessGroup.py
    lldb-api :: lang/objc/modules-auto-import/TestModulesAutoImport.py
    lldb-api :: commands/expression/cast_int_to_anonymous_enum/TestCastIntToAnonymousEnum.py
    lldb-api :: functionalities/data-formatter/type_summary_list_script/TestTypeSummaryListScript.py
    lldb-api :: functionalities/non-overlapping-index-variable-i/TestIndexVariable.py
    lldb-api :: functionalities/data-formatter/data-formatter-named-summaries/TestDataFormatterNamedSummaries.py
    lldb-api :: python_api/rdar-12481949/Test-rdar-12481949.py
    lldb-api :: commands/expression/formatters/TestFormatters.py
    lldb-api :: commands/expression/import-std-module/unique_ptr/TestUniquePtr.py
    lldb-api :: lang/objc/objc-static-method/TestObjCStaticMethod.py
    lldb-api :: lang/objc/rdar-11355592/TestRdar11355592.py
    lldb-api :: lang/cpp/inlines/TestInlines.py
    lldb-api :: functionalities/thread/concurrent_events/TestConcurrentTwoBreakpointThreads.py
    lldb-api :: lang/c/stepping/TestThreadStepping.py
    lldb-api :: commands/expression/import-std-module/queue/TestQueue.py
    lldb-api :: lang/cpp/auto/TestCPPAuto.py
    lldb-api :: commands/expression/xvalue/TestXValuePrinting.py
    lldb-api :: commands/expression/call-function/TestCallUserDefinedFunction.py
    lldb-api :: commands/expression/import-std-module/list-dbg-info-content/TestDbgInfoContentList.py
    lldb-api :: types/TestDoubleTypes.py
    lldb-api :: commands/expression/weak_symbols/TestWeakSymbols.py
    lldb-api :: commands/frame/var/TestFrameVar.py
    lldb-api :: lang/cpp/lambdas/TestLambdas.py
    lldb-api :: functionalities/data-formatter/data-formatter-categories/TestDataFormatterCategories.py
    lldb-api :: lang/objc/exceptions/TestObjCExceptions.py
    lldb-api :: lang/objc/variadic_methods/TestVariadicMethods.py
    lldb-api :: functionalities/breakpoint/dummy_target_breakpoints/TestBreakpointsWithNoTargets.py
    lldb-api :: python_api/process/io/TestProcessIO.py
    lldb-api :: commands/expression/import-std-module/deque-dbg-info-content/TestDbgInfoContentDeque.py
    lldb-api :: lang/objc/real-definition/TestRealDefinition.py
    lldb-api :: functionalities/tail_call_frames/ambiguous_tail_call_seq1/TestAmbiguousTailCallSeq1.py
    lldb-api :: lang/cpp/std-function-step-into-callable/TestStdFunctionStepIntoCallable.py
    lldb-api :: lang/cpp/accelerator-table/TestCPPAccelerator.py
    lldb-api :: commands/expression/argument_passing_restrictions/TestArgumentPassingRestrictions.py
    lldb-api :: python_api/sbdata/TestSBData.py
    lldb-api :: functionalities/var_path/TestVarPath.py
    lldb-api :: commands/expression/two-files/TestObjCTypeQueryFromOtherCompileUnit.py
    lldb-api :: functionalities/data-formatter/data-formatter-objc/TestDataFormatterObjNSException.py
    lldb-api :: lang/objc/objc-super/TestObjCSuper.py
    lldb-api :: types/TestDoubleTypesExpr.py
    lldb-api :: python_api/sbvalue_const_addrof/TestSBValueConstAddrOf.py
    lldb-api :: functionalities/thread/exit_during_step/TestExitDuringStep.py
    lldb-api :: functionalities/data-formatter/data-formatter-stl/libcxx/vector/TestDataFormatterLibcxxVector.py
    lldb-api :: functionalities/thread/jump/TestThreadJump.py
    lldb-api :: lang/objc/objc-stepping/TestObjCStepping.py
    lldb-api :: lang/cpp/thread_local/TestThreadLocal.py
    lldb-api :: commands/frame/diagnose/array/TestArray.py
    lldb-api :: commands/expression/import-std-module/weak_ptr/TestWeakPtr.py
    lldb-api :: functionalities/memory/read/TestMemoryRead.py
    lldb-api :: functionalities/data-formatter/data-formatter-objc/TestDataFormatterObjCExpr.py
    lldb-api :: functionalities/step-avoids-no-debug/TestStepNoDebug.py
    lldb-api :: functionalities/breakpoint/breakpoint_ignore_count/TestBreakpointIgnoreCount.py
    lldb-api :: functionalities/load_using_paths/TestLoadUsingPaths.py
    lldb-api :: lang/objcxx/cxx-bridged-po/TestObjCXXBridgedPO.py
    lldb-api :: commands/expression/class_template_specialization_empty_pack/TestClassTemplateSpecializationParametersHandling.py
    lldb-api :: commands/expression/radar_9531204/TestPrintfAfterUp.py
    lldb-api :: python_api/process/TestProcessAPI.py
    lldb-api :: functionalities/thread/concurrent_events/TestConcurrentDelaySignalBreak.py
    lldb-api :: python_api/value_var_update/TestValueVarUpdate.py
    lldb-api :: commands/expression/import-std-module/shared_ptr-dbg-info-content/TestSharedPtrDbgInfoContent.py
    lldb-api :: lang/objc/objc-foundation-dictionary-empty/TestNSDictionary0.py
    lldb-api :: commands/frame/diagnose/inheritance/TestDiagnoseInheritance.py
    lldb-api :: commands/frame/diagnose/complicated-expression/TestComplicatedExpression.py
    lldb-api :: functionalities/rerun/TestRerun.py
    lldb-api :: python_api/process/read-mem-cstring/TestReadMemCString.py
    lldb-api :: lang/objc/objc-ivar-protocols/TestIvarProtocols.py
    lldb-api :: functionalities/data-formatter/data-formatter-stl/libcxx/unordered/TestDataFormatterUnordered.py
    lldb-api :: lang/cpp/call-function/TestCallCPPFunction.py
    lldb-api :: lang/cpp/incomplete-types/TestCppIncompleteTypes.py
    lldb-api :: commands/frame/var-scope/TestFrameVariableScope.py
    lldb-api :: lang/c/shared_lib_stripped_symbols/TestSharedLibStrippedSymbols.py
    lldb-api :: functionalities/data-formatter/data-formatter-stl/libcxx/map/TestDataFormatterLibccMap.py
    lldb-api :: python_api/value/change_values/TestChangeValueAPI.py
    lldb-api :: lang/objc/foundation/TestObjectDescriptionAPI.py
    lldb-api :: commands/expression/inline-namespace/TestInlineNamespace.py
    lldb-api :: commands/command/script/TestCommandScript.py
    lldb-api :: linux/builtin_trap/TestBuiltinTrap.py
    lldb-api :: functionalities/archives/TestBSDArchives.py
    lldb-api :: python_api/exprpath_synthetic/TestExprPathSynthetic.py
    lldb-api :: lang/c/local_variables/TestLocalVariables.py
    lldb-api :: functionalities/data-formatter/synthupdate/TestSyntheticFilterRecompute.py
    lldb-api :: functionalities/data-formatter/data-formatter-synth/TestDataFormatterSynth.py
    lldb-api :: lang/objc/global_ptrs/TestGlobalObjects.py
    lldb-api :: functionalities/data-formatter/boolreference/TestFormattersBoolRefPtr.py
    lldb-api :: python_api/class_members/TestSBTypeClassMembers.py
    lldb-api :: lang/cpp/global_operators/TestCppGlobalOperators.py
    lldb-api :: functionalities/data-formatter/poarray/TestPrintObjectArray.py
    lldb-api :: commands/process/launch/TestProcessLaunch.py
    lldb-api :: lang/objc/modules-inline-functions/TestModulesInlineFunctions.py
    lldb-api :: functionalities/breakpoint/require_hw_breakpoints/TestRequireHWBreakpoints.py
    lldb-api :: lang/objcxx/hide-runtime-values/TestObjCXXHideRuntimeValues.py
    lldb-api :: functionalities/tail_call_frames/disambiguate_tail_call_seq/TestDisambiguateTailCallSeq.py
    lldb-api :: lang/objc/objc-struct-argument/TestObjCStructArgument.py
    lldb-api :: functionalities/breakpoint/breakpoint_hit_count/TestBreakpointHitCount.py
    lldb-api :: functionalities/data-formatter/data-formatter-disabling/TestDataFormatterDisabling.py
    lldb-api :: functionalities/data-formatter/data-formatter-cpp/TestDataFormatterCpp.py
    lldb-api :: commands/expression/timeout/TestCallWithTimeout.py
    lldb-api :: functionalities/data-formatter/summary-string-onfail/Test-rdar-9974002.py
    lldb-api :: lang/objc/objc-dyn-sbtype/TestObjCDynamicSBType.py
    lldb-api :: lang/cpp/template-function/TestTemplateFunctions.py
    lldb-api :: commands/expression/scoped_enums/TestScopedEnumType.py
    lldb-api :: api/check_public_api_headers/TestPublicAPIHeaders.py
    lldb-api :: functionalities/modern-type-lookup/basic/TestBasicModernTypeLookup.py
    lldb-api :: lang/cpp/nested-class-other-compilation-unit/TestNestedClassWithParentInAnotherCU.py
    lldb-api :: functionalities/data-formatter/data-formatter-objc/TestDataFormatterObjCNSContainer.py
    lldb-api :: lang/objc/radar-9691614/TestObjCMethodReturningBOOL.py
    lldb-api :: functionalities/breakpoint/scripted_bkpt/TestScriptedResolver.py
    lldb-api :: lang/objc/objc-static-method-stripped/TestObjCStaticMethodStripped.py
    lldb-api :: lang/cpp/class-template-parameter-pack/TestClassTemplateParameterPack.py
    lldb-api :: python_api/thread/TestThreadAPI.py
    lldb-api :: commands/expression/radar_9673664/TestExprHelpExamples.py
    lldb-api :: macosx/add-dsym/TestAddDsymMidExecutionCommand.py
    lldb-api :: python_api/frame/inlines/TestInlinedFrame.py
    lldb-api :: functionalities/tail_call_frames/thread_step_out_or_return/TestSteppingOutWithArtificialFrames.py
    lldb-api :: functionalities/data-formatter/data-formatter-script/TestDataFormatterScript.py
    lldb-api :: commands/expression/dont_allow_jit/TestAllowJIT.py
    lldb-api :: python_api/formatters/TestFormattersSBAPI.py
    lldb-api :: lang/cpp/chained-calls/TestCppChainedCalls.py
    lldb-api :: commands/target/stop-hooks/TestStopHooks.py
    lldb-api :: commands/frame/select/TestFrameSelect.py
    lldb-api :: lang/cpp/scope/TestCppScope.py
    lldb-api :: commands/expression/call-function/TestCallStdStringFunction.py
    lldb-api :: commands/expression/import-std-module/forward_list-dbg-info-content/TestDbgInfoContentForwardList.py
    lldb-api :: functionalities/data-formatter/data-formatter-enum-format/TestDataFormatterEnumFormat.py
    lldb-api :: commands/expression/diagnostics/TestExprDiagnostics.py
    lldb-api :: commands/expression/options/TestExprOptions.py
    lldb-api :: functionalities/data-formatter/data-formatter-stl/libcxx/variant/TestDataFormatterLibcxxVariant.py
    lldb-api :: functionalities/inferior-crashing/recursive-inferior/TestRecursiveInferior.py
    lldb-api :: functionalities/thread/step_out/TestThreadStepOut.py
    lldb-api :: functionalities/data-formatter/data-formatter-objc/TestDataFormatterObjCCF.py

********************
Timed Out Tests (3):
    lldb-api :: python_api/lldbutil/iter/TestLLDBIterator.py
    lldb-api :: lang/objc/foundation/TestObjCMethods.py
    lldb-api :: python_api/lldbutil/iter/TestRegistersIterator.py


Slowest Tests:
--------------------------------------------------------------------------
21.24s: lldb-api :: lang/objc/foundation/TestObjCMethodsString.py
23.33s: lldb-api :: lang/cpp/namespace/TestNamespaceLookup.py
24.11s: lldb-api :: lang/objc/objc-new-syntax/TestObjCNewSyntaxDictionary.py
24.70s: lldb-api :: lang/objc/foundation/TestObjCMethodsNSError.py
27.30s: lldb-api :: lang/objc/objc-new-syntax/TestObjCNewSyntaxLiteral.py
29.14s: lldb-api :: lang/objc/real-definition/TestRealDefinition.py
29.90s: lldb-api :: lang/objc/exceptions/TestObjCExceptions.py
31.67s: lldb-api :: commands/gui/basic/TestGuiBasic.py
45.85s: lldb-api :: types/TestIntegerTypesExpr.py
46.68s: lldb-api :: types/TestIntegerTypes.py
47.33s: lldb-api :: lang/objc/hidden-ivars/TestHiddenIvars.py
56.28s: lldb-api :: api/multithreaded/TestMultithreaded.py
62.23s: lldb-api :: commands/expression/multiline-completion/TestMultilineCompletion.py
65.38s: lldb-api :: tools/lldb-server/TestLldbGdbServer.py
70.91s: lldb-api :: macosx/nslog/TestDarwinNSLogOutput.py
98.58s: lldb-api :: driver/batch_mode/TestBatchMode.py
152.37s: lldb-api :: lang/objc/foundation/TestFoundationDisassembly.py
600.04s: lldb-api :: python_api/lldbutil/iter/TestRegistersIterator.py
600.04s: lldb-api :: python_api/lldbutil/iter/TestLLDBIterator.py
600.06s: lldb-api :: lang/objc/foundation/TestObjCMethods.py

Tests Times:
--------------------------------------------------------------------------
[   Range   ] :: [               Percentage               ] :: [  Count  ]
--------------------------------------------------------------------------
[  0s, 50s) :: [*************************************** ] :: [1777/1788]
[ 50s,100s) :: [                                        ] :: [   6/1788]
[100s,150s) :: [                                        ] :: [   1/1788]
[150s,200s) :: [                                        ] :: [   1/1788]
[200s,250s) :: [                                        ] :: [   0/1788]
[250s,300s) :: [                                        ] :: [   0/1788]
[300s,350s) :: [                                        ] :: [   0/1788]
[350s,400s) :: [                                        ] :: [   0/1788]
[400s,450s) :: [                                        ] :: [   0/1788]
[450s,500s) :: [                                        ] :: [   0/1788]
[500s,550s) :: [                                        ] :: [   0/1788]
[550s,600s) :: [                                        ] :: [   0/1788]
[600s,650s) :: [                                        ] :: [   3/1788]
  Expected Passes    : 1067
  Expected Failures  : 5
  Unsupported Tests  : 237
  Unexpected Failures: 476
  Individual Timeouts: 3
FAILED: tools/lldb/test/CMakeFiles/check-lldb-lit 
cd /Users/buildslave/jenkins/workspace/lldb-cmake-matrix/lldb-build/tools/lldb/test && /usr/bin/python /Users/buildslave/jenkins/workspace/lldb-cmake-matrix/lldb-build/./bin/llvm-lit -v --time-tests --shuffle --xunit-xml-output=/Users/buildslave/jenkins/workspace/lldb-cmake-matrix/test/results.xml -v /Users/buildslave/jenkins/workspace/lldb-cmake-matrix/lldb-build/tools/lldb/test
ninja: build stopped: subcommand failed.
Command failed 
Command: ['/usr/bin/env', 'TERM=vt100', '/usr/local/bin/ninja', '-v', 'check-lldb']
+ set -e