FailedConsole Output

Skipping 8,029 KB.. Full Log
xxxxxxxxxxxxxxxxxxxxxxxxxxxxxxxxxxxxxxxxlqq<Help>qqqqqqqqqqqqqqqqqqqqqqqqqqqqqqqqqqqqqqqqqqqqqqqqqqqqqqqqqqqqqqqqqqqqqqqqqqqqqqqkxxxxx Welcome to the LLDB curses GUI.xxxxxxxxxxxx Press the TAB key to change the selected view.xxxxxx Each view has its own keyboard shortcuts, press 'h' to open a dialog to display them. xxxxxxxxxxxx Common key bindings for all views:xxxxxxxxxxxxtab - Select next viewxxxxxxh - Show help dialog with view specific key bindingsxxxxxx, - Page upxxxxxx. - Page downxxxxxxup - Select previousxxxxxxdown - Select nextxxxxxxleft - Unexpand or select parentxxxxxxright - Expandxxxxxx    page-up - Page upxxxxxx  page-down - Page downxxxxxmqqqqqqqqqqqqqqqqqqqqqqqqqqqqqqqqqqqqqqqqqqqqqqqqqqqqqqqqqqqqqq[Press any key to exit]qqjxxxxxxxxxxxxxxxxxxxxxxxxxxxxxxxxxxxmqqqqqqqqqqqqqqqqqqqqqqqqqqqqqqqqqqqqqqqqqqqqqqqqqqqqqqqqqqqqqqqqqqqqqqqqqqqqqqqqqqqqqqqqqqqqqqqqqqqqqqqqqqqqqqqqqqqqqqqqqqqqqqqqqqqqqqqqqqqqqqqqqqqqqqqqqqqqqqqqqqqqqqqqqqqqqqqqqqqqqqqqqqqqqqqqqqqqqqqqqqqqqqqqqqqqqqqqqqqqqqqqqqqqqqqqqqqqqqqqqqqqqqqqqqqqqqqqqqqqqqqqqqqqqqqqqqqqqqqqqqqqqqqqqqqqqqqqqqqqqqqqqqqqqqqqqqqqqqqqqqqqqqqqqqqqqqqqqqqqqqqqqqqqqqqqqqqqqqqqqqqqqqqqqqqqqqqqqqqqqqqqqqqqqqqqqqqqqqjxxlqq<Variables>qqqqqqqqqqqqqqqqqqqqqqqqqqqqqqqqqqqqqqqqqqqqqqqqqqqqqqqqqqqqqqqqqqqqqqqqqqqqqqqqqqqqqqqqqqqqqqqqqqqqqqqqqqqqqqqqqqqqqqqqqqqqqqqqqqqqqqqqqqqqqqqqqqqqqqqqqqqqqqqqqqqqqqqqqqqqqqqqqqqqqqqqqqqqqqqqqqqqqqqqqqqqqqqqqqqqqqqqqqqqqqqqqqqqqqqqqqqqqqqqqqqqqqqqqqqqqqqqqqqqqqqqqqqqqqqqqqqqqqqqqqqqqqqqqqqqqqqqqqqqqqqqqqqqqqqqqqqqqqqqqqqqqqqqqqqqqqqqqqqqqqqqqqqqqqqqqqqqqqqqqqqqqqqqqqqqqqqqqqqqqqqqqkxxx (int) argc = 1xxxx `q(char **) argv = 0x00007ffeefbff530xxxx (int) funky_var_name_that_should_be_rendered = 22xxxxxxxxxxxxxxxxxxxxxxxxxxxxxxxxxxxxxxxxxxxxxxxxxxxxxxxxxxxxxxxxxxxxxxxxxxxxxxxxxxxxxxxxxxxxxxxxxxxxxxxmqqqqqqqqqqqqqqqqqqqqqqqqqqqqqqqqqqqqqqqqqqqqqqqqqqqqqqqqqqqqqqqqqqqqqqqqqqqqqqqqqqqqqqqqqqqqqqqqqqqqqqqqqqqqqqqqqqqqqqqqqqqqqqqqqqqqqqqqqqqqqqqqqqqqqqqqqqqqqqqqqqqqqqqqqqqqqqqqqqqqqqqqqqqqqqqqqqqqqqqqqqqqqqqqqqqqqqqqqqqqqqqqqqqqqqqqqqqqqqqqqqqqqqqqqqqqqqqqqqqqqqqqqqqqqqqqqqqqqqqqqqqqqqqqqqqqqqqqqqqqqqqqqqqqqqqqqqqqqqqqqqqqqqqqqqqqqqqqqqqqqqqqqqqqqqqqqqqqqqqqqqqqqqqqqqqqqqqqqqqqqqqqqqqqqqqqqqqqqqjmqqqqqqqqqqqqqqqqqqqqqqqqqqqqqqqqqqqqqqqqqqqqqqqqqqqqqqqqqqqqqqqqqqqqqqqqqqqqqqqqqqqqqqqqqqqqqqqqqqjProcess: 46489    stopped               Thread: 0x102c32c   Frame:   0  PC = 0x0000000100000fab
lqq<Sources>qqqqqqqqqqqqqqqqqqqqqqqqqqqqqqqqqqqqqqqqqqqqqqqqqqqqqqqqqqqqqqqqqqqqqqqqqqqqqqqqqqqqqqqqqqqqqqqqqqqqqqqqqqqqqqqqqqqqqqqqqqqqqqqqqqqqqqqqqqqqqqqqqqqqqqqqqqqqqqqqqqqqqqqqqqqqqqqqqqqqqqqqqqqqqqqqqqqqqqqqqqqqqqqqqqqqqqqqqqqqqqqqqqqqqqqqqqqqqqqqqqqqqqqqqqqqqqqqqqqqqqqqqqqqqqqqqqqqqqqqqqqqqqqqqqqqqqqqqqqqqqqqqqqqqqqqqqqqqqqqqqqqqqqqqqqqqqqqqqqqqqqqqqqqqqqqqqqqqqqqqqqqqqqqqqqqqqqqqqqqqqqqqqqk
xx
xx
xx
xx
xx
xx
xx
xx
xx
xx
xx
xx
xx
xx
xx
xx
xx
xx
xx
xx
xx
xx
xx
xx
xx
xx
xx
xx
xx
xx
xx
xx
xx
xx
xx
xx
xx
xx
xx
x                                                                                         x
x                                  x
x  x
x                                                 x
x                                                                                         x
x  x
x                                     x
x  x
x                        x
x                                                      x
x             x
x               x
x                      x
x                    x
x                                  x
x                x
x                       x
x                         x
x                                                                                         x
xx
xx
xx
xx
xx
xx
xx
xx
mqqqqqqqqqqqqqqqqqqqqqqqqqqqqqqqqqqqqqqqqqqqqqqqqqqqqqqqqqqqqqqqqqqqqqqqqqqqqqqqqqqqqqqqqqqqqqqqqqqqqqqqqqqqqqqqqqqqqqqqqqqqqqqqqqqqqqqqqqqqqqqqqqqqqqqqqqqqqqqqqqqqqqqqqqqqqqqqqqqqqqqqqqqqqqqqqqqqqqqqqqqqqqqqqqqqqqqqqqqqqqqqqqqqqqqqqqqqqqqqqqqqqqqqqqqqqqqqqqqqqqqqqqqqqqqqqqqqqqqqqqqqqqqqqqqqqqqqqqqqqqqqqqqqqqqqqqqqqqqqqqqqqqqqqqqqqqqqqqqqqqqqqqqqqqqqqqqqqqqqqqqqqqqqqqqqqqqqqqqqqqqqqqqqqqqqqqqqqqqj
[?1l>(lldb) gui
gui
(B)0[?7h[?1h=| LLDB (F1) | Target (F2) | Process (F3) | Thread (F4) | View (F5) | Help (F6) |
lqq<Sources>qqqqqqqqqqqqqqqqqqqqqqqqqqqqqqqqqqqqqqqqqqqqqqqqqqqqqqqqqqqqqqqqqqqqqqqqqqqqqqqqqqqqqqqqqqqqqqqqqqqqqqqqqqqqqqqqqqqqqqqqqqqqqqqqqqqqqqqqqqqqqqqqqqqqqqqqqqqqqqqqqqqqqqqqqqqqqqqqqqqqqqqqqqqqqqqqqqqqqqqqqqqqqqqqqqqqqqqqqqqqqqqqqqqqqqqqqqqqqqqqqqqqqqqqqqqqqqqqqqqqqqqqqqqqqqqqqqqqqqqqqqqqqqqqqqqqqqqqqqqqqqqqqqqqqqqqqqqqqqqqqqqqqqqqqqqqqqqqqqqqqqqqqqqqqqqqqqqqqqqqqqqqqqqqqqqqqqqqqqqqqqqqqqqklqq<Threads>qqqqqqqqqqqqqqqqqqqqqqqqqqqqqqqqqqqqqqqqqqqqqqqqqqqqqqqqqqqqqqqqqqqqqqqqqqqqqqqqqqqqqqqkx a.out`main                                                                                                                                                                                                                                                                                                                                                                                                   xx `qprocess 46489xx 1 x int main(int argc, char **argv) {xxxx 2 x   int funky_var_name_that_should_be_rendered = 22;xxxx 3 x`  return 0; // Break here                                                                                                                                                                                                                                                                                                                                                   <<< Thread 1: breakpoint 1.1 xxxx 4 x }xxxx 5 xxxxxxxxxxxxxxxxxxxxxxxxxxxxxxxxxxxxxxxxxxxxxxxxxxxxxxxxxxxxxxxxxxxxxxxxxxxxxxxxxxxxxxxxxxxxxxxxxxxxxxxxxxxxxxxxxxxxxxxxxxxxxxxxxxxxxxxxxxxxxxxxxxxxxxxxxxxxxxxxxxxxxxxxxxxxxxxxxxxxxxxxxxxxxxxxxxxxxxxxxxxxxxxxxxxxxxxxxxxxxxxxxxxxxxxxxxxxxxxxxxxxmqqqqqqqqqqqqqqqqqqqqqqqqqqqqqqqqqqqqqqqqqqqqqqqqqqqqqqqqqqqqqqqqqqqqqqqqqqqqqqqqqqqqqqqqqqqqqqqqqqqqqqqqqqqqqqqqqqqqqqqqqqqqqqqqqqqqqqqqqqqqqqqqqqqqqqqqqqqqqqqqqqqqqqqqqqqqqqqqqqqqqqqqqqqqqqqqqqqqqqqqqqqqqqqqqqqqqqqqqqqqqqqqqqqqqqqqqqqqqqqqqqqqqqqqqqqqqqqqqqqqqqqqqqqqqqqqqqqqqqqqqqqqqqqqqqqqqqqqqqqqqqqqqqqqqqqqqqqqqqqqqqqqqqqqqqqqqqqqqqqqqqqqqqqqqqqqqqqqqqqqqqqqqqqqqqqqqqqqqqqqqqqqqqqqqqqqqqqqqqjxxlqq<Variables>qqqqqqqqqqqqqqqqqqqqqqqqqqqqqqqqqqqqqqqqqqqqqqqqqqqqqqqqqqqqqqqqqqqqqqqqqqqqqqqqqqqqqqqqqqqqqqqqqqqqqqqqqqqqqqqqqqqqqqqqqqqqqqqqqqqqqqqqqqqqqqqqqqqqqqqqqqqqqqqqqqqqqqqqqqqqqqqqqqqqqqqqqqqqqqqqqqqqqqqqqqqqqqqqqqqqqqqqqqqqqqqqqqqqqqqqqqqqqqqqqqqqqqqqqqqqqqqqqqqqqqqqqqqqqqqqqqqqqqqqqqqqqqqqqqqqqqqqqqqqqqqqqqqqqqqqqqqqqqqqqqqqqqqqqqqqqqqqqqqqqqqqqqqqqqqqqqqqqqqqqqqqqqqqqqqqqqqqqqqqqqqqqkxxx (int) argc = 1xxxx `q(char **) argv = 0x00007ffeefbff530xxxx (int) funky_var_name_that_should_be_rendered = 22xxxxxxxxxxxxxxxxxxxxxxxxxxxxxxxxxxxxxxxxxxxxxxxxxxxxxxxxxxxxxxxxxxxxxxxxxxxxxxxxxxxxxxxxxxxxxxxxxxxxxxxmqqqqqqqqqqqqqqqqqqqqqqqqqqqqqqqqqqqqqqqqqqqqqqqqqqqqqqqqqqqqqqqqqqqqqqqqqqqqqqqqqqqqqqqqqqqqqqqqqqqqqqqqqqqqqqqqqqqqqqqqqqqqqqqqqqqqqqqqqqqqqqqqqqqqqqqqqqqqqqqqqqqqqqqqqqqqqqqqqqqqqqqqqqqqqqqqqqqqqqqqqqqqqqqqqqqqqqqqqqqqqqqqqqqqqqqqqqqqqqqqqqqqqqqqqqqqqqqqqqqqqqqqqqqqqqqqqqqqqqqqqqqqqqqqqqqqqqqqqqqqqqqqqqqqqqqqqqqqqqqqqqqqqqqqqqqqqqqqqqqqqqqqqqqqqqqqqqqqqqqqqqqqqqqqqqqqqqqqqqqqqqqqqqqqqqqqqqqqqqjmqqqqqqqqqqqqqqqqqqqqqqqqqqqqqqqqqqqqqqqqqqqqqqqqqqqqqqqqqqqqqqqqqqqqqqqqqqqqqqqqqqqqqqqqqqqqqqqqqqjProcess: 46489    stopped               Thread: 0x102c32c   Frame:   0  PC = 0x0000000100000fab
[?1l>(lldb) settings set interpreter.prompt-on-quit false

Hide Details

Session logs for test failures/errors/unexpected successes will go into directory '/Users/buildslave/jenkins/workspace/lldb-cmake-sanitized/test/logs' Command invoked: /Users/buildslave/jenkins/workspace/lldb-cmake-sanitized/llvm-project/lldb/test/dotest.py --arch=x86_64 -s /Users/buildslave/jenkins/workspace/lldb-cmake-sanitized/lldb-build/lldb-test-traces -S nm -u CXXFLAGS -u CFLAGS --executable /Users/buildslave/jenkins/workspace/lldb-cmake-sanitized/lldb-build/./bin/lldb --dsymutil /Users/buildslave/jenkins/workspace/lldb-cmake-sanitized/lldb-build/./bin/dsymutil --filecheck /Users/buildslave/jenkins/workspace/lldb-cmake-sanitized/lldb-build/./bin/FileCheck -C /Users/buildslave/jenkins/workspace/lldb-cmake-sanitized/host-compiler/bin/clang --codesign-identity lldb_codesign --server /Users/buildslave/jenkins/workspace/lldb-cmake-sanitized/lldb-build/./bin/debugserver --arch x86_64 --build-dir /Users/buildslave/jenkins/workspace/lldb-cmake-sanitized/lldb-build/lldb-test-build.noindex -s=/Users/buildslave/jenkins/workspace/lldb-cmake-sanitized/test/logs -t --env TERM=vt100 --env LLVM_LIBS_DIR=/Users/buildslave/jenkins/workspace/lldb-cmake-sanitized/lldb-build/./lib --build-dir /Users/buildslave/jenkins/workspace/lldb-cmake-sanitized/lldb-build/tools/lldb/lldb-test-build.noindex --module-cache-dir /Users/buildslave/jenkins/workspace/lldb-cmake-sanitized/lldb-build/tools/lldb/lldb-test-build.noindex/module-cache-lldb /Users/buildslave/jenkins/workspace/lldb-cmake-sanitized/llvm-project/lldb/packages/Python/lldbsuite/test/commands/gui/basic -p TestGuiBasic.py Change dir to: /Users/buildslave/jenkins/workspace/lldb-cmake-sanitized/llvm-project/lldb/packages/Python/lldbsuite/test/commands/gui/basic runCmd: settings set symbols.enable-external-lookup false output:

Hide Details

runCmd: settings set plugin.process.gdb-remote.packet-timeout 60 output:

Hide Details

runCmd: settings set symbols.clang-modules-cache-path "/Users/buildslave/jenkins/workspace/lldb-cmake-sanitized/lldb-build/tools/lldb/lldb-test-build.noindex/module-cache-lldb" output:

Hide Details

runCmd: settings set use-color false output:

Hide Details

FAIL: LLDB (/Users/buildslave/jenkins/workspace/lldb-cmake-sanitized/host-compiler/bin/clang-10-x86_64) :: test_gui (TestGuiBasic.BasicGuiCommandTest) tearing down the child process....

Hide Details

CLEANUP ERROR: LLDB (/Users/buildslave/jenkins/workspace/lldb-cmake-sanitized/host-compiler/bin/clang-10-x86_64) :: test_gui (TestGuiBasic.BasicGuiCommandTest) Restore dir to: /Users/buildslave/jenkins/workspace/lldb-cmake-sanitized/lldb-build/tools/lldb/lit ====================================================================== ERROR: test_gui (TestGuiBasic.BasicGuiCommandTest) ---------------------------------------------------------------------- Traceback (most recent call last): File "/Users/buildslave/jenkins/workspace/lldb-cmake-sanitized/llvm-project/lldb/packages/Python/lldbsuite/test/commands/gui/basic/TestGuiBasic.py", line 60, in test_gui self.quit() File "/Users/buildslave/jenkins/workspace/lldb-cmake-sanitized/llvm-project/lldb/packages/Python/lldbsuite/test/lldbpexpect.py", line 61, in quit self.child.close(force=not gracefully) File "/Users/buildslave/jenkins/workspace/lldb-cmake-sanitized/llvm-project/lldb/third_party/Python/module/pexpect-4.6/pexpect/pty_spawn.py", line 327, in close self.ptyproc.close(force=force) File "/System/Library/Frameworks/Python.framework/Versions/2.7/lib/python2.7/contextlib.py", line 35, in __exit__ self.gen.throw(type, value, traceback) File "/Users/buildslave/jenkins/workspace/lldb-cmake-sanitized/llvm-project/lldb/third_party/Python/module/pexpect-4.6/pexpect/pty_spawn.py", line 25, in _wrap_ptyprocess_err raise ExceptionPexpect(*e.args) ExceptionPexpect: Could not terminate the child. Config=x86_64-/Users/buildslave/jenkins/workspace/lldb-cmake-sanitized/host-compiler/bin/clang-10 ---------------------------------------------------------------------- Ran 1 test in 12.920s

Hide Details

RESULT: FAILED (0 passes, 0 failures, 1 errors, 0 skipped, 0 expected failures, 0 unexpected successes)

Hide Details

******************** PASS: lldb-Suite :: functionalities/pre_run_dylibs/TestPreRunDylibs.py (635 of 1696) PASS: LLDB :: Commands/command-regex-unalias.test (636 of 1696) PASS: LLDB :: Modules/Breakpad/breakpad-identification.test (637 of 1696) PASS: lldb-Suite :: commands/settings/quoting/TestQuoting.py (638 of 1696) PASS: lldb-Suite :: lang/c/const_variables/TestConstVariables.py (639 of 1696) PASS: lldb-Suite :: commands/expression/completion-crash-incomplete-record/TestCompletionCrashIncompleteRecord.py (640 of 1696) PASS: lldb-Suite :: functionalities/data-formatter/data-formatter-stl/libcxx/bitset/TestDataFormatterLibcxxBitset.py (641 of 1696) PASS: lldb-Unit :: Utility/./UtilityTests/ProcessInstanceInfo.DumpTable_invalidUID (642 of 1696) PASS: lldb-Unit :: Process/minidump/./LLDBMinidumpTests/MinidumpParserTest.GetThreadsAndGetThreadContext (643 of 1696) PASS: LLDB :: Expr/TestMultilineExpr.test (644 of 1696) PASS: lldb-Suite :: commands/apropos/with-process/TestAproposWithProcess.py (645 of 1696) PASS: lldb-Unit :: Symbol/./SymbolTests/DWARFCallFrameInfoTest.Basic_dwarf4 (646 of 1696) PASS: lldb-Suite :: functionalities/data-formatter/data-formatter-objc/TestDataFormatterObjCNSError.py (647 of 1696) PASS: lldb-Unit :: Utility/./UtilityTests/ConstStringTest.UpdateMangledCounterpart (648 of 1696) UNSUPPORTED: LLDB :: Breakpoint/case-insensitive.test (649 of 1696) PASS: lldb-Unit :: Utility/./UtilityTests/StringExtractorTest.DecodeHexU8_Underflow2 (650 of 1696) PASS: lldb-Unit :: Utility/./UtilityTests/ScalarTest.ExtractBitfield (651 of 1696) PASS: lldb-Unit :: Utility/./UtilityTests/StreamTeeTest.Flush (652 of 1696) PASS: lldb-Unit :: Utility/./UtilityTests/UriParserTest.Minimal (653 of 1696) PASS: lldb-Suite :: functionalities/data-formatter/synthupdate/TestSyntheticFilterRecompute.py (654 of 1696) PASS: lldb-Unit :: Utility/./UtilityTests/BinaryStreamTest.PutSLEB128SevenBytes (655 of 1696) PASS: LLDB :: Quit/TestQuitExitCodeImplicit0.test (656 of 1696) PASS: lldb-Suite :: functionalities/memory/read/TestMemoryRead.py (657 of 1696) PASS: LLDB :: Breakpoint/split-dwarf5-debug-stroffsets.test (658 of 1696) PASS: lldb-Suite :: lang/objc/objc-dyn-sbtype/TestObjCDynamicSBType.py (659 of 1696) PASS: LLDB :: Modules/ELF/section-types.yaml (660 of 1696) PASS: lldb-Unit :: Utility/./UtilityTests/UriParserTest.SchemeHostSeparator4 (661 of 1696) PASS: lldb-Suite :: commands/command/nested_alias/TestNestedAlias.py (662 of 1696) PASS: lldb-Suite :: functionalities/gdb_remote_client/TestRecognizeBreakpoint.py (663 of 1696) PASS: lldb-Unit :: Utility/./UtilityTests/StreamTest.PutHex64ByteOrderBig (664 of 1696) PASS: lldb-Unit :: Utility/./UtilityTests/UserIDResolver.GetUserName (665 of 1696) PASS: lldb-Unit :: Utility/./UtilityTests/ArgsTest.DoubleQuotedItem (666 of 1696) PASS: lldb-Suite :: android/platform/TestDefaultCacheLineSize.py (667 of 1696) PASS: lldb-Suite :: lang/cpp/static_methods/TestCPPStaticMethods.py (668 of 1696) PASS: lldb-Unit :: Signals/./SignalsTests/UnixSignalsTest.Iteration (669 of 1696) PASS: lldb-Suite :: types/TestIntegerTypes.py (670 of 1696) PASS: lldb-Unit :: Utility/./UtilityTests/StringExtractorTest.GetHexBytes_FullString (671 of 1696) PASS: lldb-Unit :: Utility/./UtilityTests/ArgsTest.TestOverwriteArgs (672 of 1696) PASS: lldb-Unit :: Utility/./UtilityTests/BinaryStreamTest.PutSLEB128SixBytes (673 of 1696) PASS: LLDB :: SymbolFile/DWARF/apple-index-is-used.cpp (674 of 1696) PASS: lldb-Suite :: python_api/class_members/TestSBTypeClassMembers.py (675 of 1696) PASS: lldb-Suite :: functionalities/step-avoids-no-debug/TestStepNoDebug.py (676 of 1696) PASS: lldb-Suite :: functionalities/tsan/multiple/TestTsanMultiple.py (677 of 1696) PASS: lldb-Unit :: Language/Highlighting/./HighlighterTests/HighlighterTest.ClangComments (678 of 1696) PASS: lldb-Suite :: types/TestFloatTypes.py (679 of 1696) PASS: lldb-Suite :: api/multithreaded/TestMultithreaded.py (680 of 1696) PASS: lldb-Unit :: Language/Highlighting/./HighlighterTests/HighlighterTest.ClangCommas (681 of 1696) PASS: lldb-Suite :: commands/frame/diagnose/dereference-this/TestDiagnoseDereferenceThis.py (682 of 1696) PASS: lldb-Suite :: lang/cpp/breakpoint-commands/TestCPPBreakpointCommands.py (683 of 1696) PASS: lldb-Suite :: commands/register/register/register_command/TestRegisters.py (684 of 1696) PASS: lldb-Suite :: functionalities/data-formatter/data-formatter-stl/libcxx/list/loop/TestDataFormatterLibcxxListLoop.py (685 of 1696) PASS: lldb-Unit :: Utility/./UtilityTests/StreamTest.PutBytesAsRawHex8ToLittleEndian (686 of 1696) PASS: lldb-Unit :: Utility/./UtilityTests/RangeTest.SizeTypes (687 of 1696) PASS: lldb-Suite :: commands/log/invalid-args/TestInvalidArgsLog.py (688 of 1696) PASS: lldb-Unit :: Utility/./UtilityTests/Flags.AllSet (689 of 1696) PASS: lldb-Unit :: Utility/./UtilityTests/ScalarTest.GetBytes (690 of 1696) PASS: lldb-Unit :: Utility/./UtilityTests/BroadcasterTest.BroadcastEvent (691 of 1696) PASS: lldb-Unit :: Host/./HostTests/HostInfoTest.GetAugmentedArchSpec (692 of 1696) PASS: lldb-Suite :: functionalities/thread/concurrent_events/TestConcurrentNWatchNBreak.py (693 of 1696) PASS: LLDB :: Modules/Breakpad/discontiguous-sections.test (694 of 1696) PASS: lldb-Unit :: Utility/./UtilityTests/SerializationRountripTest.SerializeDeserializeObjectPointer (695 of 1696) PASS: lldb-Suite :: functionalities/backticks/TestBackticksWithoutATarget.py (696 of 1696) PASS: lldb-Suite :: commands/expression/vector_of_enums/TestVectorOfEnums.py (697 of 1696) PASS: lldb-Suite :: functionalities/data-formatter/data-formatter-skip-summary/TestDataFormatterSkipSummary.py (698 of 1696) PASS: lldb-Suite :: tools/lldb-server/TestGdbRemoteThreadsInStopReply.py (699 of 1696) PASS: lldb-Unit :: Interpreter/./InterpreterTests/OptionArgParserTest.toChar (700 of 1696) UNSUPPORTED: LLDB :: SymbolFile/PDB/variables-locations.test (701 of 1696) PASS: lldb-Suite :: commands/expression/import-std-module/vector-bool/TestBoolVector.py (702 of 1696) PASS: lldb-Suite :: python_api/symbol-context/TestSymbolContext.py (703 of 1696) PASS: lldb-Suite :: macosx/find-dsym/bundle-with-dot-in-filename/TestBundleWithDotInFilename.py (704 of 1696) PASS: LLDB :: Settings/TestDisassemblyFormat.test (705 of 1696) PASS: lldb-Suite :: functionalities/thread/concurrent_events/TestConcurrentTwoBreakpointsOneDelaySignal.py (706 of 1696) PASS: lldb-Suite :: functionalities/asan/TestMemoryHistory.py (707 of 1696) PASS: lldb-Suite :: python_api/watchpoint/watchlocation/TestTargetWatchAddress.py (708 of 1696) PASS: lldb-Suite :: python_api/findvalue_duplist/TestSBFrameFindValue.py (709 of 1696) PASS: LLDB :: Reproducer/TestDriverOptions.test (710 of 1696) PASS: LLDB :: Expr/TestIRMemoryMap.test (711 of 1696) PASS: lldb-Unit :: Host/./HostTests/ProcessLaunchInfoTest.Constructor (712 of 1696) PASS: lldb-Suite :: tools/lldb-server/TestAppleSimulatorOSType.py (713 of 1696) PASS: lldb-Unit :: Utility/./UtilityTests/LogChannelTest.Enable (714 of 1696) PASS: lldb-Unit :: SymbolFile/NativePDB/./SymbolFileNativePDBTests/PDBFPOProgramToDWARFExpressionTests.UnknownOp (715 of 1696) PASS: lldb-Unit :: Symbol/./SymbolTests/TestClangASTContext.TestBuiltinTypeForEncodingAndBitSize (716 of 1696) PASS: lldb-Suite :: types/TestDoubleTypes.py (717 of 1696) PASS: lldb-Suite :: functionalities/load_unload/TestLoadUnload.py (718 of 1696) PASS: lldb-Unit :: Utility/./UtilityTests/VMRange.Ordering (719 of 1696) PASS: lldb-Unit :: Utility/./UtilityTests/StringListTest.AppendListCStringArrayEmpty (720 of 1696) PASS: lldb-Unit :: Utility/./UtilityTests/OptionsWithRawTest.SingleWhitespaceInput (721 of 1696) PASS: lldb-Suite :: functionalities/memory-region/TestMemoryRegion.py (722 of 1696) PASS: lldb-Suite :: python_api/name_lookup/TestNameLookup.py (723 of 1696) UNSUPPORTED: LLDB :: Process/Windows/exception_access_violation.cpp (724 of 1696) PASS: lldb-Suite :: functionalities/target_var/TestTargetVar.py (725 of 1696) PASS: LLDB :: SymbolFile/DWARF/find-qualified-variable.cpp (726 of 1696) PASS: lldb-Unit :: Utility/./UtilityTests/UriParserTest.PortOverflow (727 of 1696) PASS: LLDB :: SymbolFile/DWARF/dwarf5_locations.s (728 of 1696) PASS: LLDB :: Reproducer/Functionalities/TestStepping.test (729 of 1696) PASS: lldb-Unit :: Utility/./UtilityTests/StreamTest.PutMaxHex64ByteOrderBig (730 of 1696) PASS: lldb-Suite :: functionalities/data-formatter/data-formatter-stl/libcxx/set/TestDataFormatterLibcxxSet.py (731 of 1696) PASS: lldb-Suite :: functionalities/data-formatter/data-formatter-stl/libcxx/variant/TestDataFormatterLibcxxVariant.py (732 of 1696) PASS: lldb-Unit :: Utility/./UtilityTests/StreamTeeTest.GetStreamAtIndexOutOfBoundsEmpty (733 of 1696) PASS: lldb-Unit :: Process/gdb-remote/./ProcessGdbRemoteTests/GDBRemoteCommunicationClientTest.SyncThreadState (734 of 1696) PASS: LLDB :: Breakpoint/single-file-split-dwarf.test (735 of 1696) PASS: lldb-Suite :: commands/expression/persistent_types/TestPersistentTypes.py (736 of 1696) PASS: lldb-Unit :: Utility/./UtilityTests/StringExtractorTest.GetHexBytesAvail_FullString (737 of 1696) PASS: lldb-Suite :: functionalities/plugins/python_os_plugin/TestPythonOSPlugin.py (738 of 1696) PASS: lldb-Suite :: commands/expression/rdar42038760/TestScalarURem.py (739 of 1696) PASS: lldb-Unit :: Utility/./UtilityTests/BinaryStreamTest.PutULEB128MaxValue (740 of 1696) PASS: LLDB :: Quit/TestQuitExitCode0.test (741 of 1696) PASS: lldb-Unit :: Process/gdb-remote/./ProcessGdbRemoteTests/GDBRemoteClientBaseTest.SendPacketAndReceiveResponseWithOutputSupport (742 of 1696) PASS: lldb-Suite :: lang/cpp/class-template-parameter-pack/TestClassTemplateParameterPack.py (743 of 1696) PASS: lldb-Unit :: Language/Highlighting/./HighlighterTests/HighlighterTest.ClangCursorPos (744 of 1696) PASS: lldb-Suite :: functionalities/thread/break_after_join/TestBreakAfterJoin.py (745 of 1696) PASS: lldb-Unit :: Utility/./UtilityTests/RegisterValueTest.GetSet8 (746 of 1696) PASS: lldb-Unit :: Utility/./UtilityTests/UriParserTest.MinimalPortPath (747 of 1696) PASS: LLDB :: Driver/TestFile.test (748 of 1696) PASS: lldb-Suite :: lang/c/typedef/Testtypedef.py (749 of 1696) PASS: lldb-Suite :: functionalities/set-data/TestSetData.py (750 of 1696) PASS: lldb-Unit :: Utility/./UtilityTests/RangeTest.SlideZero (751 of 1696) PASS: lldb-Suite :: functionalities/thread/concurrent_events/TestConcurrentCrashWithWatchpointBreakpointSignal.py (752 of 1696) PASS: lldb-Unit :: Utility/./UtilityTests/StreamTest.PutULEB128 (753 of 1696) PASS: lldb-Suite :: functionalities/data-formatter/summary-string-onfail/Test-rdar-9974002.py (754 of 1696) PASS: lldb-Unit :: Process/gdb-remote/./ProcessGdbRemoteTests/GDBRemoteCommunicationTest.ReadPacket_checksum (755 of 1696) PASS: LLDB :: Modules/ELF/section-permissions.yaml (756 of 1696) PASS: lldb-Unit :: Utility/./UtilityTests/ArgsTest.GetQuotedCommandString (757 of 1696) PASS: lldb-Unit :: Utility/./UtilityTests/ScalarTest.RightShiftOperator (758 of 1696) PASS: lldb-Unit :: Utility/./UtilityTests/StringListTest.AppendStringCString (759 of 1696) PASS: lldb-Suite :: functionalities/tty/TestTerminal.py (760 of 1696) PASS: lldb-Unit :: Utility/./UtilityTests/CompletionRequest.TestCompletionOwnership (761 of 1696) UNSUPPORTED: LLDB :: SymbolFile/PDB/enums-layout.test (762 of 1696) PASS: lldb-Unit :: UnwindAssembly/x86/./UnwindAssemblyx86Tests/Testx86AssemblyInspectionEngine.TestPopEBP (763 of 1696) PASS: lldb-Unit :: Process/minidump/./LLDBMinidumpTests/MinidumpParserTest.MinidumpDuplicateModuleMinAddress (764 of 1696) PASS: lldb-Unit :: Process/minidump/./LLDBMinidumpTests/MinidumpParserTest.GetMemoryRegionInfoFromMemoryList (765 of 1696) PASS: lldb-Suite :: functionalities/data-formatter/data-formatter-stl/libstdcpp/vbool/TestDataFormatterStdVBool.py (766 of 1696) PASS: lldb-Suite :: lang/objcxx/cxx-bridged-po/TestObjCXXBridgedPO.py (767 of 1696) PASS: LLDB :: Modules/ELF/gnu-debuglink.yaml (768 of 1696) PASS: lldb-Suite :: commands/watchpoints/watchpoint_commands/condition/TestWatchpointConditionCmd.py (769 of 1696) PASS: lldb-Unit :: Utility/./UtilityTests/StreamTest.PutMaxHex64ByteOrderLittle (770 of 1696) PASS: lldb-Suite :: lang/objcxx/objcxx-ivar-vector/TestIvarVector.py (771 of 1696) PASS: lldb-Suite :: python_api/formatters/TestFormattersSBAPI.py (772 of 1696) PASS: LLDB :: Quit/TestQuitExitCodeHex0.test (773 of 1696) PASS: lldb-Suite :: commands/command/source/TestCommandSource.py (774 of 1696) PASS: lldb-Unit :: Utility/./UtilityTests/StringListTest.JoinNonSpace (775 of 1696) PASS: lldb-Suite :: functionalities/gdb_remote_client/TestNestedRegDefinitions.py (776 of 1696) PASS: lldb-Suite :: lang/cpp/overloaded-functions/TestOverloadedFunctions.py (777 of 1696) PASS: lldb-Unit :: UnwindAssembly/x86/./UnwindAssemblyx86Tests/Testx86AssemblyInspectionEngine.TestDisassemblyJunkBytes (778 of 1696) PASS: lldb-Suite :: commands/expression/import-std-module/basic/TestImportStdModule.py (779 of 1696) PASS: lldb-Unit :: Utility/./UtilityTests/StreamTest.ShiftOperatorStrings (780 of 1696) PASS: lldb-Unit :: Utility/./UtilityTests/AnsiTerminal.Empty (781 of 1696) PASS: lldb-Suite :: lang/objc/conflicting-definition/TestConflictingDefinition.py (782 of 1696) PASS: lldb-Suite :: lang/c/local_types/TestUseClosestType.py (783 of 1696) PASS: lldb-Suite :: commands/watchpoints/multiple_threads/TestWatchpointMultipleThreads.py (784 of 1696) PASS: lldb-Unit :: Utility/./UtilityTests/StreamTest.PutBytesAsRawHex8ToBigEndian (785 of 1696) PASS: lldb-Suite :: functionalities/data-formatter/data-formatter-stl/libcxx/initializerlist/TestInitializerList.py (786 of 1696) PASS: LLDB :: SymbolFile/Breakpad/line-table-discontinuous-file-ids.test (787 of 1696) PASS: lldb-Suite :: tools/lldb-server/TestGdbRemote_qThreadStopInfo.py (788 of 1696) PASS: LLDB :: SymbolFile/sizeless-symbol.test (789 of 1696) PASS: lldb-Unit :: Utility/./UtilityTests/StatusTest.ErrorConstructor (790 of 1696) PASS: LLDB :: SymbolFile/Breakpad/line-table-missing-file.test (791 of 1696) PASS: LLDB :: Commands/CommandScriptImmediateOutput/CommandScriptImmediateOutputConsole.test (792 of 1696) PASS: lldb-Suite :: lang/cpp/auto/TestCPPAuto.py (793 of 1696) PASS: lldb-Suite :: functionalities/unwind/ehframe/TestEhFrameUnwind.py (794 of 1696) PASS: lldb-Unit :: SymbolFile/NativePDB/./SymbolFileNativePDBTests/PDBFPOProgramToDWARFExpressionTests.InvalidOpBinary (795 of 1696) PASS: lldb-Suite :: functionalities/postmortem/elf-core/TestLinuxCore.py (796 of 1696) PASS: lldb-Suite :: lang/c/shared_lib/TestSharedLib.py (797 of 1696) PASS: lldb-Suite :: functionalities/recursion/TestValueObjectRecursion.py (798 of 1696) PASS: LLDB :: Modules/ELF/netbsd-exec-8.99.30-amd64.yaml (799 of 1696) PASS: lldb-Unit :: ObjectFile/Breakpad/./ObjectFileBreakpadTests/ModuleRecord.parse (800 of 1696) PASS: lldb-Unit :: Utility/./UtilityTests/FileSpecTest.FileAndDirectoryComponents (801 of 1696) PASS: lldb-Unit :: Utility/./UtilityTests/BinaryStreamTest.PutSLEB128OneByte (802 of 1696) PASS: lldb-Unit :: UnwindAssembly/x86/./UnwindAssemblyx86Tests/Testx86AssemblyInspectionEngine.TestPush0 (803 of 1696) PASS: lldb-Unit :: Process/minidump/./LLDBMinidumpTests/MinidumpParserTest.GetLinuxProcStatus_no_stream (804 of 1696) PASS: lldb-Suite :: api/listeners/TestListener.py (805 of 1696) PASS: lldb-Unit :: UnwindAssembly/x86/./UnwindAssemblyx86Tests/Testx86AssemblyInspectionEngine.TestPushImm (806 of 1696) PASS: lldb-Unit :: Utility/./UtilityTests/StreamTest.PutHex8 (807 of 1696) PASS: lldb-Unit :: Expression/./ExpressionTests/DiagnosticManagerTest.PutStringSeverities (808 of 1696) PASS: lldb-Unit :: Utility/./UtilityTests/StringExtractorTest.DecodeHexU8_Exact (809 of 1696) PASS: lldb-Suite :: lang/objc/hidden-ivars/TestHiddenIvars.py (810 of 1696) PASS: lldb-Unit :: Utility/./UtilityTests/ProcessInstanceInfo.Dump (811 of 1696) PASS: lldb-Suite :: commands/quit/TestQuit.py (812 of 1696) PASS: lldb-Suite :: python_api/signals/TestSignalsAPI.py (813 of 1696) PASS: lldb-Unit :: ScriptInterpreter/Python/./ScriptInterpreterPythonTests/PythonDataObjectsTest.TestPythonBytes (814 of 1696) PASS: lldb-Unit :: Utility/./UtilityTests/StringListTest.LongestCommonPrefix (815 of 1696) PASS: lldb-Suite :: lang/cpp/symbols/TestSymbols.py (816 of 1696) PASS: lldb-Suite :: lang/cpp/function_refs/TestFunctionRefs.py (817 of 1696) PASS: lldb-Suite :: functionalities/tail_call_frames/ambiguous_tail_call_seq1/TestAmbiguousTailCallSeq1.py (818 of 1696) PASS: LLDB :: SymbolFile/DWARF/debug_ranges.s (819 of 1696) PASS: lldb-Suite :: functionalities/ubsan/user-expression/TestUbsanUserExpression.py (820 of 1696) PASS: lldb-Suite :: macosx/function-starts/TestFunctionStarts.py (821 of 1696) PASS: lldb-Suite :: commands/expression/po_verbosity/TestPoVerbosity.py (822 of 1696) PASS: lldb-Suite :: functionalities/data-formatter/pyobjsynthprovider/TestPyObjSynthProvider.py (823 of 1696) PASS: lldb-Suite :: lang/objc/foundation/TestConstStrings.py (824 of 1696) PASS: lldb-Unit :: Utility/./UtilityTests/StringListTest.CopyList (825 of 1696) PASS: lldb-Suite :: functionalities/data-formatter/data-formatter-stl/libcxx/atomic/TestLibCxxAtomic.py (826 of 1696) PASS: lldb-Unit :: Utility/./UtilityTests/StatusTest.ErrorConversion (827 of 1696) PASS: lldb-Suite :: commands/expression/import-std-module/vector-of-vectors/TestVectorOfVectors.py (828 of 1696) PASS: lldb-Unit :: Utility/./UtilityTests/LogChannelTest.Disable (829 of 1696) PASS: lldb-Suite :: python_api/frame/get-variables/TestGetVariables.py (830 of 1696) PASS: lldb-Suite :: macosx/find-app-in-bundle/TestFindAppInBundle.py (831 of 1696) PASS: lldb-Suite :: functionalities/tsan/thread_numbers/TestTsanThreadNumbers.py (832 of 1696) PASS: lldb-Unit :: Utility/./UtilityTests/VASprintfTest.NoBufferResize (833 of 1696) PASS: lldb-Suite :: lang/objc/objc-optimized/TestObjcOptimized.py (834 of 1696) PASS: lldb-Suite :: commands/register/register/intel_xtended_registers/mpx_bound_violation/TestBoundViolation.py (835 of 1696) PASS: lldb-Suite :: commands/statistics/basic/TestStats.py (836 of 1696) PASS: lldb-Suite :: macosx/order/TestOrderFile.py (837 of 1696) PASS: lldb-Suite :: macosx/macabi/TestMacABImacOSFramework.py (838 of 1696) PASS: LLDB :: Quit/TestQuitExitCodeHexA.test (839 of 1696) PASS: lldb-Suite :: functionalities/testid/TestTestId.py (840 of 1696) PASS: lldb-Suite :: functionalities/data-formatter/var-in-aggregate-misuse/TestVarInAggregateMisuse.py (841 of 1696) PASS: lldb-Unit :: UnwindAssembly/x86/./UnwindAssemblyx86Tests/Testx86AssemblyInspectionEngine.TestPushEBP (842 of 1696) PASS: lldb-Unit :: Utility/./UtilityTests/ScalarTest.ComparisonFloat (843 of 1696) PASS: lldb-Unit :: Process/gdb-remote/./ProcessGdbRemoteTests/GDBRemoteCommunicationClientTest.SendGetDataPacket (844 of 1696) PASS: lldb-Suite :: functionalities/paths/TestPaths.py (845 of 1696) PASS: lldb-Suite :: python_api/module_section/TestModuleAndSection.py (846 of 1696) PASS: lldb-Suite :: tools/lldb-vscode/breakpoint/TestVSCode_setFunctionBreakpoints.py (847 of 1696) PASS: lldb-Unit :: Symbol/./SymbolTests/LineEntryTest.GetSameLineContiguousAddressRangeNoInlines (848 of 1696) PASS: lldb-Unit :: Utility/./UtilityTests/StringListTest.AppendStringStdString (849 of 1696) UNSUPPORTED: LLDB :: SymbolFile/NativePDB/typedefs.cpp (850 of 1696) PASS: lldb-Unit :: Utility/./UtilityTests/StreamTest.PutCString (851 of 1696) FAIL: lldb-Suite :: functionalities/gdb_remote_client/TestGDBRemoteLoad.py (852 of 1696) ******************** TEST 'lldb-Suite :: functionalities/gdb_remote_client/TestGDBRemoteLoad.py' FAILED ******************** lldb version 10.0.99 (http://labmaster3.local/git/llvm-project.git revision fcef13344db8883d2ba5adfca1499b605a136c5b) clang revision fcef13344db8883d2ba5adfca1499b605a136c5b llvm revision fcef13344db8883d2ba5adfca1499b605a136c5b LLDB library dir: /Users/buildslave/jenkins/workspace/lldb-cmake-sanitized/lldb-build/bin LLDB import library dir: /Users/buildslave/jenkins/workspace/lldb-cmake-sanitized/lldb-build/bin libstdcxx tests will not be run because: Don't know how to build with libstdcxx on macosx Skipping following debug info categories: ['dwo']

Hide Details

Session logs for test failures/errors/unexpected successes will go into directory '/Users/buildslave/jenkins/workspace/lldb-cmake-sanitized/test/logs' Command invoked: /Users/buildslave/jenkins/workspace/lldb-cmake-sanitized/llvm-project/lldb/test/dotest.py --arch=x86_64 -s /Users/buildslave/jenkins/workspace/lldb-cmake-sanitized/lldb-build/lldb-test-traces -S nm -u CXXFLAGS -u CFLAGS --executable /Users/buildslave/jenkins/workspace/lldb-cmake-sanitized/lldb-build/./bin/lldb --dsymutil /Users/buildslave/jenkins/workspace/lldb-cmake-sanitized/lldb-build/./bin/dsymutil --filecheck /Users/buildslave/jenkins/workspace/lldb-cmake-sanitized/lldb-build/./bin/FileCheck -C /Users/buildslave/jenkins/workspace/lldb-cmake-sanitized/host-compiler/bin/clang --codesign-identity lldb_codesign --server /Users/buildslave/jenkins/workspace/lldb-cmake-sanitized/lldb-build/./bin/debugserver --arch x86_64 --build-dir /Users/buildslave/jenkins/workspace/lldb-cmake-sanitized/lldb-build/lldb-test-build.noindex -s=/Users/buildslave/jenkins/workspace/lldb-cmake-sanitized/test/logs -t --env TERM=vt100 --env LLVM_LIBS_DIR=/Users/buildslave/jenkins/workspace/lldb-cmake-sanitized/lldb-build/./lib --build-dir /Users/buildslave/jenkins/workspace/lldb-cmake-sanitized/lldb-build/tools/lldb/lldb-test-build.noindex --module-cache-dir /Users/buildslave/jenkins/workspace/lldb-cmake-sanitized/lldb-build/tools/lldb/lldb-test-build.noindex/module-cache-lldb /Users/buildslave/jenkins/workspace/lldb-cmake-sanitized/llvm-project/lldb/packages/Python/lldbsuite/test/functionalities/gdb_remote_client -p TestGDBRemoteLoad.py Change dir to: /Users/buildslave/jenkins/workspace/lldb-cmake-sanitized/llvm-project/lldb/packages/Python/lldbsuite/test/functionalities/gdb_remote_client runCmd: settings set symbols.enable-external-lookup false output:

Hide Details

runCmd: settings set plugin.process.gdb-remote.packet-timeout 60 output:

Hide Details

runCmd: settings set symbols.clang-modules-cache-path "/Users/buildslave/jenkins/workspace/lldb-cmake-sanitized/lldb-build/tools/lldb/lldb-test-build.noindex/module-cache-lldb" output:

Hide Details

runCmd: settings set use-color false output:

Hide Details

FAIL: LLDB (/Users/buildslave/jenkins/workspace/lldb-cmake-sanitized/host-compiler/bin/clang-10-x86_64) :: test_flash_load (TestGDBRemoteLoad.TestGDBRemoteLoad) <bound method SBProcess.Kill of <lldb.SBProcess; proxy of <Swig Object of type 'lldb::SBProcess *' at 0x125ef1ae0> >>: success

Hide Details

runCmd: settings set symbols.enable-external-lookup false output:

Hide Details

runCmd: settings set plugin.process.gdb-remote.packet-timeout 60 output:

Hide Details

runCmd: settings set symbols.clang-modules-cache-path "/Users/buildslave/jenkins/workspace/lldb-cmake-sanitized/lldb-build/tools/lldb/lldb-test-build.noindex/module-cache-lldb" output:

Hide Details

runCmd: settings set use-color false output:

Hide Details

FAIL: LLDB (/Users/buildslave/jenkins/workspace/lldb-cmake-sanitized/host-compiler/bin/clang-10-x86_64) :: test_module_load_address (TestGDBRemoteLoad.TestGDBRemoteLoad) <bound method SBProcess.Kill of <lldb.SBProcess; proxy of <Swig Object of type 'lldb::SBProcess *' at 0x125ef1a80> >>: success

Hide Details

runCmd: settings set symbols.enable-external-lookup false output:

Hide Details

runCmd: settings set plugin.process.gdb-remote.packet-timeout 60 output:

Hide Details

runCmd: settings set symbols.clang-modules-cache-path "/Users/buildslave/jenkins/workspace/lldb-cmake-sanitized/lldb-build/tools/lldb/lldb-test-build.noindex/module-cache-lldb" output:

Hide Details

runCmd: settings set use-color false output:

Hide Details

FAIL: LLDB (/Users/buildslave/jenkins/workspace/lldb-cmake-sanitized/host-compiler/bin/clang-10-x86_64) :: test_ram_load (TestGDBRemoteLoad.TestGDBRemoteLoad) <bound method SBProcess.Kill of <lldb.SBProcess; proxy of <Swig Object of type 'lldb::SBProcess *' at 0x125ef1ae0> >>: success

Hide Details

Restore dir to: /Users/buildslave/jenkins/workspace/lldb-cmake-sanitized/lldb-build/tools/lldb/lit ====================================================================== FAIL: test_flash_load (TestGDBRemoteLoad.TestGDBRemoteLoad) Test loading an object file to a target's flash memory ---------------------------------------------------------------------- Traceback (most recent call last): File "/Users/buildslave/jenkins/workspace/lldb-cmake-sanitized/llvm-project/lldb/packages/Python/lldbsuite/test/functionalities/gdb_remote_client/TestGDBRemoteLoad.py", line 73, in test_flash_load process = self.connect(target) File "/Users/buildslave/jenkins/workspace/lldb-cmake-sanitized/llvm-project/lldb/packages/Python/lldbsuite/test/functionalities/gdb_remote_client/gdbclientutils.py", line 479, in connect self.assertTrue(error.Success(), error.description) AssertionError: False is not True : failed to get reply to handshake packet Config=x86_64-/Users/buildslave/jenkins/workspace/lldb-cmake-sanitized/host-compiler/bin/clang-10 ====================================================================== FAIL: test_module_load_address (TestGDBRemoteLoad.TestGDBRemoteLoad) Test that setting the load address of a module uses virtual addresses ---------------------------------------------------------------------- Traceback (most recent call last): File "/Users/buildslave/jenkins/workspace/lldb-cmake-sanitized/llvm-project/lldb/packages/Python/lldbsuite/test/functionalities/gdb_remote_client/TestGDBRemoteLoad.py", line 20, in test_module_load_address process = self.connect(target) File "/Users/buildslave/jenkins/workspace/lldb-cmake-sanitized/llvm-project/lldb/packages/Python/lldbsuite/test/functionalities/gdb_remote_client/gdbclientutils.py", line 479, in connect self.assertTrue(error.Success(), error.description) AssertionError: False is not True : failed to get reply to handshake packet Config=x86_64-/Users/buildslave/jenkins/workspace/lldb-cmake-sanitized/host-compiler/bin/clang-10 ====================================================================== FAIL: test_ram_load (TestGDBRemoteLoad.TestGDBRemoteLoad) Test loading an object file to a target's ram ---------------------------------------------------------------------- Traceback (most recent call last): File "/Users/buildslave/jenkins/workspace/lldb-cmake-sanitized/llvm-project/lldb/packages/Python/lldbsuite/test/functionalities/gdb_remote_client/TestGDBRemoteLoad.py", line 31, in test_ram_load process = self.connect(target) File "/Users/buildslave/jenkins/workspace/lldb-cmake-sanitized/llvm-project/lldb/packages/Python/lldbsuite/test/functionalities/gdb_remote_client/gdbclientutils.py", line 479, in connect self.assertTrue(error.Success(), error.description) AssertionError: False is not True : failed to get reply to handshake packet Config=x86_64-/Users/buildslave/jenkins/workspace/lldb-cmake-sanitized/host-compiler/bin/clang-10 ---------------------------------------------------------------------- Ran 3 tests in 189.279s

Hide Details

RESULT: FAILED (0 passes, 3 failures, 0 errors, 0 skipped, 0 expected failures, 0 unexpected successes)

Hide Details

******************** PASS: lldb-Unit :: Utility/./UtilityTests/UriParserTest.SchemeHostSeparator2 (853 of 1696) PASS: lldb-Unit :: Core/./LLDBCoreTests/RichManglingContextTest.FromCxxMethodName (854 of 1696) PASS: lldb-Suite :: commands/expression/import-std-module/forward_list-dbg-info-content/TestDbgInfoContentForwardList.py (855 of 1696) PASS: lldb-Suite :: commands/expression/radar_8638051/Test8638051.py (856 of 1696) PASS: lldb-Suite :: functionalities/tsan/cpp_global_location/TestTsanCPPGlobalLocation.py (857 of 1696) PASS: lldb-Unit :: Utility/./UtilityTests/ArgsTest.TestUnknownEscape (858 of 1696) PASS: lldb-Suite :: functionalities/inferior-crashing/recursive-inferior/TestRecursiveInferior.py (859 of 1696) PASS: LLDB :: SymbolFile/DWARF/parallel-indexing-stress.s (860 of 1696) PASS: lldb-Suite :: benchmarks/turnaround/TestCompileRunToBreakpointTurnaround.py (861 of 1696) PASS: lldb-Unit :: Utility/./UtilityTests/StringListTest.LongestCommonPrefixDuplicateElement (862 of 1696) PASS: lldb-Unit :: Host/./HostTests/SocketTest.TCPGetConnectURI (863 of 1696) PASS: lldb-Suite :: lang/objc/rdar-10967107/TestRdar10967107.py (864 of 1696) PASS: lldb-Unit :: Utility/./UtilityTests/StreamTest.PutStringAsRawHex8 (865 of 1696) PASS: lldb-Suite :: lang/cpp/function-template-parameter-pack/TestFunctionTemplateParameterPack.py (866 of 1696) PASS: lldb-Unit :: Utility/./UtilityTests/VASprintfTest.BufferResize (867 of 1696) PASS: lldb-Suite :: commands/expression/top-level/TestTopLevelExprs.py (868 of 1696) PASS: lldb-Unit :: Language/Highlighting/./HighlighterTests/HighlighterTest.ClangPPDirectives (869 of 1696) PASS: lldb-Unit :: Utility/./UtilityTests/OptionsWithRawTest.EmptyInput (870 of 1696) UNSUPPORTED: LLDB :: Register/x86-64-zmm-write.test (871 of 1696) PASS: lldb-Unit :: Utility/./UtilityTests/StringListTest.RemoveBlankLines (872 of 1696) PASS: lldb-Unit :: Utility/./UtilityTests/StreamTest.PutChar (873 of 1696) PASS: LLDB :: Quit/TestQuitExitCodeTooManyArgs.test (874 of 1696) PASS: lldb-Suite :: terminal/TestSTTYBeforeAndAfter.py (875 of 1696) PASS: lldb-Unit :: Utility/./UtilityTests/EnvironmentTest.EnvpConstruction (876 of 1696) PASS: lldb-Suite :: functionalities/thread/create_during_step/TestCreateDuringStep.py (877 of 1696) PASS: LLDB :: Modules/PECOFF/basic-info.yaml (878 of 1696) PASS: lldb-Unit :: Utility/./UtilityTests/FileSpecTest.FormatFileSpec (879 of 1696) PASS: lldb-Suite :: commands/watchpoints/hello_watchlocation/TestWatchLocation.py (880 of 1696) PASS: LLDB :: Modules/PECOFF/subsections.yaml (881 of 1696) PASS: lldb-Unit :: SymbolFile/DWARF/./SymbolFileDWARFTests/SymbolFileDWARFTests.TestAbbrevValidAttrNullForm (882 of 1696) PASS: lldb-Unit :: Utility/./UtilityTests/StringExtractorTest.GetNameColonValueSuccess (883 of 1696) PASS: lldb-Unit :: UnwindAssembly/x86/./UnwindAssemblyx86Tests/Testx86AssemblyInspectionEngine.Test64bitFramelessBigStackFrame (884 of 1696) PASS: lldb-Suite :: commands/disassemble/basic/TestDisassembleBreakpoint.py (885 of 1696) PASS: lldb-Suite :: commands/breakpoint/basic/TestBreakpointCommand.py (886 of 1696) PASS: lldb-Unit :: Expression/./ExpressionTests/DiagnosticManagerTest.AppendMessageAttachToLastDiag (887 of 1696) PASS: LLDB :: Modules/ELF/PT_TLS-overlap-PT_LOAD.yaml (888 of 1696) PASS: lldb-Unit :: UnwindAssembly/x86/./UnwindAssemblyx86Tests/Testx86AssemblyInspectionEngine.TestPushR13 (889 of 1696) PASS: lldb-Suite :: python_api/type/TestTypeList.py (890 of 1696) PASS: lldb-Suite :: functionalities/thread/concurrent_events/TestConcurrentTwoWatchpointsOneBreakpoint.py (891 of 1696) PASS: lldb-Suite :: lang/objc/objc-ivar-offsets/TestObjCIvarOffsets.py (892 of 1696) PASS: lldb-Unit :: Utility/./UtilityTests/StringExtractorTest.GetHexBytes_OddPair (893 of 1696) PASS: lldb-Unit :: SymbolFile/DWARF/./SymbolFileDWARFTests/SymbolFileDWARFTests.TestAbbrevOutOfOrder (894 of 1696) PASS: lldb-Suite :: functionalities/mtc/simple/TestMTCSimple.py (895 of 1696) PASS: lldb-Unit :: Utility/./UtilityTests/StateTest.Formatv (896 of 1696) PASS: lldb-Suite :: lang/objc/objc-builtin-types/TestObjCBuiltinTypes.py (897 of 1696) PASS: lldb-Suite :: commands/expression/context-object-objc/TestContextObjectObjc.py (898 of 1696) PASS: lldb-Unit :: Target/./TargetTests/PathMappingListTest.RemapRoot (899 of 1696) PASS: lldb-Unit :: Utility/./UtilityTests/NameMatchesTest.Equals (900 of 1696) PASS: LLDB :: SymbolFile/NativePDB/globals-bss.cpp (901 of 1696) PASS: lldb-Unit :: SymbolFile/DWARF/./SymbolFileDWARFTests/SymbolFileDWARFTests.TestAbbrevInvalidNULLTag (902 of 1696) PASS: lldb-Suite :: commands/expression/unicode-in-variable/TestUnicodeInVariable.py (903 of 1696) PASS: lldb-Unit :: Utility/./UtilityTests/BinaryStreamTest.PutULEB128FourBytes (904 of 1696) PASS: lldb-Suite :: types/TestDoubleTypesExpr.py (905 of 1696) PASS: lldb-Unit :: UnwindAssembly/x86/./UnwindAssemblyx86Tests/Testx86AssemblyInspectionEngine.TestPushEDI (906 of 1696) PASS: lldb-Suite :: functionalities/abbreviation/TestAbbreviations.py (907 of 1696) PASS: lldb-Unit :: Utility/./UtilityTests/ScalarTest.SetValueFromCString (908 of 1696) PASS: lldb-Suite :: commands/settings/TestSettings.py (909 of 1696) PASS: lldb-Unit :: Utility/./UtilityTests/StringListTest.JoinMultiCharSeparator (910 of 1696) PASS: lldb-Suite :: functionalities/stats_api/TestStatisticsAPI.py (911 of 1696) PASS: lldb-Unit :: ScriptInterpreter/Python/./ScriptInterpreterPythonTests/PythonExceptionStateTest.TestResetSemantics (912 of 1696) PASS: lldb-Suite :: commands/expression/import-std-module/vector-dbg-info-content/TestDbgInfoContentVector.py (913 of 1696) PASS: lldb-Unit :: Utility/./UtilityTests/StructuredDataTest.StringDump (914 of 1696) PASS: lldb-Suite :: commands/expression/dont_allow_jit/TestAllowJIT.py (915 of 1696) PASS: lldb-Unit :: SymbolFile/NativePDB/./SymbolFileNativePDBTests/PDBFPOProgramToDWARFExpressionTests.MultipleIndependentAssignments (916 of 1696) PASS: lldb-Unit :: Utility/./UtilityTests/ArgsTest.GetArgumentArrayRef (917 of 1696) PASS: lldb-Suite :: functionalities/conditional_break/TestConditionalBreak.py (918 of 1696) PASS: lldb-Suite :: functionalities/data-formatter/data-formatter-stl/libcxx/multimap/TestDataFormatterLibccMultiMap.py (919 of 1696) PASS: lldb-Suite :: lang/c/bitfields/TestBitfields.py (920 of 1696) PASS: lldb-Suite :: lang/objc/objc-property/TestObjCProperty.py (921 of 1696) PASS: lldb-Suite :: tools/lldb-server/TestGdbRemoteAuxvSupport.py (922 of 1696) PASS: lldb-Unit :: Utility/./UtilityTests/StringListTest.Join (923 of 1696) PASS: lldb-Suite :: functionalities/data-formatter/data-formatter-stl/libstdcpp/string/TestDataFormatterStdString.py (924 of 1696) UNSUPPORTED: LLDB :: SymbolFile/PDB/typedefs.test (925 of 1696) PASS: lldb-Unit :: Host/./HostTests/TaskPoolTest.AddTask (926 of 1696) PASS: lldb-Suite :: benchmarks/libcxxmap/TestBenchmarkLibcxxMap.py (927 of 1696) PASS: lldb-Suite :: lang/c/modules/TestCModules.py (928 of 1696) PASS: lldb-Unit :: Utility/./UtilityTests/ScalarTest.Division (929 of 1696) PASS: lldb-Suite :: functionalities/gdb_remote_client/TestRestartBug.py (930 of 1696) UNSUPPORTED: LLDB :: Unwind/eh-frame-small-fde.test (931 of 1696) PASS: lldb-Suite :: lang/cpp/class_types/TestClassTypesDisassembly.py (932 of 1696) PASS: lldb-Unit :: Process/gdb-remote/./ProcessGdbRemoteTests/GDBRemoteCommunicationClientTest.WriteRegister (933 of 1696) PASS: lldb-Suite :: commands/expression/inline-namespace/TestInlineNamespace.py (934 of 1696) PASS: lldb-Unit :: ScriptInterpreter/Python/./ScriptInterpreterPythonTests/PythonDataObjectsTest.TestPythonBoolean (935 of 1696) PASS: lldb-Unit :: Symbol/./SymbolTests/SymbolsTest.TerminateLocateExecutableSymbolFileForUnknownExecutableAndUnknownSymbolFile (936 of 1696) PASS: lldb-Unit :: ScriptInterpreter/Python/./ScriptInterpreterPythonTests/PythonDataObjectsTest.TestInstanceNameResolutionNoDot (937 of 1696) PASS: lldb-Unit :: Host/./HostTests/NativeProcessProtocolTest.ReadCStringFromMemory_CrossPageBoundary (938 of 1696) PASS: lldb-Unit :: Symbol/./SymbolTests/TestClangASTContext.TestGetBasicTypeFromEnum (939 of 1696) PASS: lldb-Unit :: Process/gdb-remote/./ProcessGdbRemoteTests/GDBRemoteCommunicationClientTest.GetModulesInfoInvalidResponse (940 of 1696) PASS: lldb-Suite :: functionalities/thread/concurrent_events/TestConcurrentManyWatchpoints.py (941 of 1696) PASS: lldb-Suite :: lang/objc/foundation/TestObjectDescriptionAPI.py (942 of 1696) PASS: lldb-Suite :: functionalities/data-formatter/ostypeformatting/TestFormattersOsType.py (943 of 1696) PASS: lldb-Suite :: tools/lldb-vscode/breakpoint/TestVSCode_setExceptionBreakpoints.py (944 of 1696) PASS: lldb-Unit :: Utility/./UtilityTests/RangeDataVector.FindEntryThatContains_Overlap (945 of 1696) PASS: lldb-Suite :: functionalities/darwin_log/filter/regex/category/TestDarwinLogFilterRegexCategory.py (946 of 1696) PASS: lldb-Unit :: Utility/./UtilityTests/ArgsTest.TestMultipleArgs (947 of 1696) PASS: LLDB :: Driver/TestConvenienceVariables.test (948 of 1696) PASS: lldb-Unit :: Expression/./ExpressionTests/DiagnosticManagerTest.HasFixits (949 of 1696) PASS: lldb-Suite :: functionalities/data-formatter/data-formatter-stl/libcxx/tuple/TestDataFormatterLibcxxTuple.py (950 of 1696) PASS: lldb-Unit :: Utility/./UtilityTests/StreamTest.PutRawBytesToBigEndian (951 of 1696) PASS: lldb-Unit :: SymbolFile/NativePDB/./SymbolFileNativePDBTests/PDBFPOProgramToDWARFExpressionTests.UnresolvedRegisterAssignmentReference (952 of 1696) PASS: lldb-Suite :: tools/lldb-vscode/variables/TestVSCode_variables.py (953 of 1696) PASS: lldb-Suite :: lang/objcxx/class-name-clash/TestNameClash.py (954 of 1696) PASS: lldb-Suite :: commands/expression/completion-crash2/TestCompletionCrash2.py (955 of 1696) PASS: lldb-Suite :: lang/cpp/exceptions/TestCPPExceptionBreakpoints.py (956 of 1696) PASS: lldb-Unit :: Target/./TargetTests/ExecutionContextTest.GetByteOrderProcess (957 of 1696) PASS: LLDB :: Modules/ELF/PT_LOAD-overlap.yaml (958 of 1696) PASS: lldb-Suite :: lang/c/shared_lib_stripped_symbols/TestSharedLibStrippedSymbols.py (959 of 1696) PASS: lldb-Suite :: python_api/symbol-context/two-files/TestSymbolContextTwoFiles.py (960 of 1696) PASS: lldb-Unit :: Utility/./UtilityTests/StreamTest.ShiftOperatorInts (961 of 1696) PASS: lldb-Unit :: Process/minidump/./LLDBMinidumpTests/MinidumpParserTest.FindMemoryRange (962 of 1696) PASS: lldb-Suite :: tools/lldb-server/inferior-crash/TestGdbRemoteSegFault.py (963 of 1696) PASS: lldb-Unit :: Language/Highlighting/./HighlighterTests/HighlighterTest.ClangIdentifiers (964 of 1696) PASS: lldb-Suite :: commands/expression/unwind_expression/TestUnwindExpression.py (965 of 1696) PASS: lldb-Suite :: lang/objc/foundation/TestObjCMethodsNSArray.py (966 of 1696) PASS: lldb-Suite :: functionalities/multidebugger_commands/TestMultipleDebuggersCommands.py (967 of 1696) PASS: lldb-Unit :: Utility/./UtilityTests/StringListTest.LongestCommonPrefixNoPrefix (968 of 1696) PASS: lldb-Suite :: tools/lldb-server/commandline/TestStubSetSID.py (969 of 1696) PASS: lldb-Suite :: python_api/breakpoint/TestBreakpointAPI.py (970 of 1696) PASS: lldb-Suite :: lang/c/find_struct_type/TestFindStructTypes.py (971 of 1696) PASS: lldb-Unit :: Utility/./UtilityTests/RangeTest.ContainsEndInclusiveInvalid (972 of 1696) PASS: lldb-Unit :: ObjectFile/Breakpad/./ObjectFileBreakpadTests/FileRecord.parse (973 of 1696) PASS: LLDB :: SymbolFile/DWARF/childless-compile-unit.s (974 of 1696) PASS: LLDB :: SymbolFile/NativePDB/nested-types.cpp (975 of 1696) PASS: lldb-Suite :: lang/objc/modules-auto-import/TestModulesAutoImport.py (976 of 1696) PASS: lldb-Suite :: commands/expression/pr35310/TestExprsBug35310.py (977 of 1696) PASS: lldb-Suite :: python_api/lldbutil/TestSwigVersion.py (978 of 1696) PASS: lldb-Suite :: functionalities/process_save_core/TestProcessSaveCore.py (979 of 1696) PASS: LLDB :: SymbolFile/DWARF/forward-declarations.s (980 of 1696) UNSUPPORTED: LLDB :: SymbolFile/NativePDB/stack_unwinding01.cpp (981 of 1696) PASS: lldb-Unit :: ScriptInterpreter/Python/./ScriptInterpreterPythonTests/PythonDataObjectsTest.TestPythonIntegerToStr (982 of 1696) PASS: lldb-Suite :: commands/disassemble/basic/TestFrameDisassemble.py (983 of 1696) PASS: lldb-Suite :: commands/frame/diagnose/dereference-function-return/TestDiagnoseDereferenceFunctionReturn.py (984 of 1696) PASS: lldb-Suite :: functionalities/tail_call_frames/disambiguate_tail_call_seq/TestDisambiguateTailCallSeq.py (985 of 1696) PASS: lldb-Suite :: functionalities/darwin_log/filter/regex/activity-chain/TestDarwinLogFilterRegexActivityChain.py (986 of 1696) PASS: lldb-Suite :: python_api/debugger/TestDebuggerAPI.py (987 of 1696) PASS: lldb-Unit :: Utility/./UtilityTests/BinaryStreamTest.PutSLEB128TwoBytes (988 of 1696) PASS: lldb-Unit :: Utility/./UtilityTests/NameMatchesTest.Contains (989 of 1696) PASS: lldb-Suite :: functionalities/thread/concurrent_events/TestConcurrentDelayedCrashWithBreakpointSignal.py (990 of 1696) PASS: lldb-Suite :: python_api/sbtype_typeclass/TestSBTypeTypeClass.py (991 of 1696) UNSUPPORTED: LLDB :: SymbolFile/NativePDB/local-variables.cpp (992 of 1696) PASS: LLDB :: Minidump/Windows/find-module.test (993 of 1696) PASS: lldb-Suite :: lang/objc/ivar-IMP/TestObjCiVarIMP.py (994 of 1696) PASS: lldb-Unit :: Process/minidump/./LLDBMinidumpTests/MinidumpParserTest.GetExceptionStream (995 of 1696) PASS: lldb-Unit :: Utility/./UtilityTests/ReproducerTest.SetReplay (996 of 1696) PASS: lldb-Suite :: lang/cpp/enum_types/TestCPP11EnumTypes.py (997 of 1696) PASS: lldb-Suite :: functionalities/darwin_log/filter/exact_match/message/TestDarwinLogFilterMatchMessage.py (998 of 1696) PASS: LLDB :: Unwind/trap_frame_sym_ctx.test (999 of 1696) PASS: lldb-Suite :: lang/cpp/class_types/TestClassTypes.py (1000 of 1696) PASS: lldb-Suite :: tools/lldb-server/platform-process-connect/TestPlatformProcessConnect.py (1001 of 1696) UNSUPPORTED: LLDB :: Register/x86-64-xmm16-read.test (1002 of 1696) PASS: lldb-Unit :: Utility/./UtilityTests/RangeTest.LessThanInvalid (1003 of 1696) PASS: lldb-Unit :: Utility/./UtilityTests/StringExtractorTest.DecodeHexU8_InvalidHex2 (1004 of 1696) PASS: lldb-Unit :: Utility/./UtilityTests/RangeTest.ClearWithStarAddress (1005 of 1696) PASS: lldb-Unit :: Utility/./UtilityTests/LogTest.Register (1006 of 1696) PASS: lldb-Unit :: Symbol/./SymbolTests/DWARFCallFrameInfoTest.Basic_dwarf3 (1007 of 1696) PASS: lldb-Unit :: UnwindAssembly/x86/./UnwindAssemblyx86Tests/Testx86AssemblyInspectionEngine.Test64bitFramelessSmallStackFrame (1008 of 1696) PASS: LLDB :: Unwind/eh-frame-dwarf-unwind.test (1009 of 1696) PASS: lldb-Suite :: functionalities/postmortem/elf-core/thread_crash/TestLinuxCoreThreads.py (1010 of 1696) PASS: lldb-Suite :: lang/objc/objc-stepping/TestObjCStepping.py (1011 of 1696) PASS: LLDB :: Breakpoint/debug_rnglist_basic.test (1012 of 1696) PASS: LLDB :: SymbolFile/DWARF/debug-types-signature-loop.s (1013 of 1696) PASS: lldb-Unit :: Utility/./UtilityTests/UriParserTest.SchemeHostSeparator (1014 of 1696) PASS: lldb-Unit :: Utility/./UtilityTests/DataExtractorTest.GetMaxU64 (1015 of 1696) PASS: lldb-Suite :: commands/expression/import-std-module/queue/TestQueue.py (1016 of 1696) PASS: lldb-Unit :: Utility/./UtilityTests/RangeTest.Constructor (1017 of 1696) PASS: lldb-Suite :: functionalities/inferior-crashing/TestInferiorCrashing.py (1018 of 1696) PASS: lldb-Unit :: Utility/./UtilityTests/BinaryStreamTest.PutSLEB128FiveBytes (1019 of 1696) PASS: lldb-Unit :: Utility/./UtilityTests/StringListTest.GetMaxStringLengthMixed (1020 of 1696) PASS: lldb-Unit :: Utility/./UtilityTests/FileSpecTest.RemoveLastPathComponent (1021 of 1696) PASS: LLDB :: SymbolFile/DWARF/debug-types-missing-signature.test (1022 of 1696) PASS: lldb-Unit :: Process/minidump/./LLDBMinidumpTests/MinidumpParserTest.GetPid (1023 of 1696) PASS: lldb-Unit :: Utility/./UtilityTests/LogTest.LLDB_LOG_nullptr (1024 of 1696) PASS: lldb-Suite :: functionalities/gdb_remote_client/TestArmRegisterDefinition.py (1025 of 1696) PASS: lldb-Suite :: lang/objc/variadic_methods/TestVariadicMethods.py (1026 of 1696) PASS: lldb-Suite :: commands/process/launch-with-shellexpand/TestLaunchWithShellExpand.py (1027 of 1696) PASS: lldb-Suite :: lang/cpp/signed_types/TestSignedTypes.py (1028 of 1696) PASS: lldb-Suite :: functionalities/data-formatter/user-format-vs-summary/TestUserFormatVsSummary.py (1029 of 1696) PASS: LLDB :: Modules/ELF/basic-info.yaml (1030 of 1696) PASS: lldb-Unit :: Utility/./UtilityTests/StringLexerTest.NextIf (1031 of 1696) PASS: lldb-Unit :: Utility/./UtilityTests/BinaryStreamTest.PutULEB128SixBytes (1032 of 1696) PASS: lldb-Unit :: Symbol/./SymbolTests/TestClangASTContext.TestUnifyAccessSpecifiers (1033 of 1696) PASS: lldb-Suite :: commands/platform/basic/TestPlatformPython.py (1034 of 1696) PASS: lldb-Suite :: functionalities/thread/concurrent_events/TestConcurrentSignalWatchBreak.py (1035 of 1696) PASS: lldb-Unit :: ScriptInterpreter/Python/./ScriptInterpreterPythonTests/PythonDataObjectsTest.TestPythonDictionaryValueEquality (1036 of 1696) PASS: lldb-Unit :: Utility/./UtilityTests/StringExtractorTest.GetHexBytesAvail_OddPair (1037 of 1696) PASS: lldb-Suite :: commands/frame/recognizer/TestFrameRecognizer.py (1038 of 1696) PASS: lldb-Unit :: Host/./HostTests/TaskPoolTest.TaskMap (1039 of 1696) PASS: lldb-Suite :: functionalities/inferior-assert/TestInferiorAssert.py (1040 of 1696) PASS: lldb-Suite :: lang/cpp/llvm-style/TestLLVMStyle.py (1041 of 1696) PASS: lldb-Suite :: python_api/hello_world/TestHelloWorld.py (1042 of 1696) PASS: lldb-Suite :: lang/cpp/modules-import/TestCXXModulesImport.py (1043 of 1696) PASS: LLDB :: SymbolFile/NativePDB/source-list.cpp (1044 of 1696) PASS: lldb-Unit :: Utility/./UtilityTests/StringExtractorTest.GetHexBytes (1045 of 1696) PASS: lldb-Suite :: lang/objc/modules-incomplete/TestIncompleteModules.py (1046 of 1696) PASS: lldb-Unit :: Process/gdb-remote/./ProcessGdbRemoteTests/GDBRemoteClientBaseTest.SendContinueAndWait (1047 of 1696) PASS: lldb-Unit :: Host/./HostTests/FileSystemTest.Exists (1048 of 1696) PASS: lldb-Unit :: UnwindAssembly/x86/./UnwindAssemblyx86Tests/Testx86AssemblyInspectionEngine.TestPopRBP (1049 of 1696) PASS: lldb-Unit :: SymbolFile/DWARF/./SymbolFileDWARFTests/SymbolFileDWARFTests.TestAbbrevMissingTerminator (1050 of 1696) PASS: LLDB :: Commands/command-regex-delete.test (1051 of 1696) PASS: lldb-Unit :: Utility/./UtilityTests/ArgsTest.ReplaceArgumentAtIndexOutOfRange (1052 of 1696) PASS: lldb-Suite :: lang/c/anonymous/TestAnonymous.py (1053 of 1696) PASS: lldb-Suite :: commands/expression/import-std-module/deque-basic/TestBasicDeque.py (1054 of 1696) PASS: lldb-Unit :: Utility/./UtilityTests/UriParserTest.Empty (1055 of 1696) PASS: lldb-Suite :: commands/expression/weak_symbols/TestWeakSymbols.py (1056 of 1696) PASS: lldb-Unit :: Utility/./UtilityTests/StringListTest.AppendList (1057 of 1696) PASS: lldb-Unit :: Host/./HostTests/HostInfoTest.GetHostname (1058 of 1696) XFAIL: LLDB :: Register/x86-64-ymm-write.test (1059 of 1696) PASS: lldb-Suite :: tools/lldb-server/TestGdbRemoteAttach.py (1060 of 1696) PASS: lldb-Suite :: commands/expression/scoped_enums/TestScopedEnumType.py (1061 of 1696) PASS: LLDB :: SymbolFile/DWARF/split-dwarf-multiple-cu.ll (1062 of 1696) PASS: lldb-Suite :: lang/cpp/std-function-step-into-callable/TestStdFunctionStepIntoCallable.py (1063 of 1696) PASS: lldb-Unit :: Symbol/./SymbolTests/DWARFCallFrameInfoTest.Basic_eh (1064 of 1696) PASS: lldb-Suite :: functionalities/data-formatter/data-formatter-ptr-to-array/TestPtrToArrayFormatting.py (1065 of 1696) PASS: lldb-Suite :: commands/expression/call-function/TestCallStopAndContinue.py (1066 of 1696) PASS: lldb-Suite :: functionalities/target-new-solib-notifications/TestModuleLoadedNotifys.py (1067 of 1696) PASS: lldb-Unit :: Breakpoint/./LLDBBreakpointTests/BreakpointIDTest.StringIsBreakpointName (1068 of 1696) PASS: lldb-Suite :: lang/objc/objc-ivar-stripped/TestObjCIvarStripped.py (1069 of 1696) PASS: lldb-Suite :: commands/expression/import-std-module/sysroot/TestStdModuleSysroot.py (1070 of 1696) PASS: lldb-Suite :: tools/lldb-vscode/attach/TestVSCode_attach.py (1071 of 1696) PASS: lldb-Suite :: python_api/frame/TestFrames.py (1072 of 1696) PASS: lldb-Suite :: functionalities/data-formatter/compactvectors/TestCompactVectors.py (1073 of 1696) PASS: LLDB :: Modules/ELF/PT_LOAD-overlap-section.yaml (1074 of 1696) PASS: lldb-Unit :: Utility/./UtilityTests/StreamTest.PutHex32ByteOrderLittle (1075 of 1696) PASS: lldb-Suite :: python_api/section/TestSectionAPI.py (1076 of 1696) PASS: lldb-Suite :: macosx/safe-to-func-call/TestSafeFuncCalls.py (1077 of 1696) PASS: lldb-Suite :: commands/expression/ir-interpreter/TestIRInterpreter.py (1078 of 1696) PASS: lldb-Suite :: python_api/frame/inlines/TestInlinedFrame.py (1079 of 1696) PASS: lldb-Unit :: Language/Highlighting/./HighlighterTests/HighlighterTest.DefaultHighlighterWithCursor (1080 of 1696) PASS: LLDB :: SymbolFile/DWARF/find-variable-file.cpp (1081 of 1696) PASS: lldb-Unit :: debugserver/./debugserverTests/RNBSocket.LoopBackConnectIPv6 (1082 of 1696) PASS: lldb-Suite :: functionalities/data-formatter/data-formatter-disabling/TestDataFormatterDisabling.py (1083 of 1696) PASS: lldb-Suite :: macosx/indirect_symbol/TestIndirectSymbols.py (1084 of 1696) PASS: lldb-Unit :: ObjectFile/ELF/./ObjectFileELFTests/ObjectFileELFTest.SectionsResolveConsistently (1085 of 1696) PASS: lldb-Unit :: Host/./HostTests/Host.GetEnvironment (1086 of 1696) PASS: lldb-Suite :: functionalities/signal/TestSendSignal.py (1087 of 1696) PASS: lldb-Unit :: UnwindAssembly/x86/./UnwindAssemblyx86Tests/Testx86AssemblyInspectionEngine.Test32bitFramelessSmallStackFrame (1088 of 1696) PASS: lldb-Unit :: Utility/./UtilityTests/StringExtractorTest.GetHexU8_Underflow2 (1089 of 1696) PASS: lldb-Unit :: Utility/./UtilityTests/StringListTest.ShiftStdString (1090 of 1696) PASS: lldb-Suite :: tools/lldb-vscode/step/TestVSCode_step.py (1091 of 1696) PASS: lldb-Suite :: commands/target/create-deps/TestTargetCreateDeps.py (1092 of 1696) PASS: lldb-Unit :: Utility/./UtilityTests/RangeTest.DoesAdjoinOrIntersect (1093 of 1696) PASS: lldb-Unit :: ObjectFile/Breakpad/./ObjectFileBreakpadTests/FuncRecord.parse (1094 of 1696) PASS: lldb-Unit :: UnwindAssembly/x86/./UnwindAssemblyx86Tests/Testx86AssemblyInspectionEngine.TestAddESP (1095 of 1696) PASS: lldb-Suite :: commands/expression/persistent_ptr_update/TestPersistentPtrUpdate.py (1096 of 1696) PASS: lldb-Unit :: Utility/./UtilityTests/StringListTest.CopyListSingle (1097 of 1696) PASS: lldb-Unit :: Host/./HostTests/SocketTest.UDPConnect (1098 of 1696) PASS: lldb-Suite :: commands/target/stop-hooks/TestStopHooks.py (1099 of 1696) PASS: lldb-Unit :: Target/./TargetTests/ExecutionContextTest.GetByteOrder (1100 of 1696) PASS: lldb-Unit :: Process/minidump/./LLDBMinidumpTests/MinidumpParserTest.GetMemoryRegionInfoFromMemory64List (1101 of 1696) PASS: lldb-Unit :: Target/./TargetTests/MemoryRegionInfoTest.Formatv (1102 of 1696) PASS: LLDB :: SymbolFile/DWARF/gnu-style-compression.cpp (1103 of 1696) PASS: lldb-Suite :: tools/lldb-server/inferior-crash/TestGdbRemoteAbort.py (1104 of 1696) PASS: lldb-Suite :: lang/objc/objc-new-syntax/TestObjCNewSyntaxLiteral.py (1105 of 1696) UNSUPPORTED: LLDB :: Register/x86-gp-read.test (1106 of 1696) PASS: lldb-Suite :: functionalities/tail_call_frames/ambiguous_tail_call_seq2/TestAmbiguousTailCallSeq2.py (1107 of 1696) PASS: lldb-Suite :: commands/command/script_alias/TestCommandScriptAlias.py (1108 of 1696) PASS: lldb-Unit :: Host/./HostTests/TaskPoolTest.RunTasks (1109 of 1696) PASS: lldb-Unit :: Expression/./ExpressionTests/DiagnosticManagerTest.GetStringMultiline (1110 of 1696) PASS: lldb-Suite :: lang/c/unicode/TestUnicodeSymbols.py (1111 of 1696) PASS: lldb-Suite :: lang/objcxx/hide-runtime-values/TestObjCXXHideRuntimeValues.py (1112 of 1696) PASS: lldb-Unit :: Host/./HostTests/MainLoopTest.Signal (1113 of 1696) PASS: lldb-Unit :: Utility/./UtilityTests/LogChannelEnabledTest.LogThread (1114 of 1696) PASS: lldb-Suite :: commands/watchpoints/multi_watchpoint_slots/TestWatchpointMultipleSlots.py (1115 of 1696) PASS: lldb-Unit :: Utility/./UtilityTests/Flags.Clear (1116 of 1696) PASS: lldb-Suite :: lang/objc/objc-struct-return/TestObjCStructReturn.py (1117 of 1696) PASS: LLDB :: Modules/ELF/duplicate-section.yaml (1118 of 1696) PASS: lldb-Unit :: Utility/./UtilityTests/ArgsTest.TestQuotedUnknownEscape (1119 of 1696) PASS: lldb-Unit :: Utility/./UtilityTests/RangeTest.NotEqual (1120 of 1696) PASS: lldb-Suite :: lang/c/inlines/TestRedefinitionsInInlines.py (1121 of 1696) PASS: lldb-Unit :: Process/gdb-remote/./ProcessGdbRemoteTests/GDBRemoteCommunicationClientTest.ReadRegister (1122 of 1696) PASS: lldb-Suite :: functionalities/data-formatter/data-formatter-stl/libcxx/vbool/TestDataFormatterLibcxxVBool.py (1123 of 1696) PASS: lldb-Suite :: commands/expression/call-function/TestCallUserDefinedFunction.py (1124 of 1696) PASS: lldb-Suite :: python_api/file_handle/TestFileHandle.py (1125 of 1696) PASS: lldb-Unit :: Utility/./UtilityTests/FileSpecTest.GuessPathStyle (1126 of 1696) PASS: lldb-Suite :: python_api/sblaunchinfo/TestSBLaunchInfo.py (1127 of 1696) XFAIL: LLDB :: Register/x86-mm-xmm-read.test (1128 of 1696) PASS: LLDB :: SymbolFile/DWARF/debug-types-address-ranges.s (1129 of 1696) PASS: lldb-Unit :: Utility/./UtilityTests/IndexToObjectTest.ObjectForIndex (1130 of 1696) PASS: LLDB :: Watchpoint/SetErrorCases.test (1131 of 1696) PASS: lldb-Unit :: Process/gdb-remote/./ProcessGdbRemoteTests/GDBRemoteCommunicationClientTest.GetModulesInfo (1132 of 1696) PASS: lldb-Unit :: Utility/./UtilityTests/RegularExpression.Invalid (1133 of 1696) PASS: lldb-Unit :: UnwindAssembly/x86/./UnwindAssemblyx86Tests/Testx86AssemblyInspectionEngine.TestPopEBX (1134 of 1696) PASS: lldb-Suite :: functionalities/type_lookup/TestTypeLookup.py (1135 of 1696) PASS: lldb-Suite :: functionalities/unwind/standard/TestStandardUnwind.py (1136 of 1696) PASS: lldb-Suite :: functionalities/data-formatter/data-formatter-objc/TestDataFormatterObjNSException.py (1137 of 1696) PASS: lldb-Unit :: Process/gdb-remote/./ProcessGdbRemoteTests/GDBRemoteClientBaseTest.SendContinueAndInterrupt (1138 of 1696) PASS: lldb-Suite :: functionalities/gdb_remote_client/TestTargetXMLArch.py (1139 of 1696) PASS: lldb-Suite :: lang/objc/objc-struct-argument/TestObjCStructArgument.py (1140 of 1696) PASS: lldb-Suite :: commands/expression/expr-in-syscall/TestExpressionInSyscall.py (1141 of 1696) PASS: lldb-Suite :: functionalities/data-formatter/ptr_ref_typedef/TestPtrRef2Typedef.py (1142 of 1696) PASS: lldb-Suite :: functionalities/thread/concurrent_events/TestConcurrentWatchBreakDelay.py (1143 of 1696) XFAIL: LLDB :: SymbolFile/DWARF/find-type-in-function.cpp (1144 of 1696) PASS: lldb-Unit :: Utility/./UtilityTests/StreamTeeTest.AppendStream (1145 of 1696) PASS: lldb-Unit :: Utility/./UtilityTests/ArchSpecTest.TestSetTriple (1146 of 1696) PASS: lldb-Suite :: functionalities/data-formatter/data-formatter-synthtype/TestDataFormatterSynthType.py (1147 of 1696) PASS: lldb-Suite :: lang/cpp/class_static/TestStaticVariables.py (1148 of 1696) PASS: lldb-Suite :: functionalities/thread/concurrent_events/TestConcurrentDelaySignalWatch.py (1149 of 1696) PASS: lldb-Suite :: python_api/lldbutil/iter/TestRegistersIterator.py (1150 of 1696) PASS: lldb-Suite :: functionalities/value_md5_crash/TestValueMD5Crash.py (1151 of 1696) PASS: lldb-Suite :: lang/objc/objc-foundation-dictionary-empty/TestNSDictionary0.py (1152 of 1696) PASS: lldb-Suite :: commands/expression/fixits/TestFixIts.py (1153 of 1696) PASS: lldb-Suite :: functionalities/thread/concurrent_events/TestConcurrentWatchpointWithDelayWatchpointThreads.py (1154 of 1696) PASS: lldb-Suite :: functionalities/data-formatter/dump_dynamic/TestDumpDynamic.py (1155 of 1696) PASS: lldb-Unit :: Utility/./UtilityTests/RangeTest.DefaultConstructor (1156 of 1696) PASS: lldb-Unit :: Utility/./UtilityTests/StringExtractorTest.DecodeHexU8_Underflow (1157 of 1696) PASS: LLDB :: Breakpoint/debug_addrx.test (1158 of 1696) PASS: lldb-Suite :: commands/expression/xvalue/TestXValuePrinting.py (1159 of 1696) PASS: lldb-Suite :: functionalities/thread/concurrent_events/TestConcurrentTwoBreakpointsOneSignal.py (1160 of 1696) PASS: lldb-Suite :: functionalities/thread/exit_during_step/TestExitDuringStep.py (1161 of 1696) UNSUPPORTED: LLDB :: Register/x86-ymm-write.test (1162 of 1696) PASS: lldb-Suite :: commands/expression/import-std-module/conflicts/TestStdModuleWithConflicts.py (1163 of 1696) UNSUPPORTED: LLDB :: Register/x86-64-zmm-read.test (1164 of 1696) PASS: lldb-Unit :: Host/./HostTests/FileSystemTest.EnumerateDirectory (1165 of 1696) PASS: LLDB :: SymbolFile/DWARF/find-basic-variable.cpp (1166 of 1696) PASS: lldb-Suite :: functionalities/thread/concurrent_events/TestConcurrentCrashWithSignal.py (1167 of 1696) PASS: lldb-Unit :: Host/./HostTests/NativeProcessProtocolTest.SetBreakpointFailWrite (1168 of 1696) PASS: lldb-Suite :: functionalities/history/TestHistoryRecall.py (1169 of 1696) PASS: lldb-Unit :: Utility/./UtilityTests/Flags.IsClear (1170 of 1696) PASS: lldb-Suite :: python_api/sbvalue_persist/TestSBValuePersist.py (1171 of 1696) PASS: lldb-Suite :: commands/expression/macros/TestMacros.py (1172 of 1696) PASS: LLDB :: Settings/TestDisableColor.test (1173 of 1696) PASS: lldb-Unit :: Utility/./UtilityTests/StringListTest.InsertStringAtIndexEnd (1174 of 1696) PASS: lldb-Suite :: functionalities/gdb_remote_client/TestStopPCs.py (1175 of 1696) PASS: LLDB :: Driver/TestNoUseColor.test (1176 of 1696) PASS: lldb-Suite :: lang/cpp/nsimport/TestCppNsImport.py (1177 of 1696) PASS: lldb-Unit :: ScriptInterpreter/Python/./ScriptInterpreterPythonTests/PythonDataObjectsTest.TestExtractingUInt64ThroughStructuredData (1178 of 1696) PASS: lldb-Suite :: linux/mix-dwo-and-regular-objects/TestMixedDwarfBinary.py (1179 of 1696) PASS: lldb-Unit :: debugserver/./debugserverTests/RNBSocket.LoopBackConnectIPv4 (1180 of 1696) PASS: lldb-Suite :: functionalities/ubsan/basic/TestUbsanBasic.py (1181 of 1696) PASS: lldb-Suite :: functionalities/data-formatter/data-formatter-objc/TestDataFormatterObjCNSDate.py (1182 of 1696) PASS: lldb-Suite :: commands/frame/diagnose/array/TestArray.py (1183 of 1696) PASS: lldb-Unit :: Utility/./UtilityTests/ScalarTest.Equality (1184 of 1696) PASS: lldb-Suite :: functionalities/data-formatter/nssetsynth/TestNSSetSynthetic.py (1185 of 1696) PASS: lldb-Unit :: Utility/./UtilityTests/BinaryStreamTest.PutULEB128EightBytes (1186 of 1696) PASS: lldb-Unit :: Symbol/./SymbolTests/Type.GetTypeScopeAndBasename (1187 of 1696) PASS: lldb-Suite :: lang/cpp/unique-types/TestUniqueTypes.py (1188 of 1696) PASS: lldb-Unit :: Utility/./UtilityTests/ScalarTest.GetValue (1189 of 1696) PASS: lldb-Unit :: Utility/./UtilityTests/ListenerTest.GetEventImmediate (1190 of 1696) PASS: lldb-Unit :: Symbol/./SymbolTests/SymbolsTest.LocateExecutableSymbolFileForUnknownExecutableAndMissingSymbolFile (1191 of 1696) PASS: lldb-Unit :: Host/./HostTests/NativeProcessProtocolTest.ReadCStringFromMemory (1192 of 1696) PASS: lldb-Suite :: functionalities/data-formatter/data-formatter-objc/nsstring/TestDataFormatterNSString.py (1193 of 1696) PASS: lldb-Unit :: Utility/./UtilityTests/BinaryStreamTest.PutULEB128Zero (1194 of 1696) PASS: lldb-Unit :: Process/gdb-remote/./ProcessGdbRemoteTests/GDBRemoteClientBaseTest.SendContinueDelegateInterface (1195 of 1696) PASS: lldb-Unit :: Utility/./UtilityTests/AnsiTerminal.AtStart (1196 of 1696) PASS: lldb-Suite :: lang/c/blocks/TestBlocks.py (1197 of 1696) PASS: lldb-Suite :: functionalities/thread/concurrent_events/TestConcurrentBreakpointsDelayedBreakpointOneWatchpoint.py (1198 of 1696) PASS: lldb-Unit :: Utility/./UtilityTests/LogTest.Unregister (1199 of 1696) PASS: lldb-Suite :: python_api/target/TestTargetAPI.py (1200 of 1696) PASS: lldb-Unit :: Utility/./UtilityTests/StringLexerTest.NextIfList (1201 of 1696) PASS: lldb-Suite :: commands/expression/dollar-in-variable/TestDollarInVariable.py (1202 of 1696) PASS: lldb-Suite :: functionalities/data-formatter/synthcapping/TestSyntheticCapping.py (1203 of 1696) PASS: lldb-Suite :: functionalities/tsan/global_location/TestTsanGlobalLocation.py (1204 of 1696) PASS: lldb-Unit :: Utility/./UtilityTests/BinaryStreamTest.PutSLEB128MaxValue (1205 of 1696) PASS: LLDB :: Breakpoint/debug_rnglist_rlestartend.test (1206 of 1696) PASS: lldb-Unit :: Utility/./UtilityTests/UriParserTest.BracketedHostname (1207 of 1696) PASS: lldb-Unit :: Utility/./UtilityTests/UriParserTest.BadPort (1208 of 1696) PASS: lldb-Suite :: commands/expression/import-std-module/list-basic/TestBasicList.py (1209 of 1696) PASS: lldb-Unit :: Host/./HostTests/SocketTest.DomainGetConnectURI (1210 of 1696) PASS: lldb-Unit :: Core/./LLDBCoreTests/RichManglingContextTest.SwitchProvider (1211 of 1696) PASS: lldb-Suite :: functionalities/data-formatter/hexcaps/TestDataFormatterHexCaps.py (1212 of 1696) PASS: lldb-Unit :: ScriptInterpreter/Python/./ScriptInterpreterPythonTests/PythonExceptionStateTest.TestAutoRestoreChanged (1213 of 1696) PASS: lldb-Suite :: lang/cpp/template/TestTemplateArgs.py (1214 of 1696) PASS: lldb-Suite :: arm/emulation/TestEmulations.py (1215 of 1696) PASS: lldb-Suite :: functionalities/tail_call_frames/disambiguate_call_site/TestDisambiguateCallSite.py (1216 of 1696) PASS: lldb-Unit :: UnwindAssembly/x86/./UnwindAssemblyx86Tests/Testx86AssemblyInspectionEngine.TestPushEAX (1217 of 1696) PASS: lldb-Unit :: Utility/./UtilityTests/OptionsWithRawTest.ArgsButNoDelimiter (1218 of 1696) PASS: lldb-Unit :: UnwindAssembly/x86/./UnwindAssemblyx86Tests/Testx86AssemblyInspectionEngine.TestSubESP (1219 of 1696) PASS: lldb-Suite :: functionalities/data-formatter/data-formatter-objc/TestDataFormatterObjCCF.py (1220 of 1696) PASS: lldb-Suite :: python_api/rdar-12481949/Test-rdar-12481949.py (1221 of 1696) PASS: lldb-Unit :: SymbolFile/NativePDB/./SymbolFileNativePDBTests/PDBFPOProgramToDWARFExpressionTests.InvalidOpUnary (1222 of 1696) PASS: lldb-Suite :: functionalities/completion/TestCompletion.py (1223 of 1696) PASS: lldb-Suite :: functionalities/data-formatter/data-formatter-stl/libcxx/function/TestLibCxxFunction.py (1224 of 1696) PASS: lldb-Unit :: Utility/./UtilityTests/FileSpecTest.CopyByAppendingPathComponent (1225 of 1696) PASS: lldb-Unit :: SymbolFile/NativePDB/./SymbolFileNativePDBTests/PDBFPOProgramToDWARFExpressionTests.MissingTargetRegister (1226 of 1696) PASS: lldb-Unit :: Process/minidump/./LLDBMinidumpTests/MinidumpParserTest.GetArchitectureWindows (1227 of 1696) PASS: lldb-Suite :: functionalities/postmortem/elf-core/gcore/TestGCore.py (1228 of 1696) PASS: lldb-Unit :: Process/gdb-remote/./ProcessGdbRemoteTests/GDBRemoteCommunicationServerTest.SendErrorResponse_Status (1229 of 1696) PASS: lldb-Suite :: functionalities/data-formatter/data-formatter-objc/TestDataFormatterObjCNSBundle.py (1230 of 1696) PASS: lldb-Unit :: UnwindAssembly/x86/./UnwindAssemblyx86Tests/Testx86AssemblyInspectionEngine.TestPushEBX (1231 of 1696) PASS: LLDB :: Settings/TestFrameFormatColor.test (1232 of 1696) PASS: lldb-Unit :: Utility/./UtilityTests/ArgsTest.TestQuotedTrailingBackslash (1233 of 1696) PASS: lldb-Suite :: python_api/disassemble-raw-data/TestDisassemble_VST1_64.py (1234 of 1696) PASS: lldb-Suite :: lang/objc/print-obj/TestPrintObj.py (1235 of 1696) PASS: lldb-Suite :: lang/cpp/const_this/TestConstThis.py (1236 of 1696) PASS: lldb-Unit :: Expression/./ExpressionTests/DiagnosticManagerTest.AddDiagnostic (1237 of 1696) PASS: lldb-Suite :: functionalities/data-formatter/data-formatter-stl/libstdcpp/list/TestDataFormatterStdList.py (1238 of 1696) PASS: lldb-Suite :: tools/lldb-server/TestGdbRemoteExitCode.py (1239 of 1696) PASS: lldb-Unit :: Utility/./UtilityTests/AnsiTerminal.Basic (1240 of 1696) PASS: lldb-Suite :: functionalities/unwind/noreturn/module-end/TestNoReturnModuleEnd.py (1241 of 1696) PASS: lldb-Unit :: Process/minidump/./LLDBMinidumpTests/MinidumpParserTest.GetFilteredModuleList (1242 of 1696) PASS: lldb-Suite :: functionalities/thread/step_until/TestStepUntil.py (1243 of 1696) PASS: lldb-Unit :: Utility/./UtilityTests/StreamTest.PutNHex8 (1244 of 1696) PASS: lldb-Unit :: Process/gdb-remote/./ProcessGdbRemoteTests/GDBRemoteCommunicationClientTest.TestPacketSpeedJSON (1245 of 1696) PASS: lldb-Unit :: Utility/./UtilityTests/StringListTest.ShiftCString (1246 of 1696) UNSUPPORTED: LLDB :: SymbolFile/PDB/type-quals.test (1247 of 1696) PASS: LLDB :: Modules/PECOFF/export-dllfunc.yaml (1248 of 1696) PASS: lldb-Unit :: ScriptInterpreter/Python/./ScriptInterpreterPythonTests/PythonDataObjectsTest.TestPythonTupleToStructuredList (1249 of 1696) PASS: lldb-Unit :: Process/gdb-remote/./ProcessGdbRemoteTests/GDBRemoteClientBaseTest.InterruptNoResponse (1250 of 1696) PASS: lldb-Unit :: Utility/./UtilityTests/ArgsTest.StringListConstructor (1251 of 1696) UNSUPPORTED: LLDB :: ExecControl/StopHook/stop-hook-threads.test (1252 of 1696) PASS: lldb-Unit :: tools/lldb-server/tests/./LLDBServerTests/TestBase.LaunchModePreservesEnvironment (1253 of 1696) PASS: lldb-Suite :: python_api/lldbutil/process/TestPrintStackTraces.py (1254 of 1696) PASS: lldb-Suite :: commands/expression/save_jit_objects/TestSaveJITObjects.py (1255 of 1696) PASS: LLDB :: Settings/TestSettingsWrite.test (1256 of 1696) PASS: lldb-Suite :: commands/process/attach/TestProcessAttach.py (1257 of 1696) PASS: lldb-Unit :: Language/Highlighting/./HighlighterTests/HighlighterTest.ClangCursorPosAfterOtherToken (1258 of 1696) PASS: lldb-Suite :: functionalities/data-formatter/language_category_updates/TestDataFormatterLanguageCategoryUpdates.py (1259 of 1696) PASS: lldb-Suite :: functionalities/data-formatter/data-formatter-stl/libstdcpp/vector/TestDataFormatterStdVector.py (1260 of 1696) PASS: lldb-Suite :: functionalities/data-formatter/data-formatter-stl/libstdcpp/unique_ptr/invalid/TestDataFormatterInvalidStdUniquePtr.py (1261 of 1696) PASS: lldb-Unit :: Utility/./UtilityTests/ConstStringTest.format_provider (1262 of 1696) PASS: lldb-Unit :: Expression/./ExpressionTests/DiagnosticManagerTest.AppendMessageNoDiag (1263 of 1696) PASS: lldb-Unit :: Utility/./UtilityTests/StreamTeeTest.SetStreamAtIndexOutOfBounds (1264 of 1696) PASS: LLDB :: Register/x86-64-ymm-read.test (1265 of 1696) PASS: lldb-Suite :: macosx/load-kext/TestLoadKext.py (1266 of 1696) PASS: LLDB :: SymbolFile/NativePDB/tag-types.cpp (1267 of 1696) PASS: LLDB :: SymbolFile/NativePDB/ast-functions.cpp (1268 of 1696) PASS: lldb-Suite :: commands/expression/entry-bp/TestExprEntryBP.py (1269 of 1696) PASS: lldb-Unit :: Utility/./UtilityTests/TimerTest.CategoryTimesStats (1270 of 1696) PASS: lldb-Suite :: python_api/value/change_values/TestChangeValueAPI.py (1271 of 1696) PASS: lldb-Suite :: arm/breakpoint-it/TestBreakpointIt.py (1272 of 1696) PASS: lldb-Suite :: commands/target/create-no-such-arch/TestNoSuchArch.py (1273 of 1696) PASS: lldb-Suite :: commands/process/attach/attach_denied/TestAttachDenied.py (1274 of 1696) PASS: lldb-Unit :: Utility/./UtilityTests/RecordReplayTest.InstrumentedBarPtr (1275 of 1696) PASS: lldb-Suite :: tools/lldb-vscode/stackTrace/TestVSCode_stackTrace.py (1276 of 1696) PASS: lldb-Unit :: Utility/./UtilityTests/NameMatchesTest.Ignore (1277 of 1696) PASS: lldb-Unit :: Utility/./UtilityTests/ConstStringTest.CompareConstString (1278 of 1696) PASS: lldb-Unit :: Utility/./UtilityTests/Flags.AnyClear (1279 of 1696) PASS: lldb-Suite :: functionalities/data-formatter/data-formatter-categories/TestDataFormatterCategories.py (1280 of 1696) PASS: lldb-Unit :: Utility/./UtilityTests/RangeTest.ContainsRangeStartingFromZero (1281 of 1696) PASS: lldb-Unit :: Utility/./UtilityTests/ArgsTest.TestAppendArg (1282 of 1696) PASS: LLDB :: Modules/ELF/compressed-sections.yaml (1283 of 1696) PASS: lldb-Suite :: functionalities/jitloader_gdb/TestJITLoaderGDB.py (1284 of 1696) UNSUPPORTED: LLDB :: Register/x86-64-xmm16-write.test (1285 of 1696) PASS: lldb-Suite :: lang/cpp/dynamic-value-same-basename/TestDynamicValueSameBase.py (1286 of 1696) PASS: lldb-Unit :: Utility/./UtilityTests/UUIDTest.RelationalOperators (1287 of 1696) PASS: lldb-Unit :: Utility/./UtilityTests/TildeExpressionResolver.ResolveFullPath (1288 of 1696) PASS: lldb-Suite :: lang/c/conflicting-symbol/TestConflictingSymbol.py (1289 of 1696) PASS: lldb-Suite :: source-manager/TestSourceManager.py (1290 of 1696) PASS: lldb-Suite :: functionalities/signal/handle-abrt/TestHandleAbort.py (1291 of 1696) PASS: lldb-Unit :: Utility/./UtilityTests/RegularExpression.Valid (1292 of 1696) PASS: lldb-Suite :: lang/cpp/breakpoint_in_member_func_w_non_primitive_params/TestBreakpointInMemberFuncWNonPrimitiveParams.py (1293 of 1696) PASS: lldb-Unit :: Utility/./UtilityTests/SerializationRountripTest.SerializeDeserializeObjectReference (1294 of 1696) PASS: lldb-Suite :: functionalities/data-formatter/data-formatter-smart-array/TestDataFormatterSmartArray.py (1295 of 1696) PASS: lldb-Suite :: functionalities/data-formatter/data-formatter-stl/libcxx/string/TestDataFormatterLibcxxString.py (1296 of 1696) PASS: lldb-Suite :: lang/objc/rdar-12408181/TestRdar12408181.py (1297 of 1696) PASS: lldb-Unit :: Utility/./UtilityTests/StringExtractorTest.DecodeHexU8_Extra (1298 of 1696) PASS: LLDB :: SymbolFile/NativePDB/break-by-function.cpp (1299 of 1696) PASS: LLDB :: SymbolFile/NativePDB/s_constant.cpp (1300 of 1696) PASS: lldb-Suite :: functionalities/inferior-crashing/recursive-inferior/TestRecursiveInferiorStep.py (1301 of 1696) PASS: lldb-Suite :: macosx/universal/TestUniversal.py (1302 of 1696) PASS: LLDB :: SymbolFile/DWARF/find-inline-method.s (1303 of 1696) PASS: lldb-Unit :: Utility/./UtilityTests/RangeTest.ContainsAddr (1304 of 1696) PASS: lldb-Unit :: SymbolFile/NativePDB/./SymbolFileNativePDBTests/PDBFPOProgramToDWARFExpressionTests.UnresolvedDependentCyclicRegisterAssignmentReference (1305 of 1696) PASS: lldb-Unit :: Utility/./UtilityTests/StringExtractorTest.GetHexBytesAvail_Partial (1306 of 1696) PASS: lldb-Suite :: functionalities/darwin_log/filter/regex/message/TestDarwinLogFilterRegexMessage.py (1307 of 1696) PASS: lldb-Suite :: functionalities/data-formatter/data-formatter-enum-format/TestDataFormatterEnumFormat.py (1308 of 1696) PASS: lldb-Suite :: functionalities/data-formatter/data-formatter-script/TestDataFormatterScript.py (1309 of 1696) PASS: lldb-Suite :: commands/expression/completion/TestExprCompletion.py (1310 of 1696) PASS: lldb-Suite :: commands/command/delete/TestCommandDelete.py (1311 of 1696) PASS: lldb-Suite :: functionalities/darwin_log/filter/exact_match/category/TestDarwinLogFilterMatchCategory.py (1312 of 1696) PASS: lldb-Suite :: macosx/nslog/TestDarwinNSLogOutput.py (1313 of 1696) PASS: lldb-Unit :: Utility/./UtilityTests/StringExtractorTest.InitMisc (1314 of 1696) PASS: lldb-Suite :: functionalities/data-formatter/data-formatter-stl/libcxx/forward_list/TestDataFormatterLibcxxForwardList.py (1315 of 1696) PASS: lldb-Suite :: lang/cpp/extern_c/TestExternCSymbols.py (1316 of 1696) PASS: lldb-Unit :: UnwindAssembly/x86/./UnwindAssemblyx86Tests/Testx86AssemblyInspectionEngine.TestPushRBP (1317 of 1696) PASS: lldb-Unit :: ScriptInterpreter/Python/./ScriptInterpreterPythonTests/PythonDataObjectsTest.TestPythonCallableCheck (1318 of 1696) PASS: lldb-Unit :: Utility/./UtilityTests/RangeTest.Equal (1319 of 1696) PASS: LLDB :: SymbolFile/NativePDB/disassembly.cpp (1320 of 1696) PASS: LLDB :: Minidump/Windows/Sigsegv/sigsegv.test (1321 of 1696) PASS: lldb-Unit :: Language/Highlighting/./HighlighterTests/HighlighterTest.DefaultHighlighterWithCursorOutOfBounds (1322 of 1696) PASS: lldb-Unit :: Utility/./UtilityTests/UriParserTest.MinimalPath (1323 of 1696) PASS: lldb-Unit :: ScriptInterpreter/Python/./ScriptInterpreterPythonTests/PythonDataObjectsTest.TestPythonIntegerToStructuredInteger (1324 of 1696) PASS: lldb-Unit :: Utility/./UtilityTests/Flags.SetCount (1325 of 1696) PASS: LLDB :: Driver/TestCommands.test (1326 of 1696) PASS: lldb-Suite :: functionalities/darwin_log/format/TestDarwinLogMessageFormat.py (1327 of 1696) PASS: lldb-Suite :: lang/cpp/char1632_t/TestChar1632T.py (1328 of 1696) PASS: lldb-Unit :: Utility/./UtilityTests/RangeTest.LessThan (1329 of 1696) PASS: lldb-Suite :: lang/c/strings/TestCStrings.py (1330 of 1696) PASS: LLDB :: Minidump/breakpad-symbols.test (1331 of 1696) PASS: lldb-Suite :: commands/watchpoints/watchpoint_set_command/TestWatchLocationWithWatchSet.py (1332 of 1696) PASS: lldb-Suite :: commands/watchpoints/watchpoint_commands/command/TestWatchpointCommandPython.py (1333 of 1696) PASS: lldb-Unit :: Utility/./UtilityTests/Flags.ClearCount (1334 of 1696) PASS: lldb-Suite :: functionalities/gdb_remote_client/TestWriteMemory.py (1335 of 1696) PASS: lldb-Unit :: Utility/./UtilityTests/StringExtractorTest.InitEmpty (1336 of 1696) PASS: LLDB :: Expr/TestTypeOfDeclTypeExpr.test (1337 of 1696) PASS: lldb-Suite :: lang/cpp/operator-overload/TestOperatorOverload.py (1338 of 1696) PASS: lldb-Suite :: functionalities/archives/TestBSDArchives.py (1339 of 1696) PASS: lldb-Suite :: lang/cpp/global_variables/TestCPPGlobalVariables.py (1340 of 1696) PASS: lldb-Unit :: Target/./TargetTests/ModuleCacheTest.GetAndPutUuidExists (1341 of 1696) PASS: lldb-Suite :: functionalities/unwind/noreturn/TestNoreturnUnwind.py (1342 of 1696) PASS: lldb-Unit :: Utility/./UtilityTests/BinaryStreamTest.PutSLEB128FourBytes (1343 of 1696) PASS: LLDB :: SymbolFile/DWARF/debug-types-line-tables.s (1344 of 1696) PASS: lldb-Unit :: Process/gdb-remote/./ProcessGdbRemoteTests/GDBRemoteCommunicationClientTest.SaveRestoreRegistersNoSuffix (1345 of 1696) PASS: lldb-Unit :: Process/gdb-remote/./ProcessGdbRemoteTests/GDBRemoteCommunicationClientTest.SendGetTraceConfigPacket (1346 of 1696) PASS: lldb-Suite :: functionalities/non-overlapping-index-variable-i/TestIndexVariable.py (1347 of 1696) PASS: lldb-Unit :: Utility/./UtilityTests/SerializationRountripTest.SerializeDeserializePodPointers (1348 of 1696) PASS: lldb-Suite :: functionalities/type_completion/TestTypeCompletion.py (1349 of 1696) PASS: lldb-Suite :: commands/command/script/TestCommandScript.py (1350 of 1696) PASS: lldb-Suite :: lang/cpp/unsigned_types/TestUnsignedTypes.py (1351 of 1696) PASS: lldb-Suite :: lang/c/array_types/TestArrayTypes.py (1352 of 1696) PASS: lldb-Unit :: Host/./HostTests/MainLoopTest.ReadObject (1353 of 1696) FAIL: lldb-Suite :: commands/expression/multiline-completion/TestMultilineCompletion.py (1354 of 1696) ******************** TEST 'lldb-Suite :: commands/expression/multiline-completion/TestMultilineCompletion.py' FAILED ******************** lldb version 10.0.99 (http://labmaster3.local/git/llvm-project.git revision fcef13344db8883d2ba5adfca1499b605a136c5b) clang revision fcef13344db8883d2ba5adfca1499b605a136c5b llvm revision fcef13344db8883d2ba5adfca1499b605a136c5b LLDB library dir: /Users/buildslave/jenkins/workspace/lldb-cmake-sanitized/lldb-build/bin LLDB import library dir: /Users/buildslave/jenkins/workspace/lldb-cmake-sanitized/lldb-build/bin libstdcxx tests will not be run because: Don't know how to build with libstdcxx on macosx Skipping following debug info categories: ['dwo'] (lldb) settings set symbols.enable-external-lookup false (lldb) settings set plugin.process.gdb-remote.packet-timeout 60 (lldb) settings set symbols.clang-modules-cache-path "/Users/buildslave/jenkins/workspace/lldb-cmake-sanitized/lldb-build/tools/lldb/lldb-test-build.noindex/module-cache-lldb" (lldb) settings set use-color false (lldb) target create "/Users/buildslave/jenkins/workspace/lldb-cmake-sanitized/lldb-build/tools/lldb/lldb-test-build.noindex/commands/expression/multiline-completion/TestMultilineCompletion.test_basic_completion/a.out" Current executable set to '/Users/buildslave/jenkins/workspace/lldb-cmake-sanitized/lldb-build/tools/lldb/lldb-test-build.noindex/commands/expression/multiline-completion/TestMultilineCompletion.test_basic_completion/a.out' (x86_64). (lldb) b main b main Breakpoint 1: where = a.out`main + 18 at main.c:2:7, address = 0x0000000100000fa2 (lldb) run run Process 18561 launched: '/Users/buildslave/jenkins/workspace/lldb-cmake-sanitized/lldb-build/tools/lldb/lldb-test-build.noindex/commands/expression/multiline-completion/TestMultilineCompletion.test_basic_completion/a.out' (x86_64) Process 18561 stopped * thread #1, queue = 'com.apple.main-thread', stop reason = breakpoint 1.1 frame #0: 0x0000000100000fa2 a.out`main(argc=1, argv=0x00007ffeefbff4d0) at main.c:2:7 1 int main(int argc, char **argv) { -> 2 int to_complete = 0; ^ 3 return to_complete; 4 } (lldb) expr expr Enter expressions, then terminate with an empty line to evaluate: to_  1:  1: to_ to_  1: to_complete

Hide Details

 1: to_complete 2:  2:  (int) $0 = 0 (lldb) settings set interpreter.prompt-on-quit false

Hide Details

Session logs for test failures/errors/unexpected successes will go into directory '/Users/buildslave/jenkins/workspace/lldb-cmake-sanitized/test/logs' Command invoked: /Users/buildslave/jenkins/workspace/lldb-cmake-sanitized/llvm-project/lldb/test/dotest.py --arch=x86_64 -s /Users/buildslave/jenkins/workspace/lldb-cmake-sanitized/lldb-build/lldb-test-traces -S nm -u CXXFLAGS -u CFLAGS --executable /Users/buildslave/jenkins/workspace/lldb-cmake-sanitized/lldb-build/./bin/lldb --dsymutil /Users/buildslave/jenkins/workspace/lldb-cmake-sanitized/lldb-build/./bin/dsymutil --filecheck /Users/buildslave/jenkins/workspace/lldb-cmake-sanitized/lldb-build/./bin/FileCheck -C /Users/buildslave/jenkins/workspace/lldb-cmake-sanitized/host-compiler/bin/clang --codesign-identity lldb_codesign --server /Users/buildslave/jenkins/workspace/lldb-cmake-sanitized/lldb-build/./bin/debugserver --arch x86_64 --build-dir /Users/buildslave/jenkins/workspace/lldb-cmake-sanitized/lldb-build/lldb-test-build.noindex -s=/Users/buildslave/jenkins/workspace/lldb-cmake-sanitized/test/logs -t --env TERM=vt100 --env LLVM_LIBS_DIR=/Users/buildslave/jenkins/workspace/lldb-cmake-sanitized/lldb-build/./lib --build-dir /Users/buildslave/jenkins/workspace/lldb-cmake-sanitized/lldb-build/tools/lldb/lldb-test-build.noindex --module-cache-dir /Users/buildslave/jenkins/workspace/lldb-cmake-sanitized/lldb-build/tools/lldb/lldb-test-build.noindex/module-cache-lldb /Users/buildslave/jenkins/workspace/lldb-cmake-sanitized/llvm-project/lldb/packages/Python/lldbsuite/test/commands/expression/multiline-completion -p TestMultilineCompletion.py Change dir to: /Users/buildslave/jenkins/workspace/lldb-cmake-sanitized/llvm-project/lldb/packages/Python/lldbsuite/test/commands/expression/multiline-completion runCmd: settings set symbols.enable-external-lookup false output:

Hide Details

runCmd: settings set plugin.process.gdb-remote.packet-timeout 60 output:

Hide Details

runCmd: settings set symbols.clang-modules-cache-path "/Users/buildslave/jenkins/workspace/lldb-cmake-sanitized/lldb-build/tools/lldb/lldb-test-build.noindex/module-cache-lldb" output:

Hide Details

runCmd: settings set use-color false output:

Hide Details

FAIL: LLDB (/Users/buildslave/jenkins/workspace/lldb-cmake-sanitized/host-compiler/bin/clang-10-x86_64) :: test_basic_completion (TestMultilineCompletion.MultilineCompletionTest) tearing down the child process....

Hide Details

CLEANUP ERROR: LLDB (/Users/buildslave/jenkins/workspace/lldb-cmake-sanitized/host-compiler/bin/clang-10-x86_64) :: test_basic_completion (TestMultilineCompletion.MultilineCompletionTest) Restore dir to: /Users/buildslave/jenkins/workspace/lldb-cmake-sanitized/lldb-build/tools/lldb/lit ====================================================================== ERROR: test_basic_completion (TestMultilineCompletion.MultilineCompletionTest) Test that we can complete a simple multiline expression ---------------------------------------------------------------------- Traceback (most recent call last): File "/Users/buildslave/jenkins/workspace/lldb-cmake-sanitized/llvm-project/lldb/packages/Python/lldbsuite/test/commands/expression/multiline-completion/TestMultilineCompletion.py", line 30, in test_basic_completion self.quit() File "/Users/buildslave/jenkins/workspace/lldb-cmake-sanitized/llvm-project/lldb/packages/Python/lldbsuite/test/lldbpexpect.py", line 61, in quit self.child.close(force=not gracefully) File "/Users/buildslave/jenkins/workspace/lldb-cmake-sanitized/llvm-project/lldb/third_party/Python/module/pexpect-4.6/pexpect/pty_spawn.py", line 327, in close self.ptyproc.close(force=force) File "/System/Library/Frameworks/Python.framework/Versions/2.7/lib/python2.7/contextlib.py", line 35, in __exit__ self.gen.throw(type, value, traceback) File "/Users/buildslave/jenkins/workspace/lldb-cmake-sanitized/llvm-project/lldb/third_party/Python/module/pexpect-4.6/pexpect/pty_spawn.py", line 25, in _wrap_ptyprocess_err raise ExceptionPexpect(*e.args) ExceptionPexpect: Could not terminate the child. Config=x86_64-/Users/buildslave/jenkins/workspace/lldb-cmake-sanitized/host-compiler/bin/clang-10 ---------------------------------------------------------------------- Ran 1 test in 7.649s

Hide Details

RESULT: FAILED (0 passes, 0 failures, 1 errors, 0 skipped, 0 expected failures, 0 unexpected successes)

Hide Details

******************** PASS: lldb-Unit :: Language/Highlighting/./HighlighterTests/HighlighterTest.ClangOperators (1355 of 1696) PASS: lldb-Unit :: UnwindAssembly/x86/./UnwindAssemblyx86Tests/Testx86AssemblyInspectionEngine.TestSpillRegToStackViaMOVx86_64 (1356 of 1696) PASS: lldb-Unit :: Utility/./UtilityTests/RangeTest.Slide (1357 of 1696) PASS: lldb-Unit :: Utility/./UtilityTests/StringListTest.GetSize (1358 of 1696) PASS: lldb-Suite :: lang/objc/objc-static-method/TestObjCStaticMethod.py (1359 of 1696) PASS: LLDB :: Minidump/dump-all.test (1360 of 1696) PASS: lldb-Unit :: Utility/./UtilityTests/ArgsTest.TestArgv (1361 of 1696) PASS: lldb-Unit :: Utility/./UtilityTests/StringExtractorTest.GetHexU8_Underflow (1362 of 1696) PASS: lldb-Unit :: Utility/./UtilityTests/RangeDataVector.FindEntryThatContains (1363 of 1696) PASS: lldb-Suite :: lang/cpp/namespace/TestNamespace.py (1364 of 1696) PASS: lldb-Unit :: Signals/./SignalsTests/UnixSignalsTest.GetFilteredSignals (1365 of 1696) PASS: lldb-Unit :: Utility/./UtilityTests/DeserializerTest.HasData (1366 of 1696) PASS: LLDB :: Modules/PECOFF/sections-names.yaml (1367 of 1696) PASS: lldb-Suite :: commands/expression/call-throws/TestCallThatThrows.py (1368 of 1696) PASS: lldb-Unit :: UnwindAssembly/x86/./UnwindAssemblyx86Tests/Testx86AssemblyInspectionEngine.TestSubRSP (1369 of 1696) PASS: lldb-Unit :: Utility/./UtilityTests/StringExtractorTest.GetHexU8_Exact (1370 of 1696) PASS: lldb-Suite :: functionalities/abbreviation/TestCommonShortSpellings.py (1371 of 1696) PASS: LLDB :: SymbolFile/NativePDB/ast-types.cpp (1372 of 1696) PASS: LLDB :: SymbolFile/DWARF/debug_ranges-missing-section.s (1373 of 1696) PASS: lldb-Unit :: Utility/./UtilityTests/StringExtractorTest.GetHexBytesAvail (1374 of 1696) PASS: lldb-Suite :: python_api/disassemble-raw-data/TestDisassembleRawData.py (1375 of 1696) PASS: lldb-Suite :: lang/objc/ptr_refs/TestPtrRefsObjC.py (1376 of 1696) PASS: lldb-Unit :: Core/./LLDBCoreTests/MangledTest.ResultForValidName (1377 of 1696) PASS: lldb-Unit :: Language/Highlighting/./HighlighterTests/HighlighterTest.ClangCursorOutOfBounds (1378 of 1696) UNSUPPORTED: LLDB :: Register/x86-zmm-read.test (1379 of 1696) PASS: lldb-Suite :: tools/lldb-server/thread-name/TestGdbRemoteThreadName.py (1380 of 1696) PASS: lldb-Unit :: Utility/./UtilityTests/StringListTest.Clear (1381 of 1696) PASS: lldb-Unit :: ScriptInterpreter/Python/./ScriptInterpreterPythonTests/PythonDataObjectsTest.TestPythonDictionaryManipulation (1382 of 1696) PASS: lldb-Unit :: Utility/./UtilityTests/StatusTest.Formatv (1383 of 1696) PASS: lldb-Unit :: Utility/./UtilityTests/StringListTest.AppendListCStringArray (1384 of 1696) PASS: LLDB :: SymbolFile/NativePDB/ast-methods.cpp (1385 of 1696) PASS: lldb-Unit :: Utility/./UtilityTests/StreamTest.PutPtr (1386 of 1696) PASS: lldb-Suite :: functionalities/data-formatter/data-formatter-stl/libcxx/multiset/TestDataFormatterLibcxxMultiSet.py (1387 of 1696) PASS: lldb-Unit :: Utility/./UtilityTests/BinaryStreamTest.PutSLEB128ThreeBytes (1388 of 1696) PASS: lldb-Suite :: lang/objc/rdar-11355592/TestRdar11355592.py (1389 of 1696) PASS: lldb-Unit :: Utility/./UtilityTests/ArgsTest.ReplaceArgumentAtIndexFarOutOfRange (1390 of 1696) PASS: lldb-Suite :: functionalities/data-formatter/frameformat_smallstruct/TestFrameFormatSmallStruct.py (1391 of 1696) PASS: lldb-Unit :: Utility/./UtilityTests/JSONTest.Dictionary (1392 of 1696) PASS: lldb-Unit :: Expression/./ExpressionTests/DiagnosticManagerTest.GetStringBasic (1393 of 1696) PASS: LLDB :: Modules/PECOFF/uuid.yaml (1394 of 1696) PASS: lldb-Unit :: ScriptInterpreter/Python/./ScriptInterpreterPythonTests/PythonDataObjectsTest.TestPythonCallableInvoke (1395 of 1696) PASS: lldb-Suite :: functionalities/unwind/sigtramp/TestSigtrampUnwind.py (1396 of 1696) PASS: lldb-Unit :: Utility/./UtilityTests/TimeoutTest.Format (1397 of 1696) PASS: LLDB :: SymbolFile/DWARF/debug-names-compressed.cpp (1398 of 1696) PASS: lldb-Suite :: functionalities/data-formatter/data-formatter-stl/libstdcpp/map/TestDataFormatterStdMap.py (1399 of 1696) PASS: lldb-Suite :: lang/objc/modules-cache/TestClangModulesCache.py (1400 of 1696) PASS: lldb-Suite :: functionalities/thread/concurrent_events/TestConcurrentSignalWatch.py (1401 of 1696) PASS: lldb-Unit :: Host/./HostTests/MainLoopTest.TerminatesImmediately (1402 of 1696) PASS: lldb-Unit :: Utility/./UtilityTests/StringExtractorTest.GetHexU8_Extra_NoEof (1403 of 1696) PASS: lldb-Unit :: Process/minidump/./LLDBMinidumpTests/MinidumpParserTest.GetLinuxProcStatus (1404 of 1696) PASS: lldb-Unit :: Host/./HostTests/FileSystemTest.MakeAbsolute (1405 of 1696) PASS: lldb-Suite :: commands/expression/no-deadlock/TestExprDoesntBlock.py (1406 of 1696) PASS: lldb-Unit :: Utility/./UtilityTests/AnsiTerminal.KnownPrefix (1407 of 1696) PASS: lldb-Suite :: commands/expression/timeout/TestCallWithTimeout.py (1408 of 1696) PASS: lldb-Unit :: Symbol/./SymbolTests/Type.CompilerContextPattern (1409 of 1696) PASS: lldb-Unit :: Utility/./UtilityTests/StreamTest.ShiftOperatorUInts (1410 of 1696) PASS: lldb-Suite :: functionalities/darwin_log/source/debug/TestDarwinLogSourceDebug.py (1411 of 1696) PASS: lldb-Unit :: UnwindAssembly/x86/./UnwindAssemblyx86Tests/Testx86AssemblyInspectionEngine.TestPopESI (1412 of 1696) PASS: lldb-Unit :: Language/Highlighting/./HighlighterTests/HighlighterTest.Colons (1413 of 1696) PASS: lldb-Suite :: commands/expression/namespace_local_var_same_name_cpp_and_c/TestNamespaceLocalVarSameNameCppAndC.py (1414 of 1696) PASS: lldb-Unit :: SymbolFile/NativePDB/./SymbolFileNativePDBTests/PDBFPOProgramToDWARFExpressionTests.InvalidAssignmentMultiple (1415 of 1696) PASS: lldb-Suite :: linux/add-symbols/TestTargetSymbolsAddCommand.py (1416 of 1696) PASS: lldb-Suite :: lang/objc/forward-decl/TestForwardDecl.py (1417 of 1696) PASS: lldb-Suite :: functionalities/postmortem/minidump-new/TestMiniDumpUUID.py (1418 of 1696) PASS: lldb-Unit :: Process/minidump/./LLDBMinidumpTests/MinidumpParserTest.GetMiscInfo_no_stream (1419 of 1696) PASS: lldb-Unit :: Utility/./UtilityTests/VMRange.CollectionContains (1420 of 1696) PASS: LLDB :: Modules/ELF/aarch64-relocations.yaml (1421 of 1696) PASS: lldb-Suite :: functionalities/tail_call_frames/disambiguate_paths_to_common_sink/TestDisambiguatePathsToCommonSink.py (1422 of 1696) PASS: lldb-Unit :: Utility/./UtilityTests/VMRange.SetEndAddress (1423 of 1696) PASS: lldb-Unit :: Utility/./UtilityTests/StreamTeeTest.Write (1424 of 1696) PASS: lldb-Suite :: commands/breakpoint/basic/TestRegexpBreakCommand.py (1425 of 1696) PASS: lldb-Unit :: Utility/./UtilityTests/ArgsTest.TestSingleArg (1426 of 1696) PASS: lldb-Unit :: Utility/./UtilityTests/RegularExpression.CopyAssignment (1427 of 1696) PASS: LLDB :: Driver/TestTarget.test (1428 of 1696) PASS: lldb-Unit :: ScriptInterpreter/Python/./ScriptInterpreterPythonTests/PythonDataObjectsTest.TestObjectAttributes (1429 of 1696) PASS: lldb-Suite :: python_api/event/TestEvents.py (1430 of 1696) PASS: lldb-Unit :: Utility/./UtilityTests/OptionsWithRawTest.QuotedSuffix (1431 of 1696) PASS: lldb-Suite :: commands/watchpoints/watchpoint_commands/command/TestWatchpointCommandLLDB.py (1432 of 1696) PASS: lldb-Suite :: functionalities/data-formatter/parray/TestPrintArray.py (1433 of 1696) PASS: lldb-Unit :: Utility/./UtilityTests/UUIDTest.SetFromStringRef (1434 of 1696) PASS: lldb-Unit :: Core/./LLDBCoreTests/StreamCallbackTest.Callback (1435 of 1696) PASS: lldb-Unit :: Utility/./UtilityTests/ArchSpecTest.Compatibility (1436 of 1696) PASS: LLDB :: SymbolFile/DWARF/find-basic-function.cpp (1437 of 1696) PASS: lldb-Suite :: lang/objc/self/TestObjCSelf.py (1438 of 1696) PASS: LLDB :: Driver/TestRepl.test (1439 of 1696) PASS: lldb-Suite :: benchmarks/startup/TestStartupDelays.py (1440 of 1696) PASS: lldb-Unit :: Utility/./UtilityTests/DataExtractorTest.GetBitfield (1441 of 1696) PASS: lldb-Unit :: Utility/./UtilityTests/RangeTest.EqualInvalid (1442 of 1696) PASS: lldb-Suite :: lang/cpp/call-function/TestCallCPPFunction.py (1443 of 1696) PASS: LLDB :: Modules/MachO/lc_build_version.yaml (1444 of 1696) PASS: lldb-Suite :: lang/cpp/incomplete-types/TestCppIncompleteTypes.py (1445 of 1696) PASS: lldb-Suite :: commands/reproducer/invalid-args/TestInvalidArgsReproducer.py (1446 of 1696) PASS: lldb-Suite :: functionalities/inferior-crashing/TestInferiorCrashingStep.py (1447 of 1696) PASS: lldb-Suite :: lang/objc/blocks/TestObjCIvarsInBlocks.py (1448 of 1696) PASS: lldb-Suite :: functionalities/data-formatter/data-formatter-named-summaries/TestDataFormatterNamedSummaries.py (1449 of 1696) PASS: lldb-Unit :: Utility/./UtilityTests/StreamTest.ChangingByteOrder (1450 of 1696) PASS: lldb-Suite :: commands/gui/invalid-args/TestInvalidArgsGui.py (1451 of 1696) PASS: LLDB :: Settings/TestEchoCommands.test (1452 of 1696) PASS: lldb-Unit :: Utility/./UtilityTests/RangeTest.Clear (1453 of 1696) PASS: lldb-Suite :: functionalities/data-formatter/type_summary_list_script/TestTypeSummaryListScript.py (1454 of 1696) PASS: lldb-Unit :: Utility/./UtilityTests/ReproducerTest.SetCapture (1455 of 1696) PASS: lldb-Unit :: Interpreter/./InterpreterTests/CompletionTest.DirCompletionAbsolute (1456 of 1696) PASS: lldb-Suite :: commands/expression/invalid-args/TestInvalidArgsExpression.py (1457 of 1696) PASS: LLDB :: Python/crashlog.test (1458 of 1696) UNSUPPORTED: LLDB :: SymbolFile/PDB/vbases.test (1459 of 1696) PASS: lldb-Suite :: commands/register/register/intel_xtended_registers/TestMPXRegisters.py (1460 of 1696) PASS: lldb-Unit :: Target/./TargetTests/PathMappingListTest.AbsoluteTests (1461 of 1696) PASS: lldb-Suite :: functionalities/darwin_log/filter/exact_match/activity/TestDarwinLogFilterMatchActivity.py (1462 of 1696) PASS: lldb-Unit :: SymbolFile/NativePDB/./SymbolFileNativePDBTests/PDBFPOProgramToDWARFExpressionTests.SingleAssignmentRegisterRef (1463 of 1696) PASS: lldb-Suite :: python_api/thread/TestThreadAPI.py (1464 of 1696) PASS: lldb-Unit :: Utility/./UtilityTests/Predicate.WaitForValueNotEqualTo (1465 of 1696) PASS: lldb-Unit :: Utility/./UtilityTests/CompletionRequest.Constructor (1466 of 1696) PASS: lldb-Unit :: Signals/./SignalsTests/UnixSignalsTest.GetInfo (1467 of 1696) PASS: lldb-Unit :: Utility/./UtilityTests/TimerTest.CategoryTimesNested (1468 of 1696) PASS: lldb-Suite :: functionalities/darwin_log/filter/exact_match/subsystem/TestDarwinLogFilterMatchSubsystem.py (1469 of 1696) PASS: lldb-Suite :: functionalities/thread/concurrent_events/TestConcurrentCrashWithWatchpoint.py (1470 of 1696) PASS: lldb-Unit :: SymbolFile/DWARF/./SymbolFileDWARFTests/SymbolFileDWARFTests.TestAbbrevOrder1Start5 (1471 of 1696) PASS: lldb-Unit :: Utility/./UtilityTests/StringExtractorTest.GetU64BigEndian (1472 of 1696) PASS: lldb-Unit :: Symbol/./SymbolTests/TestClangASTContext.TestGetBasicTypeFromName (1473 of 1696) PASS: lldb-Suite :: functionalities/ptr_refs/TestPtrRefs.py (1474 of 1696) PASS: lldb-Unit :: UnwindAssembly/x86/./UnwindAssemblyx86Tests/Testx86AssemblyInspectionEngine.Testi386IgnoredRegisters (1475 of 1696) PASS: lldb-Unit :: Utility/./UtilityTests/StringExtractorTest.GetHexBytes_OddPair2 (1476 of 1696) PASS: LLDB :: Settings/TestStopCommandSourceOnError.test (1477 of 1696) PASS: LLDB :: SymbolFile/DWARF/deterministic-build.cpp (1478 of 1696) PASS: lldb-Unit :: Utility/./UtilityTests/StreamTest.ShiftOperatorPtr (1479 of 1696) PASS: lldb-Suite :: commands/watchpoints/hello_watchpoint/TestMyFirstWatchpoint.py (1480 of 1696) PASS: LLDB :: SymbolFile/DWARF/find-function-regex.cpp (1481 of 1696) PASS: lldb-Suite :: functionalities/darwin_log/basic/TestDarwinLogBasic.py (1482 of 1696) PASS: LLDB :: SymbolFile/DWARF/dir-separator-windows.s (1483 of 1696) PASS: lldb-Unit :: Utility/./UtilityTests/StringLexerTest.GetUnlexed (1484 of 1696) PASS: lldb-Unit :: Host/./HostTests/NativeProcessProtocolTest.ReadMemoryWithoutTrap (1485 of 1696) PASS: lldb-Suite :: functionalities/thread/concurrent_events/TestConcurrentManyBreakpoints.py (1486 of 1696) PASS: lldb-Unit :: Utility/./UtilityTests/StringListTest.GetMaxStringLengthEqualSize (1487 of 1696) PASS: LLDB :: Register/x86-64-read.test (1488 of 1696) PASS: lldb-Unit :: Utility/./UtilityTests/NameMatchesTest.StartsWith (1489 of 1696) PASS: lldb-Unit :: Utility/./UtilityTests/OptionsWithRawTest.MultiWordSuffix (1490 of 1696) PASS: LLDB :: Modules/ELF/PT_LOAD-overlap-PT_INTERP.yaml (1491 of 1696) PASS: lldb-Unit :: Expression/./ExpressionTests/DiagnosticManagerTest.GetStringMultipleDiags (1492 of 1696) PASS: lldb-Unit :: Host/./HostTests/NativeProcessProtocolTest.SetBreakpointFailRead (1493 of 1696) PASS: lldb-Unit :: Utility/./UtilityTests/SerializationRountripTest.SerializeDeserializePod (1494 of 1696) PASS: lldb-Unit :: Utility/./UtilityTests/UUIDTest.Validity (1495 of 1696) PASS: lldb-Unit :: Language/CPlusPlus/./LanguageCPlusPlusTests/CPlusPlusLanguage.MethodNameParsing (1496 of 1696) PASS: LLDB :: SymbolFile/DWARF/debug_loc.s (1497 of 1696) PASS: lldb-Unit :: Utility/./UtilityTests/LogChannelTest.List (1498 of 1696) PASS: lldb-Unit :: Utility/./UtilityTests/CleanUpTest.disable (1499 of 1696) PASS: lldb-Suite :: driver/batch_mode/TestBatchMode.py (1500 of 1696) PASS: lldb-Suite :: lang/cpp/diamond/TestDiamond.py (1501 of 1696) PASS: lldb-Suite :: tools/lldb-server/register-reading/TestGdbRemoteGPacket.py (1502 of 1696) PASS: lldb-Suite :: python_api/process/TestProcessAPI.py (1503 of 1696) PASS: LLDB :: SymbolFile/NativePDB/break-by-line.cpp (1504 of 1696) PASS: lldb-Unit :: Utility/./UtilityTests/StringLexerTest.AdvanceIf (1505 of 1696) PASS: LLDB :: BuildScript/script-args.test (1506 of 1696) PASS: LLDB :: SymbolFile/DWARF/split-dwarf-inlining.cpp (1507 of 1696) PASS: lldb-Suite :: functionalities/thread/concurrent_events/TestConcurrentManySignals.py (1508 of 1696) PASS: lldb-Unit :: Utility/./UtilityTests/RecordReplayTest.InstrumentedFooSameThis (1509 of 1696) PASS: lldb-Suite :: functionalities/data-formatter/data-formatter-stl/libstdcpp/smart_ptr/TestDataFormatterStdSmartPtr.py (1510 of 1696) PASS: lldb-Unit :: Utility/./UtilityTests/FileSpecTest.IsRelative (1511 of 1696) PASS: LLDB :: SymbolFile/DWARF/find-basic-namespace.cpp (1512 of 1696) PASS: lldb-Suite :: lang/objc/foundation/TestObjCMethods.py (1513 of 1696) PASS: lldb-Unit :: SymbolFile/DWARF/./SymbolFileDWARFTests/SymbolFileDWARFTests.TestAbbrevNullAttrValidForm (1514 of 1696) PASS: LLDB :: SymbolFile/NativePDB/global-classes.cpp (1515 of 1696) PASS: lldb-Unit :: Utility/./UtilityTests/DataExtractorTest.GetMaxU64_unchecked (1516 of 1696) PASS: lldb-Unit :: ScriptInterpreter/Python/./ScriptInterpreterPythonTests/PythonDataObjectsTest.TestPythonStringToStr (1517 of 1696) PASS: LLDB :: Commands/CommandScriptImmediateOutput/CommandScriptImmediateOutputFile.test (1518 of 1696) PASS: lldb-Unit :: Utility/./UtilityTests/VASprintfTest.EncodingError (1519 of 1696) PASS: lldb-Unit :: ScriptInterpreter/Python/./ScriptInterpreterPythonTests/PythonDataObjectsTest.TestPythonTupleInitializerList2 (1520 of 1696) PASS: lldb-Suite :: lang/cpp/virtual/TestVirtual.py (1521 of 1696) PASS: lldb-Suite :: macosx/queues/TestQueues.py (1522 of 1696) PASS: lldb-Unit :: Utility/./UtilityTests/StringListTest.GetMaxStringLengthDecreasingSize (1523 of 1696) PASS: lldb-Suite :: lang/cpp/dynamic-value/TestDynamicValue.py (1524 of 1696) PASS: lldb-Suite :: iohandler/completion/TestIOHandlerCompletion.py (1525 of 1696) PASS: lldb-Suite :: types/TestRecursiveTypes.py (1526 of 1696) PASS: lldb-Unit :: SymbolFile/DWARF/./SymbolFileDWARFTests/SymbolFileDWARFTests.TestAbbrevOrder1Start1 (1527 of 1696) PASS: lldb-Unit :: Utility/./UtilityTests/FileSpecTest.EqualDotsWindows (1528 of 1696) PASS: lldb-Suite :: commands/expression/completion-crash1/TestCompletionCrash1.py (1529 of 1696) PASS: lldb-Suite :: macosx/add-dsym/TestAddDsymMidExecutionCommand.py (1530 of 1696) PASS: lldb-Unit :: Utility/./UtilityTests/StructuredDataTest.ParseJSONFromFile (1531 of 1696) PASS: lldb-Suite :: lang/cpp/stl/TestSTL.py (1532 of 1696) PASS: lldb-Suite :: lang/cpp/member-and-local-vars-with-same-name/TestMembersAndLocalsWithSameName.py (1533 of 1696) PASS: lldb-Suite :: lang/objc/objc-dynamic-value/TestObjCDynamicValue.py (1534 of 1696) PASS: lldb-Suite :: lang/objc/foundation/TestRuntimeTypes.py (1535 of 1696) PASS: lldb-Suite :: functionalities/data-formatter/data-formatter-objc/nsindexpath/TestDataFormatterNSIndexPath.py (1536 of 1696) UNSUPPORTED: LLDB :: Register/x86-64-ymm16-write.test (1537 of 1696) PASS: lldb-Unit :: Utility/./UtilityTests/StringExtractorTest.GetNameColonValueNoColon (1538 of 1696) PASS: LLDB :: Modules/ELF/section-addresses.yaml (1539 of 1696) PASS: lldb-Unit :: UnwindAssembly/x86/./UnwindAssemblyx86Tests/Testx86AssemblyInspectionEngine.TestAddRSP (1540 of 1696) PASS: lldb-Unit :: Utility/./UtilityTests/StringListTest.DefaultConstructor (1541 of 1696) PASS: LLDB :: Reproducer/Modules/TestModuleCXX.test (1542 of 1696) PASS: lldb-Unit :: Utility/./UtilityTests/ArgsTest.ReplaceArgumentAtIndexLonger (1543 of 1696) PASS: LLDB :: SymbolFile/DWARF/dir-separator-no-comp-dir.s (1544 of 1696) PASS: LLDB :: Breakpoint/implicit_const_form_support.test (1545 of 1696) PASS: LLDB :: BuildScript/compiler-full-path.test (1546 of 1696) UNSUPPORTED: LLDB :: Register/x86-zmm-write.test (1547 of 1696) FAIL: lldb-Suite :: functionalities/gdb_remote_client/TestThreadSelectionBug.py (1548 of 1696) ******************** TEST 'lldb-Suite :: functionalities/gdb_remote_client/TestThreadSelectionBug.py' FAILED ******************** lldb version 10.0.99 (http://labmaster3.local/git/llvm-project.git revision fcef13344db8883d2ba5adfca1499b605a136c5b) clang revision fcef13344db8883d2ba5adfca1499b605a136c5b llvm revision fcef13344db8883d2ba5adfca1499b605a136c5b LLDB library dir: /Users/buildslave/jenkins/workspace/lldb-cmake-sanitized/lldb-build/bin LLDB import library dir: /Users/buildslave/jenkins/workspace/lldb-cmake-sanitized/lldb-build/bin libstdcxx tests will not be run because: Don't know how to build with libstdcxx on macosx Skipping following debug info categories: ['dwo']

Hide Details

Session logs for test failures/errors/unexpected successes will go into directory '/Users/buildslave/jenkins/workspace/lldb-cmake-sanitized/test/logs' Command invoked: /Users/buildslave/jenkins/workspace/lldb-cmake-sanitized/llvm-project/lldb/test/dotest.py --arch=x86_64 -s /Users/buildslave/jenkins/workspace/lldb-cmake-sanitized/lldb-build/lldb-test-traces -S nm -u CXXFLAGS -u CFLAGS --executable /Users/buildslave/jenkins/workspace/lldb-cmake-sanitized/lldb-build/./bin/lldb --dsymutil /Users/buildslave/jenkins/workspace/lldb-cmake-sanitized/lldb-build/./bin/dsymutil --filecheck /Users/buildslave/jenkins/workspace/lldb-cmake-sanitized/lldb-build/./bin/FileCheck -C /Users/buildslave/jenkins/workspace/lldb-cmake-sanitized/host-compiler/bin/clang --codesign-identity lldb_codesign --server /Users/buildslave/jenkins/workspace/lldb-cmake-sanitized/lldb-build/./bin/debugserver --arch x86_64 --build-dir /Users/buildslave/jenkins/workspace/lldb-cmake-sanitized/lldb-build/lldb-test-build.noindex -s=/Users/buildslave/jenkins/workspace/lldb-cmake-sanitized/test/logs -t --env TERM=vt100 --env LLVM_LIBS_DIR=/Users/buildslave/jenkins/workspace/lldb-cmake-sanitized/lldb-build/./lib --build-dir /Users/buildslave/jenkins/workspace/lldb-cmake-sanitized/lldb-build/tools/lldb/lldb-test-build.noindex --module-cache-dir /Users/buildslave/jenkins/workspace/lldb-cmake-sanitized/lldb-build/tools/lldb/lldb-test-build.noindex/module-cache-lldb /Users/buildslave/jenkins/workspace/lldb-cmake-sanitized/llvm-project/lldb/packages/Python/lldbsuite/test/functionalities/gdb_remote_client -p TestThreadSelectionBug.py Change dir to: /Users/buildslave/jenkins/workspace/lldb-cmake-sanitized/llvm-project/lldb/packages/Python/lldbsuite/test/functionalities/gdb_remote_client runCmd: settings set symbols.enable-external-lookup false output:

Hide Details

runCmd: settings set plugin.process.gdb-remote.packet-timeout 60 output:

Hide Details

runCmd: settings set symbols.clang-modules-cache-path "/Users/buildslave/jenkins/workspace/lldb-cmake-sanitized/lldb-build/tools/lldb/lldb-test-build.noindex/module-cache-lldb" output:

Hide Details

runCmd: settings set use-color false output:

Hide Details

FAIL: LLDB (/Users/buildslave/jenkins/workspace/lldb-cmake-sanitized/host-compiler/bin/clang-10-x86_64) :: test (TestThreadSelectionBug.TestThreadSelectionBug) <bound method SBProcess.Kill of <lldb.SBProcess; proxy of <Swig Object of type 'lldb::SBProcess *' at 0x10817a900> >>: success

Hide Details

Restore dir to: /Users/buildslave/jenkins/workspace/lldb-cmake-sanitized/lldb-build/tools/lldb/lit ====================================================================== FAIL: test (TestThreadSelectionBug.TestThreadSelectionBug) ---------------------------------------------------------------------- Traceback (most recent call last): File "/Users/buildslave/jenkins/workspace/lldb-cmake-sanitized/llvm-project/lldb/packages/Python/lldbsuite/test/functionalities/gdb_remote_client/TestThreadSelectionBug.py", line 17, in test process = self.connect(target) File "/Users/buildslave/jenkins/workspace/lldb-cmake-sanitized/llvm-project/lldb/packages/Python/lldbsuite/test/functionalities/gdb_remote_client/gdbclientutils.py", line 479, in connect self.assertTrue(error.Success(), error.description) AssertionError: False is not True : failed to get reply to handshake packet Config=x86_64-/Users/buildslave/jenkins/workspace/lldb-cmake-sanitized/host-compiler/bin/clang-10 ---------------------------------------------------------------------- Ran 1 test in 63.743s

Hide Details

RESULT: FAILED (0 passes, 1 failures, 0 errors, 0 skipped, 0 expected failures, 0 unexpected successes)

Hide Details

******************** PASS: lldb-Unit :: UnwindAssembly/x86/./UnwindAssemblyx86Tests/Testx86AssemblyInspectionEngine.TestCALLNextInsn (1549 of 1696) PASS: lldb-Unit :: Process/gdb-remote/./ProcessGdbRemoteTests/GDBRemoteCommunicationServerTest.SendErrorResponse_StringError (1550 of 1696) UNSUPPORTED: LLDB :: SymbolFile/PDB/calling-conventions.test (1551 of 1696) PASS: lldb-Suite :: lang/cpp/trivial_abi/TestTrivialABI.py (1552 of 1696) PASS: lldb-Suite :: functionalities/thread/concurrent_events/TestConcurrentTwoWatchpointThreads.py (1553 of 1696) PASS: lldb-Suite :: functionalities/thread/concurrent_events/TestConcurrentBreakpointDelayBreakpointOneSignal.py (1554 of 1696) PASS: lldb-Unit :: Utility/./UtilityTests/StringExtractorTest.GetHexBytesAvail_Underflow (1555 of 1696) PASS: lldb-Unit :: ScriptInterpreter/Python/./ScriptInterpreterPythonTests/PythonDataObjectsTest.TestPythonDictionaryToStructuredDictionary (1556 of 1696) PASS: lldb-Unit :: Utility/./UtilityTests/UriParserTest.BracketedHostnamePort (1557 of 1696) PASS: lldb-Suite :: functionalities/darwin_log/filter/regex/activity/TestDarwinLogFilterRegexActivity.py (1558 of 1696) PASS: lldb-Suite :: functionalities/data-formatter/data-formatter-stl/libstdcpp/iterator/TestDataFormatterStdIterator.py (1559 of 1696) PASS: lldb-Suite :: commands/watchpoints/variable_out_of_scope/TestWatchedVarHitWhenInScope.py (1560 of 1696) PASS: lldb-Unit :: ScriptInterpreter/Python/./ScriptInterpreterPythonTests/PythonExceptionStateTest.TestManualRestoreSemantics (1561 of 1696) PASS: LLDB :: Quit/TestQuitExitCodeNonInt.test (1562 of 1696) PASS: lldb-Suite :: commands/expression/completion-in-lambda-and-unnnamed-class/TestCompletionInLambdaAndUnnamedClass.py (1563 of 1696) PASS: LLDB :: Modules/MachO/subsections.yaml (1564 of 1696) PASS: LLDB :: Breakpoint/case-sensitive.test (1565 of 1696) PASS: lldb-Suite :: functionalities/memory/find/TestMemoryFind.py (1566 of 1696) PASS: lldb-Suite :: functionalities/float-display/TestFloatDisplay.py (1567 of 1696) PASS: lldb-Suite :: commands/expression/namespace_local_var_same_name_obj_c/TestNamespaceLocalVarSameNameObjC.py (1568 of 1696) PASS: lldb-Suite :: commands/expression/calculator_mode/TestCalculatorMode.py (1569 of 1696) PASS: lldb-Unit :: Utility/./UtilityTests/BinaryStreamTest.PutULEB128FiveBytes (1570 of 1696) PASS: lldb-Unit :: Host/./HostTests/SocketTest.DomainListenConnectAccept (1571 of 1696) PASS: lldb-Suite :: linux/thread/create_during_instruction_step/TestCreateDuringInstructionStep.py (1572 of 1696) PASS: lldb-Unit :: Process/minidump/./LLDBMinidumpTests/RegisterContextMinidump.ConvertMinidumpContext_x86_32 (1573 of 1696) PASS: lldb-Suite :: functionalities/thread/exit_during_break/TestExitDuringBreak.py (1574 of 1696) XFAIL: LLDB :: Register/x86-64-write.test (1575 of 1696) PASS: lldb-Unit :: UnwindAssembly/x86/./UnwindAssemblyx86Tests/Testx86AssemblyInspectionEngine.TestPopRBPWithREX (1576 of 1696) PASS: lldb-Suite :: commands/expression/context-object/TestContextObject.py (1577 of 1696) PASS: lldb-Suite :: lang/objc/unicode-string/TestUnicodeString.py (1578 of 1696) PASS: LLDB :: Commands/command-backtrace.test (1579 of 1696) PASS: lldb-Unit :: Utility/./UtilityTests/ArchSpecTest.TestParseMachCPUDashSubtypeTripleSimple (1580 of 1696) PASS: lldb-Suite :: commands/expression/test/TestExprs.py (1581 of 1696) PASS: lldb-Suite :: functionalities/avoids-fd-leak/TestFdLeak.py (1582 of 1696) FAIL: lldb-Suite :: functionalities/gdb_remote_client/TestGDBRemoteClient.py (1583 of 1696) ******************** TEST 'lldb-Suite :: functionalities/gdb_remote_client/TestGDBRemoteClient.py' FAILED ******************** lldb version 10.0.99 (http://labmaster3.local/git/llvm-project.git revision fcef13344db8883d2ba5adfca1499b605a136c5b) clang revision fcef13344db8883d2ba5adfca1499b605a136c5b llvm revision fcef13344db8883d2ba5adfca1499b605a136c5b LLDB library dir: /Users/buildslave/jenkins/workspace/lldb-cmake-sanitized/lldb-build/bin LLDB import library dir: /Users/buildslave/jenkins/workspace/lldb-cmake-sanitized/lldb-build/bin libstdcxx tests will not be run because: Don't know how to build with libstdcxx on macosx Skipping following debug info categories: ['dwo']

Hide Details

Session logs for test failures/errors/unexpected successes will go into directory '/Users/buildslave/jenkins/workspace/lldb-cmake-sanitized/test/logs' Command invoked: /Users/buildslave/jenkins/workspace/lldb-cmake-sanitized/llvm-project/lldb/test/dotest.py --arch=x86_64 -s /Users/buildslave/jenkins/workspace/lldb-cmake-sanitized/lldb-build/lldb-test-traces -S nm -u CXXFLAGS -u CFLAGS --executable /Users/buildslave/jenkins/workspace/lldb-cmake-sanitized/lldb-build/./bin/lldb --dsymutil /Users/buildslave/jenkins/workspace/lldb-cmake-sanitized/lldb-build/./bin/dsymutil --filecheck /Users/buildslave/jenkins/workspace/lldb-cmake-sanitized/lldb-build/./bin/FileCheck -C /Users/buildslave/jenkins/workspace/lldb-cmake-sanitized/host-compiler/bin/clang --codesign-identity lldb_codesign --server /Users/buildslave/jenkins/workspace/lldb-cmake-sanitized/lldb-build/./bin/debugserver --arch x86_64 --build-dir /Users/buildslave/jenkins/workspace/lldb-cmake-sanitized/lldb-build/lldb-test-build.noindex -s=/Users/buildslave/jenkins/workspace/lldb-cmake-sanitized/test/logs -t --env TERM=vt100 --env LLVM_LIBS_DIR=/Users/buildslave/jenkins/workspace/lldb-cmake-sanitized/lldb-build/./lib --build-dir /Users/buildslave/jenkins/workspace/lldb-cmake-sanitized/lldb-build/tools/lldb/lldb-test-build.noindex --module-cache-dir /Users/buildslave/jenkins/workspace/lldb-cmake-sanitized/lldb-build/tools/lldb/lldb-test-build.noindex/module-cache-lldb /Users/buildslave/jenkins/workspace/lldb-cmake-sanitized/llvm-project/lldb/packages/Python/lldbsuite/test/functionalities/gdb_remote_client -p TestGDBRemoteClient.py Change dir to: /Users/buildslave/jenkins/workspace/lldb-cmake-sanitized/llvm-project/lldb/packages/Python/lldbsuite/test/functionalities/gdb_remote_client runCmd: settings set symbols.enable-external-lookup false output:

Hide Details

runCmd: settings set plugin.process.gdb-remote.packet-timeout 60 output:

Hide Details

runCmd: settings set symbols.clang-modules-cache-path "/Users/buildslave/jenkins/workspace/lldb-cmake-sanitized/lldb-build/tools/lldb/lldb-test-build.noindex/module-cache-lldb" output:

Hide Details

runCmd: settings set use-color false output:

Hide Details

<bound method SBProcess.Kill of <lldb.SBProcess; proxy of <Swig Object of type 'lldb::SBProcess *' at 0x11c785ba0> >>: success

Hide Details

PASS: LLDB (/Users/buildslave/jenkins/workspace/lldb-cmake-sanitized/host-compiler/bin/clang-10-x86_64) :: test_attach_fail (TestGDBRemoteClient.TestGDBRemoteClient) runCmd: settings set symbols.enable-external-lookup false output:

Hide Details

runCmd: settings set plugin.process.gdb-remote.packet-timeout 60 output:

Hide Details

runCmd: settings set symbols.clang-modules-cache-path "/Users/buildslave/jenkins/workspace/lldb-cmake-sanitized/lldb-build/tools/lldb/lldb-test-build.noindex/module-cache-lldb" output:

Hide Details

runCmd: settings set use-color false output:

Hide Details

FAIL: LLDB (/Users/buildslave/jenkins/workspace/lldb-cmake-sanitized/host-compiler/bin/clang-10-x86_64) :: test_connect (TestGDBRemoteClient.TestGDBRemoteClient) <bound method SBProcess.Kill of <lldb.SBProcess; proxy of <Swig Object of type 'lldb::SBProcess *' at 0x11c785900> >>: success

Hide Details

Restore dir to: /Users/buildslave/jenkins/workspace/lldb-cmake-sanitized/lldb-build/tools/lldb/lit ====================================================================== FAIL: test_connect (TestGDBRemoteClient.TestGDBRemoteClient) Test connecting to a remote gdb server ---------------------------------------------------------------------- Traceback (most recent call last): File "/Users/buildslave/jenkins/workspace/lldb-cmake-sanitized/llvm-project/lldb/packages/Python/lldbsuite/test/functionalities/gdb_remote_client/TestGDBRemoteClient.py", line 13, in test_connect process = self.connect(target) File "/Users/buildslave/jenkins/workspace/lldb-cmake-sanitized/llvm-project/lldb/packages/Python/lldbsuite/test/functionalities/gdb_remote_client/gdbclientutils.py", line 479, in connect self.assertTrue(error.Success(), error.description) AssertionError: False is not True : failed to get reply to handshake packet Config=x86_64-/Users/buildslave/jenkins/workspace/lldb-cmake-sanitized/host-compiler/bin/clang-10 ---------------------------------------------------------------------- Ran 2 tests in 63.364s

Hide Details

RESULT: FAILED (1 passes, 1 failures, 0 errors, 0 skipped, 0 expected failures, 0 unexpected successes)

Hide Details

******************** PASS: lldb-Unit :: Language/Highlighting/./HighlighterTests/HighlighterTest.ClangScalarLiterals (1584 of 1696) PASS: lldb-Suite :: functionalities/data-formatter/poarray/TestPrintObjectArray.py (1585 of 1696) PASS: lldb-Unit :: Utility/./UtilityTests/JSONTest.Newlines (1586 of 1696) PASS: lldb-Unit :: Utility/./UtilityTests/StringExtractorTest.GetHexU8_InvalidHex_NoEof (1587 of 1696) PASS: lldb-Unit :: Utility/./UtilityTests/StringListTest.SplitIntoLines (1588 of 1696) PASS: lldb-Unit :: ScriptInterpreter/Python/./ScriptInterpreterPythonTests/PythonDataObjectsTest.TestTypeNameResolutionNoDot (1589 of 1696) PASS: lldb-Unit :: ScriptInterpreter/Python/./ScriptInterpreterPythonTests/PythonDataObjectsTest.TestDictionaryResolutionWithDot (1590 of 1696) PASS: lldb-Unit :: Utility/./UtilityTests/UserIDResolver.GetGroupName (1591 of 1696) PASS: lldb-Suite :: commands/frame/diagnose/bad-reference/TestBadReference.py (1592 of 1696) UNSUPPORTED: LLDB :: SymbolFile/PDB/compilands.test (1593 of 1696) PASS: lldb-Unit :: Host/./HostTests/MainLoopTest.DetectsEOF (1594 of 1696) PASS: lldb-Unit :: Editline/./EditlineTests/EditlineTestFixture.EditlineReceivesMultiLineText (1595 of 1696) PASS: lldb-Suite :: functionalities/signal/handle-segv/TestHandleSegv.py (1596 of 1696) PASS: LLDB :: SymbolFile/DWARF/dir-separator-posix.s (1597 of 1696) PASS: lldb-Unit :: Interpreter/./InterpreterTests/OptionArgParserTest.toBoolean (1598 of 1696) PASS: LLDB :: SymbolFile/DWARF/debug-line-basic.s (1599 of 1696) PASS: lldb-Suite :: lang/cpp/frame-var-anon-unions/TestFrameVariableAnonymousUnions.py (1600 of 1696) PASS: LLDB :: Modules/ELF/section-types-edgecases.yaml (1601 of 1696) PASS: lldb-Unit :: Utility/./UtilityTests/StringListTest.Assignment (1602 of 1696) PASS: lldb-Unit :: ObjectFile/ELF/./ObjectFileELFTests/ObjectFileELFTest.GetModuleSpecifications_EarlySectionHeaders (1603 of 1696) PASS: lldb-Unit :: Utility/./UtilityTests/StreamTest.PutHex64ByteOrderLittle (1604 of 1696) PASS: lldb-Suite :: lang/objc/single-entry-dictionary/TestObjCSingleEntryDictionary.py (1605 of 1696) PASS: lldb-Suite :: functionalities/thread/step_out/TestThreadStepOut.py (1606 of 1696) PASS: lldb-Suite :: functionalities/data-formatter/format-propagation/TestFormatPropagation.py (1607 of 1696) PASS: lldb-Suite :: lang/cpp/static_members/TestCPPStaticMembers.py (1608 of 1696) PASS: lldb-Suite :: macosx/thread-names/TestInterruptThreadNames.py (1609 of 1696) PASS: lldb-Suite :: benchmarks/continue/TestBenchmarkContinue.py (1610 of 1696) PASS: lldb-Suite :: macosx/duplicate-archive-members/TestDuplicateMembers.py (1611 of 1696) PASS: LLDB :: SymbolFile/DWARF/debug_ranges_and_rnglists.test (1612 of 1696) PASS: lldb-Unit :: Utility/./UtilityTests/LogChannelEnabledTest.log_options (1613 of 1696) PASS: lldb-Suite :: lang/cpp/rvalue-references/TestRvalueReferences.py (1614 of 1696) PASS: lldb-Suite :: lang/mixed/TestMixedLanguages.py (1615 of 1696) PASS: lldb-Unit :: SymbolFile/DWARF/./SymbolFileDWARFTests/DWARFASTParserClangTests.TestGetDIEForDeclContextReturnsOnlyMatchingEntries (1616 of 1696) PASS: lldb-Unit :: Utility/./UtilityTests/ArchSpecTest.OperatorBool (1617 of 1696) UNSUPPORTED: LLDB :: Expr/TestIRMemoryMapWindows.test (1618 of 1696) PASS: lldb-Unit :: Utility/./UtilityTests/StringListTest.SplitIntoLinesEmpty (1619 of 1696) PASS: lldb-Unit :: Utility/./UtilityTests/VMRange.Comparison (1620 of 1696) PASS: lldb-Unit :: Utility/./UtilityTests/StringExtractorTest.GetHexBytes_Partial (1621 of 1696) PASS: lldb-Unit :: Process/minidump/./LLDBMinidumpTests/MinidumpParserTest.GetThreadContext_x86_32_wow64 (1622 of 1696) PASS: lldb-Unit :: Utility/./UtilityTests/StringLexerTest.PutBack (1623 of 1696) PASS: lldb-Unit :: Utility/./UtilityTests/NameMatchesTest.RegularExpression (1624 of 1696) PASS: lldb-Suite :: python_api/function_symbol/TestDisasmAPI.py (1625 of 1696) PASS: lldb-Suite :: lang/c/tls_globals/TestTlsGlobals.py (1626 of 1696) PASS: lldb-Unit :: Process/gdb-remote/./ProcessGdbRemoteTests/GDBRemoteClientBaseTest.SendContinueAndInterrupt2PacketBug (1627 of 1696) PASS: LLDB :: Reproducer/TestFileRepro.test (1628 of 1696) PASS: lldb-Suite :: functionalities/tail_call_frames/thread_step_out_message/TestArtificialFrameStepOutMessage.py (1629 of 1696) PASS: lldb-Suite :: commands/watchpoints/watchpoint_on_vectors/TestValueOfVectorVariable.py (1630 of 1696) PASS: lldb-Suite :: python_api/watchpoint/TestWatchpointIter.py (1631 of 1696) PASS: lldb-Suite :: sample_test/TestSampleInlineTest.py (1632 of 1696) PASS: lldb-Suite :: lang/c/stepping/TestThreadStepping.py (1633 of 1696) PASS: lldb-Unit :: Utility/./UtilityTests/StreamTeeTest.CopyConstructor (1634 of 1696) PASS: lldb-Suite :: lang/cpp/unicode-literals/TestUnicodeLiterals.py (1635 of 1696) PASS: lldb-Unit :: Utility/./UtilityTests/StreamTest.PutHex16ByteOrderLittle (1636 of 1696) PASS: lldb-Unit :: Target/./TargetTests/ModuleCacheTest.GetAndPut (1637 of 1696) PASS: LLDB :: SymbolFile/DWARF/debug-types-dwo-cross-reference.cpp (1638 of 1696) PASS: lldb-Suite :: lang/objc/foundation/TestSymbolTable.py (1639 of 1696) PASS: lldb-Suite :: commands/help/TestHelp.py (1640 of 1696) PASS: lldb-Unit :: Utility/./UtilityTests/UriParserTest.MinimalPort (1641 of 1696) PASS: lldb-Unit :: Utility/./UtilityTests/StreamTest.PutCharNull (1642 of 1696) PASS: lldb-Unit :: UnwindAssembly/x86/./UnwindAssemblyx86Tests/Testx86AssemblyInspectionEngine.TestDisassemblyMidFunctionEpilogues (1643 of 1696) PASS: lldb-Suite :: python_api/process/read-mem-cstring/TestReadMemCString.py (1644 of 1696) PASS: lldb-Suite :: functionalities/rerun/TestRerun.py (1645 of 1696) PASS: lldb-Suite :: commands/expression/argument_passing_restrictions/TestArgumentPassingRestrictions.py (1646 of 1696) PASS: lldb-Suite :: tools/lldb-server/commandline/TestStubReverseConnect.py (1647 of 1696) PASS: lldb-Suite :: functionalities/data-formatter/data-formatter-objc/TestDataFormatterObjCNSURL.py (1648 of 1696) PASS: lldb-Unit :: Utility/./UtilityTests/ArgsTest.TestSingleArgWithQuotedSpace (1649 of 1696) PASS: lldb-Suite :: functionalities/thread/concurrent_events/TestConcurrentTwoWatchpointsOneSignal.py (1650 of 1696) PASS: lldb-Suite :: commands/command/script/import/TestImport.py (1651 of 1696) PASS: lldb-Suite :: lang/objc/objc-new-syntax/TestObjCNewSyntaxArray.py (1652 of 1696) PASS: lldb-Suite :: tools/lldb-server/TestGdbRemoteProcessInfo.py (1653 of 1696) PASS: lldb-Unit :: Host/./HostTests/SocketTest.DecodeHostAndPort (1654 of 1696) PASS: lldb-Suite :: functionalities/data-formatter/data-formatter-objc/TestDataFormatterObjCExpr.py (1655 of 1696) PASS: lldb-Suite :: tools/lldb-server/signal-filtering/TestGdbRemote_QPassSignals.py (1656 of 1696) PASS: lldb-Unit :: Utility/./UtilityTests/LogChannelEnabledTest.LLDB_LOG_ERROR (1657 of 1696) PASS: lldb-Suite :: commands/expression/call-function/TestCallBuiltinFunction.py (1658 of 1696) PASS: LLDB :: Register/x86-64-gp-read.test (1659 of 1696) PASS: lldb-Unit :: Utility/./UtilityTests/OptionsWithRawTest.WhitespaceSuffix (1660 of 1696) PASS: lldb-Unit :: Utility/./UtilityTests/SerializationRountripTest.SerializeDeserializePodReferences (1661 of 1696) PASS: lldb-Suite :: lang/cpp/bool/TestCPPBool.py (1662 of 1696) PASS: lldb-Suite :: functionalities/data-formatter/data-formatter-proper-plurals/TestFormattersOneIsSingular.py (1663 of 1696) PASS: lldb-Unit :: Process/minidump/./LLDBMinidumpTests/MinidumpParserTest.InvalidMinidump (1664 of 1696) PASS: lldb-Suite :: functionalities/postmortem/wow64_minidump/TestWow64MiniDump.py (1665 of 1696) PASS: lldb-Unit :: Utility/./UtilityTests/StringExtractorTest.GetHexU8_InvalidHex (1666 of 1696) PASS: lldb-Suite :: commands/expression/issue_11588/Test11588.py (1667 of 1696) PASS: lldb-Suite :: commands/expression/call-restarts/TestCallThatRestarts.py (1668 of 1696) PASS: lldb-Unit :: Core/./LLDBCoreTests/MangledTest.EmptyForInvalidName (1669 of 1696) PASS: lldb-Unit :: Process/minidump/./LLDBMinidumpTests/MinidumpParserTest.GetMemoryRegionInfo (1670 of 1696) PASS: lldb-Suite :: lang/cpp/type_lookup/TestCppTypeLookup.py (1671 of 1696) PASS: lldb-Suite :: api/check_public_api_headers/TestPublicAPIHeaders.py (1672 of 1696) PASS: LLDB :: SymbolFile/NativePDB/globals-fundamental.cpp (1673 of 1696) PASS: lldb-Suite :: macosx/lc-note/kern-ver-str/TestKernVerStrLCNOTE.py (1674 of 1696) PASS: LLDB :: SymbolFile/DWARF/dir-separator-no-comp-dir-relative-name.s (1675 of 1696) PASS: lldb-Suite :: python_api/sbstructureddata/TestStructuredDataAPI.py (1676 of 1696) PASS: lldb-Suite :: api/multiple-targets/TestMultipleTargets.py (1677 of 1696) PASS: lldb-Suite :: functionalities/process_group/TestChangeProcessGroup.py (1678 of 1696) PASS: lldb-Unit :: ScriptInterpreter/Python/./ScriptInterpreterPythonTests/PythonDataObjectsTest.TestBorrowedReferences (1679 of 1696) PASS: lldb-Suite :: python_api/value_var_update/TestValueVarUpdate.py (1680 of 1696) PASS: lldb-Unit :: Utility/./UtilityTests/Flags.Test (1681 of 1696) PASS: lldb-Unit :: UnwindAssembly/x86/./UnwindAssemblyx86Tests/Testx86AssemblyInspectionEngine.TestSimple32bitFrameFunction (1682 of 1696) PASS: lldb-Unit :: Language/Highlighting/./HighlighterTests/HighlighterTest.ClangBraces (1683 of 1696) PASS: lldb-Suite :: functionalities/thread/concurrent_events/TestConcurrentDelayedCrashWithBreakpointWatchpoint.py (1684 of 1696) PASS: lldb-Suite :: lang/objc/global_ptrs/TestGlobalObjects.py (1685 of 1696) PASS: lldb-Suite :: lang/c/function_types/TestFunctionTypes.py (1686 of 1696) PASS: LLDB :: Breakpoint/jitbp_elf.test (1687 of 1696) PASS: lldb-Suite :: functionalities/thread/create_after_attach/TestCreateAfterAttach.py (1688 of 1696) PASS: lldb-Suite :: commands/expression/radar_9531204/TestPrintfAfterUp.py (1689 of 1696) PASS: lldb-Suite :: lang/cpp/namespace/TestNamespaceLookup.py (1690 of 1696) PASS: lldb-Suite :: commands/watchpoints/watchpoint_commands/TestWatchpointCommands.py (1691 of 1696) PASS: lldb-Suite :: functionalities/data-formatter/setvaluefromcstring/TestSetValueFromCString.py (1692 of 1696) PASS: lldb-Suite :: lang/objc/foundation/TestObjCMethods2.py (1693 of 1696) PASS: lldb-Suite :: lang/objc/foundation/TestObjCMethodsNSError.py (1694 of 1696) PASS: lldb-Suite :: types/TestIntegerTypesExpr.py (1695 of 1696) TIMEOUT: lldb-Suite :: lang/objc/foundation/TestFoundationDisassembly.py (1696 of 1696) ******************** TEST 'lldb-Suite :: lang/objc/foundation/TestFoundationDisassembly.py' FAILED ******************** Reached timeout of 1200 seconds ******************** Testing Time: 2204.73s ******************** Failing Tests (5): lldb-Suite :: commands/gui/basic/TestGuiBasic.py lldb-Suite :: functionalities/gdb_remote_client/TestGDBRemoteLoad.py lldb-Suite :: commands/expression/multiline-completion/TestMultilineCompletion.py lldb-Suite :: functionalities/gdb_remote_client/TestThreadSelectionBug.py lldb-Suite :: functionalities/gdb_remote_client/TestGDBRemoteClient.py

Hide Details

******************** Timed Out Tests (1): lldb-Suite :: lang/objc/foundation/TestFoundationDisassembly.py

Hide Details

Hide Details

Slowest Tests: -------------------------------------------------------------------------- 121.86s: lldb-Suite :: api/check_public_api_headers/TestPublicAPIHeaders.py 125.40s: lldb-Suite :: functionalities/inferior-crashing/TestInferiorCrashingStep.py 126.89s: lldb-Suite :: lang/objc/objc-new-syntax/TestObjCNewSyntaxArray.py 132.44s: lldb-Suite :: lang/c/anonymous/TestAnonymous.py 142.09s: lldb-Suite :: lang/objc/objc-new-syntax/TestObjCNewSyntaxDictionary.py 154.64s: lldb-Suite :: lang/cpp/namespace/TestNamespaceLookup.py 158.42s: lldb-Suite :: lang/objc/exceptions/TestObjCExceptions.py 161.90s: lldb-Suite :: commands/target/basic/TestTargetCommand.py 188.77s: lldb-Suite :: lang/objc/objc-new-syntax/TestObjCNewSyntaxLiteral.py 198.63s: lldb-Suite :: functionalities/gdb_remote_client/TestGDBRemoteLoad.py 202.07s: lldb-Suite :: functionalities/load_unload/TestLoadUnload.py 204.38s: lldb-Suite :: lang/objc/foundation/TestObjCMethods.py 213.03s: lldb-Suite :: lang/cpp/enum_types/TestCPP11EnumTypes.py 216.43s: lldb-Suite :: tools/lldb-server/TestLldbGdbServer.py 222.55s: lldb-Suite :: types/TestIntegerTypesExpr.py 231.76s: lldb-Suite :: functionalities/return-value/TestReturnValue.py 235.95s: lldb-Suite :: lang/objc/hidden-ivars/TestHiddenIvars.py 248.96s: lldb-Suite :: api/multithreaded/TestMultithreaded.py 466.78s: lldb-Suite :: types/TestIntegerTypes.py 1200.72s: lldb-Suite :: lang/objc/foundation/TestFoundationDisassembly.py

Hide Details

Tests Times: -------------------------------------------------------------------------- [ Range ] :: [ Percentage ] :: [ Count ] -------------------------------------------------------------------------- [ 0s, 100s) :: [*************************************** ] :: [1670/1696] [ 100s, 200s) :: [ ] :: [ 14/1696] [ 200s, 300s) :: [ ] :: [ 10/1696] [ 300s, 400s) :: [ ] :: [ 0/1696] [ 400s, 500s) :: [ ] :: [ 0/1696] [ 500s, 600s) :: [ ] :: [ 1/1696] [ 600s, 700s) :: [ ] :: [ 0/1696] [ 700s, 800s) :: [ ] :: [ 0/1696] [ 800s, 900s) :: [ ] :: [ 0/1696] [ 900s,1000s) :: [ ] :: [ 0/1696] [1000s,1100s) :: [ ] :: [ 0/1696] [1100s,1200s) :: [ ] :: [ 0/1696] [1200s,1300s) :: [ ] :: [ 1/1696] Expected Passes : 1640 Expected Failures : 6 Unsupported Tests : 44 Unexpected Failures: 5 Individual Timeouts: 1 FAILED: tools/lldb/lit/CMakeFiles/check-lldb-lit cd /Users/buildslave/jenkins/workspace/lldb-cmake-sanitized/lldb-build/tools/lldb/lit && /usr/bin/python /Users/buildslave/jenkins/workspace/lldb-cmake-sanitized/lldb-build/./bin/llvm-lit -v --time-tests --shuffle --xunit-xml-output=/Users/buildslave/jenkins/workspace/lldb-cmake-sanitized/test/results.xml -v --timeout 1200 /Users/buildslave/jenkins/workspace/lldb-cmake-sanitized/lldb-build/tools/lldb/lit ninja: build stopped: subcommand failed. Command failed Command: ['/usr/bin/env', 'TERM=vt100', '/usr/local/bin/ninja', '-v', 'check-lldb'] [Pipeline] } [Pipeline] // timeout [Pipeline] } [Pipeline] // stage [Pipeline] stage [Pipeline] { (Declarative: Post Actions) [Pipeline] scanForIssues No credentials specified [Clang (LLVM based)] Sleeping for 5 seconds due to JENKINS-32191... [Clang (LLVM based)] Parsing console log (workspace: '/Users/buildslave/jenkins/workspace/lldb-cmake-sanitized') [Pipeline] junit Recording test results [Pipeline] } [Pipeline] // stage [Pipeline] } [Pipeline] // withEnv [Pipeline] } [Pipeline] // node [Pipeline] End of Pipeline [BFA] Scanning build for known causes... [BFA] Found failure cause(s): [BFA] Regression test failed from category Test [BFA] Ninja target failed from category Compile [BFA] Done. 1s ERROR: script returned exit code 1 Finished: FAILURE