FailedConsole Output

Skipping 8,225 KB.. Full Log

Hide Details

Adding tearDown hook: def cleanupSubprocesses(self): # Ensure any subprocesses are cleaned up for p in self.subprocesses: p.terminate() del p del self.subprocesses[:] # Ensure any forked processes are cleaned up for pid in self.forkedProcessPids: if os.path.exists("/proc/" + str(pid)): os.kill(pid, signal.SIGTERM)

Hide Details

Hide Details

Adding tearDown hook: def shutdown_debug_monitor(): try: server.terminate() except: logger.warning( "failed to terminate server for debug monitor: {}; ignoring".format( sys.exc_info()[0]))

Hide Details

Hide Details

Adding tearDown hook: def shutdown_socket(): if sock: try: # send the kill packet so lldb-server shuts down gracefully sock.sendall(GdbRemoteTestCaseBase._GDBREMOTE_KILL_PACKET) except: logger.warning( "failed to send kill packet to debug monitor: {}; ignoring".format( sys.exc_info()[0]))

Hide Details

try: sock.close() except: logger.warning( "failed to close socket to debug monitor: {}; ignoring".format( sys.exc_info()[0]))

Hide Details

Hide Details

Executing tearDown hook: def shutdown_socket(): if sock: try: # send the kill packet so lldb-server shuts down gracefully sock.sendall(GdbRemoteTestCaseBase._GDBREMOTE_KILL_PACKET) except: logger.warning( "failed to send kill packet to debug monitor: {}; ignoring".format( sys.exc_info()[0]))

Hide Details

try: sock.close() except: logger.warning( "failed to close socket to debug monitor: {}; ignoring".format( sys.exc_info()[0]))

Hide Details

Hide Details

Executing tearDown hook: def shutdown_debug_monitor(): try: server.terminate() except: logger.warning( "failed to terminate server for debug monitor: {}; ignoring".format( sys.exc_info()[0]))

Hide Details

Hide Details

Executing tearDown hook: def cleanupSubprocesses(self): # Ensure any subprocesses are cleaned up for p in self.subprocesses: p.terminate() del p del self.subprocesses[:] # Ensure any forked processes are cleaned up for pid in self.forkedProcessPids: if os.path.exists("/proc/" + str(pid)): os.kill(pid, signal.SIGTERM)

Hide Details

Hide Details

Executing tearDown hook: def shutdown_named_pipe(): # Close the pipe. try: named_pipe.close() except: print("failed to close named pipe") None

Hide Details

# Delete the pipe. try: os.remove(named_pipe_path) except: print("failed to delete named pipe: {}".format(named_pipe_path)) None

Hide Details

# Delete the temp directory. try: os.rmdir(temp_dir) except: print( "failed to delete temp dir: {}, directory contents: '{}'".format( temp_dir, os.listdir(temp_dir))) None

Hide Details

Hide Details

PASS: LLDB (/Users/buildslave/jenkins/workspace/lldb-cmake-sanitized/host-compiler/bin/clang-10-x86_64) :: test_qRegisterInfo_contains_required_generics_debugserver (TestLldbGdbServer.LldbGdbServerTestCase) runCmd: settings set symbols.enable-external-lookup false output:

Hide Details

runCmd: settings set plugin.process.gdb-remote.packet-timeout 60 output:

Hide Details

runCmd: settings set symbols.clang-modules-cache-path "/Users/buildslave/jenkins/workspace/lldb-cmake-sanitized/lldb-build/tools/lldb/lldb-test-build.noindex/module-cache-lldb" output:

Hide Details

runCmd: settings set use-color false output:

Hide Details

UNSUPPORTED: LLDB (/Users/buildslave/jenkins/workspace/lldb-cmake-sanitized/host-compiler/bin/clang-10-x86_64) :: test_qRegisterInfo_contains_required_generics_llgs (TestLldbGdbServer.LldbGdbServerTestCase) (llgs tests) runCmd: settings set symbols.enable-external-lookup false output:

Hide Details

runCmd: settings set plugin.process.gdb-remote.packet-timeout 60 output:

Hide Details

runCmd: settings set symbols.clang-modules-cache-path "/Users/buildslave/jenkins/workspace/lldb-cmake-sanitized/lldb-build/tools/lldb/lldb-test-build.noindex/module-cache-lldb" output:

Hide Details

runCmd: settings set use-color false output:

Hide Details

Adding tearDown hook: def shutdown_named_pipe(): # Close the pipe. try: named_pipe.close() except: print("failed to close named pipe") None

Hide Details

# Delete the pipe. try: os.remove(named_pipe_path) except: print("failed to delete named pipe: {}".format(named_pipe_path)) None

Hide Details

# Delete the temp directory. try: os.rmdir(temp_dir) except: print( "failed to delete temp dir: {}, directory contents: '{}'".format( temp_dir, os.listdir(temp_dir))) None

Hide Details

Hide Details

Adding tearDown hook: def cleanupSubprocesses(self): # Ensure any subprocesses are cleaned up for p in self.subprocesses: p.terminate() del p del self.subprocesses[:] # Ensure any forked processes are cleaned up for pid in self.forkedProcessPids: if os.path.exists("/proc/" + str(pid)): os.kill(pid, signal.SIGTERM)

Hide Details

Hide Details

Adding tearDown hook: def shutdown_debug_monitor(): try: server.terminate() except: logger.warning( "failed to terminate server for debug monitor: {}; ignoring".format( sys.exc_info()[0]))

Hide Details

Hide Details

Adding tearDown hook: def shutdown_socket(): if sock: try: # send the kill packet so lldb-server shuts down gracefully sock.sendall(GdbRemoteTestCaseBase._GDBREMOTE_KILL_PACKET) except: logger.warning( "failed to send kill packet to debug monitor: {}; ignoring".format( sys.exc_info()[0]))

Hide Details

try: sock.close() except: logger.warning( "failed to close socket to debug monitor: {}; ignoring".format( sys.exc_info()[0]))

Hide Details

Hide Details

Executing tearDown hook: def shutdown_socket(): if sock: try: # send the kill packet so lldb-server shuts down gracefully sock.sendall(GdbRemoteTestCaseBase._GDBREMOTE_KILL_PACKET) except: logger.warning( "failed to send kill packet to debug monitor: {}; ignoring".format( sys.exc_info()[0]))

Hide Details

try: sock.close() except: logger.warning( "failed to close socket to debug monitor: {}; ignoring".format( sys.exc_info()[0]))

Hide Details

Hide Details

Executing tearDown hook: def shutdown_debug_monitor(): try: server.terminate() except: logger.warning( "failed to terminate server for debug monitor: {}; ignoring".format( sys.exc_info()[0]))

Hide Details

Hide Details

Executing tearDown hook: def cleanupSubprocesses(self): # Ensure any subprocesses are cleaned up for p in self.subprocesses: p.terminate() del p del self.subprocesses[:] # Ensure any forked processes are cleaned up for pid in self.forkedProcessPids: if os.path.exists("/proc/" + str(pid)): os.kill(pid, signal.SIGTERM)

Hide Details

Hide Details

Executing tearDown hook: def shutdown_named_pipe(): # Close the pipe. try: named_pipe.close() except: print("failed to close named pipe") None

Hide Details

# Delete the pipe. try: os.remove(named_pipe_path) except: print("failed to delete named pipe: {}".format(named_pipe_path)) None

Hide Details

# Delete the temp directory. try: os.rmdir(temp_dir) except: print( "failed to delete temp dir: {}, directory contents: '{}'".format( temp_dir, os.listdir(temp_dir))) None

Hide Details

Hide Details

PASS: LLDB (/Users/buildslave/jenkins/workspace/lldb-cmake-sanitized/host-compiler/bin/clang-10-x86_64) :: test_qRegisterInfo_returns_all_valid_results_debugserver (TestLldbGdbServer.LldbGdbServerTestCase) runCmd: settings set symbols.enable-external-lookup false output:

Hide Details

runCmd: settings set plugin.process.gdb-remote.packet-timeout 60 output:

Hide Details

runCmd: settings set symbols.clang-modules-cache-path "/Users/buildslave/jenkins/workspace/lldb-cmake-sanitized/lldb-build/tools/lldb/lldb-test-build.noindex/module-cache-lldb" output:

Hide Details

runCmd: settings set use-color false output:

Hide Details

UNSUPPORTED: LLDB (/Users/buildslave/jenkins/workspace/lldb-cmake-sanitized/host-compiler/bin/clang-10-x86_64) :: test_qRegisterInfo_returns_all_valid_results_llgs (TestLldbGdbServer.LldbGdbServerTestCase) (llgs tests) runCmd: settings set symbols.enable-external-lookup false output:

Hide Details

runCmd: settings set plugin.process.gdb-remote.packet-timeout 60 output:

Hide Details

runCmd: settings set symbols.clang-modules-cache-path "/Users/buildslave/jenkins/workspace/lldb-cmake-sanitized/lldb-build/tools/lldb/lldb-test-build.noindex/module-cache-lldb" output:

Hide Details

runCmd: settings set use-color false output:

Hide Details

Adding tearDown hook: def shutdown_named_pipe(): # Close the pipe. try: named_pipe.close() except: print("failed to close named pipe") None

Hide Details

# Delete the pipe. try: os.remove(named_pipe_path) except: print("failed to delete named pipe: {}".format(named_pipe_path)) None

Hide Details

# Delete the temp directory. try: os.rmdir(temp_dir) except: print( "failed to delete temp dir: {}, directory contents: '{}'".format( temp_dir, os.listdir(temp_dir))) None

Hide Details

Hide Details

Adding tearDown hook: def cleanupSubprocesses(self): # Ensure any subprocesses are cleaned up for p in self.subprocesses: p.terminate() del p del self.subprocesses[:] # Ensure any forked processes are cleaned up for pid in self.forkedProcessPids: if os.path.exists("/proc/" + str(pid)): os.kill(pid, signal.SIGTERM)

Hide Details

Hide Details

Adding tearDown hook: def shutdown_debug_monitor(): try: server.terminate() except: logger.warning( "failed to terminate server for debug monitor: {}; ignoring".format( sys.exc_info()[0]))

Hide Details

Hide Details

Adding tearDown hook: def shutdown_socket(): if sock: try: # send the kill packet so lldb-server shuts down gracefully sock.sendall(GdbRemoteTestCaseBase._GDBREMOTE_KILL_PACKET) except: logger.warning( "failed to send kill packet to debug monitor: {}; ignoring".format( sys.exc_info()[0]))

Hide Details

try: sock.close() except: logger.warning( "failed to close socket to debug monitor: {}; ignoring".format( sys.exc_info()[0]))

Hide Details

Hide Details

Executing tearDown hook: def shutdown_socket(): if sock: try: # send the kill packet so lldb-server shuts down gracefully sock.sendall(GdbRemoteTestCaseBase._GDBREMOTE_KILL_PACKET) except: logger.warning( "failed to send kill packet to debug monitor: {}; ignoring".format( sys.exc_info()[0]))

Hide Details

try: sock.close() except: logger.warning( "failed to close socket to debug monitor: {}; ignoring".format( sys.exc_info()[0]))

Hide Details

Hide Details

Executing tearDown hook: def shutdown_debug_monitor(): try: server.terminate() except: logger.warning( "failed to terminate server for debug monitor: {}; ignoring".format( sys.exc_info()[0]))

Hide Details

Hide Details

Executing tearDown hook: def cleanupSubprocesses(self): # Ensure any subprocesses are cleaned up for p in self.subprocesses: p.terminate() del p del self.subprocesses[:] # Ensure any forked processes are cleaned up for pid in self.forkedProcessPids: if os.path.exists("/proc/" + str(pid)): os.kill(pid, signal.SIGTERM)

Hide Details

Hide Details

Executing tearDown hook: def shutdown_named_pipe(): # Close the pipe. try: named_pipe.close() except: print("failed to close named pipe") None

Hide Details

# Delete the pipe. try: os.remove(named_pipe_path) except: print("failed to delete named pipe: {}".format(named_pipe_path)) None

Hide Details

# Delete the temp directory. try: os.rmdir(temp_dir) except: print( "failed to delete temp dir: {}, directory contents: '{}'".format( temp_dir, os.listdir(temp_dir))) None

Hide Details

Hide Details

PASS: LLDB (/Users/buildslave/jenkins/workspace/lldb-cmake-sanitized/host-compiler/bin/clang-10-x86_64) :: test_qRegisterInfo_returns_one_valid_result_debugserver (TestLldbGdbServer.LldbGdbServerTestCase) runCmd: settings set symbols.enable-external-lookup false output:

Hide Details

runCmd: settings set plugin.process.gdb-remote.packet-timeout 60 output:

Hide Details

runCmd: settings set symbols.clang-modules-cache-path "/Users/buildslave/jenkins/workspace/lldb-cmake-sanitized/lldb-build/tools/lldb/lldb-test-build.noindex/module-cache-lldb" output:

Hide Details

runCmd: settings set use-color false output:

Hide Details

UNSUPPORTED: LLDB (/Users/buildslave/jenkins/workspace/lldb-cmake-sanitized/host-compiler/bin/clang-10-x86_64) :: test_qRegisterInfo_returns_one_valid_result_llgs (TestLldbGdbServer.LldbGdbServerTestCase) (llgs tests) runCmd: settings set symbols.enable-external-lookup false output:

Hide Details

runCmd: settings set plugin.process.gdb-remote.packet-timeout 60 output:

Hide Details

runCmd: settings set symbols.clang-modules-cache-path "/Users/buildslave/jenkins/workspace/lldb-cmake-sanitized/lldb-build/tools/lldb/lldb-test-build.noindex/module-cache-lldb" output:

Hide Details

runCmd: settings set use-color false output:

Hide Details

Adding tearDown hook: def shutdown_named_pipe(): # Close the pipe. try: named_pipe.close() except: print("failed to close named pipe") None

Hide Details

# Delete the pipe. try: os.remove(named_pipe_path) except: print("failed to delete named pipe: {}".format(named_pipe_path)) None

Hide Details

# Delete the temp directory. try: os.rmdir(temp_dir) except: print( "failed to delete temp dir: {}, directory contents: '{}'".format( temp_dir, os.listdir(temp_dir))) None

Hide Details

Hide Details

Adding tearDown hook: def cleanupSubprocesses(self): # Ensure any subprocesses are cleaned up for p in self.subprocesses: p.terminate() del p del self.subprocesses[:] # Ensure any forked processes are cleaned up for pid in self.forkedProcessPids: if os.path.exists("/proc/" + str(pid)): os.kill(pid, signal.SIGTERM)

Hide Details

Hide Details

Adding tearDown hook: def shutdown_debug_monitor(): try: server.terminate() except: logger.warning( "failed to terminate server for debug monitor: {}; ignoring".format( sys.exc_info()[0]))

Hide Details

Hide Details

Adding tearDown hook: def shutdown_socket(): if sock: try: # send the kill packet so lldb-server shuts down gracefully sock.sendall(GdbRemoteTestCaseBase._GDBREMOTE_KILL_PACKET) except: logger.warning( "failed to send kill packet to debug monitor: {}; ignoring".format( sys.exc_info()[0]))

Hide Details

try: sock.close() except: logger.warning( "failed to close socket to debug monitor: {}; ignoring".format( sys.exc_info()[0]))

Hide Details

Hide Details

Executing tearDown hook: def shutdown_socket(): if sock: try: # send the kill packet so lldb-server shuts down gracefully sock.sendall(GdbRemoteTestCaseBase._GDBREMOTE_KILL_PACKET) except: logger.warning( "failed to send kill packet to debug monitor: {}; ignoring".format( sys.exc_info()[0]))

Hide Details

try: sock.close() except: logger.warning( "failed to close socket to debug monitor: {}; ignoring".format( sys.exc_info()[0]))

Hide Details

Hide Details

Executing tearDown hook: def shutdown_debug_monitor(): try: server.terminate() except: logger.warning( "failed to terminate server for debug monitor: {}; ignoring".format( sys.exc_info()[0]))

Hide Details

Hide Details

Executing tearDown hook: def cleanupSubprocesses(self): # Ensure any subprocesses are cleaned up for p in self.subprocesses: p.terminate() del p del self.subprocesses[:] # Ensure any forked processes are cleaned up for pid in self.forkedProcessPids: if os.path.exists("/proc/" + str(pid)): os.kill(pid, signal.SIGTERM)

Hide Details

Hide Details

Executing tearDown hook: def shutdown_named_pipe(): # Close the pipe. try: named_pipe.close() except: print("failed to close named pipe") None

Hide Details

# Delete the pipe. try: os.remove(named_pipe_path) except: print("failed to delete named pipe: {}".format(named_pipe_path)) None

Hide Details

# Delete the temp directory. try: os.rmdir(temp_dir) except: print( "failed to delete temp dir: {}, directory contents: '{}'".format( temp_dir, os.listdir(temp_dir))) None

Hide Details

Hide Details

PASS: LLDB (/Users/buildslave/jenkins/workspace/lldb-cmake-sanitized/host-compiler/bin/clang-10-x86_64) :: test_qSupported_returns_known_stub_features_debugserver (TestLldbGdbServer.LldbGdbServerTestCase) runCmd: settings set symbols.enable-external-lookup false output:

Hide Details

runCmd: settings set plugin.process.gdb-remote.packet-timeout 60 output:

Hide Details

runCmd: settings set symbols.clang-modules-cache-path "/Users/buildslave/jenkins/workspace/lldb-cmake-sanitized/lldb-build/tools/lldb/lldb-test-build.noindex/module-cache-lldb" output:

Hide Details

runCmd: settings set use-color false output:

Hide Details

UNSUPPORTED: LLDB (/Users/buildslave/jenkins/workspace/lldb-cmake-sanitized/host-compiler/bin/clang-10-x86_64) :: test_qSupported_returns_known_stub_features_llgs (TestLldbGdbServer.LldbGdbServerTestCase) (llgs tests) runCmd: settings set symbols.enable-external-lookup false output:

Hide Details

runCmd: settings set plugin.process.gdb-remote.packet-timeout 60 output:

Hide Details

runCmd: settings set symbols.clang-modules-cache-path "/Users/buildslave/jenkins/workspace/lldb-cmake-sanitized/lldb-build/tools/lldb/lldb-test-build.noindex/module-cache-lldb" output:

Hide Details

runCmd: settings set use-color false output:

Hide Details

Adding tearDown hook: def shutdown_named_pipe(): # Close the pipe. try: named_pipe.close() except: print("failed to close named pipe") None

Hide Details

# Delete the pipe. try: os.remove(named_pipe_path) except: print("failed to delete named pipe: {}".format(named_pipe_path)) None

Hide Details

# Delete the temp directory. try: os.rmdir(temp_dir) except: print( "failed to delete temp dir: {}, directory contents: '{}'".format( temp_dir, os.listdir(temp_dir))) None

Hide Details

Hide Details

Adding tearDown hook: def shutdown_process_for_attach(): try: inferior.terminate() except: logger.warning( "failed to terminate inferior process for attach: {}; ignoring".format( sys.exc_info()[0]))

Hide Details

Hide Details

Adding tearDown hook: def cleanupSubprocesses(self): # Ensure any subprocesses are cleaned up for p in self.subprocesses: p.terminate() del p del self.subprocesses[:] # Ensure any forked processes are cleaned up for pid in self.forkedProcessPids: if os.path.exists("/proc/" + str(pid)): os.kill(pid, signal.SIGTERM)

Hide Details

Hide Details

Adding tearDown hook: def shutdown_debug_monitor(): try: server.terminate() except: logger.warning( "failed to terminate server for debug monitor: {}; ignoring".format( sys.exc_info()[0]))

Hide Details

Hide Details

Adding tearDown hook: def shutdown_socket(): if sock: try: # send the kill packet so lldb-server shuts down gracefully sock.sendall(GdbRemoteTestCaseBase._GDBREMOTE_KILL_PACKET) except: logger.warning( "failed to send kill packet to debug monitor: {}; ignoring".format( sys.exc_info()[0]))

Hide Details

try: sock.close() except: logger.warning( "failed to close socket to debug monitor: {}; ignoring".format( sys.exc_info()[0]))

Hide Details

Hide Details

Executing tearDown hook: def shutdown_socket(): if sock: try: # send the kill packet so lldb-server shuts down gracefully sock.sendall(GdbRemoteTestCaseBase._GDBREMOTE_KILL_PACKET) except: logger.warning( "failed to send kill packet to debug monitor: {}; ignoring".format( sys.exc_info()[0]))

Hide Details

try: sock.close() except: logger.warning( "failed to close socket to debug monitor: {}; ignoring".format( sys.exc_info()[0]))

Hide Details

Hide Details

Executing tearDown hook: def shutdown_debug_monitor(): try: server.terminate() except: logger.warning( "failed to terminate server for debug monitor: {}; ignoring".format( sys.exc_info()[0]))

Hide Details

Hide Details

Executing tearDown hook: def cleanupSubprocesses(self): # Ensure any subprocesses are cleaned up for p in self.subprocesses: p.terminate() del p del self.subprocesses[:] # Ensure any forked processes are cleaned up for pid in self.forkedProcessPids: if os.path.exists("/proc/" + str(pid)): os.kill(pid, signal.SIGTERM)

Hide Details

Hide Details

Executing tearDown hook: def shutdown_process_for_attach(): try: inferior.terminate() except: logger.warning( "failed to terminate inferior process for attach: {}; ignoring".format( sys.exc_info()[0]))

Hide Details

Hide Details

Executing tearDown hook: def shutdown_named_pipe(): # Close the pipe. try: named_pipe.close() except: print("failed to close named pipe") None

Hide Details

# Delete the pipe. try: os.remove(named_pipe_path) except: print("failed to delete named pipe: {}".format(named_pipe_path)) None

Hide Details

# Delete the temp directory. try: os.rmdir(temp_dir) except: print( "failed to delete temp dir: {}, directory contents: '{}'".format( temp_dir, os.listdir(temp_dir))) None

Hide Details

Hide Details

PASS: LLDB (/Users/buildslave/jenkins/workspace/lldb-cmake-sanitized/host-compiler/bin/clang-10-x86_64) :: test_qThreadInfo_contains_thread_attach_debugserver (TestLldbGdbServer.LldbGdbServerTestCase) runCmd: settings set symbols.enable-external-lookup false output:

Hide Details

runCmd: settings set plugin.process.gdb-remote.packet-timeout 60 output:

Hide Details

runCmd: settings set symbols.clang-modules-cache-path "/Users/buildslave/jenkins/workspace/lldb-cmake-sanitized/lldb-build/tools/lldb/lldb-test-build.noindex/module-cache-lldb" output:

Hide Details

runCmd: settings set use-color false output:

Hide Details

UNSUPPORTED: LLDB (/Users/buildslave/jenkins/workspace/lldb-cmake-sanitized/host-compiler/bin/clang-10-x86_64) :: test_qThreadInfo_contains_thread_attach_llgs (TestLldbGdbServer.LldbGdbServerTestCase) (llgs tests) runCmd: settings set symbols.enable-external-lookup false output:

Hide Details

runCmd: settings set plugin.process.gdb-remote.packet-timeout 60 output:

Hide Details

runCmd: settings set symbols.clang-modules-cache-path "/Users/buildslave/jenkins/workspace/lldb-cmake-sanitized/lldb-build/tools/lldb/lldb-test-build.noindex/module-cache-lldb" output:

Hide Details

runCmd: settings set use-color false output:

Hide Details

Adding tearDown hook: def shutdown_named_pipe(): # Close the pipe. try: named_pipe.close() except: print("failed to close named pipe") None

Hide Details

# Delete the pipe. try: os.remove(named_pipe_path) except: print("failed to delete named pipe: {}".format(named_pipe_path)) None

Hide Details

# Delete the temp directory. try: os.rmdir(temp_dir) except: print( "failed to delete temp dir: {}, directory contents: '{}'".format( temp_dir, os.listdir(temp_dir))) None

Hide Details

Hide Details

Adding tearDown hook: def cleanupSubprocesses(self): # Ensure any subprocesses are cleaned up for p in self.subprocesses: p.terminate() del p del self.subprocesses[:] # Ensure any forked processes are cleaned up for pid in self.forkedProcessPids: if os.path.exists("/proc/" + str(pid)): os.kill(pid, signal.SIGTERM)

Hide Details

Hide Details

Adding tearDown hook: def shutdown_debug_monitor(): try: server.terminate() except: logger.warning( "failed to terminate server for debug monitor: {}; ignoring".format( sys.exc_info()[0]))

Hide Details

Hide Details

Adding tearDown hook: def shutdown_socket(): if sock: try: # send the kill packet so lldb-server shuts down gracefully sock.sendall(GdbRemoteTestCaseBase._GDBREMOTE_KILL_PACKET) except: logger.warning( "failed to send kill packet to debug monitor: {}; ignoring".format( sys.exc_info()[0]))

Hide Details

try: sock.close() except: logger.warning( "failed to close socket to debug monitor: {}; ignoring".format( sys.exc_info()[0]))

Hide Details

Hide Details

Executing tearDown hook: def shutdown_socket(): if sock: try: # send the kill packet so lldb-server shuts down gracefully sock.sendall(GdbRemoteTestCaseBase._GDBREMOTE_KILL_PACKET) except: logger.warning( "failed to send kill packet to debug monitor: {}; ignoring".format( sys.exc_info()[0]))

Hide Details

try: sock.close() except: logger.warning( "failed to close socket to debug monitor: {}; ignoring".format( sys.exc_info()[0]))

Hide Details

Hide Details

Executing tearDown hook: def shutdown_debug_monitor(): try: server.terminate() except: logger.warning( "failed to terminate server for debug monitor: {}; ignoring".format( sys.exc_info()[0]))

Hide Details

Hide Details

Executing tearDown hook: def cleanupSubprocesses(self): # Ensure any subprocesses are cleaned up for p in self.subprocesses: p.terminate() del p del self.subprocesses[:] # Ensure any forked processes are cleaned up for pid in self.forkedProcessPids: if os.path.exists("/proc/" + str(pid)): os.kill(pid, signal.SIGTERM)

Hide Details

Hide Details

Executing tearDown hook: def shutdown_named_pipe(): # Close the pipe. try: named_pipe.close() except: print("failed to close named pipe") None

Hide Details

# Delete the pipe. try: os.remove(named_pipe_path) except: print("failed to delete named pipe: {}".format(named_pipe_path)) None

Hide Details

# Delete the temp directory. try: os.rmdir(temp_dir) except: print( "failed to delete temp dir: {}, directory contents: '{}'".format( temp_dir, os.listdir(temp_dir))) None

Hide Details

Hide Details

PASS: LLDB (/Users/buildslave/jenkins/workspace/lldb-cmake-sanitized/host-compiler/bin/clang-10-x86_64) :: test_qThreadInfo_contains_thread_launch_debugserver (TestLldbGdbServer.LldbGdbServerTestCase) runCmd: settings set symbols.enable-external-lookup false output:

Hide Details

runCmd: settings set plugin.process.gdb-remote.packet-timeout 60 output:

Hide Details

runCmd: settings set symbols.clang-modules-cache-path "/Users/buildslave/jenkins/workspace/lldb-cmake-sanitized/lldb-build/tools/lldb/lldb-test-build.noindex/module-cache-lldb" output:

Hide Details

runCmd: settings set use-color false output:

Hide Details

UNSUPPORTED: LLDB (/Users/buildslave/jenkins/workspace/lldb-cmake-sanitized/host-compiler/bin/clang-10-x86_64) :: test_qThreadInfo_contains_thread_launch_llgs (TestLldbGdbServer.LldbGdbServerTestCase) (llgs tests) runCmd: settings set symbols.enable-external-lookup false output:

Hide Details

runCmd: settings set plugin.process.gdb-remote.packet-timeout 60 output:

Hide Details

runCmd: settings set symbols.clang-modules-cache-path "/Users/buildslave/jenkins/workspace/lldb-cmake-sanitized/lldb-build/tools/lldb/lldb-test-build.noindex/module-cache-lldb" output:

Hide Details

runCmd: settings set use-color false output:

Hide Details

Adding tearDown hook: def shutdown_named_pipe(): # Close the pipe. try: named_pipe.close() except: print("failed to close named pipe") None

Hide Details

# Delete the pipe. try: os.remove(named_pipe_path) except: print("failed to delete named pipe: {}".format(named_pipe_path)) None

Hide Details

# Delete the temp directory. try: os.rmdir(temp_dir) except: print( "failed to delete temp dir: {}, directory contents: '{}'".format( temp_dir, os.listdir(temp_dir))) None

Hide Details

Hide Details

Adding tearDown hook: def shutdown_process_for_attach(): try: inferior.terminate() except: logger.warning( "failed to terminate inferior process for attach: {}; ignoring".format( sys.exc_info()[0]))

Hide Details

Hide Details

Adding tearDown hook: def cleanupSubprocesses(self): # Ensure any subprocesses are cleaned up for p in self.subprocesses: p.terminate() del p del self.subprocesses[:] # Ensure any forked processes are cleaned up for pid in self.forkedProcessPids: if os.path.exists("/proc/" + str(pid)): os.kill(pid, signal.SIGTERM)

Hide Details

Hide Details

Adding tearDown hook: def shutdown_debug_monitor(): try: server.terminate() except: logger.warning( "failed to terminate server for debug monitor: {}; ignoring".format( sys.exc_info()[0]))

Hide Details

Hide Details

Adding tearDown hook: def shutdown_socket(): if sock: try: # send the kill packet so lldb-server shuts down gracefully sock.sendall(GdbRemoteTestCaseBase._GDBREMOTE_KILL_PACKET) except: logger.warning( "failed to send kill packet to debug monitor: {}; ignoring".format( sys.exc_info()[0]))

Hide Details

try: sock.close() except: logger.warning( "failed to close socket to debug monitor: {}; ignoring".format( sys.exc_info()[0]))

Hide Details

Hide Details

Executing tearDown hook: def shutdown_socket(): if sock: try: # send the kill packet so lldb-server shuts down gracefully sock.sendall(GdbRemoteTestCaseBase._GDBREMOTE_KILL_PACKET) except: logger.warning( "failed to send kill packet to debug monitor: {}; ignoring".format( sys.exc_info()[0]))

Hide Details

try: sock.close() except: logger.warning( "failed to close socket to debug monitor: {}; ignoring".format( sys.exc_info()[0]))

Hide Details

Hide Details

Executing tearDown hook: def shutdown_debug_monitor(): try: server.terminate() except: logger.warning( "failed to terminate server for debug monitor: {}; ignoring".format( sys.exc_info()[0]))

Hide Details

Hide Details

Executing tearDown hook: def cleanupSubprocesses(self): # Ensure any subprocesses are cleaned up for p in self.subprocesses: p.terminate() del p del self.subprocesses[:] # Ensure any forked processes are cleaned up for pid in self.forkedProcessPids: if os.path.exists("/proc/" + str(pid)): os.kill(pid, signal.SIGTERM)

Hide Details

Hide Details

Executing tearDown hook: def shutdown_process_for_attach(): try: inferior.terminate() except: logger.warning( "failed to terminate inferior process for attach: {}; ignoring".format( sys.exc_info()[0]))

Hide Details

Hide Details

Executing tearDown hook: def shutdown_named_pipe(): # Close the pipe. try: named_pipe.close() except: print("failed to close named pipe") None

Hide Details

# Delete the pipe. try: os.remove(named_pipe_path) except: print("failed to delete named pipe: {}".format(named_pipe_path)) None

Hide Details

# Delete the temp directory. try: os.rmdir(temp_dir) except: print( "failed to delete temp dir: {}, directory contents: '{}'".format( temp_dir, os.listdir(temp_dir))) None

Hide Details

Hide Details

PASS: LLDB (/Users/buildslave/jenkins/workspace/lldb-cmake-sanitized/host-compiler/bin/clang-10-x86_64) :: test_qThreadInfo_matches_qC_attach_debugserver (TestLldbGdbServer.LldbGdbServerTestCase) runCmd: settings set symbols.enable-external-lookup false output:

Hide Details

runCmd: settings set plugin.process.gdb-remote.packet-timeout 60 output:

Hide Details

runCmd: settings set symbols.clang-modules-cache-path "/Users/buildslave/jenkins/workspace/lldb-cmake-sanitized/lldb-build/tools/lldb/lldb-test-build.noindex/module-cache-lldb" output:

Hide Details

runCmd: settings set use-color false output:

Hide Details

UNSUPPORTED: LLDB (/Users/buildslave/jenkins/workspace/lldb-cmake-sanitized/host-compiler/bin/clang-10-x86_64) :: test_qThreadInfo_matches_qC_attach_llgs (TestLldbGdbServer.LldbGdbServerTestCase) (llgs tests) runCmd: settings set symbols.enable-external-lookup false output:

Hide Details

runCmd: settings set plugin.process.gdb-remote.packet-timeout 60 output:

Hide Details

runCmd: settings set symbols.clang-modules-cache-path "/Users/buildslave/jenkins/workspace/lldb-cmake-sanitized/lldb-build/tools/lldb/lldb-test-build.noindex/module-cache-lldb" output:

Hide Details

runCmd: settings set use-color false output:

Hide Details

Adding tearDown hook: def shutdown_named_pipe(): # Close the pipe. try: named_pipe.close() except: print("failed to close named pipe") None

Hide Details

# Delete the pipe. try: os.remove(named_pipe_path) except: print("failed to delete named pipe: {}".format(named_pipe_path)) None

Hide Details

# Delete the temp directory. try: os.rmdir(temp_dir) except: print( "failed to delete temp dir: {}, directory contents: '{}'".format( temp_dir, os.listdir(temp_dir))) None

Hide Details

Hide Details

Adding tearDown hook: def cleanupSubprocesses(self): # Ensure any subprocesses are cleaned up for p in self.subprocesses: p.terminate() del p del self.subprocesses[:] # Ensure any forked processes are cleaned up for pid in self.forkedProcessPids: if os.path.exists("/proc/" + str(pid)): os.kill(pid, signal.SIGTERM)

Hide Details

Hide Details

Adding tearDown hook: def shutdown_debug_monitor(): try: server.terminate() except: logger.warning( "failed to terminate server for debug monitor: {}; ignoring".format( sys.exc_info()[0]))

Hide Details

Hide Details

Adding tearDown hook: def shutdown_socket(): if sock: try: # send the kill packet so lldb-server shuts down gracefully sock.sendall(GdbRemoteTestCaseBase._GDBREMOTE_KILL_PACKET) except: logger.warning( "failed to send kill packet to debug monitor: {}; ignoring".format( sys.exc_info()[0]))

Hide Details

try: sock.close() except: logger.warning( "failed to close socket to debug monitor: {}; ignoring".format( sys.exc_info()[0]))

Hide Details

Hide Details

Executing tearDown hook: def shutdown_socket(): if sock: try: # send the kill packet so lldb-server shuts down gracefully sock.sendall(GdbRemoteTestCaseBase._GDBREMOTE_KILL_PACKET) except: logger.warning( "failed to send kill packet to debug monitor: {}; ignoring".format( sys.exc_info()[0]))

Hide Details

try: sock.close() except: logger.warning( "failed to close socket to debug monitor: {}; ignoring".format( sys.exc_info()[0]))

Hide Details

Hide Details

Executing tearDown hook: def shutdown_debug_monitor(): try: server.terminate() except: logger.warning( "failed to terminate server for debug monitor: {}; ignoring".format( sys.exc_info()[0]))

Hide Details

Hide Details

Executing tearDown hook: def cleanupSubprocesses(self): # Ensure any subprocesses are cleaned up for p in self.subprocesses: p.terminate() del p del self.subprocesses[:] # Ensure any forked processes are cleaned up for pid in self.forkedProcessPids: if os.path.exists("/proc/" + str(pid)): os.kill(pid, signal.SIGTERM)

Hide Details

Hide Details

Executing tearDown hook: def shutdown_named_pipe(): # Close the pipe. try: named_pipe.close() except: print("failed to close named pipe") None

Hide Details

# Delete the pipe. try: os.remove(named_pipe_path) except: print("failed to delete named pipe: {}".format(named_pipe_path)) None

Hide Details

# Delete the temp directory. try: os.rmdir(temp_dir) except: print( "failed to delete temp dir: {}, directory contents: '{}'".format( temp_dir, os.listdir(temp_dir))) None

Hide Details

Hide Details

PASS: LLDB (/Users/buildslave/jenkins/workspace/lldb-cmake-sanitized/host-compiler/bin/clang-10-x86_64) :: test_qThreadInfo_matches_qC_launch_debugserver (TestLldbGdbServer.LldbGdbServerTestCase) runCmd: settings set symbols.enable-external-lookup false output:

Hide Details

runCmd: settings set plugin.process.gdb-remote.packet-timeout 60 output:

Hide Details

runCmd: settings set symbols.clang-modules-cache-path "/Users/buildslave/jenkins/workspace/lldb-cmake-sanitized/lldb-build/tools/lldb/lldb-test-build.noindex/module-cache-lldb" output:

Hide Details

runCmd: settings set use-color false output:

Hide Details

UNSUPPORTED: LLDB (/Users/buildslave/jenkins/workspace/lldb-cmake-sanitized/host-compiler/bin/clang-10-x86_64) :: test_qThreadInfo_matches_qC_launch_llgs (TestLldbGdbServer.LldbGdbServerTestCase) (llgs tests) runCmd: settings set symbols.enable-external-lookup false output:

Hide Details

runCmd: settings set plugin.process.gdb-remote.packet-timeout 60 output:

Hide Details

runCmd: settings set symbols.clang-modules-cache-path "/Users/buildslave/jenkins/workspace/lldb-cmake-sanitized/lldb-build/tools/lldb/lldb-test-build.noindex/module-cache-lldb" output:

Hide Details

runCmd: settings set use-color false output:

Hide Details

Adding tearDown hook: def shutdown_named_pipe(): # Close the pipe. try: named_pipe.close() except: print("failed to close named pipe") None

Hide Details

# Delete the pipe. try: os.remove(named_pipe_path) except: print("failed to delete named pipe: {}".format(named_pipe_path)) None

Hide Details

# Delete the temp directory. try: os.rmdir(temp_dir) except: print( "failed to delete temp dir: {}, directory contents: '{}'".format( temp_dir, os.listdir(temp_dir))) None

Hide Details

Hide Details

Adding tearDown hook: def cleanupSubprocesses(self): # Ensure any subprocesses are cleaned up for p in self.subprocesses: p.terminate() del p del self.subprocesses[:] # Ensure any forked processes are cleaned up for pid in self.forkedProcessPids: if os.path.exists("/proc/" + str(pid)): os.kill(pid, signal.SIGTERM)

Hide Details

Hide Details

Adding tearDown hook: def shutdown_debug_monitor(): try: server.terminate() except: logger.warning( "failed to terminate server for debug monitor: {}; ignoring".format( sys.exc_info()[0]))

Hide Details

Hide Details

Adding tearDown hook: def shutdown_socket(): if sock: try: # send the kill packet so lldb-server shuts down gracefully sock.sendall(GdbRemoteTestCaseBase._GDBREMOTE_KILL_PACKET) except: logger.warning( "failed to send kill packet to debug monitor: {}; ignoring".format( sys.exc_info()[0]))

Hide Details

try: sock.close() except: logger.warning( "failed to close socket to debug monitor: {}; ignoring".format( sys.exc_info()[0]))

Hide Details

Hide Details

Executing tearDown hook: def shutdown_socket(): if sock: try: # send the kill packet so lldb-server shuts down gracefully sock.sendall(GdbRemoteTestCaseBase._GDBREMOTE_KILL_PACKET) except: logger.warning( "failed to send kill packet to debug monitor: {}; ignoring".format( sys.exc_info()[0]))

Hide Details

try: sock.close() except: logger.warning( "failed to close socket to debug monitor: {}; ignoring".format( sys.exc_info()[0]))

Hide Details

Hide Details

Executing tearDown hook: def shutdown_debug_monitor(): try: server.terminate() except: logger.warning( "failed to terminate server for debug monitor: {}; ignoring".format( sys.exc_info()[0]))

Hide Details

Hide Details

Executing tearDown hook: def cleanupSubprocesses(self): # Ensure any subprocesses are cleaned up for p in self.subprocesses: p.terminate() del p del self.subprocesses[:] # Ensure any forked processes are cleaned up for pid in self.forkedProcessPids: if os.path.exists("/proc/" + str(pid)): os.kill(pid, signal.SIGTERM)

Hide Details

Hide Details

Executing tearDown hook: def shutdown_named_pipe(): # Close the pipe. try: named_pipe.close() except: print("failed to close named pipe") None

Hide Details

# Delete the pipe. try: os.remove(named_pipe_path) except: print("failed to delete named pipe: {}".format(named_pipe_path)) None

Hide Details

# Delete the temp directory. try: os.rmdir(temp_dir) except: print( "failed to delete temp dir: {}, directory contents: '{}'".format( temp_dir, os.listdir(temp_dir))) None

Hide Details

Hide Details

PASS: LLDB (/Users/buildslave/jenkins/workspace/lldb-cmake-sanitized/host-compiler/bin/clang-10-x86_64) :: test_software_breakpoint_set_and_remove_work_debugserver (TestLldbGdbServer.LldbGdbServerTestCase) runCmd: settings set symbols.enable-external-lookup false output:

Hide Details

runCmd: settings set plugin.process.gdb-remote.packet-timeout 60 output:

Hide Details

runCmd: settings set symbols.clang-modules-cache-path "/Users/buildslave/jenkins/workspace/lldb-cmake-sanitized/lldb-build/tools/lldb/lldb-test-build.noindex/module-cache-lldb" output:

Hide Details

runCmd: settings set use-color false output:

Hide Details

UNSUPPORTED: LLDB (/Users/buildslave/jenkins/workspace/lldb-cmake-sanitized/host-compiler/bin/clang-10-x86_64) :: test_software_breakpoint_set_and_remove_work_llgs (TestLldbGdbServer.LldbGdbServerTestCase) (llgs tests) runCmd: settings set symbols.enable-external-lookup false output:

Hide Details

runCmd: settings set plugin.process.gdb-remote.packet-timeout 60 output:

Hide Details

runCmd: settings set symbols.clang-modules-cache-path "/Users/buildslave/jenkins/workspace/lldb-cmake-sanitized/lldb-build/tools/lldb/lldb-test-build.noindex/module-cache-lldb" output:

Hide Details

runCmd: settings set use-color false output:

Hide Details

Adding tearDown hook: def shutdown_named_pipe(): # Close the pipe. try: named_pipe.close() except: print("failed to close named pipe") None

Hide Details

# Delete the pipe. try: os.remove(named_pipe_path) except: print("failed to delete named pipe: {}".format(named_pipe_path)) None

Hide Details

# Delete the temp directory. try: os.rmdir(temp_dir) except: print( "failed to delete temp dir: {}, directory contents: '{}'".format( temp_dir, os.listdir(temp_dir))) None

Hide Details

Hide Details

Adding tearDown hook: def cleanupSubprocesses(self): # Ensure any subprocesses are cleaned up for p in self.subprocesses: p.terminate() del p del self.subprocesses[:] # Ensure any forked processes are cleaned up for pid in self.forkedProcessPids: if os.path.exists("/proc/" + str(pid)): os.kill(pid, signal.SIGTERM)

Hide Details

Hide Details

Adding tearDown hook: def shutdown_debug_monitor(): try: server.terminate() except: logger.warning( "failed to terminate server for debug monitor: {}; ignoring".format( sys.exc_info()[0]))

Hide Details

Hide Details

Adding tearDown hook: def shutdown_socket(): if sock: try: # send the kill packet so lldb-server shuts down gracefully sock.sendall(GdbRemoteTestCaseBase._GDBREMOTE_KILL_PACKET) except: logger.warning( "failed to send kill packet to debug monitor: {}; ignoring".format( sys.exc_info()[0]))

Hide Details

try: sock.close() except: logger.warning( "failed to close socket to debug monitor: {}; ignoring".format( sys.exc_info()[0]))

Hide Details

Hide Details

Executing tearDown hook: def shutdown_socket(): if sock: try: # send the kill packet so lldb-server shuts down gracefully sock.sendall(GdbRemoteTestCaseBase._GDBREMOTE_KILL_PACKET) except: logger.warning( "failed to send kill packet to debug monitor: {}; ignoring".format( sys.exc_info()[0]))

Hide Details

try: sock.close() except: logger.warning( "failed to close socket to debug monitor: {}; ignoring".format( sys.exc_info()[0]))

Hide Details

Hide Details

Executing tearDown hook: def shutdown_debug_monitor(): try: server.terminate() except: logger.warning( "failed to terminate server for debug monitor: {}; ignoring".format( sys.exc_info()[0]))

Hide Details

Hide Details

Executing tearDown hook: def cleanupSubprocesses(self): # Ensure any subprocesses are cleaned up for p in self.subprocesses: p.terminate() del p del self.subprocesses[:] # Ensure any forked processes are cleaned up for pid in self.forkedProcessPids: if os.path.exists("/proc/" + str(pid)): os.kill(pid, signal.SIGTERM)

Hide Details

Hide Details

Executing tearDown hook: def shutdown_named_pipe(): # Close the pipe. try: named_pipe.close() except: print("failed to close named pipe") None

Hide Details

# Delete the pipe. try: os.remove(named_pipe_path) except: print("failed to delete named pipe: {}".format(named_pipe_path)) None

Hide Details

# Delete the temp directory. try: os.rmdir(temp_dir) except: print( "failed to delete temp dir: {}, directory contents: '{}'".format( temp_dir, os.listdir(temp_dir))) None

Hide Details

Hide Details

PASS: LLDB (/Users/buildslave/jenkins/workspace/lldb-cmake-sanitized/host-compiler/bin/clang-10-x86_64) :: test_start_no_ack_mode_debugserver (TestLldbGdbServer.LldbGdbServerTestCase) runCmd: settings set symbols.enable-external-lookup false output:

Hide Details

runCmd: settings set plugin.process.gdb-remote.packet-timeout 60 output:

Hide Details

runCmd: settings set symbols.clang-modules-cache-path "/Users/buildslave/jenkins/workspace/lldb-cmake-sanitized/lldb-build/tools/lldb/lldb-test-build.noindex/module-cache-lldb" output:

Hide Details

runCmd: settings set use-color false output:

Hide Details

UNSUPPORTED: LLDB (/Users/buildslave/jenkins/workspace/lldb-cmake-sanitized/host-compiler/bin/clang-10-x86_64) :: test_start_no_ack_mode_llgs (TestLldbGdbServer.LldbGdbServerTestCase) (llgs tests) runCmd: settings set symbols.enable-external-lookup false output:

Hide Details

runCmd: settings set plugin.process.gdb-remote.packet-timeout 60 output:

Hide Details

runCmd: settings set symbols.clang-modules-cache-path "/Users/buildslave/jenkins/workspace/lldb-cmake-sanitized/lldb-build/tools/lldb/lldb-test-build.noindex/module-cache-lldb" output:

Hide Details

runCmd: settings set use-color false output:

Hide Details

Adding tearDown hook: def shutdown_named_pipe(): # Close the pipe. try: named_pipe.close() except: print("failed to close named pipe") None

Hide Details

# Delete the pipe. try: os.remove(named_pipe_path) except: print("failed to delete named pipe: {}".format(named_pipe_path)) None

Hide Details

# Delete the temp directory. try: os.rmdir(temp_dir) except: print( "failed to delete temp dir: {}, directory contents: '{}'".format( temp_dir, os.listdir(temp_dir))) None

Hide Details

Hide Details

Adding tearDown hook: def cleanupSubprocesses(self): # Ensure any subprocesses are cleaned up for p in self.subprocesses: p.terminate() del p del self.subprocesses[:] # Ensure any forked processes are cleaned up for pid in self.forkedProcessPids: if os.path.exists("/proc/" + str(pid)): os.kill(pid, signal.SIGTERM)

Hide Details

Hide Details

Adding tearDown hook: def shutdown_debug_monitor(): try: server.terminate() except: logger.warning( "failed to terminate server for debug monitor: {}; ignoring".format( sys.exc_info()[0]))

Hide Details

Hide Details

Adding tearDown hook: def shutdown_socket(): if sock: try: # send the kill packet so lldb-server shuts down gracefully sock.sendall(GdbRemoteTestCaseBase._GDBREMOTE_KILL_PACKET) except: logger.warning( "failed to send kill packet to debug monitor: {}; ignoring".format( sys.exc_info()[0]))

Hide Details

try: sock.close() except: logger.warning( "failed to close socket to debug monitor: {}; ignoring".format( sys.exc_info()[0]))

Hide Details

Hide Details

Executing tearDown hook: def shutdown_socket(): if sock: try: # send the kill packet so lldb-server shuts down gracefully sock.sendall(GdbRemoteTestCaseBase._GDBREMOTE_KILL_PACKET) except: logger.warning( "failed to send kill packet to debug monitor: {}; ignoring".format( sys.exc_info()[0]))

Hide Details

try: sock.close() except: logger.warning( "failed to close socket to debug monitor: {}; ignoring".format( sys.exc_info()[0]))

Hide Details

Hide Details

Executing tearDown hook: def shutdown_debug_monitor(): try: server.terminate() except: logger.warning( "failed to terminate server for debug monitor: {}; ignoring".format( sys.exc_info()[0]))

Hide Details

Hide Details

Executing tearDown hook: def cleanupSubprocesses(self): # Ensure any subprocesses are cleaned up for p in self.subprocesses: p.terminate() del p del self.subprocesses[:] # Ensure any forked processes are cleaned up for pid in self.forkedProcessPids: if os.path.exists("/proc/" + str(pid)): os.kill(pid, signal.SIGTERM)

Hide Details

Hide Details

Executing tearDown hook: def shutdown_named_pipe(): # Close the pipe. try: named_pipe.close() except: print("failed to close named pipe") None

Hide Details

# Delete the pipe. try: os.remove(named_pipe_path) except: print("failed to delete named pipe: {}".format(named_pipe_path)) None

Hide Details

# Delete the temp directory. try: os.rmdir(temp_dir) except: print( "failed to delete temp dir: {}, directory contents: '{}'".format( temp_dir, os.listdir(temp_dir))) None

Hide Details

Hide Details

PASS: LLDB (/Users/buildslave/jenkins/workspace/lldb-cmake-sanitized/host-compiler/bin/clang-10-x86_64) :: test_thread_suffix_supported_debugserver (TestLldbGdbServer.LldbGdbServerTestCase) runCmd: settings set symbols.enable-external-lookup false output:

Hide Details

runCmd: settings set plugin.process.gdb-remote.packet-timeout 60 output:

Hide Details

runCmd: settings set symbols.clang-modules-cache-path "/Users/buildslave/jenkins/workspace/lldb-cmake-sanitized/lldb-build/tools/lldb/lldb-test-build.noindex/module-cache-lldb" output:

Hide Details

runCmd: settings set use-color false output:

Hide Details

UNSUPPORTED: LLDB (/Users/buildslave/jenkins/workspace/lldb-cmake-sanitized/host-compiler/bin/clang-10-x86_64) :: test_thread_suffix_supported_llgs (TestLldbGdbServer.LldbGdbServerTestCase) (llgs tests) runCmd: settings set symbols.enable-external-lookup false output:

Hide Details

runCmd: settings set plugin.process.gdb-remote.packet-timeout 60 output:

Hide Details

runCmd: settings set symbols.clang-modules-cache-path "/Users/buildslave/jenkins/workspace/lldb-cmake-sanitized/lldb-build/tools/lldb/lldb-test-build.noindex/module-cache-lldb" output:

Hide Details

runCmd: settings set use-color false output:

Hide Details

Adding tearDown hook: def shutdown_named_pipe(): # Close the pipe. try: named_pipe.close() except: print("failed to close named pipe") None

Hide Details

# Delete the pipe. try: os.remove(named_pipe_path) except: print("failed to delete named pipe: {}".format(named_pipe_path)) None

Hide Details

# Delete the temp directory. try: os.rmdir(temp_dir) except: print( "failed to delete temp dir: {}, directory contents: '{}'".format( temp_dir, os.listdir(temp_dir))) None

Hide Details

Hide Details

Adding tearDown hook: def cleanupSubprocesses(self): # Ensure any subprocesses are cleaned up for p in self.subprocesses: p.terminate() del p del self.subprocesses[:] # Ensure any forked processes are cleaned up for pid in self.forkedProcessPids: if os.path.exists("/proc/" + str(pid)): os.kill(pid, signal.SIGTERM)

Hide Details

Hide Details

Adding tearDown hook: def shutdown_debug_monitor(): try: server.terminate() except: logger.warning( "failed to terminate server for debug monitor: {}; ignoring".format( sys.exc_info()[0]))

Hide Details

Hide Details

Adding tearDown hook: def shutdown_socket(): if sock: try: # send the kill packet so lldb-server shuts down gracefully sock.sendall(GdbRemoteTestCaseBase._GDBREMOTE_KILL_PACKET) except: logger.warning( "failed to send kill packet to debug monitor: {}; ignoring".format( sys.exc_info()[0]))

Hide Details

try: sock.close() except: logger.warning( "failed to close socket to debug monitor: {}; ignoring".format( sys.exc_info()[0]))

Hide Details

Hide Details

Executing tearDown hook: def shutdown_socket(): if sock: try: # send the kill packet so lldb-server shuts down gracefully sock.sendall(GdbRemoteTestCaseBase._GDBREMOTE_KILL_PACKET) except: logger.warning( "failed to send kill packet to debug monitor: {}; ignoring".format( sys.exc_info()[0]))

Hide Details

try: sock.close() except: logger.warning( "failed to close socket to debug monitor: {}; ignoring".format( sys.exc_info()[0]))

Hide Details

Hide Details

Executing tearDown hook: def shutdown_debug_monitor(): try: server.terminate() except: logger.warning( "failed to terminate server for debug monitor: {}; ignoring".format( sys.exc_info()[0]))

Hide Details

Hide Details

Executing tearDown hook: def cleanupSubprocesses(self): # Ensure any subprocesses are cleaned up for p in self.subprocesses: p.terminate() del p del self.subprocesses[:] # Ensure any forked processes are cleaned up for pid in self.forkedProcessPids: if os.path.exists("/proc/" + str(pid)): os.kill(pid, signal.SIGTERM)

Hide Details

Hide Details

Executing tearDown hook: def shutdown_named_pipe(): # Close the pipe. try: named_pipe.close() except: print("failed to close named pipe") None

Hide Details

# Delete the pipe. try: os.remove(named_pipe_path) except: print("failed to delete named pipe: {}".format(named_pipe_path)) None

Hide Details

# Delete the temp directory. try: os.rmdir(temp_dir) except: print( "failed to delete temp dir: {}, directory contents: '{}'".format( temp_dir, os.listdir(temp_dir))) None

Hide Details

Hide Details

PASS: LLDB (/Users/buildslave/jenkins/workspace/lldb-cmake-sanitized/host-compiler/bin/clang-10-x86_64) :: test_written_M_content_reads_back_correctly_debugserver (TestLldbGdbServer.LldbGdbServerTestCase) runCmd: settings set symbols.enable-external-lookup false output:

Hide Details

runCmd: settings set plugin.process.gdb-remote.packet-timeout 60 output:

Hide Details

runCmd: settings set symbols.clang-modules-cache-path "/Users/buildslave/jenkins/workspace/lldb-cmake-sanitized/lldb-build/tools/lldb/lldb-test-build.noindex/module-cache-lldb" output:

Hide Details

runCmd: settings set use-color false output:

Hide Details

UNSUPPORTED: LLDB (/Users/buildslave/jenkins/workspace/lldb-cmake-sanitized/host-compiler/bin/clang-10-x86_64) :: test_written_M_content_reads_back_correctly_llgs (TestLldbGdbServer.LldbGdbServerTestCase) (llgs tests) Restore dir to: /Users/buildslave/jenkins/workspace/lldb-cmake-sanitized/lldb-build/tools/lldb/lit ====================================================================== FAIL: test_attach_commandline_continue_app_exits_debugserver (TestLldbGdbServer.LldbGdbServerTestCase) ---------------------------------------------------------------------- Traceback (most recent call last): File "/Users/buildslave/jenkins/workspace/lldb-cmake-sanitized/llvm-project/lldb/packages/Python/lldbsuite/test/decorators.py", line 141, in wrapper func(*args, **kwargs) File "/Users/buildslave/jenkins/workspace/lldb-cmake-sanitized/llvm-project/lldb/packages/Python/lldbsuite/test/tools/lldb-server/TestLldbGdbServer.py", line 231, in test_attach_commandline_continue_app_exits_debugserver self.attach_commandline_continue_app_exits() File "/Users/buildslave/jenkins/workspace/lldb-cmake-sanitized/llvm-project/lldb/packages/Python/lldbsuite/test/tools/lldb-server/TestLldbGdbServer.py", line 203, in attach_commandline_continue_app_exits procs = self.prep_debug_monitor_and_inferior() File "/Users/buildslave/jenkins/workspace/lldb-cmake-sanitized/llvm-project/lldb/packages/Python/lldbsuite/test/tools/lldb-server/gdbremote_testcase.py", line 581, in prep_debug_monitor_and_inferior server = self.connect_to_debug_monitor(attach_pid=attach_pid) File "/Users/buildslave/jenkins/workspace/lldb-cmake-sanitized/llvm-project/lldb/packages/Python/lldbsuite/test/tools/lldb-server/gdbremote_testcase.py", line 415, in connect_to_debug_monitor server = self.launch_debug_monitor(attach_pid=attach_pid) File "/Users/buildslave/jenkins/workspace/lldb-cmake-sanitized/llvm-project/lldb/packages/Python/lldbsuite/test/tools/lldb-server/gdbremote_testcase.py", line 408, in launch_debug_monitor self.port = self.get_stub_port_from_named_socket() File "/Users/buildslave/jenkins/workspace/lldb-cmake-sanitized/llvm-project/lldb/packages/Python/lldbsuite/test/tools/lldb-server/gdbremote_testcase.py", line 214, in get_stub_port_from_named_socket "write side of pipe has not written anything - stub isn't writing to pipe.") AssertionError: 0 == 0 : write side of pipe has not written anything - stub isn't writing to pipe. Config=x86_64-/Users/buildslave/jenkins/workspace/lldb-cmake-sanitized/host-compiler/bin/clang-10 ---------------------------------------------------------------------- Ran 65 tests in 246.450s

Hide Details

RESULT: FAILED (29 passes, 1 failures, 0 errors, 34 skipped, 1 expected failures, 0 unexpected successes)

Hide Details

******************** PASS: lldb-Suite :: functionalities/dead-strip/TestDeadStrip.py (966 of 1696) PASS: lldb-Unit :: Utility/./UtilityTests/OptionsWithRawTest.LeadingSpaceArgs (967 of 1696) PASS: lldb-Unit :: Host/./HostTests/FileSystemTest.Exists (968 of 1696) PASS: LLDB :: SymbolFile/Breakpad/line-table-missing-file.test (969 of 1696) PASS: lldb-Suite :: functionalities/darwin_log/filter/regex/category/TestDarwinLogFilterRegexCategory.py (970 of 1696) PASS: lldb-Unit :: Interpreter/./InterpreterTests/CompletionTest.DirCompletionAbsolute (971 of 1696) PASS: lldb-Suite :: commands/breakpoint/basic/TestBreakpointCommandsFromPython.py (972 of 1696) PASS: LLDB :: Register/x86-64-gp-read.test (973 of 1696) PASS: lldb-Unit :: Utility/./UtilityTests/StringLexerTest.PutBack (974 of 1696) PASS: lldb-Suite :: commands/process/launch-with-shellexpand/TestLaunchWithShellExpand.py (975 of 1696) PASS: lldb-Suite :: lang/objc/objc-ivar-offsets/TestObjCIvarOffsets.py (976 of 1696) PASS: lldb-Suite :: lang/cpp/modules-import/TestCXXModulesImport.py (977 of 1696) PASS: lldb-Suite :: functionalities/longjmp/TestLongjmp.py (978 of 1696) PASS: LLDB :: Modules/ELF/PT_LOAD.yaml (979 of 1696) PASS: LLDB :: SymbolFile/DWARF/gnu-style-compression.cpp (980 of 1696) PASS: lldb-Suite :: commands/register/register/register_command/TestRegisters.py (981 of 1696) PASS: LLDB :: SymbolFile/NativePDB/break-by-line.cpp (982 of 1696) PASS: lldb-Unit :: Utility/./UtilityTests/OptionsWithRawTest.EmptyArgsOnlySuffix (983 of 1696) PASS: lldb-Unit :: UnwindAssembly/x86/./UnwindAssemblyx86Tests/Testx86AssemblyInspectionEngine.TestMovRSPtoRBP (984 of 1696) PASS: lldb-Unit :: Utility/./UtilityTests/UriParserTest.BracketedHostname (985 of 1696) PASS: lldb-Suite :: lang/c/stepping/TestStepAndBreakpoints.py (986 of 1696) PASS: lldb-Unit :: Symbol/./SymbolTests/PostfixExpression.ParseFPOProgram (987 of 1696) PASS: lldb-Suite :: functionalities/data-formatter/data-formatter-synthval/TestDataFormatterSynthVal.py (988 of 1696) PASS: LLDB :: Breakpoint/debug_addrx.test (989 of 1696) PASS: lldb-Unit :: Core/./LLDBCoreTests/RichManglingContextTest.SwitchProvider (990 of 1696) PASS: lldb-Suite :: python_api/interpreter/TestRunCommandInterpreterAPI.py (991 of 1696) PASS: lldb-Suite :: lang/objcxx/class-name-clash/TestNameClash.py (992 of 1696) PASS: lldb-Unit :: Utility/./UtilityTests/RegularExpression.Valid (993 of 1696) PASS: lldb-Suite :: functionalities/tail_call_frames/thread_step_out_or_return/TestSteppingOutWithArtificialFrames.py (994 of 1696) PASS: lldb-Unit :: SymbolFile/NativePDB/./SymbolFileNativePDBTests/PDBFPOProgramToDWARFExpressionTests.InvalidOpBinary (995 of 1696) PASS: lldb-Unit :: Utility/./UtilityTests/ArgsTest.TestSingleArgWithQuotedSpace (996 of 1696) PASS: lldb-Unit :: Utility/./UtilityTests/StreamTeeTest.Constructor1Stream (997 of 1696) PASS: LLDB :: SymbolFile/sizeless-symbol.test (998 of 1696) PASS: lldb-Suite :: lang/c/array_types/TestArrayTypes.py (999 of 1696) PASS: lldb-Suite :: lang/cpp/gmodules-templates/TestGModules.py (1000 of 1696) PASS: lldb-Unit :: Expression/./ExpressionTests/DiagnosticManagerTest.PutString (1001 of 1696) PASS: LLDB :: BuildScript/script-args.test (1002 of 1696) PASS: lldb-Suite :: functionalities/darwin_log/format/TestDarwinLogMessageFormat.py (1003 of 1696) PASS: lldb-Unit :: Process/gdb-remote/./ProcessGdbRemoteTests/GDBRemoteClientBaseTest.SendContinueAndLateInterrupt (1004 of 1696) PASS: lldb-Unit :: Utility/./UtilityTests/OptionsWithRawTest.EmptySuffix (1005 of 1696) PASS: lldb-Suite :: functionalities/memory/find/TestMemoryFind.py (1006 of 1696) PASS: LLDB :: Reproducer/TestGDBRemoteRepro.test (1007 of 1696) PASS: lldb-Unit :: ScriptInterpreter/Python/./ScriptInterpreterPythonTests/PythonDataObjectsTest.TestPythonFile (1008 of 1696) PASS: lldb-Unit :: Interpreter/./InterpreterTests/CompletionTest.DirCompletionUsername (1009 of 1696) PASS: lldb-Unit :: Utility/./UtilityTests/StringExtractorTest.GetU32BigEndian (1010 of 1696) PASS: LLDB :: SymbolFile/DWARF/debug_ranges.s (1011 of 1696) PASS: lldb-Unit :: Utility/./UtilityTests/OptionsWithRawTest.SingleWhitespaceInput (1012 of 1696) PASS: lldb-Suite :: functionalities/tail_call_frames/disambiguate_paths_to_common_sink/TestDisambiguatePathsToCommonSink.py (1013 of 1696) PASS: lldb-Suite :: commands/log/invalid-args/TestInvalidArgsLog.py (1014 of 1696) PASS: lldb-Unit :: Utility/./UtilityTests/DataExtractorTest.GetMaxU64_unchecked (1015 of 1696) PASS: lldb-Unit :: Host/./HostTests/NativeProcessProtocolTest.ReadMemoryWithoutTrap (1016 of 1696) PASS: LLDB :: Minidump/Windows/Sigsegv/sigsegv.test (1017 of 1696) PASS: lldb-Suite :: python_api/class_members/TestSBTypeClassMembers.py (1018 of 1696) PASS: lldb-Suite :: functionalities/memory/cache/TestMemoryCache.py (1019 of 1696) PASS: lldb-Unit :: Process/minidump/./LLDBMinidumpTests/MinidumpParserTest.InvalidMinidump (1020 of 1696) PASS: lldb-Suite :: lang/cpp/overloaded-functions/TestOverloadedFunctions.py (1021 of 1696) PASS: lldb-Suite :: lang/objc/modules-inline-functions/TestModulesInlineFunctions.py (1022 of 1696) PASS: lldb-Unit :: Utility/./UtilityTests/CompletionRequest.DuplicateFilteringWithComments (1023 of 1696) PASS: lldb-Suite :: functionalities/darwin_log/filter/regex/message/TestDarwinLogFilterRegexMessage.py (1024 of 1696) PASS: lldb-Unit :: Utility/./UtilityTests/BinaryStreamTest.PutULEB128EightBytes (1025 of 1696) PASS: lldb-Unit :: Utility/./UtilityTests/OptionsWithRawTest.ArgsButNoLeadingDash (1026 of 1696) PASS: lldb-Unit :: Utility/./UtilityTests/OptionsWithRawTest.SingleWordSuffix (1027 of 1696) PASS: lldb-Suite :: macosx/find-dsym/bundle-with-dot-in-filename/TestBundleWithDotInFilename.py (1028 of 1696) PASS: lldb-Suite :: commands/expression/persistent_types/TestPersistentTypes.py (1029 of 1696) PASS: LLDB :: Breakpoint/debug_rnglist_basic.test (1030 of 1696) PASS: LLDB :: Reproducer/TestDriverOptions.test (1031 of 1696) PASS: lldb-Unit :: Utility/./UtilityTests/ArchSpecTest.Compatibility (1032 of 1696) PASS: lldb-Suite :: tools/lldb-server/TestGdbRemoteSingleStep.py (1033 of 1696) PASS: lldb-Suite :: commands/expression/import-std-module/shared_ptr/TestSharedPtr.py (1034 of 1696) PASS: lldb-Unit :: SymbolFile/DWARF/./SymbolFileDWARFTests/SymbolFileDWARFTests.TestAbbrevOrder1Start1 (1035 of 1696) PASS: lldb-Suite :: functionalities/postmortem/wow64_minidump/TestWow64MiniDump.py (1036 of 1696) PASS: lldb-Unit :: UnwindAssembly/x86/./UnwindAssemblyx86Tests/Testx86AssemblyInspectionEngine.TestSimplei386ugmented (1037 of 1696) PASS: lldb-Suite :: functionalities/data-formatter/data-formatter-globals/TestDataFormatterGlobals.py (1038 of 1696) PASS: lldb-Unit :: Host/./HostTests/MainLoopTest.UnmonitoredSignal (1039 of 1696) PASS: lldb-Suite :: commands/expression/scoped_enums/TestScopedEnumType.py (1040 of 1696) PASS: lldb-Unit :: Utility/./UtilityTests/FileSpecTest.RemoveLastPathComponent (1041 of 1696) PASS: lldb-Unit :: SymbolFile/DWARF/./SymbolFileDWARFTests/SymbolFileDWARFTests.TestAbbrevOrder1Start5 (1042 of 1696) PASS: lldb-Suite :: sample_test/TestSampleInlineTest.py (1043 of 1696) PASS: lldb-Suite :: macosx/duplicate-archive-members/TestDuplicateMembers.py (1044 of 1696) PASS: lldb-Unit :: Utility/./UtilityTests/RangeTest.ContainsRangeStartingFromZero (1045 of 1696) PASS: lldb-Unit :: Utility/./UtilityTests/StreamTeeTest.CopyConstructor (1046 of 1696) PASS: lldb-Suite :: functionalities/data-formatter/data-formatter-objc/TestDataFormatterObjCCF.py (1047 of 1696) PASS: lldb-Suite :: tools/lldb-vscode/attach/TestVSCode_attach.py (1048 of 1696) PASS: lldb-Suite :: python_api/debugger/TestDebuggerAPI.py (1049 of 1696) PASS: lldb-Suite :: commands/expression/call-function/TestCallStopAndContinue.py (1050 of 1696) PASS: lldb-Unit :: Utility/./UtilityTests/StringExtractorTest.GetHexU8_Extra (1051 of 1696) PASS: lldb-Unit :: Utility/./UtilityTests/StreamTeeTest.Flush (1052 of 1696) PASS: lldb-Unit :: Utility/./UtilityTests/ArgsTest.BareSingleQuote (1053 of 1696) PASS: lldb-Unit :: Language/Highlighting/./HighlighterTests/HighlighterTest.Keywords (1054 of 1696) PASS: LLDB :: Modules/MachO/subsections.yaml (1055 of 1696) PASS: lldb-Unit :: UnwindAssembly/x86/./UnwindAssemblyx86Tests/Testx86AssemblyInspectionEngine.TestStackRealignMSVC_i386 (1056 of 1696) PASS: lldb-Unit :: Utility/./UtilityTests/StringListTest.DefaultConstructor (1057 of 1696) PASS: lldb-Suite :: functionalities/thread/concurrent_events/TestConcurrentWatchpointDelayWatchpointOneBreakpoint.py (1058 of 1696) PASS: lldb-Suite :: benchmarks/startup/TestStartupDelays.py (1059 of 1696) PASS: lldb-Suite :: lang/c/conflicting-symbol/TestConflictingSymbol.py (1060 of 1696) PASS: lldb-Unit :: UnwindAssembly/x86/./UnwindAssemblyx86Tests/Testx86AssemblyInspectionEngine.TestPopR14 (1061 of 1696) PASS: lldb-Suite :: functionalities/step-avoids-no-debug/TestStepNoDebug.py (1062 of 1696) PASS: lldb-Suite :: python_api/watchpoint/TestWatchpointIter.py (1063 of 1696) PASS: lldb-Unit :: Utility/./UtilityTests/StreamTeeTest.AppendStream (1064 of 1696) PASS: lldb-Unit :: Process/gdb-remote/./ProcessGdbRemoteTests/GDBRemoteCommunicationClientTest.GetMemoryRegionInfoInvalidResponse (1065 of 1696) PASS: lldb-Suite :: python_api/watchpoint/TestWatchpointIgnoreCount.py (1066 of 1696) PASS: LLDB :: SymbolFile/Breakpad/line-table-discontinuous-file-ids.test (1067 of 1696) PASS: lldb-Unit :: Utility/./UtilityTests/RangeTest.Union (1068 of 1696) PASS: LLDB :: Modules/ELF/section-types.yaml (1069 of 1696) PASS: lldb-Unit :: ScriptInterpreter/Python/./ScriptInterpreterPythonTests/PythonDataObjectsTest.TestPythonIntegerToStructuredInteger (1070 of 1696) PASS: lldb-Suite :: commands/watchpoints/multiple_threads/TestWatchpointMultipleThreads.py (1071 of 1696) PASS: lldb-Unit :: Utility/./UtilityTests/UriParserTest.TypicalPortPath (1072 of 1696) PASS: lldb-Suite :: functionalities/data-formatter/user-format-vs-summary/TestUserFormatVsSummary.py (1073 of 1696) PASS: lldb-Unit :: UnwindAssembly/x86/./UnwindAssemblyx86Tests/Testx86AssemblyInspectionEngine.TestPopEBX (1074 of 1696) PASS: lldb-Suite :: macosx/universal/TestUniversal.py (1075 of 1696) PASS: LLDB :: Modules/ELF/basic-info.yaml (1076 of 1696) PASS: lldb-Unit :: Expression/./ExpressionTests/DiagnosticManagerTest.GetStringBasic (1077 of 1696) PASS: lldb-Unit :: Utility/./UtilityTests/FileSpecTest.GetNormalizedPath (1078 of 1696) PASS: lldb-Unit :: Utility/./UtilityTests/OptionsWithRawTest.QuotedSuffix (1079 of 1696) PASS: lldb-Unit :: Utility/./UtilityTests/RecordReplayTest.InstrumentedBar (1080 of 1696) PASS: lldb-Suite :: lang/c/anonymous/TestAnonymous.py (1081 of 1696) PASS: lldb-Suite :: functionalities/data-formatter/data-formatter-smart-array/TestDataFormatterSmartArray.py (1082 of 1696) PASS: lldb-Unit :: Utility/./UtilityTests/ReproducerTest.SetCapture (1083 of 1696) PASS: lldb-Suite :: lang/cpp/extern_c/TestExternCSymbols.py (1084 of 1696) PASS: LLDB :: Unwind/eh-frame-dwarf-unwind.test (1085 of 1696) PASS: lldb-Suite :: lang/objc/foundation/TestObjectDescriptionAPI.py (1086 of 1696) PASS: lldb-Unit :: Utility/./UtilityTests/AnsiTerminal.WhiteSpace (1087 of 1696) PASS: lldb-Suite :: functionalities/data-formatter/data-formatter-stl/libcxx/multimap/TestDataFormatterLibccMultiMap.py (1088 of 1696) PASS: lldb-Unit :: Utility/./UtilityTests/ScalarTest.ComparisonFloat (1089 of 1696) PASS: lldb-Unit :: UnwindAssembly/x86/./UnwindAssemblyx86Tests/Testx86AssemblyInspectionEngine.TestSubESP (1090 of 1696) PASS: lldb-Unit :: Utility/./UtilityTests/FileSpecTest.FileAndDirectoryComponents (1091 of 1696) PASS: lldb-Unit :: Expression/./ExpressionTests/DiagnosticManagerTest.GetStringMultiline (1092 of 1696) PASS: lldb-Unit :: Utility/./UtilityTests/LogTest.Register (1093 of 1696) UNSUPPORTED: LLDB :: Unwind/eh-frame-small-fde.test (1094 of 1696) PASS: lldb-Unit :: ObjectFile/Breakpad/./ObjectFileBreakpadTests/FuncRecord.parse (1095 of 1696) PASS: lldb-Suite :: commands/expression/argument_passing_restrictions/TestArgumentPassingRestrictions.py (1096 of 1696) PASS: lldb-Suite :: commands/watchpoints/watchpoint_on_vectors/TestValueOfVectorVariable.py (1097 of 1696) PASS: lldb-Suite :: lang/c/unions/TestUnionMembers.py (1098 of 1696) PASS: lldb-Suite :: macosx/macabi/TestMacABImacOSFramework.py (1099 of 1696) PASS: LLDB :: SymbolFile/DWARF/forward-declarations.s (1100 of 1696) PASS: lldb-Suite :: driver/batch_mode/TestBatchMode.py (1101 of 1696) PASS: lldb-Unit :: Utility/./UtilityTests/GeneratorTest.Get (1102 of 1696) PASS: lldb-Unit :: Utility/./UtilityTests/VASprintfTest.BufferResize (1103 of 1696) PASS: lldb-Suite :: lang/objc/objc-optimized/TestObjcOptimized.py (1104 of 1696) PASS: lldb-Suite :: commands/expression/xvalue/TestXValuePrinting.py (1105 of 1696) XFAIL: LLDB :: Register/x86-mm-xmm-write.test (1106 of 1696) PASS: lldb-Suite :: commands/expression/completion-in-lambda-and-unnnamed-class/TestCompletionInLambdaAndUnnamedClass.py (1107 of 1696) PASS: lldb-Suite :: lang/objc/real-definition/TestRealDefinition.py (1108 of 1696) PASS: lldb-Suite :: types/TestFloatTypes.py (1109 of 1696) PASS: lldb-Unit :: Utility/./UtilityTests/SerializationRountripTest.SerializeDeserializeCString (1110 of 1696) PASS: lldb-Unit :: UnwindAssembly/x86/./UnwindAssemblyx86Tests/Testx86AssemblyInspectionEngine.TestPopRBP (1111 of 1696) PASS: lldb-Suite :: functionalities/postmortem/elf-core/TestLinuxCore.py (1112 of 1696) PASS: lldb-Suite :: commands/settings/quoting/TestQuoting.py (1113 of 1696) PASS: lldb-Unit :: Utility/./UtilityTests/ScalarTest.Comparison (1114 of 1696) PASS: lldb-Unit :: Process/minidump/./LLDBMinidumpTests/MinidumpParserTest.MinidumpModuleOrder (1115 of 1696) PASS: lldb-Unit :: SymbolFile/DWARF/./SymbolFileDWARFTests/SymbolFileDWARFTests.TestAbbrevInvalidNULLTag (1116 of 1696) PASS: lldb-Unit :: Language/Highlighting/./HighlighterTests/HighlighterTest.ClangScalarLiterals (1117 of 1696) PASS: lldb-Suite :: tools/lldb-server/TestGdbRemoteAttach.py (1118 of 1696) PASS: lldb-Suite :: functionalities/object-file/TestImageListMultiArchitecture.py (1119 of 1696) PASS: lldb-Suite :: lang/c/blocks/TestBlocks.py (1120 of 1696) PASS: lldb-Unit :: Utility/./UtilityTests/StringListTest.JoinEmpty (1121 of 1696) PASS: lldb-Unit :: Utility/./UtilityTests/StreamTest.PutMaxHex64ByteOrderLittle (1122 of 1696) PASS: lldb-Unit :: Language/Highlighting/./HighlighterTests/HighlighterTest.ClangCursorPosAfterOtherToken (1123 of 1696) PASS: lldb-Suite :: python_api/function_symbol/TestDisasmAPI.py (1124 of 1696) PASS: LLDB :: Modules/MachO/lc_build_version.yaml (1125 of 1696) PASS: lldb-Suite :: lang/objc/foundation/TestObjCMethodsString.py (1126 of 1696) PASS: lldb-Suite :: functionalities/data-formatter/data-formatter-objc/TestDataFormatterObjCKVO.py (1127 of 1696) PASS: lldb-Unit :: Language/Highlighting/./HighlighterTests/HighlighterTest.ClangCommas (1128 of 1696) PASS: LLDB :: SymbolFile/DWARF/debug-types-dwarf5.s (1129 of 1696) PASS: lldb-Unit :: Utility/./UtilityTests/JSONTest.Dictionary (1130 of 1696) PASS: lldb-Suite :: lang/cpp/gmodules/TestWithModuleDebugging.py (1131 of 1696) PASS: lldb-Unit :: Utility/./UtilityTests/StreamTest.ChangingByteOrder (1132 of 1696) PASS: LLDB :: Modules/Breakpad/discontiguous-sections.test (1133 of 1696) PASS: lldb-Unit :: Language/Highlighting/./HighlighterTests/HighlighterTest.Colons (1134 of 1696) PASS: lldb-Unit :: Utility/./UtilityTests/FileSpecTest.CopyByAppendingPathComponent (1135 of 1696) PASS: lldb-Unit :: Utility/./UtilityTests/StringListTest.LongestCommonPrefixDuplicateElement (1136 of 1696) PASS: lldb-Suite :: lang/cpp/nsimport/TestCppNsImport.py (1137 of 1696) PASS: lldb-Suite :: lang/mixed/TestMixedLanguages.py (1138 of 1696) PASS: lldb-Suite :: tools/lldb-server/signal-filtering/TestGdbRemote_QPassSignals.py (1139 of 1696) PASS: lldb-Unit :: Utility/./UtilityTests/FileSpecTest.GuessPathStyle (1140 of 1696) PASS: LLDB :: Driver/TestTarget.test (1141 of 1696) PASS: lldb-Unit :: Utility/./UtilityTests/ArgsTest.GetQuotedCommandString (1142 of 1696) PASS: lldb-Unit :: UnwindAssembly/x86/./UnwindAssemblyx86Tests/Testx86AssemblyInspectionEngine.TestPushRBX (1143 of 1696) PASS: lldb-Suite :: python_api/findvalue_duplist/TestSBFrameFindValue.py (1144 of 1696) PASS: lldb-Suite :: commands/watchpoints/watchpoint_commands/command/TestWatchpointCommandLLDB.py (1145 of 1696) PASS: lldb-Suite :: functionalities/data-formatter/varscript_formatting/TestDataFormatterVarScriptFormatting.py (1146 of 1696) PASS: lldb-Suite :: functionalities/thread/concurrent_events/TestConcurrentManyBreakpoints.py (1147 of 1696) PASS: lldb-Suite :: functionalities/darwin_log/source/debug/TestDarwinLogSourceDebug.py (1148 of 1696) PASS: lldb-Suite :: commands/expression/call-overridden-method/TestCallOverriddenMethod.py (1149 of 1696) PASS: lldb-Unit :: SymbolFile/DWARF/./SymbolFileDWARFTests/SymbolFileDWARFTests.TestAbbrevNullAttrValidForm (1150 of 1696) PASS: lldb-Suite :: python_api/symbol-context/TestSymbolContext.py (1151 of 1696) PASS: lldb-Unit :: Utility/./UtilityTests/BinaryStreamTest.PutULEB128One (1152 of 1696) PASS: lldb-Suite :: lang/objc/foundation/TestObjCMethods2.py (1153 of 1696) PASS: lldb-Unit :: Utility/./UtilityTests/StringListTest.JoinThree (1154 of 1696) PASS: lldb-Unit :: Utility/./UtilityTests/OptionsWithRawTest.UnterminatedQuote (1155 of 1696) PASS: lldb-Suite :: python_api/watchpoint/condition/TestWatchpointConditionAPI.py (1156 of 1696) PASS: lldb-Unit :: Host/./HostTests/NativeProcessProtocolTest.ReadCStringFromMemory_MaxSize (1157 of 1696) PASS: lldb-Suite :: commands/expression/call-restarts/TestCallThatRestarts.py (1158 of 1696) PASS: lldb-Unit :: Utility/./UtilityTests/ArgsTest.TestQuotedTrailingBackslash (1159 of 1696) PASS: lldb-Unit :: Utility/./UtilityTests/ArgsTest.TestSingleArg (1160 of 1696) PASS: LLDB :: SymbolFile/NativePDB/tag-types.cpp (1161 of 1696) PASS: lldb-Unit :: Utility/./UtilityTests/ProcessInstanceInfo.Dump (1162 of 1696) PASS: lldb-Suite :: lang/objc/unicode-string/TestUnicodeString.py (1163 of 1696) PASS: lldb-Unit :: UnwindAssembly/x86/./UnwindAssemblyx86Tests/Testx86AssemblyInspectionEngine.TestPushR13 (1164 of 1696) FAIL: lldb-Suite :: commands/expression/multiline-completion/TestMultilineCompletion.py (1165 of 1696) ******************** TEST 'lldb-Suite :: commands/expression/multiline-completion/TestMultilineCompletion.py' FAILED ******************** lldb version 10.0.99 (http://labmaster3.local/git/llvm-project.git revision bf1a23ad0e77b4f41c65b17731d443dc553f5911) clang revision bf1a23ad0e77b4f41c65b17731d443dc553f5911 llvm revision bf1a23ad0e77b4f41c65b17731d443dc553f5911 LLDB library dir: /Users/buildslave/jenkins/workspace/lldb-cmake-sanitized/lldb-build/bin LLDB import library dir: /Users/buildslave/jenkins/workspace/lldb-cmake-sanitized/lldb-build/bin libstdcxx tests will not be run because: Don't know how to build with libstdcxx on macosx Skipping following debug info categories: ['dwo'] (lldb) settings set symbols.enable-external-lookup false (lldb) settings set plugin.process.gdb-remote.packet-timeout 60 (lldb) settings set symbols.clang-modules-cache-path "/Users/buildslave/jenkins/workspace/lldb-cmake-sanitized/lldb-build/tools/lldb/lldb-test-build.noindex/module-cache-lldb" (lldb) settings set use-color false (lldb) target create "/Users/buildslave/jenkins/workspace/lldb-cmake-sanitized/lldb-build/tools/lldb/lldb-test-build.noindex/commands/expression/multiline-completion/TestMultilineCompletion.test_basic_completion/a.out" Current executable set to '/Users/buildslave/jenkins/workspace/lldb-cmake-sanitized/lldb-build/tools/lldb/lldb-test-build.noindex/commands/expression/multiline-completion/TestMultilineCompletion.test_basic_completion/a.out' (x86_64). (lldb) b main b main Breakpoint 1: where = a.out`main + 18 at main.c:2:7, address = 0x0000000100000fa2 (lldb) run run Process 28813 launched: '/Users/buildslave/jenkins/workspace/lldb-cmake-sanitized/lldb-build/tools/lldb/lldb-test-build.noindex/commands/expression/multiline-completion/TestMultilineCompletion.test_basic_completion/a.out' (x86_64) Process 28813 stopped * thread #1, queue = 'com.apple.main-thread', stop reason = breakpoint 1.1 frame #0: 0x0000000100000fa2 a.out`main(argc=1, argv=0x00007ffeefbff4d0) at main.c:2:7 1 int main(int argc, char **argv) { -> 2 int to_complete = 0; ^ 3 return to_complete; 4 } (lldb) expr expr Enter expressions, then terminate with an empty line to evaluate: to_  1:  1: to_ to_  1: to_complete

Hide Details

 1: to_complete 2:  2:  (int) $0 = 0 (lldb) settings set interpreter.prompt-on-quit false

Hide Details

Session logs for test failures/errors/unexpected successes will go into directory '/Users/buildslave/jenkins/workspace/lldb-cmake-sanitized/test/logs' Command invoked: /Users/buildslave/jenkins/workspace/lldb-cmake-sanitized/llvm-project/lldb/test/dotest.py --arch=x86_64 -s /Users/buildslave/jenkins/workspace/lldb-cmake-sanitized/lldb-build/lldb-test-traces -S nm -u CXXFLAGS -u CFLAGS --executable /Users/buildslave/jenkins/workspace/lldb-cmake-sanitized/lldb-build/./bin/lldb --dsymutil /Users/buildslave/jenkins/workspace/lldb-cmake-sanitized/lldb-build/./bin/dsymutil --filecheck /Users/buildslave/jenkins/workspace/lldb-cmake-sanitized/lldb-build/./bin/FileCheck -C /Users/buildslave/jenkins/workspace/lldb-cmake-sanitized/host-compiler/bin/clang --codesign-identity lldb_codesign --server /Users/buildslave/jenkins/workspace/lldb-cmake-sanitized/lldb-build/./bin/debugserver --arch x86_64 --build-dir /Users/buildslave/jenkins/workspace/lldb-cmake-sanitized/lldb-build/lldb-test-build.noindex -s=/Users/buildslave/jenkins/workspace/lldb-cmake-sanitized/test/logs -t --env TERM=vt100 --env LLVM_LIBS_DIR=/Users/buildslave/jenkins/workspace/lldb-cmake-sanitized/lldb-build/./lib --build-dir /Users/buildslave/jenkins/workspace/lldb-cmake-sanitized/lldb-build/tools/lldb/lldb-test-build.noindex --module-cache-dir /Users/buildslave/jenkins/workspace/lldb-cmake-sanitized/lldb-build/tools/lldb/lldb-test-build.noindex/module-cache-lldb /Users/buildslave/jenkins/workspace/lldb-cmake-sanitized/llvm-project/lldb/packages/Python/lldbsuite/test/commands/expression/multiline-completion -p TestMultilineCompletion.py Change dir to: /Users/buildslave/jenkins/workspace/lldb-cmake-sanitized/llvm-project/lldb/packages/Python/lldbsuite/test/commands/expression/multiline-completion runCmd: settings set symbols.enable-external-lookup false output:

Hide Details

runCmd: settings set plugin.process.gdb-remote.packet-timeout 60 output:

Hide Details

runCmd: settings set symbols.clang-modules-cache-path "/Users/buildslave/jenkins/workspace/lldb-cmake-sanitized/lldb-build/tools/lldb/lldb-test-build.noindex/module-cache-lldb" output:

Hide Details

runCmd: settings set use-color false output:

Hide Details

FAIL: LLDB (/Users/buildslave/jenkins/workspace/lldb-cmake-sanitized/host-compiler/bin/clang-10-x86_64) :: test_basic_completion (TestMultilineCompletion.MultilineCompletionTest) tearing down the child process....

Hide Details

CLEANUP ERROR: LLDB (/Users/buildslave/jenkins/workspace/lldb-cmake-sanitized/host-compiler/bin/clang-10-x86_64) :: test_basic_completion (TestMultilineCompletion.MultilineCompletionTest) Restore dir to: /Users/buildslave/jenkins/workspace/lldb-cmake-sanitized/lldb-build/tools/lldb/lit ====================================================================== ERROR: test_basic_completion (TestMultilineCompletion.MultilineCompletionTest) Test that we can complete a simple multiline expression ---------------------------------------------------------------------- Traceback (most recent call last): File "/Users/buildslave/jenkins/workspace/lldb-cmake-sanitized/llvm-project/lldb/packages/Python/lldbsuite/test/commands/expression/multiline-completion/TestMultilineCompletion.py", line 30, in test_basic_completion self.quit() File "/Users/buildslave/jenkins/workspace/lldb-cmake-sanitized/llvm-project/lldb/packages/Python/lldbsuite/test/lldbpexpect.py", line 61, in quit self.child.close(force=not gracefully) File "/Users/buildslave/jenkins/workspace/lldb-cmake-sanitized/llvm-project/lldb/third_party/Python/module/pexpect-4.6/pexpect/pty_spawn.py", line 327, in close self.ptyproc.close(force=force) File "/System/Library/Frameworks/Python.framework/Versions/2.7/lib/python2.7/contextlib.py", line 35, in __exit__ self.gen.throw(type, value, traceback) File "/Users/buildslave/jenkins/workspace/lldb-cmake-sanitized/llvm-project/lldb/third_party/Python/module/pexpect-4.6/pexpect/pty_spawn.py", line 25, in _wrap_ptyprocess_err raise ExceptionPexpect(*e.args) ExceptionPexpect: Could not terminate the child. Config=x86_64-/Users/buildslave/jenkins/workspace/lldb-cmake-sanitized/host-compiler/bin/clang-10 ---------------------------------------------------------------------- Ran 1 test in 9.720s

Hide Details

RESULT: FAILED (0 passes, 0 failures, 1 errors, 0 skipped, 0 expected failures, 0 unexpected successes)

Hide Details

******************** PASS: lldb-Unit :: ScriptInterpreter/Python/./ScriptInterpreterPythonTests/PythonDataObjectsTest.TestPythonCallableInvoke (1166 of 1696) PASS: lldb-Suite :: tools/lldb-vscode/step/TestVSCode_step.py (1167 of 1696) PASS: lldb-Suite :: benchmarks/stepping/TestSteppingSpeed.py (1168 of 1696) PASS: LLDB :: Quit/TestQuitExitCodeHexA.test (1169 of 1696) PASS: lldb-Unit :: Utility/./UtilityTests/StringListTest.ForRange (1170 of 1696) PASS: lldb-Unit :: ScriptInterpreter/Python/./ScriptInterpreterPythonTests/PythonDataObjectsTest.TestPythonTupleInitializerList (1171 of 1696) PASS: lldb-Unit :: Language/CPlusPlus/./LanguageCPlusPlusTests/CPlusPlusLanguage.MethodNameParsing (1172 of 1696) PASS: lldb-Unit :: ScriptInterpreter/Python/./ScriptInterpreterPythonTests/PythonDataObjectsTest.TestPythonInteger (1173 of 1696) PASS: lldb-Suite :: lang/cpp/dynamic-value/TestDynamicValue.py (1174 of 1696) PASS: lldb-Unit :: Process/gdb-remote/./ProcessGdbRemoteTests/GDBRemoteCommunicationClientTest.SendGetDataPacket (1175 of 1696) PASS: lldb-Suite :: lang/objc/objc-new-syntax/TestObjCNewSyntaxLiteral.py (1176 of 1696) PASS: LLDB :: Breakpoint/debug_rnglistx_rlex.test (1177 of 1696) PASS: lldb-Unit :: Interpreter/./InterpreterTests/OptionArgParserTest.toChar (1178 of 1696) PASS: LLDB :: BuildScript/compiler-full-path.test (1179 of 1696) PASS: lldb-Suite :: functionalities/pre_run_dylibs/TestPreRunDylibs.py (1180 of 1696) PASS: lldb-Suite :: lang/objc/modules-cache/TestClangModulesCache.py (1181 of 1696) PASS: lldb-Unit :: Process/gdb-remote/./ProcessGdbRemoteTests/GDBRemoteCommunicationClientTest.WriteRegister (1182 of 1696) PASS: lldb-Suite :: commands/expression/call-function/TestCallBuiltinFunction.py (1183 of 1696) PASS: lldb-Unit :: Process/gdb-remote/./ProcessGdbRemoteTests/GDBRemoteClientBaseTest.SendContinueAndInterrupt2PacketBug (1184 of 1696) PASS: lldb-Unit :: Process/gdb-remote/./ProcessGdbRemoteTests/GDBRemoteCommunicationClientTest.ReadRegister (1185 of 1696) PASS: lldb-Unit :: Host/./HostTests/NativeProcessProtocolTest.ReadCStringFromMemory_CrossPageBoundary (1186 of 1696) PASS: lldb-Suite :: functionalities/wrong_commands/TestWrongCommands.py (1187 of 1696) PASS: lldb-Suite :: functionalities/data-formatter/data-formatter-stl/libcxx/list/TestDataFormatterLibcxxList.py (1188 of 1696) PASS: lldb-Suite :: functionalities/tsan/thread_numbers/TestTsanThreadNumbers.py (1189 of 1696) PASS: lldb-Suite :: functionalities/data-formatter/data-formatter-stl/libstdcpp/string/TestDataFormatterStdString.py (1190 of 1696) PASS: lldb-Suite :: functionalities/non-overlapping-index-variable-i/TestIndexVariable.py (1191 of 1696) PASS: lldb-Unit :: UnwindAssembly/x86/./UnwindAssemblyx86Tests/Testx86AssemblyInspectionEngine.TestAddESP (1192 of 1696) PASS: lldb-Unit :: Utility/./UtilityTests/StreamTest.PutHex16ByteOrderBig (1193 of 1696) PASS: lldb-Suite :: tools/lldb-server/TestGdbRemoteExpeditedRegisters.py (1194 of 1696) PASS: lldb-Suite :: lang/objc/objc-ivar-stripped/TestObjCIvarStripped.py (1195 of 1696) PASS: lldb-Suite :: lang/cpp/thread_local/TestThreadLocal.py (1196 of 1696) PASS: lldb-Unit :: UnwindAssembly/x86/./UnwindAssemblyx86Tests/Testx86AssemblyInspectionEngine.Test32bitFramelessSmallStackFrame (1197 of 1696) PASS: lldb-Unit :: ScriptInterpreter/Python/./ScriptInterpreterPythonTests/PythonDataObjectsTest.TestPythonString (1198 of 1696) PASS: LLDB :: SymbolFile/DWARF/find-method.cpp (1199 of 1696) PASS: lldb-Unit :: Interpreter/./InterpreterTests/OptionArgParserTest.toBoolean (1200 of 1696) PASS: lldb-Suite :: functionalities/thread/jump/TestThreadJump.py (1201 of 1696) PASS: lldb-Suite :: commands/expression/unwind_expression/TestUnwindExpression.py (1202 of 1696) PASS: lldb-Suite :: functionalities/thread/concurrent_events/TestConcurrentManySignals.py (1203 of 1696) UNSUPPORTED: LLDB :: SymbolFile/PDB/variables-locations.test (1204 of 1696) PASS: lldb-Suite :: lang/cpp/virtual/TestVirtual.py (1205 of 1696) PASS: LLDB :: SymbolFile/Breakpad/unwind-via-stack-cfi.test (1206 of 1696) UNSUPPORTED: LLDB :: SymbolFile/PDB/function-level-linking.test (1207 of 1696) PASS: lldb-Suite :: functionalities/data-formatter/data-formatter-stl/libcxx/function/TestLibCxxFunction.py (1208 of 1696) PASS: lldb-Unit :: Utility/./UtilityTests/SerializationRountripTest.SerializeDeserializePodPointers (1209 of 1696) PASS: lldb-Suite :: functionalities/thread/concurrent_events/TestConcurrentSignalWatchBreak.py (1210 of 1696) PASS: lldb-Suite :: python_api/sbdata/TestSBData.py (1211 of 1696) PASS: lldb-Suite :: commands/expression/test/TestExprs.py (1212 of 1696) PASS: lldb-Unit :: UnwindAssembly/x86/./UnwindAssemblyx86Tests/Testx86AssemblyInspectionEngine.TestPushRBPWithREX (1213 of 1696) PASS: lldb-Unit :: UnwindAssembly/x86/./UnwindAssemblyx86Tests/Testx86AssemblyInspectionEngine.Test32bitFramelessBigStackFrame (1214 of 1696) PASS: LLDB :: Quit/TestQuitExitCode-30.test (1215 of 1696) PASS: lldb-Unit :: Process/minidump/./LLDBMinidumpTests/MinidumpParserTest.GetLinuxProcStatus (1216 of 1696) PASS: lldb-Suite :: lang/objc/objc-stepping/TestObjCStepping.py (1217 of 1696) PASS: LLDB :: Modules/ELF/PT_TLS-overlap-PT_LOAD.yaml (1218 of 1696) PASS: lldb-Unit :: Utility/./UtilityTests/LogChannelEnabledTest.log_options (1219 of 1696) PASS: lldb-Unit :: UnwindAssembly/x86/./UnwindAssemblyx86Tests/Testx86AssemblyInspectionEngine.TestPushEDI (1220 of 1696) PASS: lldb-Suite :: functionalities/dynamic_value_child_count/TestDynamicValueChildCount.py (1221 of 1696) PASS: lldb-Unit :: Utility/./UtilityTests/DataExtractorTest.GetBitfield (1222 of 1696) PASS: lldb-Unit :: Utility/./UtilityTests/StringExtractorTest.GetNameColonValueNoColon (1223 of 1696) UNSUPPORTED: LLDB :: Register/x86-gp-write.test (1224 of 1696) UNSUPPORTED: LLDB :: SymbolFile/PDB/vbases.test (1225 of 1696) PASS: lldb-Suite :: lang/cpp/llvm-style/TestLLVMStyle.py (1226 of 1696) PASS: lldb-Suite :: functionalities/tsan/basic/TestTsanBasic.py (1227 of 1696) PASS: lldb-Suite :: benchmarks/turnaround/TestCompileRunToBreakpointTurnaround.py (1228 of 1696) PASS: lldb-Suite :: python_api/process/TestProcessAPI.py (1229 of 1696) PASS: lldb-Unit :: Utility/./UtilityTests/StringListTest.PopBack (1230 of 1696) UNSUPPORTED: LLDB :: SymbolFile/PDB/typedefs.test (1231 of 1696) PASS: lldb-Suite :: commands/command/nested_alias/TestNestedAlias.py (1232 of 1696) PASS: lldb-Suite :: lang/cpp/global_operators/TestCppGlobalOperators.py (1233 of 1696) PASS: lldb-Unit :: Process/minidump/./LLDBMinidumpTests/MinidumpParserTest.GetMemoryRegionInfoLinuxMaps (1234 of 1696) PASS: lldb-Unit :: Process/gdb-remote/./ProcessGdbRemoteTests/GDBRemoteCommunicationClientTest.SendGetTraceConfigPacket (1235 of 1696) PASS: lldb-Unit :: Process/gdb-remote/./ProcessGdbRemoteTests/GDBRemoteCommunicationClientTest.SendStopTracePacket (1236 of 1696) PASS: lldb-Suite :: functionalities/data-formatter/data-formatter-synthtype/TestDataFormatterSynthType.py (1237 of 1696) PASS: lldb-Unit :: ObjectFile/Breakpad/./ObjectFileBreakpadTests/InfoRecord.parse (1238 of 1696) PASS: LLDB :: Breakpoint/debug_rnglist_offset_pair.test (1239 of 1696) PASS: lldb-Unit :: Utility/./UtilityTests/StringListTest.AppendStringMove (1240 of 1696) PASS: lldb-Unit :: UnwindAssembly/x86/./UnwindAssemblyx86Tests/Testx86AssemblyInspectionEngine.TestPushEAX (1241 of 1696) PASS: lldb-Suite :: commands/command/source/TestCommandSource.py (1242 of 1696) PASS: LLDB :: Quit/TestQuitExitCodeImplicit0.test (1243 of 1696) PASS: lldb-Unit :: Utility/./UtilityTests/StringListTest.GetSize (1244 of 1696) PASS: LLDB :: SymbolFile/NativePDB/break-by-function.cpp (1245 of 1696) PASS: lldb-Unit :: Process/gdb-remote/./ProcessGdbRemoteTests/GDBRemoteCommunicationClientTest.SendGetMetaDataPacket (1246 of 1696) PASS: LLDB :: ExecControl/StopHook/stop-hook.test (1247 of 1696) PASS: lldb-Suite :: commands/watchpoints/watchpoint_disable/TestWatchpointDisable.py (1248 of 1696) PASS: lldb-Suite :: commands/frame/diagnose/dereference-function-return/TestDiagnoseDereferenceFunctionReturn.py (1249 of 1696) PASS: LLDB :: Quit/TestQuitExitCodeTooManyArgs.test (1250 of 1696) PASS: lldb-Suite :: functionalities/data-formatter/nsarraysynth/TestNSArraySynthetic.py (1251 of 1696) PASS: lldb-Suite :: lang/cpp/type_lookup/TestCppTypeLookup.py (1252 of 1696) PASS: lldb-Unit :: Host/./HostTests/MainLoopTest.Signal (1253 of 1696) UNSUPPORTED: LLDB :: SymbolFile/PDB/function-nested-block.test (1254 of 1696) PASS: lldb-Suite :: functionalities/memory/read/TestMemoryRead.py (1255 of 1696) PASS: lldb-Suite :: functionalities/data-formatter/language_category_updates/TestDataFormatterLanguageCategoryUpdates.py (1256 of 1696) PASS: lldb-Suite :: functionalities/recursion/TestValueObjectRecursion.py (1257 of 1696) PASS: lldb-Unit :: Utility/./UtilityTests/OptionsWithRawTest.EmptySuffixSingleWhitespace (1258 of 1696) PASS: lldb-Suite :: tools/lldb-server/commandline/TestStubSetSID.py (1259 of 1696) PASS: lldb-Unit :: Utility/./UtilityTests/StreamTest.PutBytesAsRawHex8ToMixedEndian (1260 of 1696) PASS: lldb-Unit :: Target/./TargetTests/ModuleCacheTest.GetAndPutStrangeHostname (1261 of 1696) PASS: lldb-Suite :: tools/lldb-server/inferior-crash/TestGdbRemoteAbort.py (1262 of 1696) PASS: lldb-Unit :: Utility/./UtilityTests/OptionsWithRawTest.ArgsButNoDelimiter (1263 of 1696) PASS: lldb-Suite :: lang/objc/objc-baseclass-sbtype/TestObjCBaseClassSBType.py (1264 of 1696) PASS: LLDB :: Minidump/dump-all.test (1265 of 1696) PASS: lldb-Unit :: Expression/./ExpressionTests/ClangHostTest.MacOSX (1266 of 1696) PASS: lldb-Unit :: Host/./HostTests/FileActionTest.Open (1267 of 1696) PASS: LLDB :: SymbolFile/Breakpad/line-table-edgecases.test (1268 of 1696) PASS: lldb-Unit :: Expression/./ExpressionTests/DiagnosticManagerTest.PutStringMultiple (1269 of 1696) PASS: lldb-Unit :: ScriptInterpreter/Python/./ScriptInterpreterPythonTests/PythonExceptionStateTest.TestResetSemantics (1270 of 1696) PASS: lldb-Unit :: Utility/./UtilityTests/ArgsTest.StringListConstructor (1271 of 1696) PASS: lldb-Suite :: lang/cpp/template/TestTemplateArgs.py (1272 of 1696) PASS: lldb-Suite :: functionalities/darwin_log/filter/regex/subsystem/TestDarwinLogFilterRegexSubsystem.py (1273 of 1696) PASS: LLDB :: SymbolFile/DWARF/debug_aranges-empty-section.s (1274 of 1696) PASS: lldb-Unit :: Utility/./UtilityTests/UUIDTest.SetFromStringRef (1275 of 1696) PASS: lldb-Unit :: Process/gdb-remote/./ProcessGdbRemoteTests/GDBRemoteClientBaseTest.SendContinueDelegateStructuredDataReceipt (1276 of 1696) PASS: lldb-Unit :: Language/Highlighting/./HighlighterTests/HighlighterTest.ClangUnterminatedString (1277 of 1696) PASS: lldb-Suite :: lang/objc/objc-static-method/TestObjCStaticMethod.py (1278 of 1696) PASS: lldb-Unit :: Utility/./UtilityTests/ScalarTest.GetBytes (1279 of 1696) PASS: lldb-Suite :: tools/lldb-vscode/breakpoint/TestVSCode_setExceptionBreakpoints.py (1280 of 1696) PASS: LLDB :: SymbolFile/DWARF/dir-separator-windows.s (1281 of 1696) PASS: lldb-Unit :: ScriptInterpreter/Python/./ScriptInterpreterPythonTests/PythonExceptionStateTest.TestAcquisitionSemantics (1282 of 1696) PASS: LLDB :: SymbolFile/DWARF/childless-compile-unit.s (1283 of 1696) UNSUPPORTED: LLDB :: SymbolFile/PDB/calling-conventions.test (1284 of 1696) PASS: LLDB :: SymbolFile/DWARF/debug-types-line-tables.s (1285 of 1696) PASS: lldb-Suite :: lang/cpp/class_types/TestClassTypes.py (1286 of 1696) PASS: lldb-Suite :: functionalities/thread/concurrent_events/TestConcurrentSignalDelayWatch.py (1287 of 1696) PASS: lldb-Unit :: Expression/./ExpressionTests/DiagnosticManagerTest.AppendMessageSubsequentDiags (1288 of 1696) PASS: lldb-Suite :: lang/objc/bitfield_ivars/TestBitfieldIvars.py (1289 of 1696) PASS: lldb-Unit :: Target/./TargetTests/ModuleCacheTest.GetAndPutUuidExists (1290 of 1696) PASS: lldb-Unit :: Process/gdb-remote/./ProcessGdbRemoteTests/GDBRemoteClientBaseTest.SendContinueAndAsyncPacket (1291 of 1696) PASS: lldb-Unit :: Symbol/./SymbolTests/TestClangASTContext.TestIsClangType (1292 of 1696) PASS: lldb-Unit :: Utility/./UtilityTests/UriParserTest.Minimal (1293 of 1696) PASS: lldb-Suite :: functionalities/data-formatter/data-formatter-stl/libstdcpp/vector/TestDataFormatterStdVector.py (1294 of 1696) PASS: lldb-Unit :: Utility/./UtilityTests/LogTest.LLDB_LOG_nullptr (1295 of 1696) PASS: lldb-Unit :: Utility/./UtilityTests/VMRange.Comparison (1296 of 1696) PASS: lldb-Suite :: lang/c/const_variables/TestConstVariables.py (1297 of 1696) PASS: lldb-Unit :: ScriptInterpreter/Python/./ScriptInterpreterPythonTests/PythonExceptionStateTest.TestAutoRestoreSemantics (1298 of 1696) PASS: LLDB :: Register/x86-64-ymm-read.test (1299 of 1696) PASS: lldb-Unit :: Utility/./UtilityTests/StringListTest.AppendList (1300 of 1696) PASS: LLDB :: SymbolFile/DWARF/dwarf5-partial-index.cpp (1301 of 1696) PASS: lldb-Unit :: Utility/./UtilityTests/BinaryStreamTest.PutULEB128NineBytes (1302 of 1696) PASS: lldb-Unit :: Host/./HostTests/NativeProcessProtocolTest.SetBreakpoint (1303 of 1696) PASS: lldb-Suite :: functionalities/var_path/TestVarPath.py (1304 of 1696) PASS: lldb-Suite :: commands/expression/import-std-module/vector-dbg-info-content/TestDbgInfoContentVector.py (1305 of 1696) PASS: lldb-Suite :: functionalities/thread/create_after_attach/TestCreateAfterAttach.py (1306 of 1696) PASS: lldb-Unit :: Utility/./UtilityTests/StringExtractorTest.GetNameColonValueContainsColon (1307 of 1696) PASS: lldb-Unit :: Utility/./UtilityTests/Predicate.WaitForValueEqualTo (1308 of 1696) PASS: lldb-Unit :: Utility/./UtilityTests/ArgsTest.TestQuotedUnknownEscape (1309 of 1696) PASS: lldb-Suite :: commands/expression/anonymous-struct/TestCallUserAnonTypedef.py (1310 of 1696) PASS: lldb-Unit :: Utility/./UtilityTests/StreamTeeTest.Assignment (1311 of 1696) PASS: lldb-Suite :: functionalities/data-formatter/data-formatter-stl/libcxx/list/loop/TestDataFormatterLibcxxListLoop.py (1312 of 1696) PASS: lldb-Suite :: functionalities/type_lookup/TestTypeLookup.py (1313 of 1696) PASS: lldb-Unit :: Utility/./UtilityTests/IndexToObjectTest.ObjectForIndex (1314 of 1696) PASS: lldb-Unit :: Utility/./UtilityTests/StringListTest.ShiftStdString (1315 of 1696) PASS: lldb-Suite :: lang/objc/objc-property/TestObjCProperty.py (1316 of 1696) PASS: lldb-Suite :: lang/cpp/namespace/TestNamespaceLookup.py (1317 of 1696) UNSUPPORTED: LLDB :: SymbolFile/PDB/expressions.test (1318 of 1696) PASS: lldb-Unit :: Target/./TargetTests/ModuleCacheTest.GetAndPut (1319 of 1696) PASS: lldb-Unit :: Utility/./UtilityTests/VMRange.CollectionContains (1320 of 1696) PASS: lldb-Suite :: commands/expression/vector_of_enums/TestVectorOfEnums.py (1321 of 1696) PASS: lldb-Suite :: macosx/lc-note/kern-ver-str/TestKernVerStrLCNOTE.py (1322 of 1696) PASS: lldb-Suite :: benchmarks/libcxxmap/TestBenchmarkLibcxxMap.py (1323 of 1696) PASS: lldb-Unit :: ScriptInterpreter/Python/./ScriptInterpreterPythonTests/PythonDataObjectsTest.TestPythonListManipulation (1324 of 1696) UNSUPPORTED: LLDB :: SymbolFile/PDB/udt-layout.test (1325 of 1696) PASS: lldb-Suite :: functionalities/thread/concurrent_events/TestConcurrentManyCrash.py (1326 of 1696) PASS: LLDB :: SymbolFile/DWARF/find-basic-type.cpp (1327 of 1696) PASS: lldb-Suite :: python_api/value/linked_list/TestValueAPILinkedList.py (1328 of 1696) PASS: LLDB :: Settings/TestStopCommandSourceOnError.test (1329 of 1696) PASS: lldb-Suite :: python_api/signals/TestSignalsAPI.py (1330 of 1696) PASS: LLDB :: SymbolFile/Breakpad/symtab-macho.test (1331 of 1696) PASS: lldb-Unit :: UnwindAssembly/x86/./UnwindAssemblyx86Tests/Testx86AssemblyInspectionEngine.TestPushRBP (1332 of 1696) PASS: lldb-Suite :: lang/cpp/member-and-local-vars-with-same-name/TestMembersAndLocalsWithSameName.py (1333 of 1696) PASS: lldb-Unit :: ScriptInterpreter/Python/./ScriptInterpreterPythonTests/PythonDataObjectsTest.TestPythonListValueEquality (1334 of 1696) PASS: lldb-Suite :: tools/lldb-server/TestGdbRemoteProcessInfo.py (1335 of 1696) PASS: lldb-Unit :: Utility/./UtilityTests/ScalarTest.GetValue (1336 of 1696) PASS: lldb-Unit :: Utility/./UtilityTests/StringListTest.InsertStringAtIndexMove (1337 of 1696) PASS: lldb-Suite :: functionalities/thread/backtrace_limit/TestBacktraceLimit.py (1338 of 1696) PASS: lldb-Suite :: lang/c/function_types/TestFunctionTypes.py (1339 of 1696) PASS: LLDB :: SymbolFile/DWARF/find-variable-file.cpp (1340 of 1696) PASS: lldb-Unit :: Utility/./UtilityTests/RegisterValueTest.GetSet8 (1341 of 1696) PASS: lldb-Unit :: Utility/./UtilityTests/StringExtractorTest.GetHexBytes_Underflow (1342 of 1696) PASS: lldb-Unit :: Utility/./UtilityTests/RangeTest.DoesAdjoinOrIntersect (1343 of 1696) PASS: lldb-Unit :: UnwindAssembly/x86/./UnwindAssemblyx86Tests/Testx86AssemblyInspectionEngine.TestPopEDI (1344 of 1696) PASS: lldb-Unit :: ScriptInterpreter/Python/./ScriptInterpreterPythonTests/PythonDataObjectsTest.TestPythonBoolean (1345 of 1696) PASS: lldb-Unit :: Utility/./UtilityTests/BinaryStreamTest.PutULEB128FiveBytes (1346 of 1696) PASS: LLDB :: Commands/CommandScriptImmediateOutput/CommandScriptImmediateOutputConsole.test (1347 of 1696) PASS: lldb-Suite :: functionalities/thread/concurrent_events/TestConcurrentManyWatchpoints.py (1348 of 1696) PASS: lldb-Unit :: Utility/./UtilityTests/DataExtractorTest.PeekData (1349 of 1696) PASS: lldb-Suite :: commands/frame/diagnose/local-variable/TestLocalVariable.py (1350 of 1696) PASS: lldb-Unit :: Language/Highlighting/./HighlighterTests/HighlighterTest.ClangCursorPosEndOfLine (1351 of 1696) PASS: lldb-Suite :: commands/frame/language/TestGuessLanguage.py (1352 of 1696) PASS: LLDB :: BuildScript/toolchain-clang.test (1353 of 1696) PASS: lldb-Unit :: Utility/./UtilityTests/RangeDataVector.FindEntryThatContains (1354 of 1696) PASS: lldb-Suite :: functionalities/ubsan/user-expression/TestUbsanUserExpression.py (1355 of 1696) PASS: lldb-Unit :: Core/./LLDBCoreTests/RichManglingContextTest.FromCxxMethodName (1356 of 1696) PASS: lldb-Suite :: functionalities/data-formatter/data-formatter-proper-plurals/TestFormattersOneIsSingular.py (1357 of 1696) PASS: lldb-Suite :: lang/cpp/incomplete-types/TestCppIncompleteTypes.py (1358 of 1696) PASS: LLDB :: Process/TestEnvironment.test (1359 of 1696) PASS: lldb-Suite :: commands/expression/completion-crash-incomplete-record/TestCompletionCrashIncompleteRecord.py (1360 of 1696) UNSUPPORTED: LLDB :: SymbolFile/target-symbols-add-unwind.test (1361 of 1696) PASS: lldb-Unit :: UnwindAssembly/x86/./UnwindAssemblyx86Tests/Testx86AssemblyInspectionEngine.TestPopEBP (1362 of 1696) PASS: lldb-Suite :: functionalities/completion/TestCompletion.py (1363 of 1696) PASS: lldb-Suite :: lang/c/find_struct_type/TestFindStructTypes.py (1364 of 1696) PASS: lldb-Unit :: Utility/./UtilityTests/StreamTest.ShiftOperatorPtr (1365 of 1696) UNSUPPORTED: LLDB :: SymbolFile/NativePDB/local-variables.cpp (1366 of 1696) PASS: lldb-Unit :: ScriptInterpreter/Python/./ScriptInterpreterPythonTests/PythonDataObjectsTest.TestPythonCallableCheck (1367 of 1696) PASS: lldb-Suite :: functionalities/data-formatter/data-formatter-stl/libstdcpp/iterator/TestDataFormatterStdIterator.py (1368 of 1696) PASS: lldb-Unit :: Utility/./UtilityTests/RangeTest.ContainsEndInclusiveInvalid (1369 of 1696) PASS: lldb-Suite :: lang/cpp/frame-var-anon-unions/TestFrameVariableAnonymousUnions.py (1370 of 1696) PASS: lldb-Unit :: ScriptInterpreter/Python/./ScriptInterpreterPythonTests/PythonDataObjectsTest.TestPythonListToStructuredList (1371 of 1696) PASS: lldb-Suite :: commands/target/create-no-such-arch/TestNoSuchArch.py (1372 of 1696) PASS: lldb-Unit :: Utility/./UtilityTests/StringLexerTest.AdvanceIf (1373 of 1696) PASS: lldb-Suite :: commands/expression/function_template_specialization_temp_args/TestFunctionTemplateSpecializationTempArgs.py (1374 of 1696) PASS: lldb-Suite :: functionalities/tty/TestTerminal.py (1375 of 1696) PASS: lldb-Suite :: functionalities/thread/concurrent_events/TestConcurrentTwoWatchpointsOneBreakpoint.py (1376 of 1696) PASS: lldb-Suite :: functionalities/inferior-assert/TestInferiorAssert.py (1377 of 1696) PASS: lldb-Suite :: python_api/sbstructureddata/TestStructuredDataAPI.py (1378 of 1696) PASS: lldb-Unit :: Symbol/./SymbolTests/SymbolsTest.LocateExecutableSymbolFileForUnknownExecutableAndMissingSymbolFile (1379 of 1696) PASS: lldb-Unit :: Utility/./UtilityTests/StreamTeeTest.GetStreamAtIndexOutOfBounds (1380 of 1696) PASS: lldb-Suite :: lang/c/inlines/TestRedefinitionsInInlines.py (1381 of 1696) PASS: lldb-Suite :: commands/watchpoints/watchpoint_commands/condition/TestWatchpointConditionCmd.py (1382 of 1696) PASS: lldb-Suite :: functionalities/data-formatter/data-formatter-stl/libcxx/set/TestDataFormatterLibcxxSet.py (1383 of 1696) PASS: lldb-Unit :: Language/CPlusPlus/./LanguageCPlusPlusTests/CPlusPlusLanguage.CPlusPlusNameParser (1384 of 1696) PASS: lldb-Unit :: Utility/./UtilityTests/RangeTest.DoesIntersect (1385 of 1696) PASS: LLDB :: SymbolFile/DWARF/debug-types-dwo-cross-reference.cpp (1386 of 1696) PASS: lldb-Suite :: lang/cpp/wchar_t/TestCxxWCharT.py (1387 of 1696) PASS: lldb-Suite :: functionalities/inferior-crashing/TestInferiorCrashing.py (1388 of 1696) PASS: lldb-Suite :: functionalities/tail_call_frames/disambiguate_tail_call_seq/TestDisambiguateTailCallSeq.py (1389 of 1696) PASS: lldb-Suite :: commands/frame/recognizer/TestFrameRecognizer.py (1390 of 1696) PASS: lldb-Unit :: Utility/./UtilityTests/VMRange.Reset (1391 of 1696) PASS: lldb-Unit :: Utility/./UtilityTests/BroadcasterTest.BroadcastEvent (1392 of 1696) PASS: lldb-Suite :: python_api/sbtype_typeclass/TestSBTypeTypeClass.py (1393 of 1696) PASS: lldb-Suite :: commands/watchpoints/multi_watchpoint_slots/TestWatchpointMultipleSlots.py (1394 of 1696) PASS: lldb-Suite :: lang/cpp/function_refs/TestFunctionRefs.py (1395 of 1696) PASS: lldb-Unit :: Platform/./LLDBPlatformTests/PlatformDarwinTest.TestParseVersionBuildDir (1396 of 1696) PASS: lldb-Suite :: commands/expression/import-std-module/sysroot/TestStdModuleSysroot.py (1397 of 1696) PASS: LLDB :: SymbolFile/DWARF/dwarf5-index-is-used.cpp (1398 of 1696) PASS: lldb-Suite :: functionalities/data-formatter/hexcaps/TestDataFormatterHexCaps.py (1399 of 1696) PASS: lldb-Suite :: commands/expression/calculator_mode/TestCalculatorMode.py (1400 of 1696) PASS: lldb-Unit :: Breakpoint/./LLDBBreakpointTests/BreakpointIDTest.StringIsBreakpointName (1401 of 1696) PASS: lldb-Unit :: Utility/./UtilityTests/Flags.Reset (1402 of 1696) PASS: lldb-Suite :: lang/objc/rdar-12408181/TestRdar12408181.py (1403 of 1696) PASS: lldb-Unit :: Utility/./UtilityTests/VMRange.ContainsRange (1404 of 1696) PASS: lldb-Unit :: Utility/./UtilityTests/VMRange.Ordering (1405 of 1696) PASS: lldb-Suite :: lang/c/vla/TestVLA.py (1406 of 1696) PASS: lldb-Suite :: lang/objc/exceptions/TestObjCExceptions.py (1407 of 1696) PASS: lldb-Unit :: Symbol/./SymbolTests/PostfixExpression.ParseOneExpression (1408 of 1696) PASS: lldb-Suite :: lang/cpp/lambdas/TestLambdas.py (1409 of 1696) PASS: lldb-Unit :: Utility/./UtilityTests/RangeTest.ContainsEndInclusive (1410 of 1696) PASS: lldb-Unit :: Utility/./UtilityTests/BinaryStreamTest.PutSLEB128FourBytes (1411 of 1696) PASS: LLDB :: Modules/Breakpad/sections.test (1412 of 1696) PASS: lldb-Unit :: Utility/./UtilityTests/StringExtractorTest.DecodeHexU8_Exact (1413 of 1696) PASS: lldb-Unit :: Process/gdb-remote/./ProcessGdbRemoteTests/GDBRemoteClientBaseTest.SendContinueAndInterrupt (1414 of 1696) PASS: lldb-Suite :: lang/cpp/this/TestCPPThis.py (1415 of 1696) PASS: lldb-Unit :: Utility/./UtilityTests/ArgsTest.TestOverwriteArgs (1416 of 1696) PASS: lldb-Unit :: Utility/./UtilityTests/ArchSpecTest.TestParseMachCPUDashSubtypeTripleSimple (1417 of 1696) PASS: lldb-Unit :: Host/./HostTests/SocketTest.DomainListenConnectAccept (1418 of 1696) PASS: lldb-Unit :: SymbolFile/NativePDB/./SymbolFileNativePDBTests/PDBFPOProgramToDWARFExpressionTests.UnresolvedRegisterAssignmentReference (1419 of 1696) PASS: lldb-Suite :: functionalities/data-formatter/data-formatter-named-summaries/TestDataFormatterNamedSummaries.py (1420 of 1696) PASS: lldb-Suite :: functionalities/exec/TestExec.py (1421 of 1696) UNSUPPORTED: LLDB :: SymbolFile/NativePDB/typedefs.cpp (1422 of 1696) PASS: lldb-Suite :: python_api/lldbutil/frame/TestFrameUtils.py (1423 of 1696) PASS: lldb-Suite :: commands/watchpoints/step_over_watchpoint/TestStepOverWatchpoint.py (1424 of 1696) PASS: lldb-Suite :: functionalities/tsan/global_location/TestTsanGlobalLocation.py (1425 of 1696) PASS: LLDB :: Modules/ELF/PT_LOAD-overlap-section.yaml (1426 of 1696) PASS: lldb-Suite :: commands/apropos/basic/TestApropos.py (1427 of 1696) PASS: lldb-Suite :: commands/expression/issue_11588/Test11588.py (1428 of 1696) PASS: LLDB :: SymbolFile/DWARF/find-qualified-variable.cpp (1429 of 1696) PASS: lldb-Suite :: commands/expression/no-deadlock/TestExprDoesntBlock.py (1430 of 1696) PASS: lldb-Suite :: commands/frame/select/TestFrameSelect.py (1431 of 1696) PASS: lldb-Suite :: functionalities/thread/concurrent_events/TestConcurrentTwoWatchpointThreads.py (1432 of 1696) PASS: lldb-Unit :: Target/./TargetTests/ExecutionContextTest.GetByteOrderProcess (1433 of 1696) PASS: LLDB :: Expr/TestIRMemoryMap.test (1434 of 1696) PASS: lldb-Suite :: lang/objc/blocks/TestObjCIvarsInBlocks.py (1435 of 1696) PASS: LLDB :: Commands/command-regex-unalias.test (1436 of 1696) PASS: lldb-Unit :: Utility/./UtilityTests/UriParserTest.BadPort2 (1437 of 1696) PASS: lldb-Suite :: functionalities/data-formatter/data-formatter-stl/libcxx/bitset/TestDataFormatterLibcxxBitset.py (1438 of 1696) PASS: lldb-Suite :: functionalities/data-formatter/data-formatter-script/TestDataFormatterScript.py (1439 of 1696) PASS: lldb-Unit :: ObjectFile/Breakpad/./ObjectFileBreakpadTests/PublicRecord.parse (1440 of 1696) PASS: lldb-Unit :: Editline/./EditlineTests/EditlineTestFixture.EditlineReceivesSingleLineText (1441 of 1696) PASS: lldb-Suite :: functionalities/thread/concurrent_events/TestConcurrentBreakpointDelayBreakpointOneSignal.py (1442 of 1696) PASS: lldb-Suite :: functionalities/abbreviation/TestCommonShortSpellings.py (1443 of 1696) PASS: lldb-Unit :: Expression/./ExpressionTests/DWARFExpression.DW_OP_pick (1444 of 1696) PASS: lldb-Suite :: lang/objc/foundation/TestObjCMethods.py (1445 of 1696) PASS: lldb-Suite :: lang/c/shared_lib/TestSharedLib.py (1446 of 1696) PASS: lldb-Suite :: functionalities/data-formatter/setvaluefromcstring/TestSetValueFromCString.py (1447 of 1696) PASS: lldb-Unit :: Utility/./UtilityTests/Flags.SetCount (1448 of 1696) PASS: lldb-Suite :: functionalities/tail_call_frames/inlining_and_tail_calls/TestInliningAndTailCalls.py (1449 of 1696) PASS: lldb-Unit :: Utility/./UtilityTests/RecordReplayTest.InstrumentedBarRef (1450 of 1696) PASS: lldb-Unit :: UnwindAssembly/x86/./UnwindAssemblyx86Tests/Testx86AssemblyInspectionEngine.TestDisassemblyMidFunctionEpilogues (1451 of 1696) PASS: lldb-Suite :: commands/watchpoints/watchpoint_size/TestWatchpointSizes.py (1452 of 1696) PASS: lldb-Unit :: Utility/./UtilityTests/RangeTest.SlideZero (1453 of 1696) PASS: lldb-Suite :: functionalities/data-formatter/data-formatter-advanced/TestDataFormatterAdv.py (1454 of 1696) PASS: lldb-Unit :: Utility/./UtilityTests/StringExtractorTest.DecodeHexU8_Underflow (1455 of 1696) PASS: lldb-Suite :: functionalities/data-formatter/ostypeformatting/TestFormattersOsType.py (1456 of 1696) PASS: lldb-Suite :: commands/disassemble/basic/TestFrameDisassemble.py (1457 of 1696) PASS: lldb-Unit :: Utility/./UtilityTests/FileSpecTest.AppendPathComponent (1458 of 1696) PASS: lldb-Unit :: Utility/./UtilityTests/ListenerTest.GetEventImmediate (1459 of 1696) PASS: lldb-Unit :: ObjectFile/Breakpad/./ObjectFileBreakpadTests/StackWinRecord.parse (1460 of 1696) PASS: lldb-Unit :: Process/gdb-remote/./ProcessGdbRemoteTests/GDBRemoteCommunicationClientTest.SaveRestoreRegistersNoSuffix (1461 of 1696) PASS: lldb-Unit :: Utility/./UtilityTests/StreamTeeTest.SetStreamAtIndexOutOfBounds (1462 of 1696) PASS: lldb-Unit :: Utility/./UtilityTests/RangeTest.ClearWithStarAddress (1463 of 1696) PASS: lldb-Suite :: commands/disassemble/basic/TestDisassembleBreakpoint.py (1464 of 1696) PASS: lldb-Unit :: Utility/./UtilityTests/RangeTest.SetRangeBase (1465 of 1696) PASS: LLDB :: Driver/TestSingleQuote.test (1466 of 1696) PASS: lldb-Unit :: ScriptInterpreter/Python/./ScriptInterpreterPythonTests/PythonDataObjectsTest.TestPythonTupleToStructuredList (1467 of 1696) PASS: lldb-Unit :: Signals/./SignalsTests/UnixSignalsTest.Iteration (1468 of 1696) PASS: lldb-Suite :: tools/lldb-vscode/variables/TestVSCode_variables.py (1469 of 1696) PASS: lldb-Suite :: lang/c/modules/TestCModules.py (1470 of 1696) PASS: lldb-Unit :: Symbol/./SymbolTests/DWARFCallFrameInfoTest.Basic_dwarf3 (1471 of 1696) PASS: lldb-Suite :: functionalities/data-formatter/data-formatter-stl/libstdcpp/vbool/TestDataFormatterStdVBool.py (1472 of 1696) PASS: LLDB :: SymbolFile/DWARF/find-basic-function.cpp (1473 of 1696) PASS: LLDB :: Modules/Breakpad/sections-trailing-func.test (1474 of 1696) PASS: lldb-Unit :: Utility/./UtilityTests/ConstStringTest.CompareConstString (1475 of 1696) PASS: lldb-Unit :: Process/minidump/./LLDBMinidumpTests/MinidumpParserTest.GetMemoryRegionInfoFromMemoryList (1476 of 1696) PASS: lldb-Suite :: tools/lldb-server/libraries-svr4/TestGdbRemoteLibrariesSvr4Support.py (1477 of 1696) XFAIL: LLDB :: Register/x86-64-write.test (1478 of 1696) PASS: lldb-Suite :: functionalities/data-formatter/data-formatter-stl/libcxx/tuple/TestDataFormatterLibcxxTuple.py (1479 of 1696) PASS: lldb-Suite :: functionalities/thread/exit_during_step/TestExitDuringStep.py (1480 of 1696) PASS: lldb-Unit :: tools/lldb-server/tests/./LLDBServerTests/TestBase.LaunchModePreservesEnvironment (1481 of 1696) PASS: lldb-Suite :: python_api/breakpoint/TestBreakpointAPI.py (1482 of 1696) PASS: lldb-Unit :: SymbolFile/NativePDB/./SymbolFileNativePDBTests/PDBFPOProgramToDWARFExpressionTests.UnresolvedCyclicRegisterAssignmentReference (1483 of 1696) PASS: lldb-Suite :: commands/command/delete/TestCommandDelete.py (1484 of 1696) PASS: lldb-Unit :: Utility/./UtilityTests/StreamTest.PutMaxHex64ByteOrderBig (1485 of 1696) PASS: lldb-Suite :: functionalities/thread/concurrent_events/TestConcurrentWatchBreakDelay.py (1486 of 1696) PASS: lldb-Suite :: lang/cpp/virtual-overload/TestVirtualOverload.py (1487 of 1696) PASS: lldb-Suite :: commands/expression/radar_9531204/TestPrintfAfterUp.py (1488 of 1696) PASS: lldb-Unit :: SymbolFile/DWARF/./SymbolFileDWARFTests/SymbolFileDWARFTests.TestAbbrevOutOfOrder (1489 of 1696) PASS: lldb-Unit :: Language/Highlighting/./HighlighterTests/HighlighterTest.ClangCursorPos (1490 of 1696) PASS: lldb-Suite :: commands/frame/diagnose/dereference-this/TestDiagnoseDereferenceThis.py (1491 of 1696) PASS: lldb-Suite :: functionalities/data-formatter/format-propagation/TestFormatPropagation.py (1492 of 1696) UNSUPPORTED: LLDB :: Register/x86-64-gp-write.test (1493 of 1696) PASS: lldb-Unit :: Symbol/./SymbolTests/TestClangASTContext.TestGetBasicTypeFromEnum (1494 of 1696) PASS: lldb-Unit :: Utility/./UtilityTests/ReproducerTest.SetReplay (1495 of 1696) PASS: lldb-Suite :: functionalities/data-formatter/data-formatter-stl/libcxx/iterator/TestDataFormatterLibccIterator.py (1496 of 1696) PASS: lldb-Suite :: functionalities/inline-stepping/TestInlineStepping.py (1497 of 1696) PASS: lldb-Suite :: functionalities/data-formatter/data-formatter-stl/libcxx/unordered/TestDataFormatterUnordered.py (1498 of 1696) PASS: LLDB :: Breakpoint/debug_rnglist_rlestartend.test (1499 of 1696) PASS: lldb-Suite :: functionalities/load_unload/TestLoadUnload.py (1500 of 1696) PASS: lldb-Suite :: lang/cpp/const_this/TestConstThis.py (1501 of 1696) PASS: LLDB :: Modules/MachO/lc_build_version_notools.yaml (1502 of 1696) PASS: lldb-Suite :: lang/cpp/exceptions/TestCPPExceptionBreakpoints.py (1503 of 1696) PASS: lldb-Unit :: Utility/./UtilityTests/CompletionRequest.Constructor (1504 of 1696) PASS: lldb-Unit :: Host/./HostTests/MainLoopTest.ReadObject (1505 of 1696) PASS: lldb-Suite :: lang/objc/conflicting-definition/TestConflictingDefinition.py (1506 of 1696) PASS: lldb-Suite :: python_api/rdar-12481949/Test-rdar-12481949.py (1507 of 1696) UNSUPPORTED: LLDB :: BuildScript/toolchain-msvc.test (1508 of 1696) PASS: lldb-Suite :: tools/lldb-server/TestGdbRemote_vCont.py (1509 of 1696) PASS: LLDB :: Driver/TestRepl.test (1510 of 1696) PASS: LLDB :: Modules/PECOFF/subsections.yaml (1511 of 1696) PASS: lldb-Suite :: tools/lldb-server/TestGdbRemoteExitCode.py (1512 of 1696) PASS: lldb-Suite :: functionalities/data-formatter/data-formatter-objc/TestDataFormatterObjCExpr.py (1513 of 1696) PASS: lldb-Unit :: UnwindAssembly/x86/./UnwindAssemblyx86Tests/Testx86AssemblyInspectionEngine.Test64bitFramelessBigStackFrame (1514 of 1696) PASS: lldb-Suite :: functionalities/inferior-changed/TestInferiorChanged.py (1515 of 1696) PASS: lldb-Suite :: functionalities/data-formatter/parray/TestPrintArray.py (1516 of 1696) PASS: lldb-Unit :: debugserver/./debugserverTests/RNBSocket.AnyListen (1517 of 1696) PASS: LLDB :: Minidump/fb-dump.test (1518 of 1696) PASS: lldb-Unit :: Utility/./UtilityTests/BinaryStreamTest.PutULEB128Zero (1519 of 1696) PASS: lldb-Suite :: functionalities/data-formatter/synthupdate/TestSyntheticFilterRecompute.py (1520 of 1696) PASS: LLDB :: SymbolFile/DWARF/debug-types-missing-signature.test (1521 of 1696) PASS: lldb-Suite :: functionalities/fat_archives/TestFatArchives.py (1522 of 1696) PASS: lldb-Unit :: Utility/./UtilityTests/ConstStringTest.FromMidOfBufferStringRef (1523 of 1696) PASS: lldb-Suite :: tools/lldb-server/TestGdbRemoteHostInfo.py (1524 of 1696) PASS: LLDB :: SymbolFile/NativePDB/ast-types.cpp (1525 of 1696) PASS: lldb-Unit :: Utility/./UtilityTests/StringListTest.GetMaxStringLengthIncreasingSize (1526 of 1696) PASS: lldb-Suite :: lang/cpp/function-template-parameter-pack/TestFunctionTemplateParameterPack.py (1527 of 1696) PASS: lldb-Unit :: Utility/./UtilityTests/NameMatchesTest.StartsWith (1528 of 1696) PASS: lldb-Unit :: Utility/./UtilityTests/Flags.AnyClear (1529 of 1696) PASS: lldb-Suite :: arm/breakpoint-thumb-codesection/TestBreakpointThumbCodesection.py (1530 of 1696) PASS: lldb-Unit :: Utility/./UtilityTests/OptionsWithRawTest.WhitespaceSuffix (1531 of 1696) PASS: LLDB :: Modules/ELF/gnu-debuglink.yaml (1532 of 1696) PASS: lldb-Suite :: python_api/disassemble-raw-data/TestDisassembleRawData.py (1533 of 1696) PASS: lldb-Unit :: Utility/./UtilityTests/Flags.ClearCount (1534 of 1696) PASS: lldb-Unit :: Process/gdb-remote/./ProcessGdbRemoteTests/GDBRemoteCommunicationClientTest.WriteRegisterNoSuffix (1535 of 1696) PASS: lldb-Unit :: Utility/./UtilityTests/EnvironmentTest.EnvpConstruction (1536 of 1696) UNSUPPORTED: LLDB :: SymbolFile/PDB/compilands.test (1537 of 1696) PASS: LLDB :: SymbolFile/DWARF/find-function-regex.cpp (1538 of 1696) PASS: lldb-Suite :: tools/lldb-server/TestGdbRemoteAuxvSupport.py (1539 of 1696) PASS: LLDB :: Settings/TestFrameFormatNoColor.test (1540 of 1696) PASS: lldb-Suite :: functionalities/multidebugger_commands/TestMultipleDebuggersCommands.py (1541 of 1696) PASS: lldb-Unit :: ScriptInterpreter/Python/./ScriptInterpreterPythonTests/PythonDataObjectsTest.TestPythonStringToStr (1542 of 1696) PASS: lldb-Suite :: functionalities/tail_call_frames/ambiguous_tail_call_seq1/TestAmbiguousTailCallSeq1.py (1543 of 1696) PASS: lldb-Unit :: Utility/./UtilityTests/StringExtractorTest.DecodeHexU8_InvalidHex2 (1544 of 1696) PASS: lldb-Unit :: SymbolFile/NativePDB/./SymbolFileNativePDBTests/PDBFPOProgramToDWARFExpressionTests.InvalidAssignmentSingle (1545 of 1696) PASS: lldb-Suite :: types/TestRecursiveTypes.py (1546 of 1696) PASS: lldb-Suite :: functionalities/thread/concurrent_events/TestConcurrentTwoWatchpointsOneDelayBreakpoint.py (1547 of 1696) PASS: lldb-Unit :: Process/minidump/./LLDBMinidumpTests/MinidumpParserTest.GetMemory (1548 of 1696) UNSUPPORTED: LLDB :: Register/x86-64-zmm-write.test (1549 of 1696) PASS: lldb-Suite :: tools/lldb-vscode/breakpoint/TestVSCode_setFunctionBreakpoints.py (1550 of 1696) PASS: lldb-Unit :: Process/gdb-remote/./ProcessGdbRemoteTests/GDBRemoteCommunicationClientTest.GetModulesInfoInvalidResponse (1551 of 1696) PASS: lldb-Unit :: Utility/./UtilityTests/RangeTest.SizeTypes (1552 of 1696) PASS: lldb-Unit :: UnwindAssembly/x86/./UnwindAssemblyx86Tests/Testx86AssemblyInspectionEngine.TestPush0 (1553 of 1696) PASS: LLDB :: Driver/LocalLLDBInit.test (1554 of 1696) PASS: lldb-Suite :: functionalities/gdb_remote_client/TestGDBRemoteLoad.py (1555 of 1696) PASS: lldb-Unit :: Utility/./UtilityTests/StringListTest.CopyList (1556 of 1696) PASS: lldb-Unit :: Utility/./UtilityTests/ArgsTest.TestInsertArg (1557 of 1696) PASS: LLDB :: Quit/TestQuitExitCode0.test (1558 of 1696) PASS: lldb-Suite :: functionalities/tail_call_frames/ambiguous_tail_call_seq2/TestAmbiguousTailCallSeq2.py (1559 of 1696) PASS: lldb-Suite :: commands/expression/class_template_specialization_empty_pack/TestClassTemplateSpecializationParametersHandling.py (1560 of 1696) PASS: lldb-Suite :: python_api/objc_type/TestObjCType.py (1561 of 1696) PASS: lldb-Suite :: commands/watchpoints/watchpoint_events/TestWatchpointEvents.py (1562 of 1696) PASS: lldb-Suite :: functionalities/data-formatter/data-formatter-objc/TestDataFormatterObjCNSBundle.py (1563 of 1696) PASS: lldb-Suite :: commands/expression/import-std-module/vector-bool/TestBoolVector.py (1564 of 1696) PASS: lldb-Unit :: Utility/./UtilityTests/StringListTest.JoinNonSpace (1565 of 1696) PASS: lldb-Unit :: Utility/./UtilityTests/TimerTest.CategoryTimes (1566 of 1696) PASS: lldb-Unit :: Utility/./UtilityTests/RecordReplayTest.InstrumentedFooSameThis (1567 of 1696) PASS: lldb-Unit :: Host/./HostTests/SocketTest.TCPGetAddress (1568 of 1696) PASS: lldb-Suite :: commands/expression/import_builtin_fileid/TestImportBuiltinFileID.py (1569 of 1696) PASS: lldb-Suite :: commands/expression/import-std-module/forward_list-dbg-info-content/TestDbgInfoContentForwardList.py (1570 of 1696) PASS: lldb-Unit :: Host/./HostTests/ConnectionFileDescriptorTest.TCPGetURIv4 (1571 of 1696) PASS: lldb-Suite :: lang/c/register_variables/TestRegisterVariables.py (1572 of 1696) PASS: lldb-Unit :: Host/./HostTests/SocketTest.DomainGetConnectURI (1573 of 1696) PASS: lldb-Suite :: commands/expression/import-std-module/unique_ptr-dbg-info-content/TestUniquePtrDbgInfoContent.py (1574 of 1696) PASS: lldb-Unit :: Utility/./UtilityTests/OptionsWithRawTest.EmptyInput (1575 of 1696) PASS: lldb-Unit :: UnwindAssembly/x86/./UnwindAssemblyx86Tests/Testx86AssemblyInspectionEngine.TestDisassemblyJunkBytes (1576 of 1696) PASS: lldb-Unit :: Utility/./UtilityTests/DataExtractorTest.GetMaxU64 (1577 of 1696) PASS: lldb-Suite :: lang/cpp/limit-debug-info/TestWithLimitDebugInfo.py (1578 of 1696) PASS: LLDB :: Modules/ELF/netbsd-core-amd64.test (1579 of 1696) PASS: lldb-Suite :: lang/objc/objc-foundation-dictionary-empty/TestNSDictionary0.py (1580 of 1696) PASS: LLDB :: Modules/ELF/short-build-id.yaml (1581 of 1696) PASS: lldb-Unit :: Process/minidump/./LLDBMinidumpTests/MinidumpParserTest.GetArchitecture (1582 of 1696) PASS: lldb-Unit :: Language/Highlighting/./HighlighterTests/HighlighterTest.ClangComments (1583 of 1696) PASS: lldb-Unit :: Utility/./UtilityTests/AnsiTerminal.Incomplete (1584 of 1696) PASS: lldb-Suite :: benchmarks/expression/TestRepeatedExprs.py (1585 of 1696) PASS: lldb-Suite :: functionalities/history/TestHistoryRecall.py (1586 of 1696) PASS: LLDB :: Driver/TestConvenienceVariables.test (1587 of 1696) PASS: lldb-Suite :: commands/frame/diagnose/inheritance/TestDiagnoseInheritance.py (1588 of 1696) PASS: lldb-Suite :: lang/objc/print-obj/TestPrintObj.py (1589 of 1696) PASS: lldb-Unit :: Process/minidump/./LLDBMinidumpTests/MinidumpParserTest.FindMemoryRange (1590 of 1696) PASS: lldb-Unit :: Utility/./UtilityTests/StructuredDataTest.StringDump (1591 of 1696) PASS: lldb-Suite :: python_api/symbol-context/two-files/TestSymbolContextTwoFiles.py (1592 of 1696) PASS: lldb-Unit :: Utility/./UtilityTests/LogChannelTest.Disable (1593 of 1696) PASS: lldb-Unit :: Process/minidump/./LLDBMinidumpTests/MinidumpParserTest.GetMiscInfoWindows (1594 of 1696) PASS: lldb-Unit :: Utility/./UtilityTests/ArgsTest.TestArgv (1595 of 1696) PASS: lldb-Suite :: functionalities/data-formatter/data-formatter-objc/nsindexpath/TestDataFormatterNSIndexPath.py (1596 of 1696) PASS: lldb-Unit :: Utility/./UtilityTests/AnsiTerminal.Empty (1597 of 1696) PASS: LLDB :: BuildScript/modes.test (1598 of 1696) PASS: lldb-Suite :: functionalities/tsan/multiple/TestTsanMultiple.py (1599 of 1696) PASS: lldb-Unit :: Utility/./UtilityTests/VMRange.IsValid (1600 of 1696) PASS: lldb-Suite :: functionalities/data-formatter/data-formatter-stl/libcxx/vbool/TestDataFormatterLibcxxVBool.py (1601 of 1696) PASS: lldb-Unit :: Host/./HostTests/SocketAddressTest.Set (1602 of 1696) PASS: lldb-Suite :: tools/lldb-vscode/breakpoint/TestVSCode_setBreakpoints.py (1603 of 1696) PASS: lldb-Suite :: commands/frame/var/TestFrameVar.py (1604 of 1696) PASS: lldb-Unit :: Process/minidump/./LLDBMinidumpTests/MinidumpParserTest.GetLinuxProcStatus_no_stream (1605 of 1696) PASS: lldb-Unit :: Process/minidump/./LLDBMinidumpTests/MinidumpParserTest.FindMemoryRangeWithFullMemoryMinidump (1606 of 1696) PASS: lldb-Suite :: functionalities/data-formatter/pyobjsynthprovider/TestPyObjSynthProvider.py (1607 of 1696) PASS: lldb-Suite :: commands/expression/po_verbosity/TestPoVerbosity.py (1608 of 1696) PASS: lldb-Suite :: commands/expression/import-std-module/unique_ptr/TestUniquePtr.py (1609 of 1696) PASS: lldb-Unit :: SymbolFile/NativePDB/./SymbolFileNativePDBTests/PDBFPOProgramToDWARFExpressionTests.UnresolvedDependentCyclicRegisterAssignmentReference (1610 of 1696) PASS: lldb-Unit :: UnwindAssembly/x86/./UnwindAssemblyx86Tests/Testx86AssemblyInspectionEngine.Testi386IgnoredRegisters (1611 of 1696) PASS: lldb-Suite :: functionalities/darwin_log/filter/exact_match/subsystem/TestDarwinLogFilterMatchSubsystem.py (1612 of 1696) PASS: lldb-Suite :: commands/expression/fixits/TestFixIts.py (1613 of 1696) PASS: LLDB :: Minidump/Windows/find-module.test (1614 of 1696) PASS: lldb-Suite :: commands/expression/cast_int_to_anonymous_enum/TestCastIntToAnonymousEnum.py (1615 of 1696) PASS: lldb-Unit :: Core/./LLDBCoreTests/StreamCallbackTest.Callback (1616 of 1696) PASS: lldb-Unit :: Host/./HostTests/Host.GetEnvironment (1617 of 1696) PASS: lldb-Unit :: Utility/./UtilityTests/CleanUpTest.no_args (1618 of 1696) PASS: lldb-Unit :: Symbol/./SymbolTests/TestClangASTContext.TestBuiltinTypeForEncodingAndBitSize (1619 of 1696) PASS: lldb-Suite :: commands/expression/radar_9673664/TestExprHelpExamples.py (1620 of 1696) PASS: lldb-Suite :: functionalities/data-formatter/frameformat_smallstruct/TestFrameFormatSmallStruct.py (1621 of 1696) PASS: lldb-Suite :: lang/c/typedef/Testtypedef.py (1622 of 1696) PASS: lldb-Suite :: lang/cpp/operator-overload/TestOperatorOverload.py (1623 of 1696) PASS: lldb-Unit :: Utility/./UtilityTests/SerializationRountripTest.SerializeDeserializeObjectReference (1624 of 1696) PASS: lldb-Unit :: Symbol/./SymbolTests/TestClangASTContext.TestGetBasicTypeFromName (1625 of 1696) PASS: lldb-Unit :: Utility/./UtilityTests/ProcessInstanceInfo.DumpTable_invalidUID (1626 of 1696) PASS: LLDB :: Breakpoint/implicit_const_form_support.test (1627 of 1696) PASS: lldb-Unit :: Utility/./UtilityTests/StreamTest.PutCStringWithStringRef (1628 of 1696) XFAIL: LLDB :: Register/x86-mm-xmm-read.test (1629 of 1696) PASS: lldb-Unit :: Utility/./UtilityTests/StringListTest.InsertStringAtIndexOutOfBounds (1630 of 1696) PASS: lldb-Suite :: lang/cpp/stl/TestStdCXXDisassembly.py (1631 of 1696) PASS: lldb-Unit :: Utility/./UtilityTests/BinaryStreamTest.PutULEB128SixBytes (1632 of 1696) PASS: lldb-Unit :: Utility/./UtilityTests/UUIDTest.StringConverion (1633 of 1696) PASS: lldb-Suite :: functionalities/data-formatter/data-formatter-synth/TestDataFormatterSynth.py (1634 of 1696) PASS: lldb-Suite :: commands/watchpoints/hello_watchpoint/TestMyFirstWatchpoint.py (1635 of 1696) PASS: lldb-Unit :: Utility/./UtilityTests/StringExtractorTest.GetHexU8_Underflow2_NoEof (1636 of 1696) PASS: lldb-Suite :: lang/c/stepping/TestThreadStepping.py (1637 of 1696) PASS: lldb-Unit :: Utility/./UtilityTests/ArgsTest.TestTrailingBackslash (1638 of 1696) PASS: lldb-Suite :: commands/target/stop-hooks/TestStopHooks.py (1639 of 1696) PASS: LLDB :: Modules/ELF/many-sections.s (1640 of 1696) PASS: lldb-Unit :: Utility/./UtilityTests/ArgsTest.DoubleQuotedItem (1641 of 1696) PASS: lldb-Suite :: python_api/lldbutil/iter/TestRegistersIterator.py (1642 of 1696) PASS: lldb-Suite :: lang/cpp/enum_types/TestCPP11EnumTypes.py (1643 of 1696) PASS: lldb-Suite :: tools/lldb-server/platform-process-connect/TestPlatformProcessConnect.py (1644 of 1696) PASS: lldb-Suite :: commands/frame/diagnose/complicated-expression/TestComplicatedExpression.py (1645 of 1696) PASS: lldb-Suite :: functionalities/ptr_refs/TestPtrRefs.py (1646 of 1696) PASS: LLDB :: Minidump/disassemble-no-module.yaml (1647 of 1696) PASS: lldb-Suite :: commands/expression/char/TestExprsChar.py (1648 of 1696) PASS: lldb-Unit :: Utility/./UtilityTests/StringListTest.GetMaxStringLengthEmpty (1649 of 1696) PASS: lldb-Suite :: functionalities/gdb_remote_client/TestNestedRegDefinitions.py (1650 of 1696) PASS: lldb-Suite :: functionalities/data-formatter/data-formatter-objc/nsstring/TestDataFormatterNSString.py (1651 of 1696) PASS: lldb-Unit :: Utility/./UtilityTests/FileSpecTest.EqualDotsPosix (1652 of 1696) PASS: lldb-Suite :: python_api/frame/inlines/TestInlinedFrame.py (1653 of 1696) PASS: LLDB :: Commands/CommandScriptImmediateOutput/CommandScriptImmediateOutputFile.test (1654 of 1696) PASS: lldb-Unit :: Process/minidump/./LLDBMinidumpTests/MinidumpParserTest.GetThreadContext_x86_32 (1655 of 1696) UNSUPPORTED: LLDB :: SymbolFile/PDB/ast-restore.test (1656 of 1696) PASS: lldb-Suite :: commands/expression/import-std-module/conflicts/TestStdModuleWithConflicts.py (1657 of 1696) PASS: lldb-Suite :: python_api/value/empty_class/TestValueAPIEmptyClass.py (1658 of 1696) PASS: lldb-Unit :: Utility/./UtilityTests/ScalarTest.SetValueFromCString (1659 of 1696) PASS: LLDB :: Breakpoint/single-file-split-dwarf.test (1660 of 1696) PASS: lldb-Unit :: Utility/./UtilityTests/OptionsWithRawTest.WhitespaceInput (1661 of 1696) PASS: lldb-Suite :: commands/expression/save_jit_objects/TestSaveJITObjects.py (1662 of 1696) PASS: lldb-Unit :: Utility/./UtilityTests/RangeDataVector.FindEntryThatContains_Overlap (1663 of 1696) PASS: lldb-Suite :: commands/expression/context-object/TestContextObject.py (1664 of 1696) PASS: lldb-Suite :: tools/lldb-server/TestGdbRemoteRegisterState.py (1665 of 1696) PASS: lldb-Suite :: macosx/find-app-in-bundle/TestFindAppInBundle.py (1666 of 1696) PASS: lldb-Suite :: lang/c/struct_types/TestStructTypes.py (1667 of 1696) PASS: lldb-Unit :: Utility/./UtilityTests/UriParserTest.BadPort (1668 of 1696) PASS: lldb-Unit :: Host/./HostTests/FileSystemTest.Resolve (1669 of 1696) PASS: lldb-Suite :: functionalities/thread/concurrent_events/TestConcurrentBreakpointsDelayedBreakpointOneWatchpoint.py (1670 of 1696) PASS: lldb-Unit :: Utility/./UtilityTests/SerializationRountripTest.SerializeDeserializePod (1671 of 1696) PASS: lldb-Unit :: Utility/./UtilityTests/StreamTest.PutCharWhitespace (1672 of 1696) PASS: lldb-Unit :: Expression/./ExpressionTests/DiagnosticManagerTest.GetStringSeverityLabels (1673 of 1696) PASS: lldb-Unit :: Process/gdb-remote/./ProcessGdbRemoteTests/GDBRemoteCommunicationServerTest.SendErrorResponse_UnimplementedError (1674 of 1696) PASS: lldb-Unit :: Utility/./UtilityTests/StringExtractorTest.InitMisc (1675 of 1696) PASS: lldb-Suite :: functionalities/data-formatter/data-formatter-objc/TestDataFormatterObjCNSContainer.py (1676 of 1696) PASS: lldb-Unit :: ScriptInterpreter/Python/./ScriptInterpreterPythonTests/PythonDataObjectsTest.TestPythonTupleInitializerList2 (1677 of 1696) PASS: lldb-Suite :: functionalities/process_group/TestChangeProcessGroup.py (1678 of 1696) PASS: lldb-Unit :: Expression/./ExpressionTests/DiagnosticManagerTest.AddDiagnostic (1679 of 1696) PASS: lldb-Suite :: tools/lldb-server/commandline/TestStubReverseConnect.py (1680 of 1696) PASS: lldb-Unit :: Utility/./UtilityTests/BinaryStreamTest.PutULEB128FourBytes (1681 of 1696) PASS: lldb-Suite :: types/TestIntegerTypes.py (1682 of 1696) PASS: lldb-Suite :: functionalities/thread/concurrent_events/TestConcurrentWatchpointWithDelayWatchpointThreads.py (1683 of 1696) PASS: lldb-Suite :: types/TestIntegerTypesExpr.py (1684 of 1696) PASS: lldb-Suite :: lang/objc/foundation/TestSymbolTable.py (1685 of 1696) PASS: lldb-Suite :: functionalities/thread/concurrent_events/TestConcurrentBreakpointOneDelayBreakpointThreads.py (1686 of 1696) PASS: lldb-Suite :: functionalities/data-formatter/data-formatter-cpp/TestDataFormatterCpp.py (1687 of 1696) PASS: lldb-Suite :: macosx/indirect_symbol/TestIndirectSymbols.py (1688 of 1696) PASS: lldb-Suite :: commands/expression/rdar44436068/Test128BitsInteger.py (1689 of 1696) PASS: lldb-Suite :: commands/expression/context-object-objc/TestContextObjectObjc.py (1690 of 1696) PASS: lldb-Suite :: python_api/formatters/TestFormattersSBAPI.py (1691 of 1696) PASS: lldb-Suite :: lang/cpp/operators/TestCppOperators.py (1692 of 1696) PASS: lldb-Suite :: lang/objc/variadic_methods/TestVariadicMethods.py (1693 of 1696) PASS: lldb-Suite :: lang/objc/foundation/TestObjCMethodsNSError.py (1694 of 1696) PASS: lldb-Suite :: api/check_public_api_headers/TestPublicAPIHeaders.py (1695 of 1696) TIMEOUT: lldb-Suite :: lang/objc/foundation/TestFoundationDisassembly.py (1696 of 1696) ******************** TEST 'lldb-Suite :: lang/objc/foundation/TestFoundationDisassembly.py' FAILED ******************** Reached timeout of 1200 seconds ******************** Testing Time: 2019.50s ******************** Failing Tests (6): lldb-Suite :: functionalities/gdb_remote_client/TestGDBRemoteClient.py lldb-Suite :: functionalities/gdb_remote_client/TestThreadSelectionBug.py lldb-Suite :: commands/gui/basic/TestGuiBasic.py lldb-Suite :: iohandler/completion/TestIOHandlerCompletion.py lldb-Suite :: tools/lldb-server/TestLldbGdbServer.py lldb-Suite :: commands/expression/multiline-completion/TestMultilineCompletion.py

Hide Details

******************** Timed Out Tests (1): lldb-Suite :: lang/objc/foundation/TestFoundationDisassembly.py

Hide Details

Hide Details

Slowest Tests: -------------------------------------------------------------------------- 115.32s: lldb-Suite :: lang/c/anonymous/TestAnonymous.py 119.70s: lldb-Suite :: python_api/target/TestTargetAPI.py 130.20s: lldb-Suite :: lang/objc/objc-new-syntax/TestObjCNewSyntaxDictionary.py 132.65s: lldb-Suite :: functionalities/recursion/TestValueObjectRecursion.py 137.07s: lldb-Suite :: lang/objc/objc-new-syntax/TestObjCNewSyntaxArray.py 158.07s: lldb-Suite :: functionalities/inferior-crashing/TestInferiorCrashingStep.py 164.94s: lldb-Suite :: lang/objc/exceptions/TestObjCExceptions.py 166.10s: lldb-Suite :: commands/target/basic/TestTargetCommand.py 182.22s: lldb-Suite :: lang/objc/objc-new-syntax/TestObjCNewSyntaxLiteral.py 183.42s: lldb-Suite :: functionalities/load_unload/TestLoadUnload.py 186.02s: lldb-Suite :: lang/cpp/namespace/TestNamespaceLookup.py 202.19s: lldb-Suite :: functionalities/return-value/TestReturnValue.py 208.09s: lldb-Suite :: lang/objc/foundation/TestObjCMethods.py 230.86s: lldb-Suite :: lang/cpp/enum_types/TestCPP11EnumTypes.py 236.00s: lldb-Suite :: api/multithreaded/TestMultithreaded.py 254.79s: lldb-Suite :: lang/objc/hidden-ivars/TestHiddenIvars.py 256.17s: lldb-Suite :: tools/lldb-server/TestLldbGdbServer.py 405.09s: lldb-Suite :: types/TestIntegerTypes.py 564.59s: lldb-Suite :: types/TestIntegerTypesExpr.py 1200.66s: lldb-Suite :: lang/objc/foundation/TestFoundationDisassembly.py

Hide Details

Tests Times: -------------------------------------------------------------------------- [ Range ] :: [ Percentage ] :: [ Count ] -------------------------------------------------------------------------- [ 0s, 100s) :: [*************************************** ] :: [1672/1696] [ 100s, 200s) :: [ ] :: [ 14/1696] [ 200s, 300s) :: [ ] :: [ 7/1696] [ 300s, 400s) :: [ ] :: [ 0/1696] [ 400s, 500s) :: [ ] :: [ 1/1696] [ 500s, 600s) :: [ ] :: [ 0/1696] [ 600s, 700s) :: [ ] :: [ 1/1696] [ 700s, 800s) :: [ ] :: [ 0/1696] [ 800s, 900s) :: [ ] :: [ 0/1696] [ 900s,1000s) :: [ ] :: [ 0/1696] [1000s,1100s) :: [ ] :: [ 0/1696] [1100s,1200s) :: [ ] :: [ 0/1696] [1200s,1300s) :: [ ] :: [ 1/1696] Expected Passes : 1639 Expected Failures : 6 Unsupported Tests : 44 Unexpected Failures: 6 Individual Timeouts: 1 FAILED: tools/lldb/lit/CMakeFiles/check-lldb-lit cd /Users/buildslave/jenkins/workspace/lldb-cmake-sanitized/lldb-build/tools/lldb/lit && /usr/bin/python /Users/buildslave/jenkins/workspace/lldb-cmake-sanitized/lldb-build/./bin/llvm-lit -v --time-tests --shuffle --xunit-xml-output=/Users/buildslave/jenkins/workspace/lldb-cmake-sanitized/test/results.xml -v --timeout 1200 /Users/buildslave/jenkins/workspace/lldb-cmake-sanitized/lldb-build/tools/lldb/lit ninja: build stopped: subcommand failed. Command failed Command: ['/usr/bin/env', 'TERM=vt100', '/usr/local/bin/ninja', '-v', 'check-lldb'] [Pipeline] } [Pipeline] // timeout [Pipeline] } [Pipeline] // stage [Pipeline] stage [Pipeline] { (Declarative: Post Actions) [Pipeline] scanForIssues No credentials specified [Clang (LLVM based)] Sleeping for 5 seconds due to JENKINS-32191... [Clang (LLVM based)] Parsing console log (workspace: '/Users/buildslave/jenkins/workspace/lldb-cmake-sanitized') [Pipeline] junit Recording test results [Pipeline] } [Pipeline] // stage [Pipeline] } [Pipeline] // withEnv [Pipeline] } [Pipeline] // node [Pipeline] End of Pipeline [BFA] Scanning build for known causes... [BFA] Found failure cause(s): [BFA] Regression test failed from category Test [BFA] Ninja target failed from category Compile [BFA] Done. 1s ERROR: script returned exit code 1 Finished: FAILURE