FailedConsole Output

Skipping 3,381 KB.. Full Log
                        sys.exc_info()[0]))

Hide Details

Hide Details

Executing tearDown hook: def shutdown_named_pipe(): # Close the pipe. try: named_pipe.close() except: print("failed to close named pipe") None

Hide Details

# Delete the pipe. try: os.remove(named_pipe_path) except: print("failed to delete named pipe: {}".format(named_pipe_path)) None

Hide Details

# Delete the temp directory. try: os.rmdir(temp_dir) except: print( "failed to delete temp dir: {}, directory contents: '{}'".format( temp_dir, os.listdir(temp_dir))) None

Hide Details

Hide Details

runCmd: settings set symbols.enable-external-lookup false output:

Hide Details

runCmd: settings set plugin.process.gdb-remote.packet-timeout 60 output:

Hide Details

runCmd: settings set symbols.clang-modules-cache-path "/Users/buildslave/jenkins/workspace/lldb-cmake-sanitized/lldb-build/tools/lldb/lldb-test-build.noindex/module-cache-lldb" output:

Hide Details

runCmd: settings set use-color false output:

Hide Details

UNSUPPORTED: LLDB (/Users/buildslave/jenkins/workspace/lldb-cmake-sanitized/host-compiler/bin/clang-10-x86_64) :: test_attach_commandline_kill_after_initial_stop_llgs (TestGdbRemoteKill.TestGdbRemoteKill) (llgs tests) Restore dir to: /Users/buildslave/jenkins/workspace/lldb-cmake-sanitized/lldb-build/tools/lldb/lit ====================================================================== FAIL: test_attach_commandline_kill_after_initial_stop_debugserver (TestGdbRemoteKill.TestGdbRemoteKill) ---------------------------------------------------------------------- Traceback (most recent call last): File "/Users/buildslave/jenkins/workspace/lldb-cmake-sanitized/llvm-project/lldb/packages/Python/lldbsuite/test/decorators.py", line 141, in wrapper func(*args, **kwargs) File "/Users/buildslave/jenkins/workspace/lldb-cmake-sanitized/llvm-project/lldb/packages/Python/lldbsuite/test/tools/lldb-server/TestGdbRemoteKill.py", line 53, in test_attach_commandline_kill_after_initial_stop_debugserver self.attach_commandline_kill_after_initial_stop() File "/Users/buildslave/jenkins/workspace/lldb-cmake-sanitized/llvm-project/lldb/packages/Python/lldbsuite/test/tools/lldb-server/TestGdbRemoteKill.py", line 18, in attach_commandline_kill_after_initial_stop procs = self.prep_debug_monitor_and_inferior() File "/Users/buildslave/jenkins/workspace/lldb-cmake-sanitized/llvm-project/lldb/packages/Python/lldbsuite/test/tools/lldb-server/gdbremote_testcase.py", line 581, in prep_debug_monitor_and_inferior server = self.connect_to_debug_monitor(attach_pid=attach_pid) File "/Users/buildslave/jenkins/workspace/lldb-cmake-sanitized/llvm-project/lldb/packages/Python/lldbsuite/test/tools/lldb-server/gdbremote_testcase.py", line 415, in connect_to_debug_monitor server = self.launch_debug_monitor(attach_pid=attach_pid) File "/Users/buildslave/jenkins/workspace/lldb-cmake-sanitized/llvm-project/lldb/packages/Python/lldbsuite/test/tools/lldb-server/gdbremote_testcase.py", line 408, in launch_debug_monitor self.port = self.get_stub_port_from_named_socket() File "/Users/buildslave/jenkins/workspace/lldb-cmake-sanitized/llvm-project/lldb/packages/Python/lldbsuite/test/tools/lldb-server/gdbremote_testcase.py", line 214, in get_stub_port_from_named_socket "write side of pipe has not written anything - stub isn't writing to pipe.") AssertionError: 0 == 0 : write side of pipe has not written anything - stub isn't writing to pipe. Config=x86_64-/Users/buildslave/jenkins/workspace/lldb-cmake-sanitized/host-compiler/bin/clang-10 ---------------------------------------------------------------------- Ran 2 tests in 12.676s

Hide Details

RESULT: FAILED (0 passes, 1 failures, 0 errors, 1 skipped, 0 expected failures, 0 unexpected successes)

Hide Details

******************** PASS: lldb-Suite :: arm/breakpoint-thumb-codesection/TestBreakpointThumbCodesection.py (906 of 1696) PASS: lldb-Unit :: Utility/./UtilityTests/UriParserTest.SchemeHostSeparator3 (907 of 1696) PASS: lldb-Suite :: lang/objc/rdar-12408181/TestRdar12408181.py (908 of 1696) PASS: lldb-Unit :: UnwindAssembly/x86/./UnwindAssemblyx86Tests/Testx86AssemblyInspectionEngine.TestPushR12 (909 of 1696) PASS: lldb-Suite :: commands/watchpoints/variable_out_of_scope/TestWatchedVarHitWhenInScope.py (910 of 1696) PASS: lldb-Suite :: commands/watchpoints/multi_watchpoint_slots/TestWatchpointMultipleSlots.py (911 of 1696) PASS: lldb-Suite :: commands/frame/diagnose/virtual-method-call/TestDiagnoseDereferenceVirtualMethodCall.py (912 of 1696) PASS: LLDB :: SymbolFile/DWARF/dir-separator-no-comp-dir-relative-name.s (913 of 1696) PASS: lldb-Unit :: UnwindAssembly/x86/./UnwindAssemblyx86Tests/Testx86AssemblyInspectionEngine.TestSpillRegToStackViaMOVi386 (914 of 1696) PASS: lldb-Unit :: Utility/./UtilityTests/StringListTest.CopyListEmpty (915 of 1696) PASS: lldb-Unit :: Utility/./UtilityTests/StringExtractorTest.GetHexU8_Exact_NoEof (916 of 1696) PASS: lldb-Unit :: Utility/./UtilityTests/StringListTest.GetMaxStringLengthEmpty (917 of 1696) PASS: lldb-Unit :: Utility/./UtilityTests/StreamTest.PutBytesAsRawHex8ToLittleEndian (918 of 1696) PASS: lldb-Unit :: Utility/./UtilityTests/CompletionRequest.DuplicateFilteringWithComments (919 of 1696) PASS: LLDB :: SymbolFile/NativePDB/break-by-line.cpp (920 of 1696) PASS: lldb-Unit :: Process/gdb-remote/./ProcessGdbRemoteTests/GDBRemoteCommunicationClientTest.GetModulesInfoInvalidResponse (921 of 1696) PASS: lldb-Unit :: Utility/./UtilityTests/VMRange.IsValid (922 of 1696) PASS: lldb-Suite :: commands/command/source/TestCommandSource.py (923 of 1696) PASS: lldb-Suite :: functionalities/mtc/simple/TestMTCSimple.py (924 of 1696) PASS: lldb-Unit :: Utility/./UtilityTests/StringListTest.AppendStringStdString (925 of 1696) PASS: lldb-Suite :: functionalities/signal/TestSendSignal.py (926 of 1696) PASS: lldb-Unit :: Utility/./UtilityTests/ArgsTest.ReplaceArgumentAtIndexLonger (927 of 1696) PASS: lldb-Suite :: lang/c/struct_types/TestStructTypes.py (928 of 1696) PASS: LLDB :: Minidump/Windows/Sigsegv/sigsegv.test (929 of 1696) PASS: lldb-Unit :: Process/minidump/./LLDBMinidumpTests/MinidumpParserTest.GetFilteredModuleList (930 of 1696) UNSUPPORTED: LLDB :: SymbolFile/PDB/udt-layout.test (931 of 1696) PASS: LLDB :: SymbolFile/DWARF/split-dwarf-multiple-cu.ll (932 of 1696) PASS: lldb-Suite :: commands/settings/TestSettings.py (933 of 1696) PASS: LLDB :: Reproducer/Functionalities/TestStepping.test (934 of 1696) PASS: lldb-Suite :: functionalities/tsan/basic/TestTsanBasic.py (935 of 1696) PASS: lldb-Unit :: Language/Highlighting/./HighlighterTests/HighlighterTest.ClangScalarLiterals (936 of 1696) PASS: LLDB :: Modules/ELF/base-address.yaml (937 of 1696) PASS: lldb-Suite :: lang/cpp/breakpoint-commands/TestCPPBreakpointCommands.py (938 of 1696) PASS: lldb-Suite :: functionalities/exec/TestExec.py (939 of 1696) PASS: LLDB :: SymbolFile/NativePDB/ast-methods.cpp (940 of 1696) PASS: lldb-Suite :: commands/expression/formatters/TestFormatters.py (941 of 1696) PASS: lldb-Suite :: functionalities/thread/create_during_step/TestCreateDuringStep.py (942 of 1696) PASS: lldb-Unit :: Utility/./UtilityTests/CleanUpTest.disable (943 of 1696) PASS: lldb-Suite :: python_api/name_lookup/TestNameLookup.py (944 of 1696) PASS: lldb-Suite :: commands/expression/import-std-module/deque-dbg-info-content/TestDbgInfoContentDeque.py (945 of 1696) PASS: lldb-Suite :: commands/gui/invalid-args/TestInvalidArgsGui.py (946 of 1696) PASS: lldb-Suite :: commands/frame/var/TestFrameVar.py (947 of 1696) PASS: lldb-Suite :: python_api/target/TestTargetAPI.py (948 of 1696) PASS: lldb-Suite :: commands/target/stop-hooks/TestStopHooks.py (949 of 1696) PASS: lldb-Suite :: lang/cpp/dynamic-value-same-basename/TestDynamicValueSameBase.py (950 of 1696) PASS: lldb-Unit :: Utility/./UtilityTests/StatusTest.ErrorConstructor (951 of 1696) PASS: lldb-Suite :: functionalities/data-formatter/data-formatter-proper-plurals/TestFormattersOneIsSingular.py (952 of 1696) PASS: lldb-Unit :: Utility/./UtilityTests/AnsiTerminal.Basic (953 of 1696) PASS: lldb-Unit :: ObjectFile/Breakpad/./ObjectFileBreakpadTests/StackWinRecord.parse (954 of 1696) PASS: lldb-Suite :: functionalities/gdb_remote_client/TestArmRegisterDefinition.py (955 of 1696) PASS: lldb-Suite :: functionalities/data-formatter/typedef_array/TestTypedefArray.py (956 of 1696) PASS: lldb-Suite :: commands/expression/xvalue/TestXValuePrinting.py (957 of 1696) PASS: lldb-Suite :: functionalities/data-formatter/data-formatter-stl/libcxx/variant/TestDataFormatterLibcxxVariant.py (958 of 1696) PASS: lldb-Unit :: ObjectFile/Breakpad/./ObjectFileBreakpadTests/FileRecord.parse (959 of 1696) PASS: lldb-Suite :: benchmarks/startup/TestStartupDelays.py (960 of 1696) PASS: lldb-Suite :: commands/process/attach-resume/TestAttachResume.py (961 of 1696) PASS: LLDB :: Register/x86-64-ymm-read.test (962 of 1696) PASS: lldb-Suite :: commands/expression/test/TestExprs2.py (963 of 1696) PASS: lldb-Suite :: functionalities/data-formatter/data-formatter-objc/TestDataFormatterObjCNSBundle.py (964 of 1696) PASS: lldb-Suite :: lang/objc/print-obj/TestPrintObj.py (965 of 1696) PASS: lldb-Unit :: Utility/./UtilityTests/FileSpecTest.GuessPathStyle (966 of 1696) PASS: lldb-Suite :: macosx/function-starts/TestFunctionStarts.py (967 of 1696) PASS: lldb-Suite :: functionalities/data-formatter/data-formatter-stl/libcxx/multiset/TestDataFormatterLibcxxMultiSet.py (968 of 1696) PASS: lldb-Suite :: python_api/watchpoint/TestSetWatchpoint.py (969 of 1696) PASS: lldb-Suite :: functionalities/thread/concurrent_events/TestConcurrentSignalWatchBreak.py (970 of 1696) PASS: lldb-Unit :: ScriptInterpreter/Python/./ScriptInterpreterPythonTests/PythonDataObjectsTest.TestPythonStringToStr (971 of 1696) PASS: LLDB :: SymbolFile/DWARF/debug-types-missing-signature.test (972 of 1696) PASS: lldb-Unit :: UnwindAssembly/x86/./UnwindAssemblyx86Tests/Testx86AssemblyInspectionEngine.TestPushImm (973 of 1696) PASS: lldb-Suite :: functionalities/fat_archives/TestFatArchives.py (974 of 1696) PASS: lldb-Unit :: Expression/./ExpressionTests/DiagnosticManagerTest.AppendMessageAttachToLastDiag (975 of 1696) PASS: lldb-Suite :: functionalities/tail_call_frames/disambiguate_paths_to_common_sink/TestDisambiguatePathsToCommonSink.py (976 of 1696) PASS: LLDB :: Reproducer/Functionalities/TestImageList.test (977 of 1696) PASS: lldb-Unit :: Utility/./UtilityTests/StringExtractorTest.GetHexBytesAvail_Partial (978 of 1696) PASS: lldb-Unit :: SymbolFile/DWARF/./SymbolFileDWARFTests/SymbolFileDWARFTests.TestAbbrevOrder1Start1 (979 of 1696) PASS: lldb-Unit :: Host/./HostTests/FileSystemTest.Resolve (980 of 1696) PASS: lldb-Unit :: Utility/./UtilityTests/StateTest.Formatv (981 of 1696) PASS: lldb-Suite :: commands/command/script/import/rdar-12586188/TestRdar12586188.py (982 of 1696) PASS: lldb-Unit :: Utility/./UtilityTests/StringExtractorTest.GetHexU8_InvalidHex (983 of 1696) PASS: lldb-Suite :: functionalities/thread/concurrent_events/TestConcurrentBreakpointOneDelayBreakpointThreads.py (984 of 1696) PASS: lldb-Suite :: functionalities/object-file/TestImageListMultiArchitecture.py (985 of 1696) PASS: lldb-Suite :: functionalities/data-formatter/varscript_formatting/TestDataFormatterVarScriptFormatting.py (986 of 1696) PASS: lldb-Unit :: UnwindAssembly/x86/./UnwindAssemblyx86Tests/Testx86AssemblyInspectionEngine.TestPushEBX (987 of 1696) PASS: lldb-Suite :: types/TestFloatTypes.py (988 of 1696) PASS: lldb-Unit :: ScriptInterpreter/Python/./ScriptInterpreterPythonTests/PythonDataObjectsTest.TestModuleNameResolutionNoDot (989 of 1696) PASS: lldb-Unit :: Utility/./UtilityTests/OptionsWithRawTest.SingleWhitespaceInput (990 of 1696) PASS: lldb-Unit :: Core/./LLDBCoreTests/MangledTest.NameIndexes_FindFunctionSymbols (991 of 1696) PASS: lldb-Unit :: UnwindAssembly/x86/./UnwindAssemblyx86Tests/Testx86AssemblyInspectionEngine.TestStackRealignMSVC_i386 (992 of 1696) PASS: lldb-Suite :: benchmarks/turnaround/TestCompileRunToBreakpointTurnaround.py (993 of 1696) PASS: lldb-Suite :: functionalities/abbreviation/TestCommonShortSpellings.py (994 of 1696) PASS: lldb-Suite :: functionalities/signal/handle-segv/TestHandleSegv.py (995 of 1696) PASS: lldb-Unit :: Utility/./UtilityTests/UUIDTest.StringConverion (996 of 1696) PASS: lldb-Unit :: Utility/./UtilityTests/AnsiTerminal.AtEnd (997 of 1696) PASS: lldb-Suite :: commands/process/attach/attach_denied/TestAttachDenied.py (998 of 1696) PASS: lldb-Unit :: UnwindAssembly/x86/./UnwindAssemblyx86Tests/Testx86AssemblyInspectionEngine.TestStackRealign32BitDisp_x86_64 (999 of 1696) PASS: lldb-Unit :: ScriptInterpreter/Python/./ScriptInterpreterPythonTests/PythonDataObjectsTest.TestPythonInteger (1000 of 1696) PASS: lldb-Suite :: commands/register/register/intel_xtended_registers/TestMPXRegisters.py (1001 of 1696) PASS: lldb-Unit :: Utility/./UtilityTests/StringExtractorTest.DecodeHexU8_Extra (1002 of 1696) PASS: lldb-Suite :: functionalities/thread/concurrent_events/TestConcurrentCrashWithSignal.py (1003 of 1696) PASS: lldb-Suite :: functionalities/memory-region/TestMemoryRegion.py (1004 of 1696) PASS: lldb-Unit :: debugserver/./debugserverTests/RNBSocket.LoopBackConnectIPv6 (1005 of 1696) PASS: lldb-Unit :: Host/./HostTests/SocketTest.TCPGetAddress (1006 of 1696) PASS: lldb-Unit :: Expression/./ExpressionTests/DiagnosticManagerTest.AddDiagnostic (1007 of 1696) PASS: lldb-Suite :: python_api/debugger/TestDebuggerAPI.py (1008 of 1696) PASS: lldb-Unit :: UnwindAssembly/x86/./UnwindAssemblyx86Tests/Testx86AssemblyInspectionEngine.TestAddESP (1009 of 1696) PASS: lldb-Unit :: Process/minidump/./LLDBMinidumpTests/MinidumpParserTest.InvalidMinidump (1010 of 1696) PASS: LLDB :: Modules/ELF/netbsd-exec-8.99.30-amd64.yaml (1011 of 1696) PASS: lldb-Suite :: functionalities/thread/create_after_attach/TestCreateAfterAttach.py (1012 of 1696) PASS: lldb-Suite :: lang/c/tls_globals/TestTlsGlobals.py (1013 of 1696) PASS: lldb-Suite :: python_api/file_handle/TestFileHandle.py (1014 of 1696) PASS: lldb-Suite :: lang/objc/variadic_methods/TestVariadicMethods.py (1015 of 1696) PASS: LLDB :: Modules/PECOFF/sections-names.yaml (1016 of 1696) PASS: lldb-Unit :: Process/minidump/./LLDBMinidumpTests/MinidumpParserTest.FindMemoryRange (1017 of 1696) PASS: lldb-Unit :: Utility/./UtilityTests/ScalarTest.Comparison (1018 of 1696) PASS: lldb-Suite :: functionalities/data-formatter/data-formatter-stl/libstdcpp/string/TestDataFormatterStdString.py (1019 of 1696) PASS: lldb-Unit :: Utility/./UtilityTests/StringLexerTest.Peek (1020 of 1696) PASS: lldb-Unit :: UnwindAssembly/x86/./UnwindAssemblyx86Tests/Testx86AssemblyInspectionEngine.Test64bitFramelessSmallStackFrame (1021 of 1696) PASS: lldb-Suite :: functionalities/jitloader_gdb/TestJITLoaderGDB.py (1022 of 1696) PASS: lldb-Suite :: commands/frame/var-scope/TestFrameVariableScope.py (1023 of 1696) PASS: lldb-Unit :: Language/Highlighting/./HighlighterTests/HighlighterTest.ClangEmptyInput (1024 of 1696) PASS: lldb-Unit :: Expression/./ExpressionTests/DiagnosticManagerTest.GetStringPreserveOrder (1025 of 1696) PASS: lldb-Suite :: commands/expression/scoped_enums/TestScopedEnumType.py (1026 of 1696) PASS: lldb-Unit :: UnwindAssembly/x86/./UnwindAssemblyx86Tests/Testx86AssemblyInspectionEngine.TestSimplei386ugmented (1027 of 1696) PASS: lldb-Suite :: functionalities/tail_call_frames/unambiguous_sequence/TestUnambiguousTailCalls.py (1028 of 1696) PASS: LLDB :: SymbolFile/Breakpad/line-table-discontinuous-file-ids.test (1029 of 1696) PASS: lldb-Suite :: lang/cpp/virtual-overload/TestVirtualOverload.py (1030 of 1696) PASS: lldb-Unit :: UnwindAssembly/x86/./UnwindAssemblyx86Tests/Testx86AssemblyInspectionEngine.TestMovRSPtoRBP (1031 of 1696) PASS: lldb-Unit :: Symbol/./SymbolTests/TestClangASTContext.TestConvertAccessTypeToAccessSpecifier (1032 of 1696) PASS: lldb-Suite :: lang/objc/foundation/TestObjCMethods2.py (1033 of 1696) PASS: lldb-Suite :: tools/lldb-vscode/step/TestVSCode_step.py (1034 of 1696) PASS: lldb-Unit :: Host/./HostTests/ConnectionFileDescriptorTest.TCPGetURIv6 (1035 of 1696) PASS: lldb-Suite :: functionalities/postmortem/mach-core/TestMachCore.py (1036 of 1696) PASS: lldb-Unit :: Process/minidump/./LLDBMinidumpTests/MinidumpParserTest.GetMiscInfoWindows (1037 of 1696) PASS: LLDB :: Minidump/breakpad-symbols.test (1038 of 1696) PASS: lldb-Suite :: commands/process/launch/TestProcessLaunch.py (1039 of 1696) PASS: lldb-Suite :: python_api/frame/TestFrames.py (1040 of 1696) PASS: lldb-Unit :: ScriptInterpreter/Python/./ScriptInterpreterPythonTests/PythonDataObjectsTest.TestPythonByteArray (1041 of 1696) PASS: LLDB :: SymbolFile/DWARF/debug-types-address-ranges.s (1042 of 1696) PASS: lldb-Suite :: commands/expression/rdar42038760/TestScalarURem.py (1043 of 1696) PASS: lldb-Suite :: lang/cpp/overloaded-functions/TestOverloadedFunctions.py (1044 of 1696) PASS: lldb-Unit :: Process/minidump/./LLDBMinidumpTests/MinidumpParserTest.GetMemoryRegionInfoFromMemoryList (1045 of 1696) PASS: LLDB :: Modules/PECOFF/uuid.yaml (1046 of 1696) PASS: lldb-Unit :: Utility/./UtilityTests/StringListTest.GetMaxStringLengthDecreasingSize (1047 of 1696) PASS: lldb-Suite :: lang/c/blocks/TestBlocks.py (1048 of 1696) PASS: lldb-Suite :: lang/cpp/global_variables/TestCPPGlobalVariables.py (1049 of 1696) PASS: LLDB :: Modules/MachO/subsections.yaml (1050 of 1696) PASS: lldb-Unit :: Utility/./UtilityTests/CompletionRequest.DuplicateFiltering (1051 of 1696) PASS: lldb-Unit :: Target/./TargetTests/ExecutionContextTest.GetByteOrder (1052 of 1696) PASS: lldb-Suite :: functionalities/dead-strip/TestDeadStrip.py (1053 of 1696) PASS: LLDB :: ExecControl/StopHook/stop-hook.test (1054 of 1696) PASS: lldb-Unit :: Utility/./UtilityTests/UriParserTest.BracketedHostnameWithColon (1055 of 1696) PASS: lldb-Unit :: Utility/./UtilityTests/ArgsTest.GetArgumentArrayRef (1056 of 1696) PASS: lldb-Suite :: functionalities/thread/concurrent_events/TestConcurrentWatchpointWithDelayWatchpointThreads.py (1057 of 1696) PASS: lldb-Suite :: functionalities/dynamic_value_child_count/TestDynamicValueChildCount.py (1058 of 1696) PASS: lldb-Unit :: Platform/./LLDBPlatformTests/PlatformDarwinTest.TestParseVersionBuildDir (1059 of 1696) PASS: lldb-Unit :: Utility/./UtilityTests/ReproducerTest.SetReplay (1060 of 1696) PASS: lldb-Suite :: types/TestDoubleTypesExpr.py (1061 of 1696) PASS: lldb-Unit :: Utility/./UtilityTests/FileSpecTest.GetNormalizedPath (1062 of 1696) PASS: lldb-Unit :: Utility/./UtilityTests/ProcessInstanceInfo.Dump (1063 of 1696) PASS: lldb-Unit :: Language/Highlighting/./HighlighterTests/HighlighterTest.ClangStringLiterals (1064 of 1696) PASS: lldb-Suite :: commands/frame/select/TestFrameSelect.py (1065 of 1696) PASS: lldb-Unit :: Utility/./UtilityTests/ArgsTest.TestSingleQuotedArgWithSpace (1066 of 1696) PASS: lldb-Suite :: functionalities/thread/concurrent_events/TestConcurrentDelayWatchBreak.py (1067 of 1696) PASS: lldb-Unit :: Utility/./UtilityTests/GeneratorTest.GetOrCreate (1068 of 1696) PASS: lldb-Unit :: Utility/./UtilityTests/StringLexerTest.NextIfList (1069 of 1696) PASS: lldb-Unit :: Utility/./UtilityTests/ArgsTest.TestQuotedUnknownEscape (1070 of 1696) PASS: lldb-Unit :: Host/./HostTests/SocketTest.TCPListen0ConnectAccept (1071 of 1696) PASS: lldb-Unit :: Utility/./UtilityTests/StringListTest.ShiftStdString (1072 of 1696) PASS: lldb-Unit :: Process/minidump/./LLDBMinidumpTests/MinidumpParserTest.GetArchitectureWindows (1073 of 1696) PASS: lldb-Unit :: UnwindAssembly/x86/./UnwindAssemblyx86Tests/Testx86AssemblyInspectionEngine.TestPopEBX (1074 of 1696) PASS: lldb-Unit :: Expression/./ExpressionTests/DiagnosticManagerTest.GetStringNoDiags (1075 of 1696) PASS: lldb-Unit :: Utility/./UtilityTests/RangeTest.DoesAdjoinOrIntersect (1076 of 1696) PASS: LLDB :: SymbolFile/DWARF/childless-compile-unit.s (1077 of 1696) PASS: lldb-Unit :: Utility/./UtilityTests/UriParserTest.BadPort (1078 of 1696) PASS: lldb-Suite :: functionalities/data-formatter/ostypeformatting/TestFormattersOsType.py (1079 of 1696) PASS: lldb-Suite :: linux/sepdebugsymlink/TestTargetSymbolsSepDebugSymlink.py (1080 of 1696) FAIL: lldb-Suite :: tools/lldb-server/register-reading/TestGdbRemoteGPacket.py (1081 of 1696) ******************** TEST 'lldb-Suite :: tools/lldb-server/register-reading/TestGdbRemoteGPacket.py' FAILED ******************** lldb version 10.0.99 (http://labmaster3.local/git/llvm-project.git revision bf1a23ad0e77b4f41c65b17731d443dc553f5911) clang revision 178cd2cd3a69046c88ade1b31796f3f90b7e86a0 llvm revision 178cd2cd3a69046c88ade1b31796f3f90b7e86a0 LLDB library dir: /Users/buildslave/jenkins/workspace/lldb-cmake-sanitized/lldb-build/bin LLDB import library dir: /Users/buildslave/jenkins/workspace/lldb-cmake-sanitized/lldb-build/bin libstdcxx tests will not be run because: Don't know how to build with libstdcxx on macosx Skipping following debug info categories: ['dwo']

Hide Details

Session logs for test failures/errors/unexpected successes will go into directory '/Users/buildslave/jenkins/workspace/lldb-cmake-sanitized/test/logs' Command invoked: /Users/buildslave/jenkins/workspace/lldb-cmake-sanitized/llvm-project/lldb/test/dotest.py --arch=x86_64 -s /Users/buildslave/jenkins/workspace/lldb-cmake-sanitized/lldb-build/lldb-test-traces -S nm -u CXXFLAGS -u CFLAGS --executable /Users/buildslave/jenkins/workspace/lldb-cmake-sanitized/lldb-build/./bin/lldb --dsymutil /Users/buildslave/jenkins/workspace/lldb-cmake-sanitized/lldb-build/./bin/dsymutil --filecheck /Users/buildslave/jenkins/workspace/lldb-cmake-sanitized/lldb-build/./bin/FileCheck -C /Users/buildslave/jenkins/workspace/lldb-cmake-sanitized/host-compiler/bin/clang --codesign-identity lldb_codesign --server /Users/buildslave/jenkins/workspace/lldb-cmake-sanitized/lldb-build/./bin/debugserver --arch x86_64 --build-dir /Users/buildslave/jenkins/workspace/lldb-cmake-sanitized/lldb-build/lldb-test-build.noindex -s=/Users/buildslave/jenkins/workspace/lldb-cmake-sanitized/test/logs -t --env TERM=vt100 --env LLVM_LIBS_DIR=/Users/buildslave/jenkins/workspace/lldb-cmake-sanitized/lldb-build/./lib --build-dir /Users/buildslave/jenkins/workspace/lldb-cmake-sanitized/lldb-build/tools/lldb/lldb-test-build.noindex --module-cache-dir /Users/buildslave/jenkins/workspace/lldb-cmake-sanitized/lldb-build/tools/lldb/lldb-test-build.noindex/module-cache-lldb /Users/buildslave/jenkins/workspace/lldb-cmake-sanitized/llvm-project/lldb/packages/Python/lldbsuite/test/tools/lldb-server/register-reading -p TestGdbRemoteGPacket.py Change dir to: /Users/buildslave/jenkins/workspace/lldb-cmake-sanitized/llvm-project/lldb/packages/Python/lldbsuite/test/tools/lldb-server/register-reading runCmd: settings set symbols.enable-external-lookup false output:

Hide Details

runCmd: settings set plugin.process.gdb-remote.packet-timeout 60 output:

Hide Details

runCmd: settings set symbols.clang-modules-cache-path "/Users/buildslave/jenkins/workspace/lldb-cmake-sanitized/lldb-build/tools/lldb/lldb-test-build.noindex/module-cache-lldb" output:

Hide Details

runCmd: settings set use-color false output:

Hide Details

Adding tearDown hook: def shutdown_named_pipe(): # Close the pipe. try: named_pipe.close() except: print("failed to close named pipe") None

Hide Details

# Delete the pipe. try: os.remove(named_pipe_path) except: print("failed to delete named pipe: {}".format(named_pipe_path)) None

Hide Details

# Delete the temp directory. try: os.rmdir(temp_dir) except: print( "failed to delete temp dir: {}, directory contents: '{}'".format( temp_dir, os.listdir(temp_dir))) None

Hide Details

Hide Details

Adding tearDown hook: def cleanupSubprocesses(self): # Ensure any subprocesses are cleaned up for p in self.subprocesses: p.terminate() del p del self.subprocesses[:] # Ensure any forked processes are cleaned up for pid in self.forkedProcessPids: if os.path.exists("/proc/" + str(pid)): os.kill(pid, signal.SIGTERM)

Hide Details

Hide Details

Adding tearDown hook: def shutdown_debug_monitor(): try: server.terminate() except: logger.warning( "failed to terminate server for debug monitor: {}; ignoring".format( sys.exc_info()[0]))

Hide Details

Hide Details

Adding tearDown hook: def shutdown_socket(): if sock: try: # send the kill packet so lldb-server shuts down gracefully sock.sendall(GdbRemoteTestCaseBase._GDBREMOTE_KILL_PACKET) except: logger.warning( "failed to send kill packet to debug monitor: {}; ignoring".format( sys.exc_info()[0]))

Hide Details

try: sock.close() except: logger.warning( "failed to close socket to debug monitor: {}; ignoring".format( sys.exc_info()[0]))

Hide Details

Hide Details

Adding tearDown hook: def cleanupSubprocesses(self): # Ensure any subprocesses are cleaned up for p in self.subprocesses: p.terminate() del p del self.subprocesses[:] # Ensure any forked processes are cleaned up for pid in self.forkedProcessPids: if os.path.exists("/proc/" + str(pid)): os.kill(pid, signal.SIGTERM)

Hide Details

Hide Details

FAIL: LLDB (/Users/buildslave/jenkins/workspace/lldb-cmake-sanitized/host-compiler/bin/clang-10-x86_64) :: test_g_packet_debugserver (TestGdbRemoteGPacket.TestGdbRemoteGPacket) Executing tearDown hook: def cleanupSubprocesses(self): # Ensure any subprocesses are cleaned up for p in self.subprocesses: p.terminate() del p del self.subprocesses[:] # Ensure any forked processes are cleaned up for pid in self.forkedProcessPids: if os.path.exists("/proc/" + str(pid)): os.kill(pid, signal.SIGTERM)

Hide Details

Hide Details

Executing tearDown hook: def shutdown_socket(): if sock: try: # send the kill packet so lldb-server shuts down gracefully sock.sendall(GdbRemoteTestCaseBase._GDBREMOTE_KILL_PACKET) except: logger.warning( "failed to send kill packet to debug monitor: {}; ignoring".format( sys.exc_info()[0]))

Hide Details

try: sock.close() except: logger.warning( "failed to close socket to debug monitor: {}; ignoring".format( sys.exc_info()[0]))

Hide Details

Hide Details

Executing tearDown hook: def shutdown_debug_monitor(): try: server.terminate() except: logger.warning( "failed to terminate server for debug monitor: {}; ignoring".format( sys.exc_info()[0]))

Hide Details

Hide Details

Executing tearDown hook: def cleanupSubprocesses(self): # Ensure any subprocesses are cleaned up for p in self.subprocesses: p.terminate() del p del self.subprocesses[:] # Ensure any forked processes are cleaned up for pid in self.forkedProcessPids: if os.path.exists("/proc/" + str(pid)): os.kill(pid, signal.SIGTERM)

Hide Details

Hide Details

Executing tearDown hook: def shutdown_named_pipe(): # Close the pipe. try: named_pipe.close() except: print("failed to close named pipe") None

Hide Details

# Delete the pipe. try: os.remove(named_pipe_path) except: print("failed to delete named pipe: {}".format(named_pipe_path)) None

Hide Details

# Delete the temp directory. try: os.rmdir(temp_dir) except: print( "failed to delete temp dir: {}, directory contents: '{}'".format( temp_dir, os.listdir(temp_dir))) None

Hide Details

Hide Details

runCmd: settings set symbols.enable-external-lookup false output:

Hide Details

runCmd: settings set plugin.process.gdb-remote.packet-timeout 60 output:

Hide Details

runCmd: settings set symbols.clang-modules-cache-path "/Users/buildslave/jenkins/workspace/lldb-cmake-sanitized/lldb-build/tools/lldb/lldb-test-build.noindex/module-cache-lldb" output:

Hide Details

runCmd: settings set use-color false output:

Hide Details

UNSUPPORTED: LLDB (/Users/buildslave/jenkins/workspace/lldb-cmake-sanitized/host-compiler/bin/clang-10-x86_64) :: test_g_returns_correct_data_no_suffix_llgs (TestGdbRemoteGPacket.TestGdbRemoteGPacket) (llgs tests) runCmd: settings set symbols.enable-external-lookup false output:

Hide Details

runCmd: settings set plugin.process.gdb-remote.packet-timeout 60 output:

Hide Details

runCmd: settings set symbols.clang-modules-cache-path "/Users/buildslave/jenkins/workspace/lldb-cmake-sanitized/lldb-build/tools/lldb/lldb-test-build.noindex/module-cache-lldb" output:

Hide Details

runCmd: settings set use-color false output:

Hide Details

UNSUPPORTED: LLDB (/Users/buildslave/jenkins/workspace/lldb-cmake-sanitized/host-compiler/bin/clang-10-x86_64) :: test_g_returns_correct_data_with_suffix_llgs (TestGdbRemoteGPacket.TestGdbRemoteGPacket) (llgs tests) Restore dir to: /Users/buildslave/jenkins/workspace/lldb-cmake-sanitized/lldb-build/tools/lldb/lit ====================================================================== FAIL: test_g_packet_debugserver (TestGdbRemoteGPacket.TestGdbRemoteGPacket) ---------------------------------------------------------------------- Traceback (most recent call last): File "/Users/buildslave/jenkins/workspace/lldb-cmake-sanitized/llvm-project/lldb/packages/Python/lldbsuite/test/decorators.py", line 141, in wrapper func(*args, **kwargs) File "/Users/buildslave/jenkins/workspace/lldb-cmake-sanitized/llvm-project/lldb/packages/Python/lldbsuite/test/decorators.py", line 141, in wrapper func(*args, **kwargs) File "/Users/buildslave/jenkins/workspace/lldb-cmake-sanitized/llvm-project/lldb/packages/Python/lldbsuite/test/tools/lldb-server/register-reading/TestGdbRemoteGPacket.py", line 59, in test_g_packet_debugserver self.run_test_g_packet() File "/Users/buildslave/jenkins/workspace/lldb-cmake-sanitized/llvm-project/lldb/packages/Python/lldbsuite/test/tools/lldb-server/register-reading/TestGdbRemoteGPacket.py", line 41, in run_test_g_packet self.connect_to_debug_monitor() File "/Users/buildslave/jenkins/workspace/lldb-cmake-sanitized/llvm-project/lldb/packages/Python/lldbsuite/test/tools/lldb-server/gdbremote_testcase.py", line 415, in connect_to_debug_monitor server = self.launch_debug_monitor(attach_pid=attach_pid) File "/Users/buildslave/jenkins/workspace/lldb-cmake-sanitized/llvm-project/lldb/packages/Python/lldbsuite/test/tools/lldb-server/gdbremote_testcase.py", line 408, in launch_debug_monitor self.port = self.get_stub_port_from_named_socket() File "/Users/buildslave/jenkins/workspace/lldb-cmake-sanitized/llvm-project/lldb/packages/Python/lldbsuite/test/tools/lldb-server/gdbremote_testcase.py", line 222, in get_stub_port_from_named_socket "no content to read on pipe") AssertionError: 0 == 0 : no content to read on pipe Config=x86_64-/Users/buildslave/jenkins/workspace/lldb-cmake-sanitized/host-compiler/bin/clang-10 ---------------------------------------------------------------------- Ran 3 tests in 4.132s

Hide Details

RESULT: FAILED (0 passes, 1 failures, 0 errors, 2 skipped, 0 expected failures, 0 unexpected successes)

Hide Details

******************** PASS: lldb-Suite :: functionalities/thread/concurrent_events/TestConcurrentManySignals.py (1082 of 1696) PASS: lldb-Suite :: functionalities/data-formatter/data-formatter-stl/libcxx/vector/TestDataFormatterLibcxxVector.py (1083 of 1696) PASS: lldb-Unit :: Utility/./UtilityTests/ArgsTest.TestMultipleArgs (1084 of 1696) PASS: lldb-Suite :: lang/cpp/llvm-style/TestLLVMStyle.py (1085 of 1696) PASS: lldb-Unit :: ScriptInterpreter/Python/./ScriptInterpreterPythonTests/PythonDataObjectsTest.TestPythonDictionaryValueEquality (1086 of 1696) PASS: lldb-Unit :: Utility/./UtilityTests/GeneratorTest.Create (1087 of 1696) PASS: lldb-Unit :: Process/gdb-remote/./ProcessGdbRemoteTests/GDBRemoteClientBaseTest.SendContinueAndWait (1088 of 1696) PASS: LLDB :: Expr/TestMultilineExpr.test (1089 of 1696) PASS: lldb-Unit :: Process/minidump/./LLDBMinidumpTests/MinidumpParserTest.GetThreadContext_x86_32_wow64 (1090 of 1696) PASS: lldb-Unit :: Interpreter/./InterpreterTests/CompletionTest.DirCompletionUsername (1091 of 1696) PASS: lldb-Unit :: Utility/./UtilityTests/StreamTest.ShiftOperatorUInts (1092 of 1696) PASS: lldb-Suite :: functionalities/return-value/TestReturnValue.py (1093 of 1696) PASS: lldb-Suite :: functionalities/thread/concurrent_events/TestConcurrentTwoWatchpointsOneSignal.py (1094 of 1696) PASS: lldb-Suite :: functionalities/data-formatter/data-formatter-objc/TestDataFormatterObjCCF.py (1095 of 1696) PASS: lldb-Suite :: tools/lldb-server/inferior-crash/TestGdbRemoteAbort.py (1096 of 1696) PASS: lldb-Unit :: ScriptInterpreter/Python/./ScriptInterpreterPythonTests/PythonDataObjectsTest.TestPythonString (1097 of 1696) PASS: lldb-Unit :: Utility/./UtilityTests/LogChannelTest.Enable (1098 of 1696) PASS: LLDB :: SymbolFile/DWARF/find-method-local-struct.cpp (1099 of 1696) PASS: lldb-Suite :: functionalities/thread/multi_break/TestMultipleBreakpoints.py (1100 of 1696) PASS: lldb-Suite :: linux/add-symbols/TestTargetSymbolsAddCommand.py (1101 of 1696) PASS: lldb-Unit :: Target/./TargetTests/ModuleCacheTest.GetAndPutStrangeHostname (1102 of 1696) PASS: lldb-Suite :: lang/objc/objc-new-syntax/TestObjCNewSyntaxLiteral.py (1103 of 1696) PASS: lldb-Suite :: lang/objc/radar-9691614/TestObjCMethodReturningBOOL.py (1104 of 1696) PASS: lldb-Unit :: Utility/./UtilityTests/ArgsTest.TestUnknownEscape (1105 of 1696) XFAIL: LLDB :: Register/x86-64-write.test (1106 of 1696) PASS: lldb-Suite :: lang/objc/single-entry-dictionary/TestObjCSingleEntryDictionary.py (1107 of 1696) PASS: lldb-Suite :: functionalities/darwin_log/filter/exact_match/message/TestDarwinLogFilterMatchMessage.py (1108 of 1696) PASS: lldb-Suite :: tools/lldb-server/commandline/TestStubSetSID.py (1109 of 1696) PASS: lldb-Unit :: Host/./HostTests/FileSystemTest.FileAndDirectoryComponents (1110 of 1696) PASS: lldb-Unit :: Process/gdb-remote/./ProcessGdbRemoteTests/GDBRemoteCommunicationClientTest.GetMemoryRegionInfoInvalidResponse (1111 of 1696) PASS: lldb-Unit :: Host/./HostTests/NativeProcessProtocolTest.SetBreakpointFailVerify (1112 of 1696) PASS: LLDB :: SymbolFile/Breakpad/unwind-via-stack-cfi.test (1113 of 1696) PASS: lldb-Unit :: Utility/./UtilityTests/Flags.SetCount (1114 of 1696) PASS: lldb-Suite :: lang/cpp/auto/TestCPPAuto.py (1115 of 1696) PASS: lldb-Unit :: Language/Highlighting/./HighlighterTests/HighlighterTest.ClangCursorOutOfBounds (1116 of 1696) PASS: lldb-Unit :: ObjectFile/Breakpad/./ObjectFileBreakpadTests/ModuleRecord.parse (1117 of 1696) PASS: lldb-Suite :: functionalities/thread/step_until/TestStepUntil.py (1118 of 1696) PASS: lldb-Unit :: Language/Highlighting/./HighlighterTests/HighlighterTest.ClangCommas (1119 of 1696) PASS: lldb-Suite :: lang/c/bitfields/TestBitfields.py (1120 of 1696) PASS: lldb-Suite :: functionalities/data-formatter/data-formatter-stl/libstdcpp/iterator/TestDataFormatterStdIterator.py (1121 of 1696) PASS: lldb-Unit :: Utility/./UtilityTests/StreamTest.PutNHex8 (1122 of 1696) PASS: lldb-Suite :: commands/expression/entry-bp/TestExprEntryBP.py (1123 of 1696) PASS: lldb-Suite :: commands/frame/diagnose/complicated-expression/TestComplicatedExpression.py (1124 of 1696) PASS: lldb-Suite :: commands/watchpoints/watchpoint_commands/TestWatchpointCommands.py (1125 of 1696) PASS: lldb-Unit :: Utility/./UtilityTests/ProcessInfoTest.Constructor (1126 of 1696) PASS: lldb-Unit :: Utility/./UtilityTests/UriParserTest.MinimalPort (1127 of 1696) PASS: lldb-Unit :: Utility/./UtilityTests/AnsiTerminal.Twice (1128 of 1696) PASS: lldb-Suite :: commands/expression/completion/TestExprCompletion.py (1129 of 1696) PASS: LLDB :: SymbolFile/DWARF/find-qualified-variable.cpp (1130 of 1696) PASS: lldb-Unit :: Utility/./UtilityTests/StringListTest.ShiftCString (1131 of 1696) PASS: lldb-Suite :: functionalities/thread/concurrent_events/TestConcurrentTwoWatchpointsOneDelayBreakpoint.py (1132 of 1696) PASS: lldb-Unit :: Utility/./UtilityTests/AnsiTerminal.Incomplete (1133 of 1696) PASS: lldb-Suite :: lang/c/set_values/TestSetValues.py (1134 of 1696) PASS: lldb-Suite :: lang/objc/forward-decl/TestForwardDecl.py (1135 of 1696) PASS: lldb-Unit :: Utility/./UtilityTests/DeserializerTest.HasData (1136 of 1696) PASS: lldb-Unit :: Utility/./UtilityTests/StreamTest.PutCharWhitespace (1137 of 1696) PASS: lldb-Unit :: Utility/./UtilityTests/StructuredDataTest.ParseJSONFromFile (1138 of 1696) PASS: lldb-Suite :: lang/objc/objc-new-syntax/TestObjCNewSyntaxArray.py (1139 of 1696) PASS: lldb-Suite :: functionalities/darwin_log/basic/TestDarwinLogBasic.py (1140 of 1696) PASS: lldb-Suite :: lang/objc/foundation/TestObjCMethodsNSArray.py (1141 of 1696) PASS: lldb-Unit :: Process/gdb-remote/./ProcessGdbRemoteTests/GDBRemoteCommunicationClientTest.TestPacketSpeedJSON (1142 of 1696) PASS: lldb-Suite :: tools/lldb-server/commandline/TestStubReverseConnect.py (1143 of 1696) PASS: lldb-Unit :: Host/./HostTests/FileSystemTest.GetByteSize (1144 of 1696) PASS: lldb-Unit :: Utility/./UtilityTests/ConstStringTest.format_provider (1145 of 1696) PASS: lldb-Suite :: lang/c/local_variables/TestLocalVariables.py (1146 of 1696) PASS: lldb-Suite :: functionalities/memory/cache/TestMemoryCache.py (1147 of 1696) PASS: lldb-Suite :: tools/lldb-server/TestGdbRemoteExitCode.py (1148 of 1696) PASS: LLDB :: SymbolFile/DWARF/debug-types-line-tables.s (1149 of 1696) PASS: lldb-Suite :: commands/expression/import-std-module/weak_ptr-dbg-info-content/TestDbgInfoContentWeakPtr.py (1150 of 1696) PASS: lldb-Unit :: Utility/./UtilityTests/VMRange.Ordering (1151 of 1696) PASS: lldb-Unit :: Utility/./UtilityTests/StringListTest.JoinNonSpace (1152 of 1696) PASS: lldb-Suite :: functionalities/non-overlapping-index-variable-i/TestIndexVariable.py (1153 of 1696) PASS: lldb-Unit :: UnwindAssembly/x86/./UnwindAssemblyx86Tests/Testx86AssemblyInspectionEngine.Testi386IgnoredRegisters (1154 of 1696) PASS: LLDB :: SymbolFile/DWARF/debug_ranges_and_rnglists.test (1155 of 1696) PASS: lldb-Suite :: functionalities/multidebugger_commands/TestMultipleDebuggersCommands.py (1156 of 1696) PASS: lldb-Unit :: SymbolFile/DWARF/./SymbolFileDWARFTests/SymbolFileDWARFTests.TestAbbrevOutOfOrder (1157 of 1696) PASS: lldb-Suite :: functionalities/data-formatter/data-formatter-stl/libcxx/atomic/TestLibCxxAtomic.py (1158 of 1696) PASS: lldb-Unit :: Utility/./UtilityTests/StreamTest.PutHex64ByteOrderLittle (1159 of 1696) PASS: lldb-Unit :: UnwindAssembly/x86/./UnwindAssemblyx86Tests/Testx86AssemblyInspectionEngine.Test32BitOnlyInstruction (1160 of 1696) PASS: lldb-Unit :: Expression/./ExpressionTests/DiagnosticManagerTest.GetStringMultipleDiags (1161 of 1696) PASS: lldb-Unit :: Expression/./ExpressionTests/DiagnosticManagerTest.AppendMessageNoDiag (1162 of 1696) PASS: lldb-Unit :: ScriptInterpreter/Python/./ScriptInterpreterPythonTests/PythonExceptionStateTest.TestDiscardSemantics (1163 of 1696) UNSUPPORTED: LLDB :: SymbolFile/PDB/type-quals.test (1164 of 1696) PASS: lldb-Unit :: Editline/./EditlineTests/EditlineTestFixture.EditlineReceivesSingleLineText (1165 of 1696) PASS: lldb-Unit :: Host/./HostTests/SocketTest.UDPGetConnectURI (1166 of 1696) PASS: lldb-Suite :: functionalities/inferior-assert/TestInferiorAssert.py (1167 of 1696) PASS: lldb-Unit :: SymbolFile/DWARF/./SymbolFileDWARFTests/SymbolFileDWARFTests.TestAbbrevValidAttrNullForm (1168 of 1696) PASS: lldb-Suite :: lang/objc/objc-static-method-stripped/TestObjCStaticMethodStripped.py (1169 of 1696) PASS: lldb-Unit :: SymbolFile/NativePDB/./SymbolFileNativePDBTests/PDBFPOProgramToDWARFExpressionTests.UnknownOp (1170 of 1696) PASS: lldb-Unit :: UnwindAssembly/x86/./UnwindAssemblyx86Tests/Testx86AssemblyInspectionEngine.TestPushEBP (1171 of 1696) PASS: lldb-Unit :: ObjectFile/Breakpad/./ObjectFileBreakpadTests/StackCFIRecord.parse (1172 of 1696) PASS: lldb-Suite :: functionalities/data-formatter/data-formatter-stl/libstdcpp/list/TestDataFormatterStdList.py (1173 of 1696) PASS: lldb-Suite :: functionalities/abbreviation/TestAbbreviations.py (1174 of 1696) PASS: lldb-Unit :: Process/gdb-remote/./ProcessGdbRemoteTests/GDBRemoteCommunicationServerTest.SendErrorResponse_StringError (1175 of 1696) UNSUPPORTED: LLDB :: SymbolFile/NativePDB/local-variables.cpp (1176 of 1696) PASS: lldb-Unit :: Process/minidump/./LLDBMinidumpTests/MinidumpParserTest.GetExceptionStream (1177 of 1696) PASS: lldb-Unit :: Expression/./ExpressionTests/DiagnosticManagerTest.GetStringMultiline (1178 of 1696) PASS: lldb-Unit :: SymbolFile/DWARF/./SymbolFileDWARFTests/SymbolFileDWARFTests.TestAbbrevMissingTerminator (1179 of 1696) PASS: lldb-Unit :: Utility/./UtilityTests/ScalarTest.ExtractBitfield (1180 of 1696) PASS: lldb-Suite :: lang/cpp/template/TestTemplateArgs.py (1181 of 1696) PASS: lldb-Suite :: functionalities/tsan/multiple/TestTsanMultiple.py (1182 of 1696) PASS: lldb-Suite :: functionalities/inferior-changed/TestInferiorChanged.py (1183 of 1696) UNSUPPORTED: LLDB :: SymbolFile/DWARF/debug-types-expressions.test (1184 of 1696) PASS: lldb-Unit :: Utility/./UtilityTests/CompletionRequest.Constructor (1185 of 1696) PASS: lldb-Suite :: commands/expression/vector_of_enums/TestVectorOfEnums.py (1186 of 1696) PASS: lldb-Suite :: functionalities/gdb_remote_client/TestRestartBug.py (1187 of 1696) PASS: lldb-Suite :: python_api/sbstructureddata/TestStructuredDataAPI.py (1188 of 1696) PASS: lldb-Unit :: Symbol/./SymbolTests/TestClangASTContext.TestIsClangType (1189 of 1696) PASS: lldb-Unit :: Utility/./UtilityTests/TildeExpressionResolver.ResolveFullPath (1190 of 1696) PASS: lldb-Unit :: Utility/./UtilityTests/FileSpecTest.EqualDotsWindows (1191 of 1696) PASS: lldb-Suite :: commands/expression/dont_allow_jit/TestAllowJIT.py (1192 of 1696) PASS: lldb-Unit :: ScriptInterpreter/Python/./ScriptInterpreterPythonTests/PythonDataObjectsTest.TestPythonIntegerToStr (1193 of 1696) PASS: LLDB :: SymbolFile/DWARF/debug-names-compressed.cpp (1194 of 1696) PASS: lldb-Unit :: Utility/./UtilityTests/ArgsTest.ReplaceArgumentAtIndexFarOutOfRange (1195 of 1696) PASS: lldb-Suite :: lang/objc/foundation/TestRuntimeTypes.py (1196 of 1696) PASS: lldb-Suite :: commands/expression/context-object/TestContextObject.py (1197 of 1696) PASS: lldb-Unit :: Process/gdb-remote/./ProcessGdbRemoteTests/GDBRemoteCommunicationServerTest.SendErrorResponse_ErrorNumber (1198 of 1696) PASS: lldb-Suite :: lang/objc/objc-class-method/TestObjCClassMethod.py (1199 of 1696) PASS: lldb-Unit :: Host/./HostTests/NativeProcessProtocolTest.SetBreakpoint (1200 of 1696) PASS: lldb-Suite :: lang/objc/objc-stepping/TestObjCStepping.py (1201 of 1696) PASS: lldb-Unit :: Target/./TargetTests/MemoryRegionInfoTest.Formatv (1202 of 1696) PASS: lldb-Unit :: Utility/./UtilityTests/BinaryStreamTest.PutULEB128FiveBytes (1203 of 1696) PASS: lldb-Unit :: Core/./LLDBCoreTests/MangledTest.ResultForValidName (1204 of 1696) PASS: lldb-Unit :: UnwindAssembly/x86/./UnwindAssemblyx86Tests/Testx86AssemblyInspectionEngine.TestPopRBPWithREX (1205 of 1696) PASS: lldb-Unit :: Host/./HostTests/MainLoopTest.TerminatesImmediately (1206 of 1696) PASS: lldb-Suite :: functionalities/data-formatter/data-formatter-objc/TestDataFormatterObjCKVO.py (1207 of 1696) PASS: lldb-Suite :: commands/apropos/basic/TestApropos.py (1208 of 1696) PASS: LLDB :: Modules/ELF/basic-info.yaml (1209 of 1696) PASS: lldb-Unit :: Utility/./UtilityTests/StringLexerTest.GetUnlexed (1210 of 1696) PASS: lldb-Unit :: Utility/./UtilityTests/RangeTest.ContainsEndInclusiveInvalid (1211 of 1696) PASS: lldb-Unit :: Utility/./UtilityTests/ArgsTest.TestArgv (1212 of 1696) PASS: lldb-Unit :: Host/./HostTests/HostInfoTest.GetHostname (1213 of 1696) PASS: lldb-Suite :: python_api/lldbutil/TestSwigVersion.py (1214 of 1696) PASS: lldb-Suite :: commands/expression/fixits/TestFixIts.py (1215 of 1696) PASS: lldb-Suite :: commands/expression/call-restarts/TestCallThatRestarts.py (1216 of 1696) PASS: lldb-Unit :: debugserver/./debugserverTests/RNBSocket.LoopBackListenIPv4 (1217 of 1696) UNSUPPORTED: LLDB :: Register/x86-ymm-write.test (1218 of 1696) PASS: LLDB :: SymbolFile/DWARF/parallel-indexing-stress.s (1219 of 1696) UNSUPPORTED: LLDB :: SymbolFile/PDB/variables.test (1220 of 1696) PASS: lldb-Unit :: Utility/./UtilityTests/NameMatchesTest.Contains (1221 of 1696) PASS: lldb-Unit :: Core/./LLDBCoreTests/RichManglingContextTest.Basic (1222 of 1696) PASS: lldb-Unit :: Host/./HostTests/FileSystemTest.EnumerateDirectory (1223 of 1696) PASS: LLDB :: Driver/TestNoUseColor.test (1224 of 1696) PASS: lldb-Suite :: python_api/watchpoint/watchlocation/TestTargetWatchAddress.py (1225 of 1696) PASS: lldb-Unit :: Process/gdb-remote/./ProcessGdbRemoteTests/GDBRemoteCommunicationClientTest.ReadRegister (1226 of 1696) PASS: lldb-Unit :: UnwindAssembly/x86/./UnwindAssemblyx86Tests/Testx86AssemblyInspectionEngine.TestSimple32bitFrameFunction (1227 of 1696) PASS: lldb-Suite :: commands/expression/namespace_local_var_same_name_cpp_and_c/TestNamespaceLocalVarSameNameCppAndC.py (1228 of 1696) PASS: LLDB :: Commands/CommandScriptImmediateOutput/CommandScriptImmediateOutputFile.test (1229 of 1696) PASS: lldb-Suite :: functionalities/archives/TestBSDArchives.py (1230 of 1696) PASS: lldb-Unit :: Utility/./UtilityTests/BinaryStreamTest.PutULEB128SixBytes (1231 of 1696) PASS: lldb-Suite :: functionalities/data-formatter/data-formatter-synth/TestDataFormatterSynth.py (1232 of 1696) PASS: lldb-Suite :: types/TestDoubleTypes.py (1233 of 1696) PASS: lldb-Suite :: functionalities/data-formatter/synthupdate/TestSyntheticFilterRecompute.py (1234 of 1696) PASS: lldb-Suite :: lang/cpp/char8_t/TestCxxChar8_t.py (1235 of 1696) PASS: lldb-Suite :: lang/objc/blocks/TestObjCIvarsInBlocks.py (1236 of 1696) PASS: lldb-Unit :: Utility/./UtilityTests/StreamTest.PutSLEB128 (1237 of 1696) PASS: lldb-Unit :: Utility/./UtilityTests/StreamTest.PutBytesAsRawHex8ToBigEndian (1238 of 1696) PASS: lldb-Unit :: Symbol/./SymbolTests/TestClangASTContext.TemplateArguments (1239 of 1696) PASS: lldb-Suite :: python_api/symbol-context/two-files/TestSymbolContextTwoFiles.py (1240 of 1696) PASS: lldb-Suite :: commands/expression/namespace_local_var_same_name_obj_c/TestNamespaceLocalVarSameNameObjC.py (1241 of 1696) FAIL: lldb-Suite :: commands/gui/basic/TestGuiBasic.py (1242 of 1696) ******************** TEST 'lldb-Suite :: commands/gui/basic/TestGuiBasic.py' FAILED ******************** lldb version 10.0.99 (http://labmaster3.local/git/llvm-project.git revision bf1a23ad0e77b4f41c65b17731d443dc553f5911) clang revision 178cd2cd3a69046c88ade1b31796f3f90b7e86a0 llvm revision 178cd2cd3a69046c88ade1b31796f3f90b7e86a0 LLDB library dir: /Users/buildslave/jenkins/workspace/lldb-cmake-sanitized/lldb-build/bin LLDB import library dir: /Users/buildslave/jenkins/workspace/lldb-cmake-sanitized/lldb-build/bin libstdcxx tests will not be run because: Don't know how to build with libstdcxx on macosx Skipping following debug info categories: ['dwo'] (lldb) settings set symbols.enable-external-lookup false (lldb) settings set plugin.process.gdb-remote.packet-timeout 60 (lldb) settings set symbols.clang-modules-cache-path "/Users/buildslave/jenkins/workspace/lldb-cmake-sanitized/lldb-build/tools/lldb/lldb-test-build.noindex/module-cache-lldb" (lldb) settings set use-color false (lldb) target create "/Users/buildslave/jenkins/workspace/lldb-cmake-sanitized/lldb-build/tools/lldb/lldb-test-build.noindex/commands/gui/basic/TestGuiBasic.test_gui/a.out" Current executable set to '/Users/buildslave/jenkins/workspace/lldb-cmake-sanitized/lldb-build/tools/lldb/lldb-test-build.noindex/commands/gui/basic/TestGuiBasic.test_gui/a.out' (x86_64). (lldb) br set -f main.c -p "// Break here" br set -f main.c -p "// Break here" Breakpoint 1: where = a.out`main + 27 at main.c:3:3, address = 0x0000000100000fab (lldb) run run Process 37850 launched: '/Users/buildslave/jenkins/workspace/lldb-cmake-sanitized/lldb-build/tools/lldb/lldb-test-build.noindex/commands/gui/basic/TestGuiBasic.test_gui/a.out' (x86_64) Process 37850 stopped * thread #1, queue = 'com.apple.main-thread', stop reason = breakpoint 1.1 frame #0: 0x0000000100000fab a.out`main(argc=1, argv=0x00007ffeefbff530) at main.c:3:3 1 int main(int argc, char **argv) { 2 int funky_var_name_that_should_be_rendered = 22; -> 3 return 0; // Break here ^ 4 } (lldb) gui gui (B)0[?7h[?1h=| LLDB (F1) | Target (F2) | Process (F3) | Thread (F4) | View (F5) | Help (F6) | lqq<Sources>qqqqqqqqqqqqqqqqqqqqqqqqqqqqqqqqqqqqqqqqqqqqqqqqqqqqqqqqqqqqqqqqqqqqqqqqqqqqqqqqqqqqqqqqqqqqqqqqqqqqqqqqqqqqqqqqqqqqqqqqqqqqqqqqqqqqqqqqqqqqqqqqqqqqqqqqqqqqqqqqqqqqqqqqqqqqqqqqqqqqqqqqqqqqqqqqqqqqqqqqqqqqqqqqqqqqqqqqqqqqqqqqqqqqqqqqqqqqqqqqqqqqqqqqqqqqqqqqqqqqqqqqqqqqqqqqqqqqqqqqqqqqqqqqqqqqqqqqqqqqqqqqqqqqqqqqqqqqqqqqqqqqqqqqqqqqqqqqqqqqqqqqqqqqqqqqqqqqqqqqqqqqqqqqqqqqqqqqqqqqqqqqqqqklqq<Threads>qqqqqqqqqqqqqqqqqqqqqqqqqqqqqqqqqqqqqqqqqqqqqqqqqqqqqqqqqqqqqqqqqqqqqqqqqqqqqqqqqqqqqqqkx a.out`main xx `qprocess 37850xx 1 x int main(int argc, char **argv) {xxxx 2 x int funky_var_name_that_should_be_rendered = 22;xxxx 3 x` return 0; // Break here <<< Thread 1: breakpoint 1.1 xxxx 4 x }xxxx 5 xxxxxxxxxxxxxxxxxxxxxxxxxxxxxxxxxxxxxxxxxxxxxxxxxxxxxxxxxxxxxxxxxxxxxxxxxxxxxxxxxxxxxxxxxxxxxxxxxxxxxxxxxxxxxxxxxxxxxxxxxxxxxxxxxxxxxxxxxlqq<Help>qqqqqqqqqqqqqqqqqqqqqqqqqqqqqqqqqqqqqqqqqqqqqqqqqqqqqqqqqqqqqqqqqqqqqqqqqqqqqqqkxxxxx Welcome to the LLDB curses GUI.xxxxxxxxxxxx Press the TAB key to change the selected view.xxxxxx Each view has its own keyboard shortcuts, press 'h' to open a dialog to display them. xxxxxxxxxxxx Common key bindings for all views:xxxxxxxxxxxxtab - Select next viewxxxxxxh - Show help dialog with view specific key bindingsxxxxxx, - Page upxxxxxx. - Page downxxxxxxup - Select previousxxxxxxdown - Select nextxxxxxxleft - Unexpand or select parentxxxxxxright - Expandxxxxxx page-up - Page upxxxxxx page-down - Page downxxxxxmqqqqqqqqqqqqqqqqqqqqqqqqqqqqqqqqqqqqqqqqqqqqqqqqqqqqqqqqqqqqqq[Press any key to exit]qqjxxxxxxxxxxxxxxxxxxxxxxxxxxxxxxxxxxxmqqqqqqqqqqqqqqqqqqqqqqqqqqqqqqqqqqqqqqqqqqqqqqqqqqqqqqqqqqqqqqqqqqqqqqqqqqqqqqqqqqqqqqqqqqqqqqqqqqqqqqqqqqqqqqqqqqqqqqqqqqqqqqqqqqqqqqqqqqqqqqqqqqqqqqqqqqqqqqqqqqqqqqqqqqqqqqqqqqqqqqqqqqqqqqqqqqqqqqqqqqqqqqqqqqqqqqqqqqqqqqqqqqqqqqqqqqqqqqqqqqqqqqqqqqqqqqqqqqqqqqqqqqqqqqqqqqqqqqqqqqqqqqqqqqqqqqqqqqqqqqqqqqqqqqqqqqqqqqqqqqqqqqqqqqqqqqqqqqqqqqqqqqqqqqqqqqqqqqqqqqqqqqqqqqqqqqqqqqqqqqqqqqqqqqqqqqqqqqjxxlqq<Variables>qqqqqqqqqqqqqqqqqqqqqqqqqqqqqqqqqqqqqqqqqqqqqqqqqqqqqqqqqqqqqqqqqqqqqqqqqqqqqqqqqqqqqqqqqqqqqqqqqqqqqqqqqqqqqqqqqqqqqqqqqqqqqqqqqqqqqqqqqqqqqqqqqqqqqqqqqqqqqqqqqqqqqqqqqqqqqqqqqqqqqqqqqqqqqqqqqqqqqqqqqqqqqqqqqqqqqqqqqqqqqqqqqqqqqqqqqqqqqqqqqqqqqqqqqqqqqqqqqqqqqqqqqqqqqqqqqqqqqqqqqqqqqqqqqqqqqqqqqqqqqqqqqqqqqqqqqqqqqqqqqqqqqqqqqqqqqqqqqqqqqqqqqqqqqqqqqqqqqqqqqqqqqqqqqqqqqqqqqqqqqqqqqkxxx (int) argc = 1xxxx `q(char **) argv = 0x00007ffeefbff530xxxx (int) funky_var_name_that_should_be_rendered = 22xxxxxxxxxxxxxxxxxxxxxxxxxxxxxxxxxxxxxxxxxxxxxxxxxxxxxxxxxxxxxxxxxxxxxxxxxxxxxxxxxxxxxxxxxxxxxxxxxxxxxxxmqqqqqqqqqqqqqqqqqqqqqqqqqqqqqqqqqqqqqqqqqqqqqqqqqqqqqqqqqqqqqqqqqqqqqqqqqqqqqqqqqqqqqqqqqqqqqqqqqqqqqqqqqqqqqqqqqqqqqqqqqqqqqqqqqqqqqqqqqqqqqqqqqqqqqqqqqqqqqqqqqqqqqqqqqqqqqqqqqqqqqqqqqqqqqqqqqqqqqqqqqqqqqqqqqqqqqqqqqqqqqqqqqqqqqqqqqqqqqqqqqqqqqqqqqqqqqqqqqqqqqqqqqqqqqqqqqqqqqqqqqqqqqqqqqqqqqqqqqqqqqqqqqqqqqqqqqqqqqqqqqqqqqqqqqqqqqqqqqqqqqqqqqqqqqqqqqqqqqqqqqqqqqqqqqqqqqqqqqqqqqqqqqqqqqqqqqqqqqqjmqqqqqqqqqqqqqqqqqqqqqqqqqqqqqqqqqqqqqqqqqqqqqqqqqqqqqqqqqqqqqqqqqqqqqqqqqqqqqqqqqqqqqqqqqqqqqqqqqqjProcess: 37850 stopped Thread: 0x1613a9b Frame: 0 PC = 0x0000000100000fab lqq<Sources>qqqqqqqqqqqqqqqqqqqqqqqqqqqqqqqqqqqqqqqqqqqqqqqqqqqqqqqqqqqqqqqqqqqqqqqqqqqqqqqqqqqqqqqqqqqqqqqqqqqqqqqqqqqqqqqqqqqqqqqqqqqqqqqqqqqqqqqqqqqqqqqqqqqqqqqqqqqqqqqqqqqqqqqqqqqqqqqqqqqqqqqqqqqqqqqqqqqqqqqqqqqqqqqqqqqqqqqqqqqqqqqqqqqqqqqqqqqqqqqqqqqqqqqqqqqqqqqqqqqqqqqqqqqqqqqqqqqqqqqqqqqqqqqqqqqqqqqqqqqqqqqqqqqqqqqqqqqqqqqqqqqqqqqqqqqqqqqqqqqqqqqqqqqqqqqqqqqqqqqqqqqqqqqqqqqqqqqqqqqqqqqqqqqk xx xx xx xx xx xx xx xx xx xx xx xx xx xx xx xx xx xx xx xx xx xx xx xx xx xx xx xx xx xx xx xx xx xx xx xx xx xx xx x x x  x x  x x  x x x x  x x  x x  x x   x x   x x   x x   x x   x x   x x   x x   x x  x x  x x x xx xx xx xx xx xx xx xx mqqqqqqqqqqqqqqqqqqqqqqqqqqqqqqqqqqqqqqqqqqqqqqqqqqqqqqqqqqqqqqqqqqqqqqqqqqqqqqqqqqqqqqqqqqqqqqqqqqqqqqqqqqqqqqqqqqqqqqqqqqqqqqqqqqqqqqqqqqqqqqqqqqqqqqqqqqqqqqqqqqqqqqqqqqqqqqqqqqqqqqqqqqqqqqqqqqqqqqqqqqqqqqqqqqqqqqqqqqqqqqqqqqqqqqqqqqqqqqqqqqqqqqqqqqqqqqqqqqqqqqqqqqqqqqqqqqqqqqqqqqqqqqqqqqqqqqqqqqqqqqqqqqqqqqqqqqqqqqqqqqqqqqqqqqqqqqqqqqqqqqqqqqqqqqqqqqqqqqqqqqqqqqqqqqqqqqqqqqqqqqqqqqqqqqqqqqqqqqj [?1l>(lldb) gui gui (B)0[?7h[?1h=| LLDB (F1) | Target (F2) | Process (F3) | Thread (F4) | View (F5) | Help (F6) | lqq<Sources>qqqqqqqqqqqqqqqqqqqqqqqqqqqqqqqqqqqqqqqqqqqqqqqqqqqqqqqqqqqqqqqqqqqqqqqqqqqqqqqqqqqqqqqqqqqqqqqqqqqqqqqqqqqqqqqqqqqqqqqqqqqqqqqqqqqqqqqqqqqqqqqqqqqqqqqqqqqqqqqqqqqqqqqqqqqqqqqqqqqqqqqqqqqqqqqqqqqqqqqqqqqqqqqqqqqqqqqqqqqqqqqqqqqqqqqqqqqqqqqqqqqqqqqqqqqqqqqqqqqqqqqqqqqqqqqqqqqqqqqqqqqqqqqqqqqqqqqqqqqqqqqqqqqqqqqqqqqqqqqqqqqqqqqqqqqqqqqqqqqqqqqqqqqqqqqqqqqqqqqqqqqqqqqqqqqqqqqqqqqqqqqqqqqklqq<Threads>qqqqqqqqqqqqqqqqqqqqqqqqqqqqqqqqqqqqqqqqqqqqqqqqqqqqqqqqqqqqqqqqqqqqqqqqqqqqqqqqqqqqqqqkx a.out`main xx `qprocess 37850xx 1 x int main(int argc, char **argv) {xxxx 2 x int funky_var_name_that_should_be_rendered = 22;xxxx 3 x` return 0; // Break here <<< Thread 1: breakpoint 1.1 xxxx 4 x }xxxx 5 xxxxxxxxxxxxxxxxxxxxxxxxxxxxxxxxxxxxxxxxxxxxxxxxxxxxxxxxxxxxxxxxxxxxxxxxxxxxxxxxxxxxxxxxxxxxxxxxxxxxxxxxxxxxxxxxxxxxxxxxxxxxxxxxxxxxxxxxxxxxxxxxxxxxxxxxxxxxxxxxxxxxxxxxxxxxxxxxxxxxxxxxxxxxxxxxxxxxxxxxxxxxxxxxxxxxxxxxxxxxxxxxxxxxxxxxxxxxxxxxxxxxmqqqqqqqqqqqqqqqqqqqqqqqqqqqqqqqqqqqqqqqqqqqqqqqqqqqqqqqqqqqqqqqqqqqqqqqqqqqqqqqqqqqqqqqqqqqqqqqqqqqqqqqqqqqqqqqqqqqqqqqqqqqqqqqqqqqqqqqqqqqqqqqqqqqqqqqqqqqqqqqqqqqqqqqqqqqqqqqqqqqqqqqqqqqqqqqqqqqqqqqqqqqqqqqqqqqqqqqqqqqqqqqqqqqqqqqqqqqqqqqqqqqqqqqqqqqqqqqqqqqqqqqqqqqqqqqqqqqqqqqqqqqqqqqqqqqqqqqqqqqqqqqqqqqqqqqqqqqqqqqqqqqqqqqqqqqqqqqqqqqqqqqqqqqqqqqqqqqqqqqqqqqqqqqqqqqqqqqqqqqqqqqqqqqqqqqqqqqqqqjxxlqq<Variables>qqqqqqqqqqqqqqqqqqqqqqqqqqqqqqqqqqqqqqqqqqqqqqqqqqqqqqqqqqqqqqqqqqqqqqqqqqqqqqqqqqqqqqqqqqqqqqqqqqqqqqqqqqqqqqqqqqqqqqqqqqqqqqqqqqqqqqqqqqqqqqqqqqqqqqqqqqqqqqqqqqqqqqqqqqqqqqqqqqqqqqqqqqqqqqqqqqqqqqqqqqqqqqqqqqqqqqqqqqqqqqqqqqqqqqqqqqqqqqqqqqqqqqqqqqqqqqqqqqqqqqqqqqqqqqqqqqqqqqqqqqqqqqqqqqqqqqqqqqqqqqqqqqqqqqqqqqqqqqqqqqqqqqqqqqqqqqqqqqqqqqqqqqqqqqqqqqqqqqqqqqqqqqqqqqqqqqqqqqqqqqqqqkxxx (int) argc = 1xxxx `q(char **) argv = 0x00007ffeefbff530xxxx (int) funky_var_name_that_should_be_rendered = 22xxxxxxxxxxxxxxxxxxxxxxxxxxxxxxxxxxxxxxxxxxxxxxxxxxxxxxxxxxxxxxxxxxxxxxxxxxxxxxxxxxxxxxxxxxxxxxxxxxxxxxxmqqqqqqqqqqqqqqqqqqqqqqqqqqqqqqqqqqqqqqqqqqqqqqqqqqqqqqqqqqqqqqqqqqqqqqqqqqqqqqqqqqqqqqqqqqqqqqqqqqqqqqqqqqqqqqqqqqqqqqqqqqqqqqqqqqqqqqqqqqqqqqqqqqqqqqqqqqqqqqqqqqqqqqqqqqqqqqqqqqqqqqqqqqqqqqqqqqqqqqqqqqqqqqqqqqqqqqqqqqqqqqqqqqqqqqqqqqqqqqqqqqqqqqqqqqqqqqqqqqqqqqqqqqqqqqqqqqqqqqqqqqqqqqqqqqqqqqqqqqqqqqqqqqqqqqqqqqqqqqqqqqqqqqqqqqqqqqqqqqqqqqqqqqqqqqqqqqqqqqqqqqqqqqqqqqqqqqqqqqqqqqqqqqqqqqqqqqqqqqjmqqqqqqqqqqqqqqqqqqqqqqqqqqqqqqqqqqqqqqqqqqqqqqqqqqqqqqqqqqqqqqqqqqqqqqqqqqqqqqqqqqqqqqqqqqqqqqqqqqjProcess: 37850 stopped Thread: 0x1613a9b Frame: 0 PC = 0x0000000100000fab [?1l>(lldb) settings set interpreter.prompt-on-quit false

Hide Details

Session logs for test failures/errors/unexpected successes will go into directory '/Users/buildslave/jenkins/workspace/lldb-cmake-sanitized/test/logs' Command invoked: /Users/buildslave/jenkins/workspace/lldb-cmake-sanitized/llvm-project/lldb/test/dotest.py --arch=x86_64 -s /Users/buildslave/jenkins/workspace/lldb-cmake-sanitized/lldb-build/lldb-test-traces -S nm -u CXXFLAGS -u CFLAGS --executable /Users/buildslave/jenkins/workspace/lldb-cmake-sanitized/lldb-build/./bin/lldb --dsymutil /Users/buildslave/jenkins/workspace/lldb-cmake-sanitized/lldb-build/./bin/dsymutil --filecheck /Users/buildslave/jenkins/workspace/lldb-cmake-sanitized/lldb-build/./bin/FileCheck -C /Users/buildslave/jenkins/workspace/lldb-cmake-sanitized/host-compiler/bin/clang --codesign-identity lldb_codesign --server /Users/buildslave/jenkins/workspace/lldb-cmake-sanitized/lldb-build/./bin/debugserver --arch x86_64 --build-dir /Users/buildslave/jenkins/workspace/lldb-cmake-sanitized/lldb-build/lldb-test-build.noindex -s=/Users/buildslave/jenkins/workspace/lldb-cmake-sanitized/test/logs -t --env TERM=vt100 --env LLVM_LIBS_DIR=/Users/buildslave/jenkins/workspace/lldb-cmake-sanitized/lldb-build/./lib --build-dir /Users/buildslave/jenkins/workspace/lldb-cmake-sanitized/lldb-build/tools/lldb/lldb-test-build.noindex --module-cache-dir /Users/buildslave/jenkins/workspace/lldb-cmake-sanitized/lldb-build/tools/lldb/lldb-test-build.noindex/module-cache-lldb /Users/buildslave/jenkins/workspace/lldb-cmake-sanitized/llvm-project/lldb/packages/Python/lldbsuite/test/commands/gui/basic -p TestGuiBasic.py Change dir to: /Users/buildslave/jenkins/workspace/lldb-cmake-sanitized/llvm-project/lldb/packages/Python/lldbsuite/test/commands/gui/basic runCmd: settings set symbols.enable-external-lookup false output:

Hide Details

runCmd: settings set plugin.process.gdb-remote.packet-timeout 60 output:

Hide Details

runCmd: settings set symbols.clang-modules-cache-path "/Users/buildslave/jenkins/workspace/lldb-cmake-sanitized/lldb-build/tools/lldb/lldb-test-build.noindex/module-cache-lldb" output:

Hide Details

runCmd: settings set use-color false output:

Hide Details

FAIL: LLDB (/Users/buildslave/jenkins/workspace/lldb-cmake-sanitized/host-compiler/bin/clang-10-x86_64) :: test_gui (TestGuiBasic.BasicGuiCommandTest) tearing down the child process....

Hide Details

CLEANUP ERROR: LLDB (/Users/buildslave/jenkins/workspace/lldb-cmake-sanitized/host-compiler/bin/clang-10-x86_64) :: test_gui (TestGuiBasic.BasicGuiCommandTest) Restore dir to: /Users/buildslave/jenkins/workspace/lldb-cmake-sanitized/lldb-build/tools/lldb/lit ====================================================================== ERROR: test_gui (TestGuiBasic.BasicGuiCommandTest) ---------------------------------------------------------------------- Traceback (most recent call last): File "/Users/buildslave/jenkins/workspace/lldb-cmake-sanitized/llvm-project/lldb/packages/Python/lldbsuite/test/commands/gui/basic/TestGuiBasic.py", line 60, in test_gui self.quit() File "/Users/buildslave/jenkins/workspace/lldb-cmake-sanitized/llvm-project/lldb/packages/Python/lldbsuite/test/lldbpexpect.py", line 61, in quit self.child.close(force=not gracefully) File "/Users/buildslave/jenkins/workspace/lldb-cmake-sanitized/llvm-project/lldb/third_party/Python/module/pexpect-4.6/pexpect/pty_spawn.py", line 327, in close self.ptyproc.close(force=force) File "/System/Library/Frameworks/Python.framework/Versions/2.7/lib/python2.7/contextlib.py", line 35, in __exit__ self.gen.throw(type, value, traceback) File "/Users/buildslave/jenkins/workspace/lldb-cmake-sanitized/llvm-project/lldb/third_party/Python/module/pexpect-4.6/pexpect/pty_spawn.py", line 25, in _wrap_ptyprocess_err raise ExceptionPexpect(*e.args) ExceptionPexpect: Could not terminate the child. Config=x86_64-/Users/buildslave/jenkins/workspace/lldb-cmake-sanitized/host-compiler/bin/clang-10 ---------------------------------------------------------------------- Ran 1 test in 12.987s

Hide Details

RESULT: FAILED (0 passes, 0 failures, 1 errors, 0 skipped, 0 expected failures, 0 unexpected successes)

Hide Details

******************** PASS: lldb-Unit :: Utility/./UtilityTests/BinaryStreamTest.PutULEB128One (1243 of 1696) PASS: lldb-Unit :: UnwindAssembly/x86/./UnwindAssemblyx86Tests/Testx86AssemblyInspectionEngine.TestPopR12 (1244 of 1696) PASS: lldb-Suite :: commands/breakpoint/basic/TestRegexpBreakCommand.py (1245 of 1696) PASS: lldb-Suite :: tools/lldb-server/TestGdbRemote_qThreadStopInfo.py (1246 of 1696) PASS: lldb-Unit :: Utility/./UtilityTests/ArchSpecTest.TestSetTriple (1247 of 1696) PASS: lldb-Unit :: Utility/./UtilityTests/VMRange.SetEndAddress (1248 of 1696) PASS: lldb-Unit :: ScriptInterpreter/Python/./ScriptInterpreterPythonTests/PythonDataObjectsTest.TestPythonStringToStructuredString (1249 of 1696) PASS: LLDB :: SymbolFile/DWARF/find-basic-variable.cpp (1250 of 1696) PASS: lldb-Unit :: Utility/./UtilityTests/Predicate.WaitForValueEqualTo (1251 of 1696) PASS: lldb-Unit :: Symbol/./SymbolTests/LineEntryTest.GetSameLineContiguousAddressRangeOneInline (1252 of 1696) PASS: lldb-Suite :: functionalities/thread/concurrent_events/TestConcurrentSignalDelayBreak.py (1253 of 1696) PASS: lldb-Suite :: commands/source/info/TestSourceInfo.py (1254 of 1696) PASS: lldb-Suite :: commands/expression/import-std-module/forward_list-basic/TestBasicForwardList.py (1255 of 1696) PASS: lldb-Suite :: functionalities/conditional_break/TestConditionalBreak.py (1256 of 1696) PASS: lldb-Unit :: Utility/./UtilityTests/TimerTest.CategoryTimesNested (1257 of 1696) PASS: LLDB :: SymbolFile/DWARF/dir-separator-no-comp-dir.s (1258 of 1696) PASS: lldb-Suite :: benchmarks/stepping/TestSteppingSpeed.py (1259 of 1696) PASS: lldb-Unit :: Utility/./UtilityTests/Flags.AnySet (1260 of 1696) PASS: lldb-Unit :: Utility/./UtilityTests/BinaryStreamTest.PutSLEB128OneByte (1261 of 1696) PASS: lldb-Unit :: Host/./HostTests/NativeProcessProtocolTest.ReadCStringFromMemory_MaxSize (1262 of 1696) PASS: LLDB :: Modules/MachO/lc_version_min.yaml (1263 of 1696) PASS: lldb-Suite :: functionalities/data-formatter/data-formatter-stl/libcxx/string/TestDataFormatterLibcxxString.py (1264 of 1696) PASS: lldb-Unit :: Language/Highlighting/./HighlighterTests/HighlighterTest.ClangSquareBrackets (1265 of 1696) PASS: lldb-Suite :: functionalities/data-formatter/data-formatter-stl/libcxx/tuple/TestDataFormatterLibcxxTuple.py (1266 of 1696) UNSUPPORTED: LLDB :: SymbolFile/PDB/ast-restore.test (1267 of 1696) PASS: LLDB :: Driver/TestCore.test (1268 of 1696) PASS: lldb-Suite :: functionalities/data-formatter/data-formatter-skip-summary/TestDataFormatterSkipSummary.py (1269 of 1696) PASS: lldb-Unit :: Utility/./UtilityTests/UriParserTest.BracketedHostname (1270 of 1696) PASS: LLDB :: SymbolFile/Breakpad/line-table-mixed-path-styles.test (1271 of 1696) PASS: LLDB :: Modules/ELF/section-types.yaml (1272 of 1696) PASS: LLDB :: Breakpoint/split-dwarf-5-addrbase.test (1273 of 1696) PASS: lldb-Suite :: api/listeners/TestListener.py (1274 of 1696) PASS: lldb-Suite :: python_api/value_var_update/TestValueVarUpdate.py (1275 of 1696) PASS: lldb-Suite :: functionalities/data-formatter/parray/TestPrintArray.py (1276 of 1696) PASS: lldb-Unit :: Utility/./UtilityTests/RecordReplayTest.InstrumentedFoo (1277 of 1696) PASS: lldb-Unit :: Utility/./UtilityTests/ProcessInstanceInfo.DumpTable_invalidUID (1278 of 1696) FAIL: lldb-Suite :: functionalities/gdb_remote_client/TestGDBRemoteClient.py (1279 of 1696) ******************** TEST 'lldb-Suite :: functionalities/gdb_remote_client/TestGDBRemoteClient.py' FAILED ******************** lldb version 10.0.99 (http://labmaster3.local/git/llvm-project.git revision bf1a23ad0e77b4f41c65b17731d443dc553f5911) clang revision 178cd2cd3a69046c88ade1b31796f3f90b7e86a0 llvm revision 178cd2cd3a69046c88ade1b31796f3f90b7e86a0 LLDB library dir: /Users/buildslave/jenkins/workspace/lldb-cmake-sanitized/lldb-build/bin LLDB import library dir: /Users/buildslave/jenkins/workspace/lldb-cmake-sanitized/lldb-build/bin libstdcxx tests will not be run because: Don't know how to build with libstdcxx on macosx Skipping following debug info categories: ['dwo']

Hide Details

Session logs for test failures/errors/unexpected successes will go into directory '/Users/buildslave/jenkins/workspace/lldb-cmake-sanitized/test/logs' Command invoked: /Users/buildslave/jenkins/workspace/lldb-cmake-sanitized/llvm-project/lldb/test/dotest.py --arch=x86_64 -s /Users/buildslave/jenkins/workspace/lldb-cmake-sanitized/lldb-build/lldb-test-traces -S nm -u CXXFLAGS -u CFLAGS --executable /Users/buildslave/jenkins/workspace/lldb-cmake-sanitized/lldb-build/./bin/lldb --dsymutil /Users/buildslave/jenkins/workspace/lldb-cmake-sanitized/lldb-build/./bin/dsymutil --filecheck /Users/buildslave/jenkins/workspace/lldb-cmake-sanitized/lldb-build/./bin/FileCheck -C /Users/buildslave/jenkins/workspace/lldb-cmake-sanitized/host-compiler/bin/clang --codesign-identity lldb_codesign --server /Users/buildslave/jenkins/workspace/lldb-cmake-sanitized/lldb-build/./bin/debugserver --arch x86_64 --build-dir /Users/buildslave/jenkins/workspace/lldb-cmake-sanitized/lldb-build/lldb-test-build.noindex -s=/Users/buildslave/jenkins/workspace/lldb-cmake-sanitized/test/logs -t --env TERM=vt100 --env LLVM_LIBS_DIR=/Users/buildslave/jenkins/workspace/lldb-cmake-sanitized/lldb-build/./lib --build-dir /Users/buildslave/jenkins/workspace/lldb-cmake-sanitized/lldb-build/tools/lldb/lldb-test-build.noindex --module-cache-dir /Users/buildslave/jenkins/workspace/lldb-cmake-sanitized/lldb-build/tools/lldb/lldb-test-build.noindex/module-cache-lldb /Users/buildslave/jenkins/workspace/lldb-cmake-sanitized/llvm-project/lldb/packages/Python/lldbsuite/test/functionalities/gdb_remote_client -p TestGDBRemoteClient.py Change dir to: /Users/buildslave/jenkins/workspace/lldb-cmake-sanitized/llvm-project/lldb/packages/Python/lldbsuite/test/functionalities/gdb_remote_client runCmd: settings set symbols.enable-external-lookup false output:

Hide Details

runCmd: settings set plugin.process.gdb-remote.packet-timeout 60 output:

Hide Details

runCmd: settings set symbols.clang-modules-cache-path "/Users/buildslave/jenkins/workspace/lldb-cmake-sanitized/lldb-build/tools/lldb/lldb-test-build.noindex/module-cache-lldb" output:

Hide Details

runCmd: settings set use-color false output:

Hide Details

<bound method SBProcess.Kill of <lldb.SBProcess; proxy of <Swig Object of type 'lldb::SBProcess *' at 0x1205ecc00> >>: success

Hide Details

PASS: LLDB (/Users/buildslave/jenkins/workspace/lldb-cmake-sanitized/host-compiler/bin/clang-10-x86_64) :: test_attach_fail (TestGDBRemoteClient.TestGDBRemoteClient) runCmd: settings set symbols.enable-external-lookup false output:

Hide Details

runCmd: settings set plugin.process.gdb-remote.packet-timeout 60 output:

Hide Details

runCmd: settings set symbols.clang-modules-cache-path "/Users/buildslave/jenkins/workspace/lldb-cmake-sanitized/lldb-build/tools/lldb/lldb-test-build.noindex/module-cache-lldb" output:

Hide Details

runCmd: settings set use-color false output:

Hide Details

FAIL: LLDB (/Users/buildslave/jenkins/workspace/lldb-cmake-sanitized/host-compiler/bin/clang-10-x86_64) :: test_connect (TestGDBRemoteClient.TestGDBRemoteClient) <bound method SBProcess.Kill of <lldb.SBProcess; proxy of <Swig Object of type 'lldb::SBProcess *' at 0x1205ec960> >>: success

Hide Details

Restore dir to: /Users/buildslave/jenkins/workspace/lldb-cmake-sanitized/lldb-build/tools/lldb/lit ====================================================================== FAIL: test_connect (TestGDBRemoteClient.TestGDBRemoteClient) Test connecting to a remote gdb server ---------------------------------------------------------------------- Traceback (most recent call last): File "/Users/buildslave/jenkins/workspace/lldb-cmake-sanitized/llvm-project/lldb/packages/Python/lldbsuite/test/functionalities/gdb_remote_client/TestGDBRemoteClient.py", line 13, in test_connect process = self.connect(target) File "/Users/buildslave/jenkins/workspace/lldb-cmake-sanitized/llvm-project/lldb/packages/Python/lldbsuite/test/functionalities/gdb_remote_client/gdbclientutils.py", line 479, in connect self.assertTrue(error.Success(), error.description) AssertionError: False is not True : failed to get reply to handshake packet Config=x86_64-/Users/buildslave/jenkins/workspace/lldb-cmake-sanitized/host-compiler/bin/clang-10 ---------------------------------------------------------------------- Ran 2 tests in 64.277s

Hide Details

RESULT: FAILED (1 passes, 1 failures, 0 errors, 0 skipped, 0 expected failures, 0 unexpected successes)

Hide Details

******************** PASS: lldb-Suite :: functionalities/thread/concurrent_events/TestConcurrentWatchpointDelayWatchpointOneBreakpoint.py (1280 of 1696) PASS: lldb-Suite :: functionalities/process_group/TestChangeProcessGroup.py (1281 of 1696) PASS: lldb-Unit :: Utility/./UtilityTests/LogChannelEnabledTest.LogVerboseThread (1282 of 1696) PASS: lldb-Suite :: commands/expression/import-std-module/vector-bool/TestBoolVector.py (1283 of 1696) PASS: lldb-Suite :: functionalities/data-formatter/data-formatter-objc/TestDataFormatterObjCNSData.py (1284 of 1696) PASS: lldb-Suite :: functionalities/thread/concurrent_events/TestConcurrentManyWatchpoints.py (1285 of 1696) PASS: lldb-Unit :: Interpreter/./InterpreterTests/OptionArgParserTest.toBoolean (1286 of 1696) PASS: lldb-Unit :: Language/Highlighting/./HighlighterTests/HighlighterTest.DefaultHighlighterWithCursorOutOfBounds (1287 of 1696) PASS: lldb-Suite :: functionalities/data-formatter/data-formatter-stl/libcxx/iterator/TestDataFormatterLibccIterator.py (1288 of 1696) PASS: lldb-Unit :: UnwindAssembly/x86/./UnwindAssemblyx86Tests/Testx86AssemblyInspectionEngine.TestSubESP (1289 of 1696) PASS: lldb-Unit :: Utility/./UtilityTests/OptionsWithRawTest.EmptySuffix (1290 of 1696) PASS: lldb-Suite :: commands/expression/completion-crash2/TestCompletionCrash2.py (1291 of 1696) PASS: lldb-Suite :: lang/c/step-target/TestStepTarget.py (1292 of 1696) PASS: lldb-Suite :: functionalities/data-formatter/stringprinter/TestStringPrinter.py (1293 of 1696) PASS: lldb-Suite :: functionalities/data-formatter/data-formatter-objc/TestDataFormatterObjCPlain.py (1294 of 1696) UNSUPPORTED: LLDB :: BuildScript/toolchain-clang-cl.test (1295 of 1696) PASS: lldb-Suite :: lang/cpp/rvalue-references/TestRvalueReferences.py (1296 of 1696) PASS: lldb-Unit :: debugserver/./debugserverTests/RNBSocket.LoopBackListenIPv6 (1297 of 1696) PASS: LLDB :: Modules/ELF/PT_LOAD-empty.yaml (1298 of 1696) PASS: lldb-Unit :: Process/minidump/./LLDBMinidumpTests/MinidumpParserTest.MinidumpDuplicateModuleMinAddress (1299 of 1696) PASS: LLDB :: SymbolFile/DWARF/find-basic-type.cpp (1300 of 1696) PASS: lldb-Suite :: lang/cpp/breakpoint_in_member_func_w_non_primitive_params/TestBreakpointInMemberFuncWNonPrimitiveParams.py (1301 of 1696) PASS: lldb-Suite :: commands/expression/timeout/TestCallWithTimeout.py (1302 of 1696) UNSUPPORTED: LLDB :: Unwind/unwind-plan-dwarf-dump.test (1303 of 1696) PASS: lldb-Unit :: Host/./HostTests/NativeProcessProtocolTest.ReadCStringFromMemory (1304 of 1696) PASS: lldb-Unit :: ScriptInterpreter/Python/./ScriptInterpreterPythonTests/PythonDataObjectsTest.TestPythonListValueEquality (1305 of 1696) PASS: LLDB :: Register/x86-64-read.test (1306 of 1696) PASS: lldb-Suite :: functionalities/data-formatter/boolreference/TestFormattersBoolRefPtr.py (1307 of 1696) PASS: lldb-Suite :: functionalities/thread/concurrent_events/TestConcurrentCrashWithBreak.py (1308 of 1696) PASS: LLDB :: Modules/ELF/netbsd-core-amd64.test (1309 of 1696) PASS: lldb-Suite :: lang/objc/objc-struct-return/TestObjCStructReturn.py (1310 of 1696) PASS: lldb-Suite :: functionalities/gdb_remote_client/TestRecognizeBreakpoint.py (1311 of 1696) PASS: lldb-Unit :: Utility/./UtilityTests/UserIDResolver.GetGroupName (1312 of 1696) PASS: lldb-Suite :: functionalities/gdb_remote_client/TestWriteMemory.py (1313 of 1696) PASS: lldb-Suite :: lang/objc/objc-ivar-stripped/TestObjCIvarStripped.py (1314 of 1696) PASS: lldb-Suite :: functionalities/ptr_refs/TestPtrRefs.py (1315 of 1696) PASS: LLDB :: Modules/Breakpad/discontiguous-sections.test (1316 of 1696) PASS: lldb-Suite :: functionalities/data-formatter/data-formatter-objc/TestDataFormatterObjCNSDate.py (1317 of 1696) PASS: lldb-Suite :: lang/objc/objc-optimized/TestObjcOptimized.py (1318 of 1696) PASS: lldb-Unit :: Utility/./UtilityTests/RegularExpression.CopyAssignment (1319 of 1696) UNSUPPORTED: LLDB :: SymbolFile/PDB/enums-layout.test (1320 of 1696) PASS: lldb-Suite :: commands/expression/import-std-module/vector-basic/TestBasicVector.py (1321 of 1696) PASS: lldb-Suite :: functionalities/tsan/cpp_global_location/TestTsanCPPGlobalLocation.py (1322 of 1696) PASS: lldb-Unit :: ScriptInterpreter/Python/./ScriptInterpreterPythonTests/PythonDataObjectsTest.TestOwnedReferences (1323 of 1696) PASS: LLDB :: Minidump/fb-dump.test (1324 of 1696) PASS: lldb-Suite :: lang/objc/objc-checker/TestObjCCheckers.py (1325 of 1696) UNSUPPORTED: LLDB :: Breakpoint/case-insensitive.test (1326 of 1696) PASS: lldb-Suite :: functionalities/data-formatter/language_category_updates/TestDataFormatterLanguageCategoryUpdates.py (1327 of 1696) PASS: lldb-Unit :: Utility/./UtilityTests/ConstStringTest.CompareStringRef (1328 of 1696) FAIL: lldb-Suite :: iohandler/completion/TestIOHandlerCompletion.py (1329 of 1696) ******************** TEST 'lldb-Suite :: iohandler/completion/TestIOHandlerCompletion.py' FAILED ******************** lldb version 10.0.99 (http://labmaster3.local/git/llvm-project.git revision bf1a23ad0e77b4f41c65b17731d443dc553f5911) clang revision 178cd2cd3a69046c88ade1b31796f3f90b7e86a0 llvm revision 178cd2cd3a69046c88ade1b31796f3f90b7e86a0 LLDB library dir: /Users/buildslave/jenkins/workspace/lldb-cmake-sanitized/lldb-build/bin LLDB import library dir: /Users/buildslave/jenkins/workspace/lldb-cmake-sanitized/lldb-build/bin libstdcxx tests will not be run because: Don't know how to build with libstdcxx on macosx Skipping following debug info categories: ['dwo'] (lldb) settings set symbols.enable-external-lookup false (lldb) settings set plugin.process.gdb-remote.packet-timeout 60 (lldb) settings set symbols.clang-modules-cache-path "/Users/buildslave/jenkins/workspace/lldb-cmake-sanitized/lldb-build/tools/lldb/lldb-test-build.noindex/module-cache-lldb" (lldb) settings set use-color false (lldb) a Available completions: _regexp-attach -- Attach to process by ID or name. _regexp-break -- Set a breakpoint using one of several shorthand formats. _regexp-bt -- Show the current thread's call stack. Any numeric argument displays at most that many frames. The argument 'all' displays all threads. Use 'settings set frame-format' to customize the printing of individual frames and 'settings set thread-format' to customize the thread header. _regexp-display -- Evaluate an expression at every stop (see 'help target stop-hook'.) _regexp-down -- Select a newer stack frame. Defaults to moving one frame, a numeric argument can specify an arbitrary number. _regexp-env -- Shorthand for viewing and setting environment variables. _regexp-jump -- Set the program counter to a new address. _regexp-list -- List relevant source code using one of several shorthand formats. _regexp-tbreak -- Set a one-shot breakpoint using one of several shorthand formats. _regexp-undisplay -- Stop displaying expression at every stop (specified by stop-hook index.) _regexp-up -- Select an older stack frame. Defaults to moving one frame, a numeric argument can specify an arbitrary number. apropos -- List debugger commands related to a word or subject. breakpoint -- Commands for operating on breakpoints (see 'help b' for shorthand.) command -- Commands for managing custom LLDB commands. disassemble -- Disassemble specified instructions in the current target. Defaults to the current function for the current thread and stack frame. expression -- Evaluate an expression on the current thread. Displays any returned value with LLDB's default formatting. frame -- Commands for selecting and examing the current thread's stack frames. gdb-remote -- Connect to a process via remote GDB server. If no host is specifed, localhost is assumed. gui -- Switch into the curses based GUI mode. help -- Show a list of all debugger commands, or give details about a specific command. kdp-remote -- Connect to a process via remote KDP server. If no UDP port is specified, port 41139 is assumed. language -- Commands specific to a source language. log -- Commands controlling LLDB internal logging. memory -- Commands for operating on memory in the current target process. platform -- Commands to manage and create platforms. plugin -- Commands for managing LLDB plugins. process -- Commands for interacting with processes on the current platform. quit -- Quit the LLDB debugger. register -- Commands to access registers for the current thread and stack frame. reproducer -- Commands for manipulate the reproducer functionality. script -- Invoke the script interpreter with provided code and display any results. Start the interactive interpreter if no code is supplied. settings regi -- Commands for managing LLDB settings. source -- Commands for examining source code described by debug information for the current target process. statistics -- Print statistics about a debugging session target -- Commands for operating on debugger targets. thread -- Commands for operating on one or more threads in the current process. type -- Commands for operating on the type system. version -- Show the LLDB debugger version. watchpoint -- Commands for operating on watchpoints. add-dsym -- Add a debug symbol file to one of the target's current modules by specifying a path to a debug symbols file, or using the options to specify a module to download symbols for. More (Y/n/a): attach -- Attach to process by ID or name. b -- Set a breakpoint using one of several shorthand formats. bt -- Show the current thread's call stack. Any numeric argument displays at most that many frames. The argument 'all' displays all threads. Use 'settings set frame-format' to customize the printing of individual frames and 'settings set thread-format' to customize the thread header. c -- Continue execution of all threads in the current process. call -- Evaluate an expression on the current thread. Displays any returned value with LLDB's default formatting. continue -- Continue execution of all threads in the current process. detach -- Detach from the current target process. di -- Disassemble specified instructions in the current target. Defaults to the current function for the current thread and stack frame. dis -- Disassemble specified instructions in the current target. Defaults to the current function for the current thread and stack frame. display -- Evaluate an expression at every stop (see 'help target stop-hook'.) down -- Select a newer stack frame. Defaults to moving one frame, a numeric argument can specify an arbitrary number. env -- Shorthand for viewing and setting environment variables. exit -- Quit the LLDB debugger. f -- Select the current stack frame by index from within the current thread (see 'thread backtrace'.) file -- Create a target using the argument as the main executable. finish -- Finish executing the current stack frame and stop after returning. Defaults to current thread unless specified. image -- Commands for accessing information for one or more target modules. j -- Set the program counter to a new address. jump -- Set the program counter to a new address. kill -- Terminate the current target process. l -- List relevant source code using one of several shorthand formats. list -- List relevant source code using one of several shorthand formats. n -- Source level single step, stepping over calls. Defaults to current thread unless specified. next -- Source level single step, stepping over calls. Defaults to current thread unless specified. nexti -- Instruction level single step, stepping over calls. Defaults to current thread unless specified. ni -- Instruction level single step, stepping over calls. Defaults to current thread unless specified. p -- Evaluate an expression on the current thread. Displays any returned value with LLDB's default formatting. parray -- Evaluate an expression on the current thread. Displays any returned value with LLDB's default formatting. po -- Evaluate an expression on the current thread. Displays any returned value with formatting controlled by the type's author. poarray -- Evaluate an expression on the current thread. Displays any returned value with LLDB's default formatting. print -- Evaluate an expression on the current thread. Displays any returned value with LLDB's default formatting. q -- Quit the LLDB debugger. r -- Launch the executable in the debugger. rbreak -- Sets a breakpoint or set of breakpoints in the executable. re -- Commands to access registers for the current thread and stack frame. run -- Launch the executable in the debugger. s -- Source level single step, stepping into calls. Defaults to current thread unless specified. si -- Instruction level single step, stepping into calls. Defaults to current thread unless specified. sif -- Step through the current block, stopping if you step directly into a function whose name matches the TargetFunctionName. step -- Source level single step, stepping into calls. Defaults to current thread unless specified. More (Y/n/a): stepi -- Instruction level single step, stepping into calls. Defaults to current thread unless specified. t -- Change the currently selected thread. tbreak -- Set a one-shot breakpoint using one of several shorthand formats. undisplay -- Stop displaying expression at every stop (specified by stop-hook index.) up -- Select an older stack frame. Defaults to moving one frame, a numeric argument can specify an arbitrary number. v -- Show variables for the current stack frame. Defaults to all arguments and local variables in scope. Names of argument, local, file static and file global variables can be specified. Children of aggregate variables can be specified such as 'var->child.x'. The -> and [] operators in 'frame variable' do not invoke operator overloads if they exist, but directly access the specified element. If you want to trigger operator overloads use the expression command to print the variable instead. It is worth noting that except for overloaded operators, when printing local variables 'expr local_var' and 'frame var local_var' produce the same results. However, 'frame variable' is more efficient, since it uses debug information and memory reads directly, rather than parsing and evaluating an expression, which may even involve JITing and running code in the target program. var -- Show variables for the current stack frame. Defaults to all arguments and local variables in scope. Names of argument, local, file static and file global variables can be specified. Children of aggregate variables can be specified such as 'var->child.x'. The -> and [] operators in 'frame variable' do not invoke operator overloads if they exist, but directly access the specified element. If you want to trigger operator overloads use the expression command to print the variable instead. It is worth noting that except for overloaded operators, when printing local variables 'expr local_var' and 'frame var local_var' produce the same results. However, 'frame variable' is more efficient, since it uses debug information and memory reads directly, rather than parsing and evaluating an expression, which may even involve JITing and running code in the target program. vo -- Show variables for the current stack frame. Defaults to all arguments and local variables in scope. Names of argument, local, file static and file global variables can be specified. Children of aggregate variables can be specified such as 'var->child.x'. The -> and [] operators in 'frame variable' do not invoke operator overloads if they exist, but directly access the specified element. If you want to trigger operator overloads use the expression command to print the variable instead. It is worth noting that except for overloaded operators, when printing local variables 'expr local_var' and 'frame var local_var' produce the same results. However, 'frame variable' is more efficient, since it uses debug information and memory reads directly, rather than parsing and evaluating an expression, which may even involve JITing and running code in the target program. x -- Read from the memory of the current target process. (lldb)  (lldb) regi (lldb) register

Hide Details

Commands to access registers for the current thread and stack frame.

Hide Details

Syntax: register [read|write] ...

Hide Details

The following subcommands are supported:

Hide Details

read -- Dump the contents of one or more register values from the current frame. If no register is specified, dumps them all. write -- Modify a single register value.

Hide Details

For more help on any particular subcommand, type 'help <command> <subcommand>'. (lldb) file /Users/buildslave/jenkins/workspace/lldb-cmake-sanitized/llvm-project/lldb/packages/Python/lldbsuite/test/iohandler/completion file /Users/buildslave/jenkins/workspace/lldb-cmake-sanitized/llvm-project/lldb/packages/Python/lldbsuite/test/iohandler/completion (lldb) file /Users/buildslave/jenkins/workspace/lldb-cmake-sanitized/llvm-project/lldb/packages/Python/lldbsuite/test/iohandler/completion/TestIOHandler TestIOHandler (lldb) file /Users/buildslave/jenkins/workspace/lldb-cmake-sanitized/llvm-project/lldb/packages/Python/lldbsuite/test/iohandler/completion/TestIOHandlerCompletion.py

Hide Details

error: '/Users/buildslave/jenkins/workspace/lldb-cmake-sanitized/llvm-project/lldb/packages/Python/lldbsuite/test/iohandler/completion/TestIOHandlerCompletion.py' doesn't contain any 'host' platform architectures: x86_64, i386 (lldb) Available completions: _regexp-attach -- Attach to process by ID or name. _regexp-break -- Set a breakpoint using one of several shorthand formats. _regexp-bt -- Show the current thread's call stack. Any numeric argument displays at most that many frames. The argument 'all' displays all threads. Use 'settings set frame-format' to customize the printing of individual frames and 'settings set thread-format' to customize the thread header. _regexp-display -- Evaluate an expression at every stop (see 'help target stop-hook'.) _regexp-down -- Select a newer stack frame. Defaults to moving one frame, a numeric argument can specify an arbitrary number. _regexp-env -- Shorthand for viewing and setting environment variables. _regexp-jump -- Set the program counter to a new address. _regexp-list -- List relevant source code using one of several shorthand formats. _regexp-tbreak -- Set a one-shot breakpoint using one of several shorthand formats. _regexp-undisplay -- Stop displaying expression at every stop (specified by stop-hook index.) _regexp-up -- Select an older stack frame. Defaults to moving one frame, a numeric argument can specify an arbitrary number. apropos -- List debugger commands related to a word or subject. breakpoint -- Commands for operating on breakpoints (see 'help b' for shorthand.) command -- Commands for managing custom LLDB commands. disassemble -- Disassemble specified instructions in the current target. Defaults to the current function for the current thread and stack frame. expression -- Evaluate an expression on the current thread. Displays any returned value with LLDB's default formatting. frame -- Commands for selecting and examing the current thread's stack frames. gdb-remote -- Connect to a process via remote GDB server. If no host is specifed, localhost is assumed. gui -- Switch into the curses based GUI mode. help -- Show a list of all debugger commands, or give details about a specific command. kdp-remote -- Connect to a process via remote KDP server. If no UDP port is specified, port 41139 is assumed. language -- Commands specific to a source language. log -- Commands controlling LLDB internal logging. memory -- Commands for operating on memory in the current target process. platform -- Commands to manage and create platforms. plugin -- Commands for managing LLDB plugins. process -- Commands for interacting with processes on the current platform. quit -- Quit the LLDB debugger. register -- Commands to access registers for the current thread and stack frame. reproducer -- Commands for manipulate the reproducer functionality. script -- Invoke the script interpreter with provided code and display any results. Start the interactive interpreter if no code is supplied. settings -- Commands for managing LLDB settings. source -- Commands for examining source code described by debug information for the current target process. statistics -- Print statistics about a debugging session target -- Commands for operating on debugger targets. thread -- Commands for operating on one or more threads in the current process. type -- Commands for operating on the type system. version -- Show the LLDB debugger version. watchpoint -- Commands for operating on watchpoints. add-dsym -- Add a debug symbol file to one of the target's current modules by specifying a path to a debug symbols file, or using the options to specify a module to download symbols for. More (Y/n/a): n (lldb) regoinvalid (lldb) settings set interpreter.prompt-on-quit false

Hide Details

Session logs for test failures/errors/unexpected successes will go into directory '/Users/buildslave/jenkins/workspace/lldb-cmake-sanitized/test/logs' Command invoked: /Users/buildslave/jenkins/workspace/lldb-cmake-sanitized/llvm-project/lldb/test/dotest.py --arch=x86_64 -s /Users/buildslave/jenkins/workspace/lldb-cmake-sanitized/lldb-build/lldb-test-traces -S nm -u CXXFLAGS -u CFLAGS --executable /Users/buildslave/jenkins/workspace/lldb-cmake-sanitized/lldb-build/./bin/lldb --dsymutil /Users/buildslave/jenkins/workspace/lldb-cmake-sanitized/lldb-build/./bin/dsymutil --filecheck /Users/buildslave/jenkins/workspace/lldb-cmake-sanitized/lldb-build/./bin/FileCheck -C /Users/buildslave/jenkins/workspace/lldb-cmake-sanitized/host-compiler/bin/clang --codesign-identity lldb_codesign --server /Users/buildslave/jenkins/workspace/lldb-cmake-sanitized/lldb-build/./bin/debugserver --arch x86_64 --build-dir /Users/buildslave/jenkins/workspace/lldb-cmake-sanitized/lldb-build/lldb-test-build.noindex -s=/Users/buildslave/jenkins/workspace/lldb-cmake-sanitized/test/logs -t --env TERM=vt100 --env LLVM_LIBS_DIR=/Users/buildslave/jenkins/workspace/lldb-cmake-sanitized/lldb-build/./lib --build-dir /Users/buildslave/jenkins/workspace/lldb-cmake-sanitized/lldb-build/tools/lldb/lldb-test-build.noindex --module-cache-dir /Users/buildslave/jenkins/workspace/lldb-cmake-sanitized/lldb-build/tools/lldb/lldb-test-build.noindex/module-cache-lldb /Users/buildslave/jenkins/workspace/lldb-cmake-sanitized/llvm-project/lldb/packages/Python/lldbsuite/test/iohandler/completion -p TestIOHandlerCompletion.py Change dir to: /Users/buildslave/jenkins/workspace/lldb-cmake-sanitized/llvm-project/lldb/packages/Python/lldbsuite/test/iohandler/completion runCmd: settings set symbols.enable-external-lookup false output:

Hide Details

runCmd: settings set plugin.process.gdb-remote.packet-timeout 60 output:

Hide Details

runCmd: settings set symbols.clang-modules-cache-path "/Users/buildslave/jenkins/workspace/lldb-cmake-sanitized/lldb-build/tools/lldb/lldb-test-build.noindex/module-cache-lldb" output:

Hide Details

runCmd: settings set use-color false output:

Hide Details

FAIL: LLDB (/Users/buildslave/jenkins/workspace/lldb-cmake-sanitized/host-compiler/bin/clang-10-x86_64) :: test_completion (TestIOHandlerCompletion.IOHandlerCompletionTest) tearing down the child process....

Hide Details

CLEANUP ERROR: LLDB (/Users/buildslave/jenkins/workspace/lldb-cmake-sanitized/host-compiler/bin/clang-10-x86_64) :: test_completion (TestIOHandlerCompletion.IOHandlerCompletionTest) Restore dir to: /Users/buildslave/jenkins/workspace/lldb-cmake-sanitized/lldb-build/tools/lldb/lit ====================================================================== ERROR: test_completion (TestIOHandlerCompletion.IOHandlerCompletionTest) ---------------------------------------------------------------------- Traceback (most recent call last): File "/Users/buildslave/jenkins/workspace/lldb-cmake-sanitized/llvm-project/lldb/packages/Python/lldbsuite/test/iohandler/completion/TestIOHandlerCompletion.py", line 52, in test_completion self.quit() File "/Users/buildslave/jenkins/workspace/lldb-cmake-sanitized/llvm-project/lldb/packages/Python/lldbsuite/test/lldbpexpect.py", line 61, in quit self.child.close(force=not gracefully) File "/Users/buildslave/jenkins/workspace/lldb-cmake-sanitized/llvm-project/lldb/third_party/Python/module/pexpect-4.6/pexpect/pty_spawn.py", line 327, in close self.ptyproc.close(force=force) File "/System/Library/Frameworks/Python.framework/Versions/2.7/lib/python2.7/contextlib.py", line 35, in __exit__ self.gen.throw(type, value, traceback) File "/Users/buildslave/jenkins/workspace/lldb-cmake-sanitized/llvm-project/lldb/third_party/Python/module/pexpect-4.6/pexpect/pty_spawn.py", line 25, in _wrap_ptyprocess_err raise ExceptionPexpect(*e.args) ExceptionPexpect: Could not terminate the child. Config=x86_64-/Users/buildslave/jenkins/workspace/lldb-cmake-sanitized/host-compiler/bin/clang-10 ---------------------------------------------------------------------- Ran 1 test in 3.948s

Hide Details

RESULT: FAILED (0 passes, 0 failures, 1 errors, 0 skipped, 0 expected failures, 0 unexpected successes)

Hide Details

******************** PASS: lldb-Unit :: Utility/./UtilityTests/UUIDTest.RelationalOperators (1330 of 1696) PASS: lldb-Suite :: commands/expression/radar_9673664/TestExprHelpExamples.py (1331 of 1696) PASS: lldb-Unit :: Host/./HostTests/Host.GetEnvironment (1332 of 1696) PASS: lldb-Suite :: functionalities/data-formatter/data-formatter-stl/libcxx/queue/TestDataFormatterLibcxxQueue.py (1333 of 1696) PASS: LLDB :: Modules/PECOFF/basic-info.yaml (1334 of 1696) PASS: lldb-Unit :: Utility/./UtilityTests/LogChannelTest.List (1335 of 1696) PASS: lldb-Suite :: types/TestIntegerTypes.py (1336 of 1696) PASS: lldb-Unit :: ScriptInterpreter/Python/./ScriptInterpreterPythonTests/PythonDataObjectsTest.TestPythonFile (1337 of 1696) PASS: lldb-Unit :: Utility/./UtilityTests/StringExtractorTest.DecodeHexU8_InvalidHex2 (1338 of 1696) PASS: lldb-Suite :: linux/mix-dwo-and-regular-objects/TestMixedDwarfBinary.py (1339 of 1696) PASS: LLDB :: SymbolFile/Breakpad/symtab.test (1340 of 1696) PASS: lldb-Suite :: functionalities/darwin_log/filter/regex/subsystem/TestDarwinLogFilterRegexSubsystem.py (1341 of 1696) PASS: lldb-Unit :: Utility/./UtilityTests/StringListTest.JoinMultiCharSeparator (1342 of 1696) PASS: LLDB :: SymbolFile/DWARF/debug-types-signature-loop.s (1343 of 1696) PASS: lldb-Suite :: python_api/event/TestEvents.py (1344 of 1696) PASS: LLDB :: Modules/ELF/PT_LOAD-overlap-PT_INTERP.yaml (1345 of 1696) PASS: lldb-Unit :: Utility/./UtilityTests/LogTest.Register (1346 of 1696) PASS: LLDB :: Modules/ELF/gnu-debuglink.yaml (1347 of 1696) PASS: lldb-Unit :: Symbol/./SymbolTests/PostfixExpression.ToDWARF (1348 of 1696) PASS: lldb-Suite :: lang/objc/foundation/TestObjCMethods.py (1349 of 1696) PASS: lldb-Suite :: python_api/hello_world/TestHelloWorld.py (1350 of 1696) PASS: lldb-Suite :: lang/objc/objc-ivar-offsets/TestObjCIvarOffsets.py (1351 of 1696) PASS: lldb-Unit :: Utility/./UtilityTests/RangeTest.Constructor (1352 of 1696) PASS: lldb-Unit :: Signals/./SignalsTests/UnixSignalsTest.GetFilteredSignals (1353 of 1696) PASS: lldb-Unit :: Utility/./UtilityTests/OptionsWithRawTest.EmptyInput (1354 of 1696) PASS: lldb-Suite :: functionalities/data-formatter/data-formatter-stl/libcxx/set/TestDataFormatterLibcxxSet.py (1355 of 1696) PASS: lldb-Unit :: Process/minidump/./LLDBMinidumpTests/MinidumpParserTest.MinidumpModuleOrder (1356 of 1696) PASS: lldb-Suite :: commands/expression/import-std-module/deque-basic/TestBasicDeque.py (1357 of 1696) PASS: lldb-Unit :: Core/./LLDBCoreTests/RichManglingContextTest.FromCxxMethodName (1358 of 1696) PASS: lldb-Unit :: Host/./HostTests/FileActionTest.Open (1359 of 1696) PASS: lldb-Suite :: macosx/duplicate-archive-members/TestDuplicateMembers.py (1360 of 1696) PASS: lldb-Suite :: python_api/disassemble-raw-data/TestDisassembleRawData.py (1361 of 1696) PASS: lldb-Unit :: Utility/./UtilityTests/StringExtractorTest.GetHexBytes_Partial (1362 of 1696) PASS: LLDB :: Heap/heap-cstr.test (1363 of 1696) PASS: lldb-Suite :: lang/cpp/call-function/TestCallCPPFunction.py (1364 of 1696) PASS: lldb-Unit :: Process/minidump/./LLDBMinidumpTests/MinidumpParserTest.GetLinuxProcStatus (1365 of 1696) PASS: lldb-Unit :: Utility/./UtilityTests/StringExtractorTest.GetHexBytesAvail_FullString (1366 of 1696) PASS: lldb-Unit :: Process/gdb-remote/./ProcessGdbRemoteTests/GDBRemoteCommunicationTest.ReadPacket_checksum (1367 of 1696) PASS: lldb-Unit :: Target/./TargetTests/PathMappingListTest.AbsoluteTests (1368 of 1696) PASS: lldb-Suite :: lang/cpp/class-template-parameter-pack/TestClassTemplateParameterPack.py (1369 of 1696) PASS: LLDB :: Breakpoint/debug_rnglist_offset_pair.test (1370 of 1696) PASS: lldb-Unit :: Expression/./ExpressionTests/DiagnosticManagerTest.PutStringMultiple (1371 of 1696) PASS: lldb-Suite :: functionalities/data-formatter/data-formatter-stl/libcxx/unordered/TestDataFormatterUnordered.py (1372 of 1696) PASS: lldb-Unit :: Utility/./UtilityTests/VASprintfTest.EncodingError (1373 of 1696) PASS: lldb-Suite :: functionalities/data-formatter/format-propagation/TestFormatPropagation.py (1374 of 1696) PASS: LLDB :: SymbolFile/DWARF/deterministic-build.cpp (1375 of 1696) PASS: lldb-Suite :: macosx/version_zero/TestGetVersionZeroVersion.py (1376 of 1696) PASS: lldb-Unit :: SymbolFile/NativePDB/./SymbolFileNativePDBTests/PDBFPOProgramToDWARFExpressionTests.UnresolvedRegisterReference (1377 of 1696) PASS: lldb-Unit :: Utility/./UtilityTests/RangeTest.ContainsRangeStartingFromZero (1378 of 1696) PASS: LLDB :: SymbolFile/DWARF/forward-declarations.s (1379 of 1696) PASS: lldb-Unit :: Utility/./UtilityTests/ScalarTest.CastOperations (1380 of 1696) PASS: lldb-Suite :: functionalities/inferior-crashing/recursive-inferior/TestRecursiveInferior.py (1381 of 1696) PASS: LLDB :: Reproducer/TestSynchronous.test (1382 of 1696) PASS: lldb-Unit :: Utility/./UtilityTests/AnsiTerminal.Empty (1383 of 1696) PASS: lldb-Unit :: Utility/./UtilityTests/StringExtractorTest.GetHexBytesAvail (1384 of 1696) PASS: lldb-Suite :: python_api/process/TestProcessAPI.py (1385 of 1696) PASS: lldb-Suite :: commands/expression/ir-interpreter-phi-nodes/TestIRInterpreterPHINodes.py (1386 of 1696) PASS: lldb-Unit :: Utility/./UtilityTests/SerializationRountripTest.SerializeDeserializeObjectReference (1387 of 1696) PASS: lldb-Suite :: macosx/add-dsym/TestAddDsymMidExecutionCommand.py (1388 of 1696) PASS: LLDB :: SymbolFile/Breakpad/line-table.test (1389 of 1696) PASS: lldb-Suite :: functionalities/data-formatter/compactvectors/TestCompactVectors.py (1390 of 1696) PASS: lldb-Suite :: functionalities/value_md5_crash/TestValueMD5Crash.py (1391 of 1696) PASS: lldb-Suite :: functionalities/thread/concurrent_events/TestConcurrentWatchBreakDelay.py (1392 of 1696) PASS: LLDB :: Breakpoint/case-sensitive.test (1393 of 1696) PASS: LLDB :: SymbolFile/NativePDB/tag-types.cpp (1394 of 1696) PASS: LLDB :: Modules/Breakpad/breakpad-identification.test (1395 of 1696) PASS: lldb-Unit :: SymbolFile/DWARF/./SymbolFileDWARFTests/SymbolFileDWARFTests.TestAbbrevOrder1Start5 (1396 of 1696) PASS: lldb-Suite :: tools/lldb-server/TestGdbRemote_vCont.py (1397 of 1696) PASS: lldb-Suite :: lang/cpp/char1632_t/TestChar1632T.py (1398 of 1696) PASS: lldb-Suite :: commands/frame/diagnose/bad-reference/TestBadReference.py (1399 of 1696) PASS: lldb-Suite :: functionalities/thread/concurrent_events/TestConcurrentNWatchNBreak.py (1400 of 1696) PASS: lldb-Suite :: lang/cpp/exceptions/TestCPPExceptionBreakpoints.py (1401 of 1696) PASS: lldb-Suite :: functionalities/thread/concurrent_events/TestConcurrentTwoBreakpointsOneWatchpoint.py (1402 of 1696) PASS: lldb-Unit :: Utility/./UtilityTests/BinaryStreamTest.PutSLEB128One (1403 of 1696) PASS: lldb-Suite :: lang/objc/conflicting-definition/TestConflictingDefinition.py (1404 of 1696) PASS: lldb-Unit :: SymbolFile/NativePDB/./SymbolFileNativePDBTests/PDBFPOProgramToDWARFExpressionTests.InvalidAssignmentMultiple (1405 of 1696) UNSUPPORTED: LLDB :: Register/x86-64-zmm-read.test (1406 of 1696) PASS: lldb-Suite :: macosx/load-kext/TestLoadKext.py (1407 of 1696) PASS: lldb-Unit :: Symbol/./SymbolTests/LineEntryTest.GetSameLineContiguousAddressRangeNestedInline (1408 of 1696) PASS: lldb-Unit :: Expression/./ExpressionTests/ClangHostTest.MacOSX (1409 of 1696) UNSUPPORTED: LLDB :: Register/x86-ymm-read.test (1410 of 1696) PASS: LLDB :: Modules/ELF/PT_LOAD-overlap-section.yaml (1411 of 1696) PASS: lldb-Suite :: lang/c/const_variables/TestConstVariables.py (1412 of 1696) PASS: lldb-Unit :: Utility/./UtilityTests/StringListTest.SplitIntoLinesSingleTrailingCR (1413 of 1696) PASS: lldb-Unit :: Utility/./UtilityTests/StreamTest.PutRawBytesToMixedEndian (1414 of 1696) PASS: lldb-Suite :: sample_test/TestSampleTest.py (1415 of 1696) PASS: lldb-Unit :: Utility/./UtilityTests/StringLexerTest.Next (1416 of 1696) PASS: lldb-Suite :: functionalities/tail_call_frames/thread_step_out_or_return/TestSteppingOutWithArtificialFrames.py (1417 of 1696) PASS: lldb-Suite :: functionalities/avoids-fd-leak/TestFdLeak.py (1418 of 1696) PASS: lldb-Suite :: lang/cpp/template-function/TestTemplateFunctions.py (1419 of 1696) PASS: lldb-Unit :: Utility/./UtilityTests/StringExtractorTest.GetU32LittleEndian (1420 of 1696) PASS: lldb-Suite :: functionalities/darwin_log/filter/regex/activity-chain/TestDarwinLogFilterRegexActivityChain.py (1421 of 1696) PASS: lldb-Suite :: commands/watchpoints/watchpoint_events/TestWatchpointEvents.py (1422 of 1696) PASS: LLDB :: Commands/command-backtrace.test (1423 of 1696) PASS: lldb-Suite :: functionalities/data-formatter/data-formatter-stl/libstdcpp/unique_ptr/TestDataFormatterStdUniquePtr.py (1424 of 1696) PASS: lldb-Unit :: Host/./HostTests/MainLoopTest.DetectsEOF (1425 of 1696) PASS: lldb-Suite :: lang/objc/ivar-IMP/TestObjCiVarIMP.py (1426 of 1696) PASS: lldb-Unit :: Process/gdb-remote/./ProcessGdbRemoteTests/GDBRemoteClientBaseTest.SendContinueAndLateInterrupt (1427 of 1696) PASS: lldb-Unit :: Utility/./UtilityTests/LogChannelEnabledTest.LogGetLogThread (1428 of 1696) PASS: lldb-Suite :: functionalities/data-formatter/data-formatter-synthtype/TestDataFormatterSynthType.py (1429 of 1696) PASS: lldb-Suite :: lang/objc/rdar-10967107/TestRdar10967107.py (1430 of 1696) PASS: lldb-Unit :: Utility/./UtilityTests/StatusTest.ErrorConversion (1431 of 1696) PASS: lldb-Suite :: benchmarks/libcxxmap/TestBenchmarkLibcxxMap.py (1432 of 1696) PASS: lldb-Suite :: commands/expression/test/TestExprs.py (1433 of 1696) PASS: lldb-Suite :: functionalities/inline-stepping/TestInlineStepping.py (1434 of 1696) PASS: lldb-Unit :: Utility/./UtilityTests/VMRange.ContainsAddr (1435 of 1696) PASS: lldb-Unit :: Utility/./UtilityTests/Flags.Test (1436 of 1696) PASS: lldb-Unit :: Utility/./UtilityTests/ArgsTest.TestQuotedTrailingBackslash (1437 of 1696) PASS: lldb-Suite :: functionalities/completion/TestCompletion.py (1438 of 1696) PASS: lldb-Unit :: ScriptInterpreter/Python/./ScriptInterpreterPythonTests/PythonDataObjectsTest.TestPythonBoolean (1439 of 1696) PASS: lldb-Unit :: Process/minidump/./LLDBMinidumpTests/MinidumpParserTest.GetThreadsAndGetThreadContext (1440 of 1696) PASS: lldb-Unit :: Utility/./UtilityTests/StreamTeeTest.Constructor1Stream (1441 of 1696) PASS: lldb-Suite :: functionalities/target-new-solib-notifications/TestModuleLoadedNotifys.py (1442 of 1696) PASS: lldb-Unit :: Utility/./UtilityTests/ArgsTest.TestAppendArg (1443 of 1696) PASS: lldb-Suite :: commands/version/TestVersion.py (1444 of 1696) PASS: lldb-Unit :: Breakpoint/./LLDBBreakpointTests/BreakpointIDTest.StringIsBreakpointName (1445 of 1696) PASS: lldb-Unit :: ScriptInterpreter/Python/./ScriptInterpreterPythonTests/PythonExceptionStateTest.TestExceptionStateChecking (1446 of 1696) PASS: lldb-Unit :: Utility/./UtilityTests/StringListTest.ShiftMove (1447 of 1696) PASS: lldb-Unit :: Utility/./UtilityTests/UriParserTest.BracketedHostnamePort (1448 of 1696) PASS: LLDB :: Modules/ELF/compressed-sections.yaml (1449 of 1696) UNSUPPORTED: LLDB :: SymbolFile/PDB/pointers.test (1450 of 1696) PASS: lldb-Unit :: UnwindAssembly/x86/./UnwindAssemblyx86Tests/Testx86AssemblyInspectionEngine.TestPopESI (1451 of 1696) PASS: lldb-Suite :: functionalities/ubsan/basic/TestUbsanBasic.py (1452 of 1696) PASS: lldb-Unit :: Symbol/./SymbolTests/PostfixExpression.ParseFPOProgram (1453 of 1696) PASS: lldb-Suite :: commands/expression/expr-in-syscall/TestExpressionInSyscall.py (1454 of 1696) PASS: lldb-Suite :: functionalities/data-formatter/data-formatter-globals/TestDataFormatterGlobals.py (1455 of 1696) PASS: lldb-Unit :: Utility/./UtilityTests/TimerTest.CategoryTimes (1456 of 1696) PASS: lldb-Suite :: functionalities/thread/thread_exit/TestThreadExit.py (1457 of 1696) PASS: LLDB :: Breakpoint/split-dwarf5-debug-stroffsets.test (1458 of 1696) PASS: LLDB :: SymbolFile/Breakpad/line-table-edgecases.test (1459 of 1696) PASS: lldb-Suite :: macosx/nslog/TestDarwinNSLogOutput.py (1460 of 1696) PASS: LLDB :: SymbolFile/Breakpad/unwind-via-stack-win.test (1461 of 1696) PASS: lldb-Unit :: Utility/./UtilityTests/StreamTeeTest.Constructor2Streams (1462 of 1696) PASS: lldb-Suite :: commands/expression/function_template_specialization_temp_args/TestFunctionTemplateSpecializationTempArgs.py (1463 of 1696) PASS: lldb-Suite :: lang/cpp/const_this/TestConstThis.py (1464 of 1696) PASS: lldb-Unit :: Utility/./UtilityTests/Flags.GetBitSize (1465 of 1696) PASS: lldb-Unit :: Process/gdb-remote/./ProcessGdbRemoteTests/GDBRemoteCommunicationServerTest.SendErrorResponse_Status (1466 of 1696) PASS: lldb-Unit :: Utility/./UtilityTests/AnsiTerminal.WhiteSpace (1467 of 1696) PASS: lldb-Unit :: UnwindAssembly/x86/./UnwindAssemblyx86Tests/Testx86AssemblyInspectionEngine.TestPushEDI (1468 of 1696) PASS: lldb-Suite :: python_api/exprpath_synthetic/TestExprPathSynthetic.py (1469 of 1696) PASS: lldb-Suite :: lang/cpp/stl/TestSTL.py (1470 of 1696) PASS: lldb-Unit :: Utility/./UtilityTests/StreamTest.PutCharNull (1471 of 1696) PASS: lldb-Suite :: commands/command/history/TestCommandHistory.py (1472 of 1696) PASS: lldb-Unit :: Utility/./UtilityTests/LogChannelEnabledTest.LLDB_LOG_ERROR (1473 of 1696) PASS: lldb-Suite :: commands/watchpoints/watchpoint_commands/condition/TestWatchpointConditionCmd.py (1474 of 1696) PASS: LLDB :: Quit/TestQuitExitCodeNonInt.test (1475 of 1696) PASS: lldb-Unit :: Utility/./UtilityTests/BinaryStreamTest.PutULEB128OneByte (1476 of 1696) PASS: lldb-Unit :: Utility/./UtilityTests/ArgsTest.ReplaceArgumentAtIndexEqual (1477 of 1696) PASS: lldb-Suite :: lang/cpp/wchar_t/TestCxxWCharT.py (1478 of 1696) PASS: LLDB :: Modules/ELF/section-addresses.yaml (1479 of 1696) PASS: lldb-Suite :: lang/objc/objc-ivar-protocols/TestIvarProtocols.py (1480 of 1696) PASS: LLDB :: Expr/TestTypeOfDeclTypeExpr.test (1481 of 1696) PASS: lldb-Suite :: commands/command/script/TestCommandScript.py (1482 of 1696) PASS: lldb-Unit :: Utility/./UtilityTests/RangeTest.DefaultConstructor (1483 of 1696) PASS: lldb-Unit :: Utility/./UtilityTests/StringListTest.Clear (1484 of 1696) PASS: lldb-Suite :: benchmarks/continue/TestBenchmarkContinue.py (1485 of 1696) PASS: lldb-Unit :: Utility/./UtilityTests/RangeDataVector.FindEntryThatContains (1486 of 1696) PASS: lldb-Suite :: functionalities/thread/concurrent_events/TestConcurrentTwoBreakpointsOneSignal.py (1487 of 1696) PASS: lldb-Unit :: Utility/./UtilityTests/StringExtractorTest.GetHexU8_Underflow2 (1488 of 1696) PASS: lldb-Suite :: lang/c/shared_lib/TestSharedLib.py (1489 of 1696) PASS: lldb-Unit :: Process/minidump/./LLDBMinidumpTests/MinidumpParserTest.GetMemoryRegionInfoLinuxMaps (1490 of 1696) PASS: lldb-Suite :: lang/objc/real-definition/TestRealDefinition.py (1491 of 1696) PASS: lldb-Suite :: commands/expression/ir-interpreter/TestIRInterpreter.py (1492 of 1696) PASS: lldb-Unit :: Utility/./UtilityTests/StringListTest.CopyListSingle (1493 of 1696) PASS: lldb-Unit :: Expression/./ExpressionTests/DiagnosticManagerTest.GetStringBasic (1494 of 1696) PASS: lldb-Unit :: Process/gdb-remote/./ProcessGdbRemoteTests/GDBRemoteCommunicationClientTest.GetModulesInfo (1495 of 1696) PASS: lldb-Unit :: Process/gdb-remote/./ProcessGdbRemoteTests/GDBRemoteClientBaseTest.SendPacketAndReceiveResponseWithOutputSupport (1496 of 1696) PASS: lldb-Unit :: Process/minidump/./LLDBMinidumpTests/MinidumpParserTest.GetThreadContext_x86_64 (1497 of 1696) PASS: lldb-Unit :: Utility/./UtilityTests/StringLexerTest.NextIf (1498 of 1696) PASS: lldb-Suite :: python_api/formatters/TestFormattersSBAPI.py (1499 of 1696) PASS: lldb-Suite :: lang/objc/objc-dynamic-value/TestObjCDynamicValue.py (1500 of 1696) PASS: lldb-Suite :: commands/expression/import-std-module/sysroot/TestStdModuleSysroot.py (1501 of 1696) PASS: lldb-Unit :: Utility/./UtilityTests/NameMatchesTest.Ignore (1502 of 1696) PASS: lldb-Unit :: Utility/./UtilityTests/StringListTest.ForRange (1503 of 1696) PASS: lldb-Suite :: functionalities/data-formatter/data-formatter-objc/TestDataFormatterObjCNSContainer.py (1504 of 1696) PASS: lldb-Suite :: functionalities/data-formatter/data-formatter-stl/libstdcpp/map/TestDataFormatterStdMap.py (1505 of 1696) PASS: lldb-Unit :: Symbol/./SymbolTests/LineEntryTest.GetSameLineContiguousAddressRangeNoInlines (1506 of 1696) PASS: LLDB :: Modules/PECOFF/dep-modules.yaml (1507 of 1696) PASS: lldb-Unit :: Host/./HostTests/SocketTest.DomainGetConnectURI (1508 of 1696) PASS: lldb-Unit :: Host/./HostTests/FileSystemTest.GetPermissions (1509 of 1696) PASS: lldb-Unit :: Utility/./UtilityTests/FileSpecTest.FormatFileSpec (1510 of 1696) PASS: lldb-Unit :: Utility/./UtilityTests/SerializationRountripTest.SerializeDeserializePod (1511 of 1696) PASS: lldb-Unit :: Utility/./UtilityTests/ConstStringTest.UpdateMangledCounterpart (1512 of 1696) PASS: lldb-Suite :: functionalities/thread/concurrent_events/TestConcurrentCrashWithWatchpoint.py (1513 of 1696) PASS: lldb-Suite :: lang/cpp/frame-var-anon-unions/TestFrameVariableAnonymousUnions.py (1514 of 1696) UNSUPPORTED: LLDB :: SymbolFile/PDB/vbases.test (1515 of 1696) PASS: lldb-Unit :: Utility/./UtilityTests/OptionsWithRawTest.ArgsButNoDelimiter (1516 of 1696) PASS: lldb-Suite :: commands/disassemble/basic/TestDisassembleBreakpoint.py (1517 of 1696) PASS: lldb-Suite :: lang/c/conflicting-symbol/TestConflictingSymbol.py (1518 of 1696) PASS: lldb-Suite :: functionalities/thread/thread_specific_break_plus_condition/TestThreadSpecificBpPlusCondition.py (1519 of 1696) PASS: lldb-Unit :: Utility/./UtilityTests/StringExtractorTest.DecodeHexU8_Underflow2 (1520 of 1696) PASS: LLDB :: Driver/TestSingleQuote.test (1521 of 1696) PASS: lldb-Suite :: lang/objc/bitfield_ivars/TestBitfieldIvars.py (1522 of 1696) PASS: lldb-Suite :: commands/expression/import-std-module/basic/TestImportStdModule.py (1523 of 1696) PASS: lldb-Suite :: lang/c/stepping/TestStepAndBreakpoints.py (1524 of 1696) PASS: lldb-Suite :: python_api/watchpoint/watchlocation/TestSetWatchlocation.py (1525 of 1696) PASS: lldb-Suite :: api/multithreaded/TestMultithreaded.py (1526 of 1696) PASS: lldb-Unit :: Utility/./UtilityTests/StringListTest.InsertStringAtIndexStart (1527 of 1696) PASS: lldb-Unit :: Utility/./UtilityTests/StatusTest.Formatv (1528 of 1696) PASS: lldb-Unit :: UnwindAssembly/x86/./UnwindAssemblyx86Tests/Testx86AssemblyInspectionEngine.TestDisassemblyJunkBytes (1529 of 1696) PASS: LLDB :: SymbolFile/Breakpad/symtab-macho.test (1530 of 1696) PASS: lldb-Unit :: ScriptInterpreter/Python/./ScriptInterpreterPythonTests/PythonDataObjectsTest.TestTypeNameResolutionNoDot (1531 of 1696) PASS: lldb-Suite :: functionalities/testid/TestTestId.py (1532 of 1696) PASS: lldb-Suite :: lang/cpp/signed_types/TestSignedTypes.py (1533 of 1696) PASS: lldb-Unit :: Core/./LLDBCoreTests/UniqueCStringMap.NoDefaultConstructor (1534 of 1696) PASS: lldb-Unit :: Utility/./UtilityTests/ScalarTest.APIntConstructor (1535 of 1696) PASS: lldb-Unit :: UnwindAssembly/x86/./UnwindAssemblyx86Tests/Testx86AssemblyInspectionEngine.TestPushEAX (1536 of 1696) PASS: lldb-Unit :: SymbolFile/NativePDB/./SymbolFileNativePDBTests/PDBFPOProgramToDWARFExpressionTests.MultipleIndependentAssignments (1537 of 1696) PASS: lldb-Unit :: Utility/./UtilityTests/StringExtractorTest.GetHexU8_InvalidHex_NoEof (1538 of 1696) PASS: lldb-Suite :: arm/emulation/TestEmulations.py (1539 of 1696) PASS: LLDB :: Unwind/eh-frame-dwarf-unwind.test (1540 of 1696) PASS: lldb-Unit :: Utility/./UtilityTests/UriParserTest.SchemeHostSeparator4 (1541 of 1696) PASS: lldb-Suite :: functionalities/data-formatter/data-formatter-objc/TestDataFormatterObjCNSURL.py (1542 of 1696) PASS: lldb-Unit :: SymbolFile/DWARF/./SymbolFileDWARFTests/SymbolFileDWARFTests.TestAbbrevNullAttrValidForm (1543 of 1696) PASS: lldb-Unit :: Utility/./UtilityTests/StreamTest.PutBytesAsRawHex8ToMixedEndian (1544 of 1696) PASS: lldb-Suite :: functionalities/data-formatter/data-formatter-objc/nsindexpath/TestDataFormatterNSIndexPath.py (1545 of 1696) PASS: lldb-Suite :: linux/builtin_trap/TestBuiltinTrap.py (1546 of 1696) PASS: lldb-Unit :: Utility/./UtilityTests/StringExtractorTest.GetHexBytes_OddPair (1547 of 1696) PASS: lldb-Suite :: lang/objc/orderedset/TestOrderedSet.py (1548 of 1696) PASS: lldb-Suite :: commands/expression/options/TestExprOptions.py (1549 of 1696) PASS: lldb-Unit :: Utility/./UtilityTests/SerializationRountripTest.SerializeDeserializeObjectPointer (1550 of 1696) PASS: lldb-Suite :: lang/cpp/static_members/TestCPPStaticMembers.py (1551 of 1696) PASS: lldb-Suite :: commands/watchpoints/hello_watchpoint/TestMyFirstWatchpoint.py (1552 of 1696) PASS: lldb-Unit :: Utility/./UtilityTests/UriParserTest.TypicalPortPath (1553 of 1696) XFAIL: LLDB :: Register/x86-mm-xmm-write.test (1554 of 1696) PASS: lldb-Suite :: source-manager/TestSourceManager.py (1555 of 1696) PASS: lldb-Suite :: commands/expression/inline-namespace/TestInlineNamespace.py (1556 of 1696) PASS: lldb-Unit :: Symbol/./SymbolTests/TestClangASTContext.TestGetBasicTypeFromName (1557 of 1696) PASS: lldb-Unit :: UnwindAssembly/x86/./UnwindAssemblyx86Tests/Testx86AssemblyInspectionEngine.TestPushEDX (1558 of 1696) PASS: lldb-Suite :: commands/target/basic/TestTargetCommand.py (1559 of 1696) PASS: lldb-Unit :: Utility/./UtilityTests/StringListTest.JoinThree (1560 of 1696) PASS: lldb-Unit :: Symbol/./SymbolTests/Type.CompilerContextPattern (1561 of 1696) XFAIL: LLDB :: SymbolFile/DWARF/find-type-in-function.cpp (1562 of 1696) PASS: lldb-Suite :: lang/cpp/inlines/TestInlines.py (1563 of 1696) PASS: lldb-Suite :: lang/objc/modules-inline-functions/TestModulesInlineFunctions.py (1564 of 1696) PASS: lldb-Unit :: ScriptInterpreter/Python/./ScriptInterpreterPythonTests/PythonExceptionStateTest.TestAutoRestoreChanged (1565 of 1696) PASS: lldb-Suite :: commands/expression/import-std-module/queue/TestQueue.py (1566 of 1696) PASS: lldb-Unit :: Utility/./UtilityTests/TimeoutTest.Format (1567 of 1696) PASS: lldb-Unit :: ScriptInterpreter/Python/./ScriptInterpreterPythonTests/PythonDataObjectsTest.TestPythonListToStructuredList (1568 of 1696) PASS: lldb-Unit :: UnwindAssembly/x86/./UnwindAssemblyx86Tests/Testx86AssemblyInspectionEngine.TestPushRBX (1569 of 1696) PASS: lldb-Unit :: ObjectFile/Breakpad/./ObjectFileBreakpadTests/InfoRecord.parse (1570 of 1696) PASS: lldb-Unit :: Utility/./UtilityTests/StringListTest.SplitIntoLines (1571 of 1696) PASS: lldb-Suite :: commands/watchpoints/watchpoint_size/TestWatchpointSizes.py (1572 of 1696) PASS: lldb-Suite :: functionalities/data-formatter/frameformat_smallstruct/TestFrameFormatSmallStruct.py (1573 of 1696) PASS: lldb-Suite :: commands/expression/dollar-in-variable/TestDollarInVariable.py (1574 of 1696) PASS: lldb-Suite :: lang/cpp/namespace_definitions/TestNamespaceDefinitions.py (1575 of 1696) PASS: lldb-Suite :: python_api/sbtype_typeclass/TestSBTypeTypeClass.py (1576 of 1696) PASS: lldb-Suite :: lang/cpp/gmodules/TestWithModuleDebugging.py (1577 of 1696) PASS: lldb-Unit :: Utility/./UtilityTests/RangeTest.LessThanInvalid (1578 of 1696) PASS: lldb-Unit :: Utility/./UtilityTests/OptionsWithRawTest.EmptySuffixSingleWhitespace (1579 of 1696) PASS: lldb-Suite :: lang/cpp/offsetof/TestOffsetofCpp.py (1580 of 1696) PASS: lldb-Suite :: commands/expression/import-std-module/unique_ptr-dbg-info-content/TestUniquePtrDbgInfoContent.py (1581 of 1696) PASS: lldb-Suite :: commands/expression/issue_11588/Test11588.py (1582 of 1696) PASS: lldb-Suite :: tools/lldb-vscode/variables/TestVSCode_variables.py (1583 of 1696) PASS: lldb-Suite :: functionalities/thread/concurrent_events/TestConcurrentDelayedCrashWithBreakpointSignal.py (1584 of 1696) PASS: lldb-Unit :: Process/gdb-remote/./ProcessGdbRemoteTests/GDBRemoteCommunicationClientTest.SyncThreadState (1585 of 1696) PASS: lldb-Unit :: Utility/./UtilityTests/ReproducerTest.SetCapture (1586 of 1696) PASS: lldb-Suite :: commands/expression/argument_passing_restrictions/TestArgumentPassingRestrictions.py (1587 of 1696) PASS: lldb-Unit :: Utility/./UtilityTests/StreamTeeTest.GetStreamAtIndexOutOfBoundsEmpty (1588 of 1696) PASS: lldb-Unit :: Utility/./UtilityTests/StringExtractorTest.DecodeHexU8_Underflow (1589 of 1696) PASS: LLDB :: SymbolFile/NativePDB/global-classes.cpp (1590 of 1696) PASS: lldb-Unit :: Utility/./UtilityTests/LogChannelTest.Disable (1591 of 1696) PASS: lldb-Unit :: SymbolFile/NativePDB/./SymbolFileNativePDBTests/PDBFPOProgramToDWARFExpressionTests.UnresolvedRegisterAssignmentReference (1592 of 1696) PASS: lldb-Unit :: Process/gdb-remote/./ProcessGdbRemoteTests/GDBRemoteCommunicationServerTest.SendErrorResponse_UnimplementedError (1593 of 1696) PASS: lldb-Unit :: UnwindAssembly/x86/./UnwindAssemblyx86Tests/Testx86AssemblyInspectionEngine.TestPushRBP (1594 of 1696) PASS: lldb-Suite :: commands/platform/basic/TestPlatformCommand.py (1595 of 1696) PASS: lldb-Unit :: Utility/./UtilityTests/ArgsTest.TestSingleArg (1596 of 1696) PASS: LLDB :: Watchpoint/SetErrorCases.test (1597 of 1696) PASS: LLDB :: SymbolFile/NativePDB/function-types-builtins.cpp (1598 of 1696) PASS: LLDB :: Minidump/dump-all.test (1599 of 1696) PASS: lldb-Suite :: functionalities/thread/concurrent_events/TestConcurrentWatchBreak.py (1600 of 1696) PASS: lldb-Suite :: lang/objc/exceptions/TestObjCExceptions.py (1601 of 1696) PASS: lldb-Suite :: python_api/sbdata/TestSBData.py (1602 of 1696) PASS: lldb-Suite :: commands/expression/save_jit_objects/TestSaveJITObjects.py (1603 of 1696) PASS: lldb-Unit :: Process/minidump/./LLDBMinidumpTests/RegisterContextMinidump.ConvertMinidumpContext_x86_32 (1604 of 1696) PASS: lldb-Suite :: python_api/function_symbol/TestDisasmAPI.py (1605 of 1696) PASS: lldb-Suite :: tools/lldb-server/TestGdbRemoteRegisterState.py (1606 of 1696) PASS: lldb-Unit :: Utility/./UtilityTests/ScalarTest.SetValueFromCString (1607 of 1696) PASS: lldb-Unit :: Process/minidump/./LLDBMinidumpTests/MinidumpParserTest.GetMemoryRegionInfoFromMemory64List (1608 of 1696) PASS: lldb-Unit :: Symbol/./SymbolTests/TestClangASTContext.TestBuiltinTypeForEncodingAndBitSize (1609 of 1696) PASS: lldb-Unit :: Utility/./UtilityTests/EnvironmentTest.EnvpConversion (1610 of 1696) PASS: lldb-Unit :: Utility/./UtilityTests/StreamTest.PutHex32ByteOrderLittle (1611 of 1696) PASS: lldb-Unit :: Host/./HostTests/SocketTest.TCPListen0GetPort (1612 of 1696) PASS: lldb-Suite :: lang/objc/foundation/TestSymbolTable.py (1613 of 1696) PASS: lldb-Unit :: UnwindAssembly/x86/./UnwindAssemblyx86Tests/Testx86AssemblyInspectionEngine.TestReturnDetect (1614 of 1696) PASS: lldb-Suite :: functionalities/plugins/command_plugin/TestPluginCommands.py (1615 of 1696) PASS: lldb-Unit :: Utility/./UtilityTests/AnsiTerminal.KnownPrefix (1616 of 1696) PASS: lldb-Suite :: lang/c/vla/TestVLA.py (1617 of 1696) PASS: lldb-Unit :: Utility/./UtilityTests/RangeTest.EqualInvalid (1618 of 1696) PASS: lldb-Suite :: functionalities/set-data/TestSetData.py (1619 of 1696) PASS: lldb-Unit :: Expression/./ExpressionTests/DiagnosticManagerTest.GetStringSeverityLabels (1620 of 1696) PASS: lldb-Unit :: Utility/./UtilityTests/ProcessInstanceInfo.DumpTable (1621 of 1696) PASS: lldb-Unit :: UnwindAssembly/x86/./UnwindAssemblyx86Tests/Testx86AssemblyInspectionEngine.TestPopR13 (1622 of 1696) PASS: lldb-Suite :: functionalities/postmortem/elf-core/gcore/TestGCore.py (1623 of 1696) PASS: lldb-Unit :: UnwindAssembly/x86/./UnwindAssemblyx86Tests/Testx86AssemblyInspectionEngine.TestPopRBX (1624 of 1696) PASS: lldb-Suite :: commands/expression/import-std-module/forward_list-dbg-info-content/TestDbgInfoContentForwardList.py (1625 of 1696) PASS: lldb-Unit :: Host/./HostTests/ProcessLaunchInfoTest.Constructor (1626 of 1696) PASS: lldb-Suite :: functionalities/darwin_log/filter/regex/activity/TestDarwinLogFilterRegexActivity.py (1627 of 1696) PASS: lldb-Suite :: functionalities/thread/concurrent_events/TestConcurrentManyBreakpoints.py (1628 of 1696) PASS: LLDB :: Modules/Breakpad/uuid-matching-mac.test (1629 of 1696) PASS: lldb-Suite :: lang/objcxx/hide-runtime-values/TestObjCXXHideRuntimeValues.py (1630 of 1696) PASS: lldb-Suite :: lang/cpp/thread_local/TestThreadLocal.py (1631 of 1696) PASS: lldb-Suite :: functionalities/data-formatter/var-in-aggregate-misuse/TestVarInAggregateMisuse.py (1632 of 1696) PASS: lldb-Suite :: functionalities/tsan/global_location/TestTsanGlobalLocation.py (1633 of 1696) UNSUPPORTED: LLDB :: SymbolFile/PDB/variables-locations.test (1634 of 1696) PASS: lldb-Unit :: Interpreter/./InterpreterTests/OptionArgParserTest.toChar (1635 of 1696) PASS: lldb-Suite :: functionalities/thread/concurrent_events/TestConcurrentTwoWatchpointsOneBreakpoint.py (1636 of 1696) PASS: lldb-Suite :: python_api/objc_type/TestObjCType.py (1637 of 1696) PASS: lldb-Unit :: Utility/./UtilityTests/FileSpecTest.CopyByAppendingPathComponent (1638 of 1696) PASS: lldb-Unit :: UnwindAssembly/x86/./UnwindAssemblyx86Tests/Testx86AssemblyInspectionEngine.TestDisassemblyMidFunctionEpilogues (1639 of 1696) PASS: lldb-Suite :: macosx/thread-names/TestInterruptThreadNames.py (1640 of 1696) PASS: lldb-Suite :: functionalities/thread/concurrent_events/TestConcurrentSignalBreak.py (1641 of 1696) PASS: lldb-Unit :: Utility/./UtilityTests/FileSpecTest.EqualSeparator (1642 of 1696) PASS: lldb-Suite :: lang/c/register_variables/TestRegisterVariables.py (1643 of 1696) PASS: LLDB :: Breakpoint/implicit_const_form_support.test (1644 of 1696) PASS: lldb-Suite :: functionalities/tail_call_frames/inlining_and_tail_calls/TestInliningAndTailCalls.py (1645 of 1696) PASS: lldb-Suite :: lang/cpp/member-and-local-vars-with-same-name/TestMembersAndLocalsWithSameName.py (1646 of 1696) PASS: lldb-Suite :: functionalities/darwin_log/filter/regex/category/TestDarwinLogFilterRegexCategory.py (1647 of 1696) PASS: lldb-Suite :: functionalities/tail_call_frames/thread_step_out_message/TestArtificialFrameStepOutMessage.py (1648 of 1696) PASS: lldb-Unit :: Utility/./UtilityTests/CleanUpTest.multiple_args (1649 of 1696) PASS: lldb-Unit :: Symbol/./SymbolTests/SymbolsTest.TerminateLocateExecutableSymbolFileForUnknownExecutableAndUnknownSymbolFile (1650 of 1696) PASS: lldb-Unit :: Utility/./UtilityTests/StringLexerTest.HasAtLeast (1651 of 1696) PASS: lldb-Suite :: functionalities/postmortem/netbsd-core/TestNetBSDCore.py (1652 of 1696) PASS: lldb-Suite :: macosx/find-dsym/deep-bundle/TestDeepBundle.py (1653 of 1696) PASS: lldb-Unit :: Process/minidump/./LLDBMinidumpTests/MinidumpParserTest.GetPidWindows (1654 of 1696) PASS: lldb-Suite :: functionalities/data-formatter/data-formatter-objc/nsstring/TestDataFormatterNSString.py (1655 of 1696) PASS: lldb-Suite :: functionalities/postmortem/minidump-new/TestMiniDumpNew.py (1656 of 1696) PASS: LLDB :: SymbolFile/NativePDB/bitfields.cpp (1657 of 1696) PASS: lldb-Suite :: python_api/function_symbol/TestSymbolAPI.py (1658 of 1696) PASS: lldb-Suite :: commands/expression/no-deadlock/TestExprDoesntBlock.py (1659 of 1696) PASS: lldb-Unit :: Process/minidump/./LLDBMinidumpTests/RegisterContextMinidump.ConvertMinidumpContext_x86_64 (1660 of 1696) PASS: lldb-Unit :: Utility/./UtilityTests/StreamTest.PutMaxHex64ByteOrderBig (1661 of 1696) PASS: lldb-Unit :: Utility/./UtilityTests/StreamTeeTest.DefaultConstructor (1662 of 1696) PASS: lldb-Suite :: lang/cpp/dynamic-value/TestDynamicValue.py (1663 of 1696) PASS: LLDB :: SymbolFile/DWARF/debug_ranges.s (1664 of 1696) PASS: lldb-Suite :: tools/lldb-vscode/launch/TestVSCode_launch.py (1665 of 1696) PASS: lldb-Suite :: tools/lldb-server/TestGdbRemoteThreadsInStopReply.py (1666 of 1696) PASS: lldb-Suite :: functionalities/data-formatter/nsdictionarysynth/TestNSDictionarySynthetic.py (1667 of 1696) PASS: lldb-Suite :: tools/lldb-vscode/attach/TestVSCode_attach.py (1668 of 1696) PASS: lldb-Unit :: Utility/./UtilityTests/NameMatchesTest.EndsWith (1669 of 1696) PASS: lldb-Suite :: functionalities/data-formatter/data-formatter-stl/libstdcpp/unique_ptr/invalid/TestDataFormatterInvalidStdUniquePtr.py (1670 of 1696) PASS: LLDB :: Settings/TestDisableColor.test (1671 of 1696) PASS: lldb-Unit :: Process/gdb-remote/./ProcessGdbRemoteTests/GDBRemoteCommunicationClientTest.GetMemoryRegionInfo (1672 of 1696) PASS: lldb-Suite :: python_api/frame/inlines/TestInlinedFrame.py (1673 of 1696) PASS: lldb-Suite :: lang/c/stepping/TestThreadStepping.py (1674 of 1696) PASS: lldb-Suite :: commands/expression/pr35310/TestExprsBug35310.py (1675 of 1696) PASS: LLDB :: Settings/TestStopCommandSourceOnError.test (1676 of 1696) PASS: lldb-Suite :: commands/command/delete/TestCommandDelete.py (1677 of 1696) PASS: lldb-Suite :: functionalities/thread/num_threads/TestNumThreads.py (1678 of 1696) PASS: lldb-Suite :: lang/objc/objc-struct-argument/TestObjCStructArgument.py (1679 of 1696) PASS: lldb-Unit :: SymbolFile/NativePDB/./SymbolFileNativePDBTests/PDBFPOProgramToDWARFExpressionTests.UnresolvedDependentCyclicRegisterAssignmentReference (1680 of 1696) PASS: lldb-Unit :: Utility/./UtilityTests/VMRange.Clear (1681 of 1696) PASS: LLDB :: Settings/TestFrameFormatNoColor.test (1682 of 1696) PASS: lldb-Suite :: python_api/type/TestTypeList.py (1683 of 1696) PASS: lldb-Suite :: functionalities/postmortem/elf-core/thread_crash/TestLinuxCoreThreads.py (1684 of 1696) PASS: lldb-Suite :: commands/expression/persistent_types/TestNestedPersistentTypes.py (1685 of 1696) PASS: lldb-Suite :: functionalities/rerun/TestRerun.py (1686 of 1696) PASS: lldb-Suite :: lang/c/array_types/TestArrayTypes.py (1687 of 1696) PASS: lldb-Suite :: functionalities/step-avoids-no-debug/TestStepNoDebug.py (1688 of 1696) PASS: lldb-Suite :: lang/objc/objc-dyn-sbtype/TestObjCDynamicSBType.py (1689 of 1696) PASS: lldb-Suite :: lang/c/strings/TestCStrings.py (1690 of 1696) PASS: lldb-Suite :: functionalities/asan/TestReportData.py (1691 of 1696) PASS: lldb-Suite :: lang/objc/foundation/TestObjCMethodsNSError.py (1692 of 1696) PASS: lldb-Suite :: commands/expression/char/TestExprsChar.py (1693 of 1696) PASS: lldb-Suite :: lang/cpp/global_operators/TestCppGlobalOperators.py (1694 of 1696) PASS: lldb-Suite :: types/TestIntegerTypesExpr.py (1695 of 1696) PASS: lldb-Suite :: lang/objc/foundation/TestFoundationDisassembly.py (1696 of 1696) Testing Time: 2465.92s ******************** Failing Tests (8): lldb-Suite :: functionalities/gdb_remote_client/TestThreadSelectionBug.py lldb-Suite :: functionalities/gdb_remote_client/TestGDBRemoteLoad.py lldb-Suite :: tools/lldb-server/TestLldbGdbServer.py lldb-Suite :: tools/lldb-server/TestGdbRemoteKill.py lldb-Suite :: tools/lldb-server/register-reading/TestGdbRemoteGPacket.py lldb-Suite :: functionalities/gdb_remote_client/TestGDBRemoteClient.py lldb-Suite :: commands/gui/basic/TestGuiBasic.py lldb-Suite :: iohandler/completion/TestIOHandlerCompletion.py

Hide Details

Hide Details

Slowest Tests: -------------------------------------------------------------------------- 129.62s: lldb-Suite :: api/check_public_api_headers/TestPublicAPIHeaders.py 141.49s: lldb-Suite :: python_api/target/TestTargetAPI.py 145.18s: lldb-Suite :: lang/objc/objc-new-syntax/TestObjCNewSyntaxArray.py 148.32s: lldb-Suite :: lang/objc/objc-new-syntax/TestObjCNewSyntaxDictionary.py 151.34s: lldb-Suite :: lang/objc/exceptions/TestObjCExceptions.py 152.13s: lldb-Suite :: lang/c/anonymous/TestAnonymous.py 169.97s: lldb-Suite :: functionalities/inferior-crashing/TestInferiorCrashingStep.py 194.25s: lldb-Suite :: functionalities/return-value/TestReturnValue.py 195.44s: lldb-Suite :: functionalities/gdb_remote_client/TestGDBRemoteLoad.py 199.42s: lldb-Suite :: lang/objc/objc-new-syntax/TestObjCNewSyntaxLiteral.py 202.81s: lldb-Suite :: lang/objc/foundation/TestObjCMethods.py 212.94s: lldb-Suite :: functionalities/load_unload/TestLoadUnload.py 213.36s: lldb-Suite :: lang/cpp/namespace/TestNamespaceLookup.py 217.56s: lldb-Suite :: api/multithreaded/TestMultithreaded.py 230.86s: lldb-Suite :: tools/lldb-server/TestLldbGdbServer.py 237.05s: lldb-Suite :: lang/cpp/enum_types/TestCPP11EnumTypes.py 259.10s: lldb-Suite :: lang/objc/hidden-ivars/TestHiddenIvars.py 334.59s: lldb-Suite :: types/TestIntegerTypesExpr.py 405.70s: lldb-Suite :: types/TestIntegerTypes.py 1156.78s: lldb-Suite :: lang/objc/foundation/TestFoundationDisassembly.py

Hide Details

Tests Times: -------------------------------------------------------------------------- [ Range ] :: [ Percentage ] :: [ Count ] -------------------------------------------------------------------------- [ 0s, 100s) :: [*************************************** ] :: [1671/1696] [ 100s, 200s) :: [ ] :: [ 12/1696] [ 200s, 300s) :: [ ] :: [ 10/1696] [ 300s, 400s) :: [ ] :: [ 1/1696] [ 400s, 500s) :: [ ] :: [ 1/1696] [ 500s, 600s) :: [ ] :: [ 0/1696] [ 600s, 700s) :: [ ] :: [ 0/1696] [ 700s, 800s) :: [ ] :: [ 0/1696] [ 800s, 900s) :: [ ] :: [ 0/1696] [ 900s,1000s) :: [ ] :: [ 0/1696] [1000s,1100s) :: [ ] :: [ 0/1696] [1100s,1200s) :: [ ] :: [ 1/1696] Expected Passes : 1638 Expected Failures : 6 Unsupported Tests : 44 Unexpected Failures: 8 FAILED: tools/lldb/lit/CMakeFiles/check-lldb-lit cd /Users/buildslave/jenkins/workspace/lldb-cmake-sanitized/lldb-build/tools/lldb/lit && /usr/bin/python /Users/buildslave/jenkins/workspace/lldb-cmake-sanitized/lldb-build/./bin/llvm-lit -v --time-tests --shuffle --xunit-xml-output=/Users/buildslave/jenkins/workspace/lldb-cmake-sanitized/test/results.xml -v --timeout 1200 /Users/buildslave/jenkins/workspace/lldb-cmake-sanitized/lldb-build/tools/lldb/lit ninja: build stopped: subcommand failed. Command failed Command: ['/usr/bin/env', 'TERM=vt100', '/usr/local/bin/ninja', '-v', 'check-lldb'] [Pipeline] } [Pipeline] // timeout [Pipeline] } [Pipeline] // stage [Pipeline] stage [Pipeline] { (Declarative: Post Actions) [Pipeline] scanForIssues No credentials specified [Clang (LLVM based)] Sleeping for 5 seconds due to JENKINS-32191... [Clang (LLVM based)] Parsing console log (workspace: '/Users/buildslave/jenkins/workspace/lldb-cmake-sanitized') [Pipeline] junit Recording test results [Pipeline] } [Pipeline] // stage [Pipeline] } [Pipeline] // withEnv [Pipeline] } [Pipeline] // node [Pipeline] End of Pipeline [BFA] Scanning build for known causes... [BFA] Found failure cause(s): [BFA] Regression test failed from category Test [BFA] Ninja target failed from category Compile [BFA] Done. 0s ERROR: script returned exit code 1 Finished: FAILURE