FailedConsole Output

Skipping 8,060 KB.. Full Log
0;1mx 1 x int main(int argc, char **argv) {xxxx 2 x   int funky_var_name_that_should_be_rendered = 22;xxxx 3 x`  return 0; // Break here                                                                                                                                                                                                                                                                                                                                                   <<< Thread 1: breakpoint 1.1 xxxx 4 x }xxxx 5 xxxxxxxxxxxxxxxxxxxxxxxxxxxxxxxxxxxxxxxxxxxxxxxxxxxxxxxxxxxxxxxxxxxxxxxxxxxxxxxxxxxxxxxxxxxxxxxxxxxxxxxxxxxxxxxxxxxxxxxxxxxxxxxxxxxxxxxxxxxxxxxxxxxxxxxxxxxxxxxxxxxxxxxxxxxxxxxxxxxxxxxxxxxxxxxxxxxxxxxxxxxxxxxxxxxxxxxxxxxxxxxxxxxxxxxxxxxxxxxxxxxxmqqqqqqqqqqqqqqqqqqqqqqqqqqqqqqqqqqqqqqqqqqqqqqqqqqqqqqqqqqqqqqqqqqqqqqqqqqqqqqqqqqqqqqqqqqqqqqqqqqqqqqqqqqqqqqqqqqqqqqqqqqqqqqqqqqqqqqqqqqqqqqqqqqqqqqqqqqqqqqqqqqqqqqqqqqqqqqqqqqqqqqqqqqqqqqqqqqqqqqqqqqqqqqqqqqqqqqqqqqqqqqqqqqqqqqqqqqqqqqqqqqqqqqqqqqqqqqqqqqqqqqqqqqqqqqqqqqqqqqqqqqqqqqqqqqqqqqqqqqqqqqqqqqqqqqqqqqqqqqqqqqqqqqqqqqqqqqqqqqqqqqqqqqqqqqqqqqqqqqqqqqqqqqqqqqqqqqqqqqqqqqqqqqqqqqqqqqqqqqjxxlqq<Variables>qqqqqqqqqqqqqqqqqqqqqqqqqqqqqqqqqqqqqqqqqqqqqqqqqqqqqqqqqqqqqqqqqqqqqqqqqqqqqqqqqqqqqqqqqqqqqqqqqqqqqqqqqqqqqqqqqqqqqqqqqqqqqqqqqqqqqqqqqqqqqqqqqqqqqqqqqqqqqqqqqqqqqqqqqqqqqqqqqqqqqqqqqqqqqqqqqqqqqqqqqqqqqqqqqqqqqqqqqqqqqqqqqqqqqqqqqqqqqqqqqqqqqqqqqqqqqqqqqqqqqqqqqqqqqqqqqqqqqqqqqqqqqqqqqqqqqqqqqqqqqqqqqqqqqqqqqqqqqqqqqqqqqqqqqqqqqqqqqqqqqqqqqqqqqqqqqqqqqqqqqqqqqqqqqqqqqqqqqqqqqqqqqkxxx (int) argc = 1xxxx `q(char **) argv = 0x00007ffeefbff530xxxx (int) funky_var_name_that_should_be_rendered = 22xxxxxxxxxxxxxxxxxxxxxxxxxxxxxxxxxxxxxxxxxxxxxxxxxxxxxxxxxxxxxxxxxxxxxxxxxxxxxxxxxxxxxxxxxxxxxxxxxxxxxxxmqqqqqqqqqqqqqqqqqqqqqqqqqqqqqqqqqqqqqqqqqqqqqqqqqqqqqqqqqqqqqqqqqqqqqqqqqqqqqqqqqqqqqqqqqqqqqqqqqqqqqqqqqqqqqqqqqqqqqqqqqqqqqqqqqqqqqqqqqqqqqqqqqqqqqqqqqqqqqqqqqqqqqqqqqqqqqqqqqqqqqqqqqqqqqqqqqqqqqqqqqqqqqqqqqqqqqqqqqqqqqqqqqqqqqqqqqqqqqqqqqqqqqqqqqqqqqqqqqqqqqqqqqqqqqqqqqqqqqqqqqqqqqqqqqqqqqqqqqqqqqqqqqqqqqqqqqqqqqqqqqqqqqqqqqqqqqqqqqqqqqqqqqqqqqqqqqqqqqqqqqqqqqqqqqqqqqqqqqqqqqqqqqqqqqqqqqqqqqqjmqqqqqqqqqqqqqqqqqqqqqqqqqqqqqqqqqqqqqqqqqqqqqqqqqqqqqqqqqqqqqqqqqqqqqqqqqqqqqqqqqqqqqqqqqqqqqqqqqqjProcess: 38454    stopped               Thread: 0x2aaf817   Frame:   0  PC = 0x0000000100000fab
[?1l>(lldb) settings set interpreter.prompt-on-quit false

Hide Details

Session logs for test failures/errors/unexpected successes will go into directory '/Users/buildslave/jenkins/workspace/lldb-cmake-sanitized/test/logs' Command invoked: /Users/buildslave/jenkins/workspace/lldb-cmake-sanitized/llvm-project/lldb/test/dotest.py --arch=x86_64 -s /Users/buildslave/jenkins/workspace/lldb-cmake-sanitized/lldb-build/lldb-test-traces -S nm -u CXXFLAGS -u CFLAGS --executable /Users/buildslave/jenkins/workspace/lldb-cmake-sanitized/lldb-build/./bin/lldb --dsymutil /Users/buildslave/jenkins/workspace/lldb-cmake-sanitized/lldb-build/./bin/dsymutil --filecheck /Users/buildslave/jenkins/workspace/lldb-cmake-sanitized/lldb-build/./bin/FileCheck -C /Users/buildslave/jenkins/workspace/lldb-cmake-sanitized/host-compiler/bin/clang --codesign-identity lldb_codesign --server /Users/buildslave/jenkins/workspace/lldb-cmake-sanitized/lldb-build/./bin/debugserver --arch x86_64 --build-dir /Users/buildslave/jenkins/workspace/lldb-cmake-sanitized/lldb-build/lldb-test-build.noindex -s=/Users/buildslave/jenkins/workspace/lldb-cmake-sanitized/test/logs -t --env TERM=vt100 --env LLVM_LIBS_DIR=/Users/buildslave/jenkins/workspace/lldb-cmake-sanitized/lldb-build/./lib --build-dir /Users/buildslave/jenkins/workspace/lldb-cmake-sanitized/lldb-build/tools/lldb/lldb-test-build.noindex --module-cache-dir /Users/buildslave/jenkins/workspace/lldb-cmake-sanitized/lldb-build/tools/lldb/lldb-test-build.noindex/module-cache-lldb /Users/buildslave/jenkins/workspace/lldb-cmake-sanitized/llvm-project/lldb/packages/Python/lldbsuite/test/commands/gui/basic -p TestGuiBasic.py Change dir to: /Users/buildslave/jenkins/workspace/lldb-cmake-sanitized/llvm-project/lldb/packages/Python/lldbsuite/test/commands/gui/basic runCmd: settings set symbols.enable-external-lookup false output:

Hide Details

runCmd: settings set plugin.process.gdb-remote.packet-timeout 60 output:

Hide Details

runCmd: settings set symbols.clang-modules-cache-path "/Users/buildslave/jenkins/workspace/lldb-cmake-sanitized/lldb-build/tools/lldb/lldb-test-build.noindex/module-cache-lldb" output:

Hide Details

runCmd: settings set use-color false output:

Hide Details

FAIL: LLDB (/Users/buildslave/jenkins/workspace/lldb-cmake-sanitized/host-compiler/bin/clang-10-x86_64) :: test_gui (TestGuiBasic.BasicGuiCommandTest) tearing down the child process....

Hide Details

CLEANUP ERROR: LLDB (/Users/buildslave/jenkins/workspace/lldb-cmake-sanitized/host-compiler/bin/clang-10-x86_64) :: test_gui (TestGuiBasic.BasicGuiCommandTest) Restore dir to: /Users/buildslave/jenkins/workspace/lldb-cmake-sanitized/lldb-build/tools/lldb/lit ====================================================================== ERROR: test_gui (TestGuiBasic.BasicGuiCommandTest) ---------------------------------------------------------------------- Traceback (most recent call last): File "/Users/buildslave/jenkins/workspace/lldb-cmake-sanitized/llvm-project/lldb/packages/Python/lldbsuite/test/commands/gui/basic/TestGuiBasic.py", line 60, in test_gui self.quit() File "/Users/buildslave/jenkins/workspace/lldb-cmake-sanitized/llvm-project/lldb/packages/Python/lldbsuite/test/lldbpexpect.py", line 61, in quit self.child.close(force=not gracefully) File "/Users/buildslave/jenkins/workspace/lldb-cmake-sanitized/llvm-project/lldb/third_party/Python/module/pexpect-4.6/pexpect/pty_spawn.py", line 327, in close self.ptyproc.close(force=force) File "/System/Library/Frameworks/Python.framework/Versions/2.7/lib/python2.7/contextlib.py", line 35, in __exit__ self.gen.throw(type, value, traceback) File "/Users/buildslave/jenkins/workspace/lldb-cmake-sanitized/llvm-project/lldb/third_party/Python/module/pexpect-4.6/pexpect/pty_spawn.py", line 25, in _wrap_ptyprocess_err raise ExceptionPexpect(*e.args) ExceptionPexpect: Could not terminate the child. Config=x86_64-/Users/buildslave/jenkins/workspace/lldb-cmake-sanitized/host-compiler/bin/clang-10 ---------------------------------------------------------------------- Ran 1 test in 12.844s

Hide Details

RESULT: FAILED (0 passes, 0 failures, 1 errors, 0 skipped, 0 expected failures, 0 unexpected successes)

Hide Details

******************** PASS: LLDB :: Reproducer/Functionalities/TestImageList.test (490 of 1727) PASS: lldb-Unit :: Host/./HostTests/SocketAddressTest.GetAddressInfo (491 of 1727) PASS: lldb-Suite :: commands/watchpoints/hello_watchlocation/TestWatchLocation.py (492 of 1727) PASS: lldb-Suite :: functionalities/inferior-crashing/TestInferiorCrashingStep.py (493 of 1727) PASS: lldb-Unit :: Language/Highlighting/./HighlighterTests/HighlighterTest.ClangPPDirectives (494 of 1727) PASS: lldb-Suite :: functionalities/history/TestHistoryRecall.py (495 of 1727) PASS: lldb-Unit :: Interpreter/./InterpreterTests/CompletionTest.DirCompletionUsername (496 of 1727) PASS: lldb-Unit :: Utility/./UtilityTests/StreamTeeTest.Flush (497 of 1727) PASS: lldb-Unit :: debugserver/./debugserverTests/RNBSocket.AnyListen (498 of 1727) PASS: lldb-Suite :: functionalities/exec/TestExec.py (499 of 1727) PASS: LLDB :: Modules/Breakpad/discontiguous-sections.test (500 of 1727) PASS: LLDB :: SymbolFile/DWARF/find-basic-namespace.cpp (501 of 1727) PASS: lldb-Suite :: lang/objc/foundation/TestObjCMethods.py (502 of 1727) PASS: lldb-Suite :: functionalities/signal/TestSendSignal.py (503 of 1727) PASS: lldb-Unit :: UnwindAssembly/x86/./UnwindAssemblyx86Tests/Testx86AssemblyInspectionEngine.TestPushESI (504 of 1727) PASS: lldb-Unit :: Utility/./UtilityTests/ReproducerTest.SetReplay (505 of 1727) PASS: lldb-Suite :: functionalities/value_md5_crash/TestValueMD5Crash.py (506 of 1727) PASS: lldb-Unit :: Utility/./UtilityTests/StreamTeeTest.CopyConstructor (507 of 1727) PASS: lldb-Suite :: functionalities/thread/concurrent_events/TestConcurrentTwoWatchpointsOneBreakpoint.py (508 of 1727) PASS: lldb-Unit :: Utility/./UtilityTests/TimerTest.CategoryTimesStats (509 of 1727) PASS: LLDB :: SymbolFile/DWARF/deterministic-build.cpp (510 of 1727) PASS: lldb-Suite :: commands/expression/call-function/TestCallStopAndContinue.py (511 of 1727) PASS: lldb-Unit :: Utility/./UtilityTests/OptionsWithRawTest.EmptySuffixSingleWhitespace (512 of 1727) PASS: lldb-Suite :: lang/c/step-target/TestStepTarget.py (513 of 1727) PASS: LLDB :: Minidump/Windows/find-module.test (514 of 1727) UNSUPPORTED: LLDB :: Register/x86-64-ymm16-write.test (515 of 1727) PASS: lldb-Suite :: python_api/name_lookup/TestNameLookup.py (516 of 1727) PASS: lldb-Unit :: UnwindAssembly/x86/./UnwindAssemblyx86Tests/Testx86AssemblyInspectionEngine.TestLEAVE (517 of 1727) PASS: lldb-Unit :: Utility/./UtilityTests/StringExtractorTest.GetNameColonValueSuccess (518 of 1727) PASS: lldb-Suite :: functionalities/thread/concurrent_events/TestConcurrentBreakpointOneDelayBreakpointThreads.py (519 of 1727) PASS: LLDB :: SymbolFile/DWARF/debug-types-missing-signature.test (520 of 1727) PASS: lldb-Suite :: commands/expression/call-function/TestCallBuiltinFunction.py (521 of 1727) PASS: lldb-Unit :: Utility/./UtilityTests/StateTest.Formatv (522 of 1727) PASS: lldb-Suite :: functionalities/breakpoint/comp_dir_symlink/TestCompDirSymLink.py (523 of 1727) UNSUPPORTED: LLDB :: SymbolFile/PDB/enums-layout.test (524 of 1727) PASS: lldb-Suite :: commands/expression/import-std-module/vector-basic/TestBasicVector.py (525 of 1727) PASS: lldb-Suite :: functionalities/darwin_log/filter/exact_match/subsystem/TestDarwinLogFilterMatchSubsystem.py (526 of 1727) PASS: lldb-Suite :: commands/expression/call-overridden-method/TestCallOverriddenMethod.py (527 of 1727) FAIL: lldb-Suite :: commands/expression/multiline-completion/TestMultilineCompletion.py (528 of 1727) ******************** TEST 'lldb-Suite :: commands/expression/multiline-completion/TestMultilineCompletion.py' FAILED ******************** lldb version 10.0.99 (http://labmaster3.local/git/llvm-project.git revision b2b0ccab2f76733679eeceecf31b21ebc1fe23ac) clang revision b2b0ccab2f76733679eeceecf31b21ebc1fe23ac llvm revision b2b0ccab2f76733679eeceecf31b21ebc1fe23ac LLDB library dir: /Users/buildslave/jenkins/workspace/lldb-cmake-sanitized/lldb-build/bin LLDB import library dir: /Users/buildslave/jenkins/workspace/lldb-cmake-sanitized/lldb-build/bin libstdcxx tests will not be run because: Don't know how to build with libstdcxx on macosx Skipping following debug info categories: ['dwo'] (lldb) settings set symbols.enable-external-lookup false (lldb) settings set plugin.process.gdb-remote.packet-timeout 60 (lldb) settings set symbols.clang-modules-cache-path "/Users/buildslave/jenkins/workspace/lldb-cmake-sanitized/lldb-build/tools/lldb/lldb-test-build.noindex/module-cache-lldb" (lldb) settings set use-color false (lldb) target create "/Users/buildslave/jenkins/workspace/lldb-cmake-sanitized/lldb-build/tools/lldb/lldb-test-build.noindex/commands/expression/multiline-completion/TestMultilineCompletion.test_basic_completion/a.out" Current executable set to '/Users/buildslave/jenkins/workspace/lldb-cmake-sanitized/lldb-build/tools/lldb/lldb-test-build.noindex/commands/expression/multiline-completion/TestMultilineCompletion.test_basic_completion/a.out' (x86_64). (lldb) b main b main Breakpoint 1: where = a.out`main + 18 at main.c:2:7, address = 0x0000000100000fa2 (lldb) run run Process 44543 launched: '/Users/buildslave/jenkins/workspace/lldb-cmake-sanitized/lldb-build/tools/lldb/lldb-test-build.noindex/commands/expression/multiline-completion/TestMultilineCompletion.test_basic_completion/a.out' (x86_64) Process 44543 stopped * thread #1, queue = 'com.apple.main-thread', stop reason = breakpoint 1.1 frame #0: 0x0000000100000fa2 a.out`main(argc=1, argv=0x00007ffeefbff4d0) at main.c:2:7 1 int main(int argc, char **argv) { -> 2 int to_complete = 0; ^ 3 return to_complete; 4 } (lldb) expr expr Enter expressions, then terminate with an empty line to evaluate: to_  1:  1: to_ to_  1: to_complete

Hide Details

 1: to_complete 2:  2:  (int) $0 = 0 (lldb) settings set interpreter.prompt-on-quit false

Hide Details

Session logs for test failures/errors/unexpected successes will go into directory '/Users/buildslave/jenkins/workspace/lldb-cmake-sanitized/test/logs' Command invoked: /Users/buildslave/jenkins/workspace/lldb-cmake-sanitized/llvm-project/lldb/test/dotest.py --arch=x86_64 -s /Users/buildslave/jenkins/workspace/lldb-cmake-sanitized/lldb-build/lldb-test-traces -S nm -u CXXFLAGS -u CFLAGS --executable /Users/buildslave/jenkins/workspace/lldb-cmake-sanitized/lldb-build/./bin/lldb --dsymutil /Users/buildslave/jenkins/workspace/lldb-cmake-sanitized/lldb-build/./bin/dsymutil --filecheck /Users/buildslave/jenkins/workspace/lldb-cmake-sanitized/lldb-build/./bin/FileCheck -C /Users/buildslave/jenkins/workspace/lldb-cmake-sanitized/host-compiler/bin/clang --codesign-identity lldb_codesign --server /Users/buildslave/jenkins/workspace/lldb-cmake-sanitized/lldb-build/./bin/debugserver --arch x86_64 --build-dir /Users/buildslave/jenkins/workspace/lldb-cmake-sanitized/lldb-build/lldb-test-build.noindex -s=/Users/buildslave/jenkins/workspace/lldb-cmake-sanitized/test/logs -t --env TERM=vt100 --env LLVM_LIBS_DIR=/Users/buildslave/jenkins/workspace/lldb-cmake-sanitized/lldb-build/./lib --build-dir /Users/buildslave/jenkins/workspace/lldb-cmake-sanitized/lldb-build/tools/lldb/lldb-test-build.noindex --module-cache-dir /Users/buildslave/jenkins/workspace/lldb-cmake-sanitized/lldb-build/tools/lldb/lldb-test-build.noindex/module-cache-lldb /Users/buildslave/jenkins/workspace/lldb-cmake-sanitized/llvm-project/lldb/packages/Python/lldbsuite/test/commands/expression/multiline-completion -p TestMultilineCompletion.py Change dir to: /Users/buildslave/jenkins/workspace/lldb-cmake-sanitized/llvm-project/lldb/packages/Python/lldbsuite/test/commands/expression/multiline-completion runCmd: settings set symbols.enable-external-lookup false output:

Hide Details

runCmd: settings set plugin.process.gdb-remote.packet-timeout 60 output:

Hide Details

runCmd: settings set symbols.clang-modules-cache-path "/Users/buildslave/jenkins/workspace/lldb-cmake-sanitized/lldb-build/tools/lldb/lldb-test-build.noindex/module-cache-lldb" output:

Hide Details

runCmd: settings set use-color false output:

Hide Details

FAIL: LLDB (/Users/buildslave/jenkins/workspace/lldb-cmake-sanitized/host-compiler/bin/clang-10-x86_64) :: test_basic_completion (TestMultilineCompletion.MultilineCompletionTest) tearing down the child process....

Hide Details

CLEANUP ERROR: LLDB (/Users/buildslave/jenkins/workspace/lldb-cmake-sanitized/host-compiler/bin/clang-10-x86_64) :: test_basic_completion (TestMultilineCompletion.MultilineCompletionTest) Restore dir to: /Users/buildslave/jenkins/workspace/lldb-cmake-sanitized/lldb-build/tools/lldb/lit ====================================================================== ERROR: test_basic_completion (TestMultilineCompletion.MultilineCompletionTest) Test that we can complete a simple multiline expression ---------------------------------------------------------------------- Traceback (most recent call last): File "/Users/buildslave/jenkins/workspace/lldb-cmake-sanitized/llvm-project/lldb/packages/Python/lldbsuite/test/commands/expression/multiline-completion/TestMultilineCompletion.py", line 30, in test_basic_completion self.quit() File "/Users/buildslave/jenkins/workspace/lldb-cmake-sanitized/llvm-project/lldb/packages/Python/lldbsuite/test/lldbpexpect.py", line 61, in quit self.child.close(force=not gracefully) File "/Users/buildslave/jenkins/workspace/lldb-cmake-sanitized/llvm-project/lldb/third_party/Python/module/pexpect-4.6/pexpect/pty_spawn.py", line 327, in close self.ptyproc.close(force=force) File "/System/Library/Frameworks/Python.framework/Versions/2.7/lib/python2.7/contextlib.py", line 35, in __exit__ self.gen.throw(type, value, traceback) File "/Users/buildslave/jenkins/workspace/lldb-cmake-sanitized/llvm-project/lldb/third_party/Python/module/pexpect-4.6/pexpect/pty_spawn.py", line 25, in _wrap_ptyprocess_err raise ExceptionPexpect(*e.args) ExceptionPexpect: Could not terminate the child. Config=x86_64-/Users/buildslave/jenkins/workspace/lldb-cmake-sanitized/host-compiler/bin/clang-10 ---------------------------------------------------------------------- Ran 1 test in 8.001s

Hide Details

RESULT: FAILED (0 passes, 0 failures, 1 errors, 0 skipped, 0 expected failures, 0 unexpected successes)

Hide Details

******************** XFAIL: LLDB :: Register/x86-mm-xmm-read.test (529 of 1727) PASS: lldb-Suite :: commands/expression/completion-in-lambda-and-unnnamed-class/TestCompletionInLambdaAndUnnamedClass.py (530 of 1727) PASS: lldb-Unit :: Process/minidump/./LLDBMinidumpTests/MinidumpParserTest.GetThreadContext_x86_64 (531 of 1727) PASS: lldb-Unit :: Utility/./UtilityTests/StringListTest.AppendListCStringArrayEmpty (532 of 1727) PASS: lldb-Unit :: Host/./HostTests/SocketTest.DecodeHostAndPort (533 of 1727) PASS: LLDB :: Commands/command-backtrace.test (534 of 1727) PASS: lldb-Unit :: Utility/./UtilityTests/StringExtractorTest.GetU64BigEndian (535 of 1727) PASS: lldb-Suite :: commands/watchpoints/multiple_threads/TestWatchpointMultipleThreads.py (536 of 1727) PASS: lldb-Suite :: functionalities/thread/concurrent_events/TestConcurrentWatchpointWithDelayWatchpointThreads.py (537 of 1727) PASS: lldb-Unit :: Utility/./UtilityTests/StreamTest.PutCString (538 of 1727) PASS: lldb-Unit :: Utility/./UtilityTests/ConstStringTest.MangledCounterpart (539 of 1727) PASS: lldb-Suite :: tools/lldb-server/TestGdbRemote_vCont.py (540 of 1727) PASS: lldb-Unit :: Process/gdb-remote/./ProcessGdbRemoteTests/GDBRemoteClientBaseTest.InterruptNoResponse (541 of 1727) PASS: lldb-Suite :: functionalities/thread/multi_break/TestMultipleBreakpoints.py (542 of 1727) PASS: lldb-Unit :: UnwindAssembly/x86/./UnwindAssemblyx86Tests/Testx86AssemblyInspectionEngine.TestPushEDI (543 of 1727) PASS: lldb-Suite :: functionalities/data-formatter/data-formatter-stl/libcxx/multiset/TestDataFormatterLibcxxMultiSet.py (544 of 1727) PASS: lldb-Unit :: UnwindAssembly/x86/./UnwindAssemblyx86Tests/Testx86AssemblyInspectionEngine.TestPushRBX (545 of 1727) PASS: lldb-Unit :: Interpreter/./InterpreterTests/CompletionTest.DirCompletionAbsolute (546 of 1727) PASS: lldb-Unit :: Utility/./UtilityTests/UriParserTest.BracketedHostnameWithColon (547 of 1727) PASS: lldb-Suite :: benchmarks/frame_variable/TestFrameVariableResponse.py (548 of 1727) PASS: lldb-Suite :: functionalities/signal/handle-abrt/TestHandleAbort.py (549 of 1727) PASS: lldb-Suite :: functionalities/data-formatter/data-formatter-objc/TestDataFormatterObjCCF.py (550 of 1727) PASS: lldb-Suite :: functionalities/stats_api/TestStatisticsAPI.py (551 of 1727) PASS: lldb-Suite :: commands/expression/invalid-args/TestInvalidArgsExpression.py (552 of 1727) PASS: LLDB :: SymbolFile/Breakpad/stack-cfi-parsing.test (553 of 1727) PASS: lldb-Suite :: python_api/sbvalue_persist/TestSBValuePersist.py (554 of 1727) PASS: lldb-Suite :: tools/lldb-server/TestGdbRemoteAttach.py (555 of 1727) PASS: lldb-Suite :: functionalities/breakpoint/require_hw_breakpoints/TestRequireHWBreakpoints.py (556 of 1727) PASS: LLDB :: SymbolFile/DWARF/apple-index-is-used.cpp (557 of 1727) PASS: lldb-Suite :: functionalities/breakpoint/global_constructor/TestBreakpointInGlobalConstructor.py (558 of 1727) PASS: lldb-Unit :: Host/./HostTests/TaskPoolTest.TaskMap (559 of 1727) PASS: lldb-Unit :: Utility/./UtilityTests/Flags.AllClear (560 of 1727) PASS: lldb-Unit :: Process/gdb-remote/./ProcessGdbRemoteTests/GDBRemoteClientBaseTest.SendContinueAndAsyncSignal (561 of 1727) PASS: lldb-Unit :: Host/./HostTests/NativeProcessProtocolTest.SetBreakpointFailVerify (562 of 1727) PASS: LLDB :: Modules/Breakpad/sections.test (563 of 1727) PASS: lldb-Suite :: tools/lldb-server/TestGdbRemoteKill.py (564 of 1727) PASS: lldb-Unit :: Language/Highlighting/./HighlighterTests/HighlighterTest.ClangCursorPosBeforeOtherToken (565 of 1727) PASS: lldb-Unit :: Utility/./UtilityTests/StringExtractorTest.GetHexU8_Extra_NoEof (566 of 1727) PASS: lldb-Unit :: UnwindAssembly/x86/./UnwindAssemblyx86Tests/Testx86AssemblyInspectionEngine.Test32bitFramelessSmallStackFrame (567 of 1727) PASS: lldb-Unit :: Utility/./UtilityTests/RecordReplayTest.InstrumentedBarRef (568 of 1727) PASS: lldb-Suite :: functionalities/tail_call_frames/sbapi_support/TestTailCallFrameSBAPI.py (569 of 1727) PASS: lldb-Suite :: tools/lldb-vscode/variables/TestVSCode_variables.py (570 of 1727) PASS: lldb-Suite :: functionalities/thread/concurrent_events/TestConcurrentNWatchNBreak.py (571 of 1727) PASS: lldb-Suite :: functionalities/asan/TestReportData.py (572 of 1727) PASS: lldb-Unit :: ScriptInterpreter/Python/./ScriptInterpreterPythonTests/PythonDataObjectsTest.TestPythonListManipulation (573 of 1727) PASS: lldb-Suite :: lang/objc/foundation/TestObjectDescriptionAPI.py (574 of 1727) PASS: lldb-Unit :: Process/gdb-remote/./ProcessGdbRemoteTests/GDBRemoteCommunicationClientTest.GetModulesInfo_UUID20 (575 of 1727) PASS: lldb-Suite :: functionalities/load_unload/TestLoadUnload.py (576 of 1727) UNSUPPORTED: LLDB :: ExecControl/StopHook/stop-hook-threads.test (577 of 1727) PASS: lldb-Unit :: Utility/./UtilityTests/StreamTeeTest.Constructor1Stream (578 of 1727) PASS: lldb-Unit :: Utility/./UtilityTests/Flags.GetBitSize (579 of 1727) PASS: lldb-Unit :: UnwindAssembly/x86/./UnwindAssemblyx86Tests/Testx86AssemblyInspectionEngine.TestAddESP (580 of 1727) PASS: lldb-Suite :: functionalities/avoids-fd-leak/TestFdLeak.py (581 of 1727) PASS: LLDB :: SymbolFile/DWARF/debug_rnglists.s (582 of 1727) PASS: lldb-Suite :: api/check_public_api_headers/TestPublicAPIHeaders.py (583 of 1727) PASS: lldb-Suite :: functionalities/unwind/ehframe/TestEhFrameUnwind.py (584 of 1727) PASS: lldb-Suite :: types/TestRecursiveTypes.py (585 of 1727) PASS: lldb-Suite :: lang/c/unions/TestUnionMembers.py (586 of 1727) PASS: lldb-Unit :: Utility/./UtilityTests/BinaryStreamTest.PutULEB128MaxValue (587 of 1727) PASS: lldb-Suite :: driver/batch_mode/TestBatchMode.py (588 of 1727) PASS: lldb-Unit :: Host/./HostTests/FileSystemTest.GetPermissions (589 of 1727) UNSUPPORTED: LLDB :: SymbolFile/PDB/class-layout.test (590 of 1727) PASS: lldb-Unit :: UnwindAssembly/x86/./UnwindAssemblyx86Tests/Testx86AssemblyInspectionEngine.TestPushImm (591 of 1727) PASS: lldb-Suite :: lang/cpp/static_methods/TestCPPStaticMethods.py (592 of 1727) PASS: lldb-Unit :: Utility/./UtilityTests/ArgsTest.AppendArguments (593 of 1727) PASS: lldb-Suite :: python_api/function_symbol/TestSymbolAPI.py (594 of 1727) PASS: lldb-Suite :: types/TestIntegerTypes.py (595 of 1727) UNSUPPORTED: LLDB :: Breakpoint/case-insensitive.test (596 of 1727) PASS: lldb-Unit :: Utility/./UtilityTests/StreamTest.PutSLEB128 (597 of 1727) PASS: lldb-Suite :: lang/objc/objc-ivar-offsets/TestObjCIvarOffsets.py (598 of 1727) PASS: lldb-Unit :: Process/gdb-remote/./ProcessGdbRemoteTests/GDBRemoteCommunicationClientTest.SendGetMetaDataPacket (599 of 1727) PASS: lldb-Suite :: python_api/type/TestTypeList.py (600 of 1727) PASS: lldb-Unit :: UnwindAssembly/x86/./UnwindAssemblyx86Tests/Testx86AssemblyInspectionEngine.TestPushR13 (601 of 1727) PASS: lldb-Suite :: commands/expression/import-std-module/forward_list-basic/TestBasicForwardList.py (602 of 1727) PASS: lldb-Suite :: macosx/find-dsym/bundle-with-dot-in-filename/TestBundleWithDotInFilename.py (603 of 1727) PASS: lldb-Suite :: commands/expression/import-std-module/unique_ptr-dbg-info-content/TestUniquePtrDbgInfoContent.py (604 of 1727) PASS: lldb-Unit :: Utility/./UtilityTests/StringLexerTest.AdvanceIf (605 of 1727) PASS: lldb-Suite :: lang/c/struct_types/TestStructTypes.py (606 of 1727) PASS: lldb-Unit :: Host/./HostTests/FileSystemTest.FileAndDirectoryComponents (607 of 1727) PASS: LLDB :: Modules/ELF/many-sections.s (608 of 1727) PASS: lldb-Suite :: functionalities/breakpoint/breakpoint_by_line_and_column/TestBreakpointByLineAndColumn.py (609 of 1727) PASS: lldb-Suite :: commands/expression/entry-bp/TestExprEntryBP.py (610 of 1727) PASS: lldb-Unit :: ScriptInterpreter/Python/./ScriptInterpreterPythonTests/PythonDataObjectsTest.TestPythonTupleInitializerList2 (611 of 1727) UNSUPPORTED: LLDB :: Register/x86-64-ymm16-read.test (612 of 1727) PASS: lldb-Unit :: ObjectFile/Breakpad/./ObjectFileBreakpadTests/Record.classify (613 of 1727) PASS: lldb-Suite :: lang/objc/foundation/TestObjCMethodsString.py (614 of 1727) PASS: lldb-Unit :: ScriptInterpreter/Python/./ScriptInterpreterPythonTests/PythonDataObjectsTest.TestPythonCallableInvoke (615 of 1727) PASS: lldb-Unit :: Utility/./UtilityTests/StringListTest.GetMaxStringLengthEqualSize (616 of 1727) PASS: lldb-Unit :: UnwindAssembly/x86/./UnwindAssemblyx86Tests/Testx86AssemblyInspectionEngine.TestPopRBP (617 of 1727) UNSUPPORTED: LLDB :: Register/x86-64-xmm16-write.test (618 of 1727) PASS: lldb-Suite :: tools/lldb-server/TestGdbRemoteAuxvSupport.py (619 of 1727) PASS: lldb-Suite :: commands/expression/import-std-module/forward_list-dbg-info-content/TestDbgInfoContentForwardList.py (620 of 1727) PASS: lldb-Suite :: lang/c/find_struct_type/TestFindStructTypes.py (621 of 1727) PASS: lldb-Unit :: Utility/./UtilityTests/CompletionRequest.TestCompletionOwnership (622 of 1727) PASS: lldb-Unit :: Utility/./UtilityTests/FileSpecTest.RemoveLastPathComponent (623 of 1727) PASS: lldb-Unit :: Utility/./UtilityTests/BroadcasterTest.EventTypeHasListeners (624 of 1727) PASS: lldb-Suite :: lang/c/inlines/TestRedefinitionsInInlines.py (625 of 1727) PASS: lldb-Unit :: Utility/./UtilityTests/UriParserTest.BracketedHostnamePort (626 of 1727) PASS: LLDB :: Driver/TestNoUseColor.test (627 of 1727) PASS: lldb-Suite :: commands/breakpoint/basic/TestRegexpBreakCommand.py (628 of 1727) PASS: lldb-Suite :: functionalities/type_lookup/TestTypeLookup.py (629 of 1727) PASS: lldb-Suite :: functionalities/data-formatter/data-formatter-ptr-to-array/TestPtrToArrayFormatting.py (630 of 1727) PASS: lldb-Suite :: commands/expression/import-std-module/deque-basic/TestBasicDeque.py (631 of 1727) PASS: lldb-Suite :: tools/lldb-vscode/stackTrace/TestVSCode_stackTrace.py (632 of 1727) PASS: lldb-Unit :: Utility/./UtilityTests/VASprintfTest.EncodingError (633 of 1727) PASS: lldb-Suite :: macosx/indirect_symbol/TestIndirectSymbols.py (634 of 1727) PASS: lldb-Suite :: commands/expression/import_builtin_fileid/TestImportBuiltinFileID.py (635 of 1727) PASS: lldb-Unit :: Platform/./LLDBPlatformTests/PlatformDarwinTest.TestParseVersionBuildDir (636 of 1727) PASS: lldb-Unit :: Process/minidump/./LLDBMinidumpTests/MinidumpParserTest.GetMemory (637 of 1727) PASS: lldb-Unit :: Process/gdb-remote/./ProcessGdbRemoteTests/GDBRemoteClientBaseTest.SendContinueAndInterrupt (638 of 1727) PASS: lldb-Unit :: ScriptInterpreter/Python/./ScriptInterpreterPythonTests/PythonDataObjectsTest.TestPythonString (639 of 1727) PASS: lldb-Unit :: Symbol/./SymbolTests/PostfixExpression.ToDWARF (640 of 1727) PASS: LLDB :: Modules/ELF/PT_TLS-overlap-PT_LOAD.yaml (641 of 1727) PASS: lldb-Suite :: lang/cpp/member-and-local-vars-with-same-name/TestMembersAndLocalsWithSameName.py (642 of 1727) PASS: lldb-Suite :: commands/watchpoints/watchpoint_on_vectors/TestValueOfVectorVariable.py (643 of 1727) PASS: lldb-Suite :: source-manager/TestSourceManager.py (644 of 1727) PASS: lldb-Unit :: Host/./HostTests/SocketTest.TCPGetConnectURI (645 of 1727) PASS: lldb-Unit :: ScriptInterpreter/Python/./ScriptInterpreterPythonTests/PythonExceptionStateTest.TestAutoRestoreChanged (646 of 1727) PASS: lldb-Unit :: Process/gdb-remote/./ProcessGdbRemoteTests/GDBRemoteCommunicationClientTest.SendStartTracePacket (647 of 1727) PASS: lldb-Suite :: functionalities/data-formatter/data-formatter-smart-array/TestDataFormatterSmartArray.py (648 of 1727) PASS: lldb-Unit :: Utility/./UtilityTests/StringListTest.InsertStringAtIndexMove (649 of 1727) PASS: lldb-Suite :: sample_test/TestSampleInlineTest.py (650 of 1727) PASS: lldb-Unit :: Utility/./UtilityTests/StreamTeeTest.SetStreamAtIndexOutOfBounds (651 of 1727) PASS: lldb-Unit :: Utility/./UtilityTests/RangeTest.LessThanInvalid (652 of 1727) XFAIL: LLDB :: Register/x86-64-ymm-write.test (653 of 1727) PASS: lldb-Suite :: python_api/value_var_update/TestValueVarUpdate.py (654 of 1727) PASS: lldb-Suite :: lang/objc/objc-dynamic-value/TestObjCDynamicValue.py (655 of 1727) PASS: lldb-Unit :: ScriptInterpreter/Python/./ScriptInterpreterPythonTests/PythonDataObjectsTest.TestPythonStringToStructuredString (656 of 1727) PASS: lldb-Unit :: Utility/./UtilityTests/ConstStringTest.UpdateMangledCounterpart (657 of 1727) PASS: lldb-Unit :: Utility/./UtilityTests/BinaryStreamTest.PutULEB128ThreeBytes (658 of 1727) UNSUPPORTED: LLDB :: Breakpoint/ppc64-localentry.test (659 of 1727) PASS: lldb-Suite :: functionalities/thread/concurrent_events/TestConcurrentTwoBreakpointsOneSignal.py (660 of 1727) PASS: lldb-Unit :: Utility/./UtilityTests/BinaryStreamTest.PutULEB128FiveBytes (661 of 1727) PASS: LLDB :: Breakpoint/debug_rnglist_rlestartend.test (662 of 1727) PASS: lldb-Suite :: commands/expression/persistent_variables/TestPersistentVariables.py (663 of 1727) PASS: lldb-Suite :: lang/cpp/incomplete-types/TestCppIncompleteTypes.py (664 of 1727) PASS: lldb-Suite :: lang/cpp/namespace/TestNamespaceLookup.py (665 of 1727) PASS: lldb-Unit :: Symbol/./SymbolTests/Type.CompilerContextPattern (666 of 1727) PASS: lldb-Unit :: Expression/./ExpressionTests/DiagnosticManagerTest.GetStringMultipleDiags (667 of 1727) PASS: lldb-Unit :: Process/gdb-remote/./ProcessGdbRemoteTests/GDBRemoteClientBaseTest.SendContinueAndInterrupt2PacketBug (668 of 1727) PASS: lldb-Suite :: functionalities/data-formatter/data-formatter-cpp/TestDataFormatterCpp.py (669 of 1727) PASS: lldb-Unit :: Process/minidump/./LLDBMinidumpTests/MinidumpParserTest.MinidumpModuleOrder (670 of 1727) PASS: lldb-Suite :: functionalities/gdb_remote_client/TestNestedRegDefinitions.py (671 of 1727) PASS: LLDB :: Quit/TestQuitExitCodeImplicit0.test (672 of 1727) PASS: lldb-Suite :: lang/objc/foundation/TestObjCMethodsNSArray.py (673 of 1727) PASS: lldb-Unit :: Utility/./UtilityTests/RegularExpression.Match (674 of 1727) PASS: lldb-Unit :: Utility/./UtilityTests/UriParserTest.SchemeHostSeparator (675 of 1727) PASS: lldb-Suite :: commands/expression/rdar44436068/Test128BitsInteger.py (676 of 1727) PASS: lldb-Suite :: functionalities/plugins/command_plugin/TestPluginCommands.py (677 of 1727) PASS: lldb-Unit :: SymbolFile/NativePDB/./SymbolFileNativePDBTests/PDBFPOProgramToDWARFExpressionTests.UnresolvedDependentCyclicRegisterAssignmentReference (678 of 1727) PASS: lldb-Suite :: commands/version/TestVersion.py (679 of 1727) PASS: lldb-Unit :: Utility/./UtilityTests/ArgsTest.TestOverwriteArgs (680 of 1727) PASS: lldb-Suite :: commands/expression/fixits/TestFixIts.py (681 of 1727) PASS: lldb-Unit :: Language/Highlighting/./HighlighterTests/HighlighterTest.ClangCommas (682 of 1727) PASS: lldb-Unit :: Utility/./UtilityTests/RegularExpression.Invalid (683 of 1727) PASS: lldb-Suite :: python_api/target/TestTargetAPI.py (684 of 1727) PASS: lldb-Unit :: Expression/./ExpressionTests/DiagnosticManagerTest.PutString (685 of 1727) PASS: lldb-Unit :: Editline/./EditlineTests/EditlineTestFixture.EditlineReceivesMultiLineText (686 of 1727) PASS: lldb-Unit :: Process/minidump/./LLDBMinidumpTests/MinidumpParserTest.GetThreadContext_x86_32 (687 of 1727) PASS: LLDB :: Modules/ELF/PT_LOAD-empty.yaml (688 of 1727) PASS: lldb-Unit :: UnwindAssembly/x86/./UnwindAssemblyx86Tests/Testx86AssemblyInspectionEngine.TestPopRBX (689 of 1727) PASS: LLDB :: Breakpoint/debug_rnglist_basic.test (690 of 1727) UNSUPPORTED: LLDB :: SymbolFile/PDB/function-nested-block.test (691 of 1727) PASS: lldb-Unit :: Utility/./UtilityTests/StreamTeeTest.Write (692 of 1727) PASS: lldb-Unit :: Utility/./UtilityTests/OptionsWithRawTest.WhitespaceSuffix (693 of 1727) PASS: lldb-Unit :: UnwindAssembly/x86/./UnwindAssemblyx86Tests/Testx86AssemblyInspectionEngine.TestStackRealignMSVC_i386 (694 of 1727) PASS: LLDB :: Modules/ELF/PT_LOAD.yaml (695 of 1727) PASS: lldb-Unit :: Language/Highlighting/./HighlighterTests/HighlighterTest.FallbackHighlighter (696 of 1727) PASS: lldb-Unit :: Signals/./SignalsTests/UnixSignalsTest.GetFilteredSignals (697 of 1727) PASS: lldb-Suite :: commands/expression/radar_9673664/TestExprHelpExamples.py (698 of 1727) PASS: lldb-Suite :: commands/expression/save_jit_objects/TestSaveJITObjects.py (699 of 1727) PASS: lldb-Suite :: functionalities/thread/thread_specific_break/TestThreadSpecificBreakpoint.py (700 of 1727) PASS: lldb-Suite :: commands/disassemble/basic/TestDisassembleBreakpoint.py (701 of 1727) PASS: lldb-Unit :: Language/Highlighting/./HighlighterTests/HighlighterTest.DefaultHighlighterWithCursorOutOfBounds (702 of 1727) PASS: lldb-Unit :: Utility/./UtilityTests/UUIDTest.StringConverion (703 of 1727) PASS: lldb-Unit :: Utility/./UtilityTests/StringListTest.InsertStringAtIndexStart (704 of 1727) PASS: LLDB :: Driver/TestFile.test (705 of 1727) PASS: lldb-Unit :: Utility/./UtilityTests/AnsiTerminal.Twice (706 of 1727) PASS: lldb-Unit :: Host/./HostTests/MainLoopTest.ReadObject (707 of 1727) PASS: LLDB :: Commands/CommandScriptImmediateOutput/CommandScriptImmediateOutputFile.test (708 of 1727) PASS: LLDB :: Breakpoint/split-dwarf-5-addrbase.test (709 of 1727) PASS: lldb-Suite :: commands/expression/radar_8638051/Test8638051.py (710 of 1727) PASS: lldb-Unit :: Utility/./UtilityTests/StringListTest.LongestCommonPrefix (711 of 1727) PASS: LLDB :: Driver/TestTarget.test (712 of 1727) PASS: lldb-Suite :: functionalities/thread/concurrent_events/TestConcurrentManyBreakpoints.py (713 of 1727) PASS: lldb-Unit :: Utility/./UtilityTests/StringListTest.SplitIntoLinesEmpty (714 of 1727) PASS: lldb-Unit :: ScriptInterpreter/Python/./ScriptInterpreterPythonTests/PythonDataObjectsTest.TestPythonByteArray (715 of 1727) PASS: lldb-Unit :: ScriptInterpreter/Python/./ScriptInterpreterPythonTests/PythonDataObjectsTest.TestPythonIntegerToStr (716 of 1727) PASS: lldb-Suite :: functionalities/source-map/TestTargetSourceMap.py (717 of 1727) PASS: lldb-Suite :: functionalities/tail_call_frames/unambiguous_sequence/TestUnambiguousTailCalls.py (718 of 1727) PASS: lldb-Suite :: types/TestIntegerTypesExpr.py (719 of 1727) PASS: lldb-Unit :: ScriptInterpreter/Python/./ScriptInterpreterPythonTests/PythonDataObjectsTest.TestBorrowedReferences (720 of 1727) PASS: lldb-Unit :: SymbolFile/NativePDB/./SymbolFileNativePDBTests/PDBFPOProgramToDWARFExpressionTests.SingleAssignmentRegisterRef (721 of 1727) PASS: lldb-Suite :: commands/command/history/TestCommandHistory.py (722 of 1727) PASS: lldb-Suite :: functionalities/thread/step_out/TestThreadStepOut.py (723 of 1727) PASS: lldb-Unit :: Utility/./UtilityTests/StringExtractorTest.InitMisc (724 of 1727) PASS: lldb-Unit :: SymbolFile/DWARF/./SymbolFileDWARFTests/SymbolFileDWARFTests.TestAbbrevOutOfOrder (725 of 1727) PASS: lldb-Unit :: Process/gdb-remote/./ProcessGdbRemoteTests/GDBRemoteClientBaseTest.SendPacketAndReceiveResponseWithOutputSupport (726 of 1727) PASS: lldb-Suite :: functionalities/tail_call_frames/thread_step_out_or_return/TestSteppingOutWithArtificialFrames.py (727 of 1727) PASS: lldb-Unit :: Utility/./UtilityTests/UriParserTest.MinimalPortPath (728 of 1727) PASS: lldb-Unit :: SymbolFile/NativePDB/./SymbolFileNativePDBTests/PDBFPOProgramToDWARFExpressionTests.DependencyChain (729 of 1727) PASS: LLDB :: SymbolFile/NativePDB/function-types-calling-conv.cpp (730 of 1727) PASS: lldb-Suite :: lang/objc/modules-inline-functions/TestModulesInlineFunctions.py (731 of 1727) PASS: lldb-Unit :: SymbolFile/NativePDB/./SymbolFileNativePDBTests/PDBFPOProgramToDWARFExpressionTests.UnresolvedRegisterReference (732 of 1727) PASS: LLDB :: Modules/ELF/section-types-edgecases.yaml (733 of 1727) PASS: lldb-Unit :: Process/minidump/./LLDBMinidumpTests/MinidumpParserTest.GetFilteredModuleList (734 of 1727) PASS: lldb-Unit :: ObjectFile/Breakpad/./ObjectFileBreakpadTests/FuncRecord.parse (735 of 1727) PASS: LLDB :: SymbolFile/DWARF/find-function-regex.cpp (736 of 1727) PASS: LLDB :: Modules/PECOFF/export-dllfunc.yaml (737 of 1727) PASS: lldb-Unit :: Utility/./UtilityTests/StringExtractorTest.GetHexU8_Underflow2_NoEof (738 of 1727) PASS: lldb-Unit :: Expression/./ExpressionTests/DWARFExpression.DW_OP_pick (739 of 1727) PASS: lldb-Suite :: commands/watchpoints/watchpoint_disable/TestWatchpointDisable.py (740 of 1727) PASS: lldb-Unit :: ScriptInterpreter/Python/./ScriptInterpreterPythonTests/PythonExceptionStateTest.TestAcquisitionSemantics (741 of 1727) PASS: lldb-Suite :: commands/expression/ir-interpreter-phi-nodes/TestIRInterpreterPHINodes.py (742 of 1727) PASS: lldb-Suite :: python_api/disassemble-raw-data/TestDisassembleRawData.py (743 of 1727) PASS: lldb-Suite :: python_api/lldbutil/process/TestPrintStackTraces.py (744 of 1727) PASS: lldb-Suite :: functionalities/data-formatter/nssetsynth/TestNSSetSynthetic.py (745 of 1727) PASS: lldb-Unit :: Language/Highlighting/./HighlighterTests/HighlighterTest.ClangIdentifiers (746 of 1727) PASS: lldb-Suite :: functionalities/thread/concurrent_events/TestConcurrentSignalBreak.py (747 of 1727) PASS: lldb-Unit :: UnwindAssembly/x86/./UnwindAssemblyx86Tests/Testx86AssemblyInspectionEngine.TestPushExtended (748 of 1727) PASS: lldb-Suite :: lang/cpp/virtual/TestVirtual.py (749 of 1727) PASS: lldb-Unit :: ScriptInterpreter/Python/./ScriptInterpreterPythonTests/PythonDataObjectsTest.TestPythonDictionaryToStructuredDictionary (750 of 1727) PASS: lldb-Suite :: commands/expression/import-std-module/unique_ptr/TestUniquePtr.py (751 of 1727) UNSUPPORTED: LLDB :: SymbolFile/PDB/type-quals.test (752 of 1727) PASS: lldb-Unit :: Core/./LLDBCoreTests/UniqueCStringMap.NoDefaultConstructor (753 of 1727) PASS: LLDB :: Settings/TestSettingsWrite.test (754 of 1727) PASS: lldb-Unit :: Utility/./UtilityTests/ArgsTest.EscapeLLDBCommandArgument (755 of 1727) PASS: lldb-Unit :: UnwindAssembly/x86/./UnwindAssemblyx86Tests/Testx86AssemblyInspectionEngine.TestPush0 (756 of 1727) PASS: lldb-Suite :: tools/lldb-vscode/launch/TestVSCode_launch.py (757 of 1727) PASS: lldb-Suite :: functionalities/tail_call_frames/disambiguate_tail_call_seq/TestDisambiguateTailCallSeq.py (758 of 1727) PASS: lldb-Unit :: Language/Highlighting/./HighlighterTests/HighlighterTest.ClangOperators (759 of 1727) PASS: lldb-Suite :: python_api/breakpoint/TestBreakpointAPI.py (760 of 1727) UNSUPPORTED: LLDB :: SymbolFile/PDB/variables.test (761 of 1727) PASS: lldb-Suite :: functionalities/tail_call_frames/inlining_and_tail_calls/TestInliningAndTailCalls.py (762 of 1727) PASS: lldb-Suite :: functionalities/unwind/sigtramp/TestSigtrampUnwind.py (763 of 1727) PASS: lldb-Suite :: lang/cpp/nsimport/TestCppNsImport.py (764 of 1727) PASS: LLDB :: SymbolFile/DWARF/dir-separator-windows.s (765 of 1727) PASS: lldb-Suite :: functionalities/data-formatter/data-formatter-stl/libcxx/string/TestDataFormatterLibcxxString.py (766 of 1727) PASS: lldb-Suite :: functionalities/tsan/basic/TestTsanBasic.py (767 of 1727) PASS: lldb-Suite :: functionalities/thread/concurrent_events/TestConcurrentTwoWatchpointsOneSignal.py (768 of 1727) PASS: lldb-Unit :: Breakpoint/./LLDBBreakpointTests/BreakpointIDTest.StringIsBreakpointName (769 of 1727) PASS: lldb-Unit :: Utility/./UtilityTests/BinaryStreamTest.PutULEB128EightBytes (770 of 1727) PASS: lldb-Suite :: tools/lldb-server/register-reading/TestGdbRemoteGPacket.py (771 of 1727) PASS: lldb-Unit :: Symbol/./SymbolTests/TestClangASTContext.TestIsClangType (772 of 1727) PASS: lldb-Suite :: lang/objc/objc-foundation-dictionary-empty/TestNSDictionary0.py (773 of 1727) PASS: lldb-Unit :: Utility/./UtilityTests/StringListTest.LongestCommonPrefixSingleElement (774 of 1727) PASS: lldb-Suite :: commands/expression/calculator_mode/TestCalculatorMode.py (775 of 1727) PASS: lldb-Unit :: Utility/./UtilityTests/StreamTest.PutBytesAsRawHex8ToMixedEndian (776 of 1727) PASS: lldb-Suite :: functionalities/inferior-crashing/TestInferiorCrashing.py (777 of 1727) PASS: lldb-Unit :: Expression/./ExpressionTests/DiagnosticManagerTest.AppendMessageAttachToLastDiag (778 of 1727) PASS: lldb-Unit :: UnwindAssembly/x86/./UnwindAssemblyx86Tests/Testx86AssemblyInspectionEngine.Testi386IgnoredRegisters (779 of 1727) PASS: LLDB :: Modules/ELF/section-overlap.yaml (780 of 1727) PASS: lldb-Unit :: Utility/./UtilityTests/RangeTest.ContainsEndInclusive (781 of 1727) PASS: lldb-Suite :: macosx/safe-to-func-call/TestSafeFuncCalls.py (782 of 1727) PASS: lldb-Suite :: functionalities/gdb_remote_client/TestStopPCs.py (783 of 1727) PASS: lldb-Suite :: commands/expression/top-level/TestTopLevelExprs.py (784 of 1727) PASS: lldb-Suite :: functionalities/rerun/TestRerun.py (785 of 1727) PASS: lldb-Unit :: Utility/./UtilityTests/LogChannelTest.Disable (786 of 1727) PASS: LLDB :: SymbolFile/DWARF/debug-types-dwarf5.s (787 of 1727) XFAIL: LLDB :: Unwind/prefer-debug-over-eh-frame.test (788 of 1727) PASS: lldb-Unit :: ScriptInterpreter/Python/./ScriptInterpreterPythonTests/PythonDataObjectsTest.TestOwnedReferences (789 of 1727) PASS: LLDB :: SymbolFile/sizeless-symbol.test (790 of 1727) PASS: lldb-Unit :: ObjectFile/Breakpad/./ObjectFileBreakpadTests/StackCFIRecord.parse (791 of 1727) PASS: lldb-Unit :: Process/gdb-remote/./ProcessGdbRemoteTests/GDBRemoteCommunicationClientTest.TestPacketSpeedJSON (792 of 1727) PASS: lldb-Suite :: functionalities/data-formatter/data-formatter-stl/libcxx/function/TestLibCxxFunction.py (793 of 1727) PASS: lldb-Unit :: Utility/./UtilityTests/StatusTest.ErrorConversion (794 of 1727) PASS: lldb-Unit :: Utility/./UtilityTests/LogChannelTest.List (795 of 1727) PASS: lldb-Unit :: Utility/./UtilityTests/LogTest.LLDB_LOG_nullptr (796 of 1727) PASS: lldb-Unit :: Expression/./ExpressionTests/DiagnosticManagerTest.GetStringBasic (797 of 1727) PASS: lldb-Suite :: tools/lldb-server/libraries-svr4/TestGdbRemoteLibrariesSvr4Support.py (798 of 1727) PASS: lldb-Suite :: functionalities/thread/concurrent_events/TestConcurrentManyCrash.py (799 of 1727) PASS: lldb-Suite :: commands/add-dsym/uuid/TestAddDsymCommand.py (800 of 1727) PASS: lldb-Suite :: functionalities/thread/concurrent_events/TestConcurrentWatchBreakDelay.py (801 of 1727) PASS: lldb-Unit :: Utility/./UtilityTests/StringExtractorTest.GetHexU8_Exact (802 of 1727) PASS: lldb-Unit :: ScriptInterpreter/Python/./ScriptInterpreterPythonTests/PythonDataObjectsTest.TestPythonInteger (803 of 1727) PASS: lldb-Suite :: tools/lldb-server/TestLldbGdbServer.py (804 of 1727) PASS: LLDB :: Breakpoint/split-dwarf5-debug-stroffsets.test (805 of 1727) PASS: lldb-Suite :: functionalities/data-formatter/data-formatter-objc/TestDataFormatterObjCNSDate.py (806 of 1727) PASS: lldb-Suite :: lang/c/shared_lib/TestSharedLib.py (807 of 1727) PASS: lldb-Unit :: Utility/./UtilityTests/ProcessInstanceInfo.DumpTable_invalidUID (808 of 1727) PASS: lldb-Unit :: ScriptInterpreter/Python/./ScriptInterpreterPythonTests/PythonDataObjectsTest.TestPythonListToStructuredList (809 of 1727) PASS: lldb-Suite :: lang/objc/rdar-11355592/TestRdar11355592.py (810 of 1727) PASS: lldb-Unit :: Process/minidump/./LLDBMinidumpTests/MinidumpParserTest.GetMemoryRegionInfoFromMemory64List (811 of 1727) PASS: LLDB :: Minidump/dump-all.test (812 of 1727) PASS: lldb-Suite :: functionalities/breakpoint/source_regexp/TestSourceRegexBreakpoints.py (813 of 1727) PASS: lldb-Suite :: functionalities/tail_call_frames/disambiguate_call_site/TestDisambiguateCallSite.py (814 of 1727) PASS: lldb-Suite :: benchmarks/libcxxlist/TestBenchmarkLibcxxList.py (815 of 1727) PASS: lldb-Suite :: commands/log/basic/TestLogging.py (816 of 1727) PASS: lldb-Suite :: macosx/macabi/TestMacABImacOSFramework.py (817 of 1727) UNSUPPORTED: LLDB :: BuildScript/toolchain-msvc.test (818 of 1727) UNSUPPORTED: LLDB :: SymbolFile/PDB/udt-layout.test (819 of 1727) PASS: LLDB :: SymbolFile/DWARF/dwarf5-index-is-used.cpp (820 of 1727) PASS: lldb-Unit :: Utility/./UtilityTests/UriParserTest.BracketedHostname (821 of 1727) PASS: lldb-Unit :: Utility/./UtilityTests/StructuredDataTest.ParseJSONFromFile (822 of 1727) PASS: lldb-Unit :: UnwindAssembly/x86/./UnwindAssemblyx86Tests/Testx86AssemblyInspectionEngine.Test64bitFramelessSmallStackFrame (823 of 1727) PASS: lldb-Suite :: functionalities/thread/thread_exit/TestThreadExit.py (824 of 1727) PASS: lldb-Unit :: Utility/./UtilityTests/Flags.AllSet (825 of 1727) PASS: lldb-Unit :: Utility/./UtilityTests/StringLexerTest.Peek (826 of 1727) PASS: lldb-Unit :: Utility/./UtilityTests/ArgsTest.ReplaceArgumentAtIndexEqual (827 of 1727) PASS: lldb-Unit :: Utility/./UtilityTests/RangeTest.Copy (828 of 1727) PASS: lldb-Unit :: Utility/./UtilityTests/UserIDResolver.GetUserName (829 of 1727) PASS: lldb-Unit :: Utility/./UtilityTests/StringListTest.JoinThree (830 of 1727) PASS: LLDB :: SymbolFile/DWARF/debug_loc.s (831 of 1727) PASS: lldb-Unit :: ScriptInterpreter/Python/./ScriptInterpreterPythonTests/PythonDataObjectsTest.TestPythonDictionaryValueEquality (832 of 1727) PASS: lldb-Suite :: commands/disassemble/basic/TestFrameDisassemble.py (833 of 1727) PASS: lldb-Unit :: UnwindAssembly/x86/./UnwindAssemblyx86Tests/Testx86AssemblyInspectionEngine.TestDisassemblyJunkBytes (834 of 1727) PASS: lldb-Unit :: Utility/./UtilityTests/DeserializerTest.HasData (835 of 1727) PASS: lldb-Unit :: UnwindAssembly/x86/./UnwindAssemblyx86Tests/Testx86AssemblyInspectionEngine.TestPushR12 (836 of 1727) PASS: LLDB :: Quit/TestQuitExitCodeHexA.test (837 of 1727) PASS: LLDB :: SymbolFile/DWARF/find-method.cpp (838 of 1727) PASS: lldb-Unit :: Process/gdb-remote/./ProcessGdbRemoteTests/GDBRemoteClientBaseTest.SendContinueDelegateStructuredDataReceipt (839 of 1727) PASS: lldb-Suite :: lang/objc/objc-baseclass-sbtype/TestObjCBaseClassSBType.py (840 of 1727) PASS: lldb-Suite :: lang/objc/objc-builtin-types/TestObjCBuiltinTypes.py (841 of 1727) PASS: lldb-Unit :: Utility/./UtilityTests/RegularExpression.Empty (842 of 1727) PASS: lldb-Unit :: Utility/./UtilityTests/StreamTest.PutMaxHex64ByteOrderBig (843 of 1727) PASS: lldb-Suite :: types/TestDoubleTypes.py (844 of 1727) PASS: lldb-Suite :: functionalities/data-formatter/data-formatter-stl/libcxx/tuple/TestDataFormatterLibcxxTuple.py (845 of 1727) PASS: lldb-Unit :: Utility/./UtilityTests/StreamTest.PutULEB128 (846 of 1727) PASS: lldb-Suite :: commands/process/launch-with-shellexpand/TestLaunchWithShellExpand.py (847 of 1727) PASS: lldb-Unit :: Utility/./UtilityTests/FileSpecTest.EqualDotsPosixRoot (848 of 1727) PASS: lldb-Suite :: lang/objcxx/class-name-clash/TestNameClash.py (849 of 1727) PASS: lldb-Suite :: lang/c/stepping/TestStepAndBreakpoints.py (850 of 1727) PASS: lldb-Unit :: ScriptInterpreter/Python/./ScriptInterpreterPythonTests/PythonDataObjectsTest.TestGlobalNameResolutionWithDot (851 of 1727) PASS: lldb-Unit :: Utility/./UtilityTests/StringExtractorTest.GetHexU8_Extra (852 of 1727) PASS: lldb-Unit :: ScriptInterpreter/Python/./ScriptInterpreterPythonTests/PythonDataObjectsTest.TestResetting (853 of 1727) PASS: lldb-Suite :: functionalities/gdb_remote_client/TestWriteMemory.py (854 of 1727) PASS: lldb-Unit :: Utility/./UtilityTests/RangeTest.Clear (855 of 1727) PASS: lldb-Unit :: Utility/./UtilityTests/RangeTest.NotEqualInvalid (856 of 1727) PASS: lldb-Suite :: functionalities/thread/concurrent_events/TestConcurrentWatchBreak.py (857 of 1727) PASS: lldb-Suite :: functionalities/thread/concurrent_events/TestConcurrentSignalDelayBreak.py (858 of 1727) PASS: lldb-Unit :: Utility/./UtilityTests/ArgsTest.TestQuotedTrailingBackslash (859 of 1727) PASS: lldb-Unit :: UnwindAssembly/x86/./UnwindAssemblyx86Tests/Testx86AssemblyInspectionEngine.TestSubESP (860 of 1727) PASS: lldb-Unit :: Process/minidump/./LLDBMinidumpTests/MinidumpParserTest.GetPidWow64 (861 of 1727) PASS: lldb-Unit :: Utility/./UtilityTests/ArgsTest.GetQuotedCommandString (862 of 1727) PASS: LLDB :: Driver/TestProcessAttach.test (863 of 1727) PASS: lldb-Unit :: Utility/./UtilityTests/Predicate.WaitForValueNotEqualTo (864 of 1727) PASS: LLDB :: SymbolFile/DWARF/find-variable-dwo.cpp (865 of 1727) PASS: lldb-Suite :: commands/target/basic/TestTargetCommand.py (866 of 1727) PASS: lldb-Unit :: Utility/./UtilityTests/RegisterValueTest.GetSet8 (867 of 1727) PASS: lldb-Suite :: commands/expression/namespace_local_var_same_name_cpp_and_c/TestNamespaceLocalVarSameNameCppAndC.py (868 of 1727) PASS: lldb-Suite :: lang/c/strings/TestCStrings.py (869 of 1727) PASS: lldb-Suite :: commands/expression/import-std-module/basic/TestImportStdModule.py (870 of 1727) PASS: lldb-Unit :: Utility/./UtilityTests/DataExtractorTest.PeekData (871 of 1727) PASS: lldb-Unit :: Utility/./UtilityTests/BinaryStreamTest.PutSLEB128OneByte (872 of 1727) PASS: lldb-Unit :: Process/minidump/./LLDBMinidumpTests/MinidumpParserTest.GetThreadsAndGetThreadContext (873 of 1727) PASS: lldb-Suite :: benchmarks/expression/TestExpressionCmd.py (874 of 1727) PASS: lldb-Suite :: commands/expression/call-function/TestCallStdStringFunction.py (875 of 1727) PASS: lldb-Suite :: functionalities/data-formatter/data-formatter-stl/libcxx/iterator/TestDataFormatterLibccIterator.py (876 of 1727) PASS: lldb-Suite :: functionalities/inline-stepping/TestInlineStepping.py (877 of 1727) PASS: lldb-Unit :: Host/./HostTests/SocketTest.DomainGetConnectURI (878 of 1727) PASS: lldb-Suite :: functionalities/data-formatter/synthcapping/TestSyntheticCapping.py (879 of 1727) PASS: lldb-Unit :: Utility/./UtilityTests/UserIDResolver.GetGroupName (880 of 1727) PASS: lldb-Suite :: commands/expression/dont_allow_jit/TestAllowJIT.py (881 of 1727) PASS: lldb-Unit :: UnwindAssembly/x86/./UnwindAssemblyx86Tests/Testx86AssemblyInspectionEngine.TestPopR14 (882 of 1727) PASS: lldb-Unit :: Host/./HostTests/SocketTest.UDPGetConnectURI (883 of 1727) PASS: lldb-Unit :: Utility/./UtilityTests/UriParserTest.SchemeHostSeparator2 (884 of 1727) PASS: lldb-Unit :: Utility/./UtilityTests/StreamTest.PutCharNull (885 of 1727) PASS: lldb-Suite :: lang/cpp/llvm-style/TestLLVMStyle.py (886 of 1727) PASS: lldb-Suite :: macosx/add-dsym/TestAddDsymMidExecutionCommand.py (887 of 1727) PASS: lldb-Suite :: functionalities/thread/backtrace_limit/TestBacktraceLimit.py (888 of 1727) PASS: lldb-Unit :: UnwindAssembly/x86/./UnwindAssemblyx86Tests/Testx86AssemblyInspectionEngine.TestPopR15 (889 of 1727) PASS: lldb-Unit :: Utility/./UtilityTests/ScalarTest.CastOperations (890 of 1727) PASS: lldb-Suite :: functionalities/thread/create_after_attach/TestCreateAfterAttach.py (891 of 1727) PASS: lldb-Unit :: Utility/./UtilityTests/BinaryStreamTest.PutSLEB128FiveBytes (892 of 1727) PASS: lldb-Unit :: Utility/./UtilityTests/BinaryStreamTest.PutSLEB128NineBytes (893 of 1727) PASS: lldb-Suite :: macosx/universal/TestUniversal.py (894 of 1727) PASS: lldb-Unit :: Language/Highlighting/./HighlighterTests/HighlighterTest.Colons (895 of 1727) PASS: lldb-Unit :: Utility/./UtilityTests/ProcessInfoTest.Constructor (896 of 1727) PASS: lldb-Suite :: functionalities/breakpoint/auto_continue/TestBreakpointAutoContinue.py (897 of 1727) PASS: lldb-Unit :: Utility/./UtilityTests/StringListTest.InsertStringAtIndexEnd (898 of 1727) PASS: LLDB :: Modules/ELF/PT_LOAD-overlap-section.yaml (899 of 1727) PASS: lldb-Unit :: Symbol/./SymbolTests/TestClangASTContext.TestUnifyAccessSpecifiers (900 of 1727) PASS: LLDB :: SymbolFile/Breakpad/unwind-via-stack-win.test (901 of 1727) PASS: lldb-Suite :: lang/cpp/operators/TestCppOperators.py (902 of 1727) PASS: lldb-Suite :: lang/cpp/static_members/TestCPPStaticMembers.py (903 of 1727) PASS: lldb-Suite :: commands/frame/diagnose/complicated-expression/TestComplicatedExpression.py (904 of 1727) PASS: lldb-Suite :: commands/expression/rdar42038760/TestScalarURem.py (905 of 1727) PASS: lldb-Unit :: Process/gdb-remote/./ProcessGdbRemoteTests/GDBRemoteCommunicationClientTest.SendGetDataPacket (906 of 1727) PASS: lldb-Unit :: Utility/./UtilityTests/StreamTeeTest.GetStreamAtIndexOutOfBounds (907 of 1727) PASS: lldb-Unit :: Utility/./UtilityTests/RangeTest.ContainsAddrInvalid (908 of 1727) PASS: lldb-Unit :: UnwindAssembly/x86/./UnwindAssemblyx86Tests/Testx86AssemblyInspectionEngine.TestDisassemblyMidFunctionEpilogues (909 of 1727) PASS: lldb-Unit :: UnwindAssembly/x86/./UnwindAssemblyx86Tests/Testx86AssemblyInspectionEngine.TestSimplex86_64Augmented (910 of 1727) PASS: lldb-Unit :: Utility/./UtilityTests/OptionsWithRawTest.TerminatedQuote (911 of 1727) PASS: lldb-Suite :: functionalities/thread/concurrent_events/TestConcurrentBreakpointDelayBreakpointOneSignal.py (912 of 1727) PASS: lldb-Suite :: macosx/lc-note/kern-ver-str/TestKernVerStrLCNOTE.py (913 of 1727) PASS: lldb-Unit :: Utility/./UtilityTests/ArgsTest.BareSingleQuote (914 of 1727) PASS: lldb-Unit :: Utility/./UtilityTests/ArgsTest.TestMultipleArgs (915 of 1727) PASS: lldb-Unit :: Symbol/./SymbolTests/LineEntryTest.GetSameLineContiguousAddressRangeNoInlines (916 of 1727) PASS: lldb-Suite :: functionalities/inferior-crashing/recursive-inferior/TestRecursiveInferior.py (917 of 1727) PASS: lldb-Suite :: functionalities/data-formatter/setvaluefromcstring/TestSetValueFromCString.py (918 of 1727) PASS: lldb-Unit :: Utility/./UtilityTests/UriParserTest.MinimalPort (919 of 1727) PASS: lldb-Unit :: ObjectFile/Breakpad/./ObjectFileBreakpadTests/InfoRecord.parse (920 of 1727) PASS: lldb-Unit :: Utility/./UtilityTests/StreamTest.ShiftOperatorPtr (921 of 1727) PASS: lldb-Unit :: Expression/./ExpressionTests/DiagnosticManagerTest.AddDiagnostic (922 of 1727) PASS: lldb-Unit :: Process/minidump/./LLDBMinidumpTests/RegisterContextMinidump.ConvertMinidumpContext_x86_64 (923 of 1727) PASS: LLDB :: SymbolFile/DWARF/debug-names-compressed.cpp (924 of 1727) PASS: lldb-Suite :: commands/statistics/basic/TestStats.py (925 of 1727) PASS: lldb-Unit :: Host/./HostTests/NativeProcessProtocolTest.ReadCStringFromMemory_MaxSize (926 of 1727) PASS: lldb-Unit :: Utility/./UtilityTests/ScalarTest.SetValueFromCString (927 of 1727) PASS: lldb-Suite :: lang/cpp/const_this/TestConstThis.py (928 of 1727) PASS: LLDB :: Reproducer/Functionalities/TestDataFormatter.test (929 of 1727) PASS: lldb-Suite :: python_api/interpreter/TestRunCommandInterpreterAPI.py (930 of 1727) PASS: lldb-Suite :: lang/cpp/limit-debug-info/TestWithLimitDebugInfo.py (931 of 1727) PASS: lldb-Suite :: lang/c/stepping/TestThreadStepping.py (932 of 1727) PASS: lldb-Suite :: api/multithreaded/TestMultithreaded.py (933 of 1727) PASS: lldb-Unit :: tools/lldb-server/tests/./LLDBServerTests/TestBase.LaunchModePreservesEnvironment (934 of 1727) PASS: lldb-Unit :: Utility/./UtilityTests/RangeTest.LessThan (935 of 1727) PASS: lldb-Suite :: commands/expression/import-std-module/list-dbg-info-content/TestDbgInfoContentList.py (936 of 1727) PASS: LLDB :: SymbolFile/Breakpad/symtab-macho.test (937 of 1727) PASS: lldb-Suite :: benchmarks/expression/TestRepeatedExprs.py (938 of 1727) PASS: lldb-Suite :: python_api/watchpoint/TestSetWatchpoint.py (939 of 1727) PASS: lldb-Suite :: functionalities/data-formatter/synthupdate/TestSyntheticFilterRecompute.py (940 of 1727) PASS: lldb-Suite :: commands/expression/inline-namespace/TestInlineNamespace.py (941 of 1727) PASS: lldb-Unit :: Process/gdb-remote/./ProcessGdbRemoteTests/GDBRemoteCommunicationServerTest.SendErrorResponse_UnimplementedError (942 of 1727) PASS: lldb-Unit :: Utility/./UtilityTests/NameMatchesTest.Equals (943 of 1727) PASS: lldb-Suite :: functionalities/thread/thread_specific_break_plus_condition/TestThreadSpecificBpPlusCondition.py (944 of 1727) PASS: LLDB :: SymbolFile/DWARF/childless-compile-unit.s (945 of 1727) PASS: lldb-Suite :: python_api/hello_world/TestHelloWorld.py (946 of 1727) PASS: lldb-Unit :: Utility/./UtilityTests/ArgsTest.TestArgv (947 of 1727) PASS: lldb-Unit :: Process/minidump/./LLDBMinidumpTests/MinidumpParserTest.FindMemoryRange (948 of 1727) PASS: lldb-Suite :: functionalities/gdb_remote_client/TestTargetXMLArch.py (949 of 1727) XFAIL: LLDB :: Register/x86-64-write.test (950 of 1727) PASS: lldb-Suite :: functionalities/tail_call_frames/thread_step_out_message/TestArtificialFrameStepOutMessage.py (951 of 1727) PASS: LLDB :: Modules/MachO/lc_build_version.yaml (952 of 1727) PASS: lldb-Suite :: lang/cpp/namespace/TestNamespace.py (953 of 1727) PASS: LLDB :: SymbolFile/NativePDB/disassembly.cpp (954 of 1727) PASS: lldb-Suite :: tools/lldb-server/TestGdbRemoteRegisterState.py (955 of 1727) PASS: lldb-Suite :: functionalities/gdb_remote_client/TestThreadSelectionBug.py (956 of 1727) PASS: lldb-Suite :: functionalities/darwin_log/basic/TestDarwinLogBasic.py (957 of 1727) PASS: lldb-Unit :: Utility/./UtilityTests/SerializationRountripTest.SerializeDeserializeCString (958 of 1727) PASS: lldb-Suite :: lang/c/conflicting-symbol/TestConflictingSymbol.py (959 of 1727) PASS: lldb-Suite :: lang/objc/ptr_refs/TestPtrRefsObjC.py (960 of 1727) PASS: lldb-Suite :: commands/command/nested_alias/TestNestedAlias.py (961 of 1727) PASS: lldb-Unit :: Utility/./UtilityTests/StatusTest.ErrorConstructor (962 of 1727) PASS: lldb-Suite :: functionalities/backticks/TestBackticksWithoutATarget.py (963 of 1727) PASS: lldb-Suite :: commands/expression/import-std-module/shared_ptr-dbg-info-content/TestSharedPtrDbgInfoContent.py (964 of 1727) PASS: lldb-Unit :: Utility/./UtilityTests/LogTest.Register (965 of 1727) PASS: LLDB :: Commands/CommandScriptImmediateOutput/CommandScriptImmediateOutputConsole.test (966 of 1727) PASS: lldb-Unit :: Utility/./UtilityTests/StringExtractorTest.GetHexBytesAvail_OddPair2 (967 of 1727) PASS: LLDB :: SymbolFile/DWARF/compilercontext.ll (968 of 1727) PASS: lldb-Unit :: Utility/./UtilityTests/FileSpecTest.IsRelative (969 of 1727) PASS: lldb-Suite :: functionalities/thread/break_after_join/TestBreakAfterJoin.py (970 of 1727) PASS: lldb-Suite :: python_api/sbtype_typeclass/TestSBTypeTypeClass.py (971 of 1727) PASS: lldb-Suite :: functionalities/show_location/TestShowLocationDwarf5.py (972 of 1727) PASS: lldb-Suite :: functionalities/memory/find/TestMemoryFind.py (973 of 1727) PASS: lldb-Suite :: commands/watchpoints/hello_watchpoint/TestMyFirstWatchpoint.py (974 of 1727) PASS: lldb-Unit :: Host/./HostTests/ConnectionFileDescriptorTest.TCPGetURIv4 (975 of 1727) PASS: LLDB :: Breakpoint/single-file-split-dwarf.test (976 of 1727) PASS: lldb-Unit :: ScriptInterpreter/Python/./ScriptInterpreterPythonTests/PythonDataObjectsTest.TestInstanceNameResolutionNoDot (977 of 1727) PASS: lldb-Unit :: UnwindAssembly/x86/./UnwindAssemblyx86Tests/Testx86AssemblyInspectionEngine.Test64bitFramelessBigStackFrame (978 of 1727) PASS: LLDB :: Process/TestEnvironment.test (979 of 1727) PASS: LLDB :: SymbolFile/DWARF/debug_ranges-missing-section.s (980 of 1727) PASS: lldb-Suite :: python_api/lldbutil/TestSwigVersion.py (981 of 1727) PASS: lldb-Suite :: commands/frame/diagnose/dereference-argument/TestDiagnoseDereferenceArgument.py (982 of 1727) PASS: lldb-Unit :: Expression/./ExpressionTests/ClangHostTest.MacOSX (983 of 1727) PASS: lldb-Suite :: commands/expression/call-restarts/TestCallThatRestarts.py (984 of 1727) PASS: lldb-Unit :: Utility/./UtilityTests/StringListTest.JoinMultiCharSeparator (985 of 1727) PASS: lldb-Unit :: Utility/./UtilityTests/JSONTest.Dictionary (986 of 1727) PASS: lldb-Unit :: Utility/./UtilityTests/StreamTest.ShiftOperatorStrings (987 of 1727) PASS: lldb-Suite :: commands/expression/namespace_local_var_same_name_obj_c/TestNamespaceLocalVarSameNameObjC.py (988 of 1727) PASS: lldb-Suite :: commands/expression/po_verbosity/TestPoVerbosity.py (989 of 1727) PASS: lldb-Unit :: Utility/./UtilityTests/Flags.AnySet (990 of 1727) PASS: lldb-Unit :: Utility/./UtilityTests/ScalarTest.Division (991 of 1727) PASS: lldb-Suite :: functionalities/darwin_log/filter/regex/message/TestDarwinLogFilterRegexMessage.py (992 of 1727) PASS: lldb-Suite :: functionalities/breakpoint/breakpoint_options/TestBreakpointOptions.py (993 of 1727) PASS: lldb-Unit :: SymbolFile/NativePDB/./SymbolFileNativePDBTests/PDBFPOProgramToDWARFExpressionTests.UnsupportedRASearch (994 of 1727) PASS: lldb-Unit :: Host/./HostTests/FileSystemTest.GetByteSize (995 of 1727) PASS: lldb-Suite :: functionalities/darwin_log/source/debug/TestDarwinLogSourceDebug.py (996 of 1727) PASS: lldb-Suite :: functionalities/data-formatter/frameformat_smallstruct/TestFrameFormatSmallStruct.py (997 of 1727) UNSUPPORTED: LLDB :: Register/x86-gp-write.test (998 of 1727) PASS: lldb-Unit :: UnwindAssembly/x86/./UnwindAssemblyx86Tests/Testx86AssemblyInspectionEngine.TestReturnDetect (999 of 1727) PASS: lldb-Suite :: functionalities/load_using_paths/TestLoadUsingPaths.py (1000 of 1727) PASS: lldb-Suite :: lang/objc/objc-struct-return/TestObjCStructReturn.py (1001 of 1727) PASS: LLDB :: Quit/TestQuitExitCodeNonInt.test (1002 of 1727) PASS: LLDB :: ExecControl/StopHook/stop-hook.test (1003 of 1727) PASS: lldb-Suite :: functionalities/unwind/noreturn/TestNoreturnUnwind.py (1004 of 1727) PASS: lldb-Unit :: Utility/./UtilityTests/LogTest.Unregister (1005 of 1727) PASS: lldb-Suite :: functionalities/data-formatter/data-formatter-objc/TestDataFormatterObjCKVO.py (1006 of 1727) PASS: lldb-Suite :: macosx/function-starts/TestFunctionStarts.py (1007 of 1727) PASS: LLDB :: Modules/PECOFF/subsections.yaml (1008 of 1727) PASS: lldb-Unit :: Utility/./UtilityTests/BinaryStreamTest.PutSLEB128ThreeBytes (1009 of 1727) UNSUPPORTED: LLDB :: SymbolFile/PDB/func-symbols.test (1010 of 1727) PASS: lldb-Unit :: Utility/./UtilityTests/UriParserTest.SchemeHostSeparator4 (1011 of 1727) PASS: LLDB :: SymbolFile/NativePDB/bitfields.cpp (1012 of 1727) PASS: lldb-Suite :: functionalities/data-formatter/data-formatter-stl/libstdcpp/list/TestDataFormatterStdList.py (1013 of 1727) PASS: lldb-Suite :: functionalities/archives/TestBSDArchives.py (1014 of 1727) PASS: lldb-Unit :: Utility/./UtilityTests/StringExtractorTest.GetHexU8_InvalidHex (1015 of 1727) PASS: lldb-Unit :: ScriptInterpreter/Python/./ScriptInterpreterPythonTests/PythonDataObjectsTest.TestPythonBoolean (1016 of 1727) PASS: lldb-Suite :: functionalities/data-formatter/data-formatter-stl/libcxx/vbool/TestDataFormatterLibcxxVBool.py (1017 of 1727) PASS: lldb-Suite :: lang/cpp/lambdas/TestLambdas.py (1018 of 1727) PASS: lldb-Suite :: commands/platform/basic/TestPlatformPython.py (1019 of 1727) PASS: lldb-Unit :: Process/gdb-remote/./ProcessGdbRemoteTests/GDBRemoteClientBaseTest.SendContinueAndAsyncPacket (1020 of 1727) PASS: lldb-Unit :: Utility/./UtilityTests/UUIDTest.SetFromStringRef (1021 of 1727) PASS: lldb-Suite :: lang/cpp/offsetof/TestOffsetofCpp.py (1022 of 1727) PASS: lldb-Unit :: Utility/./UtilityTests/RangeTest.ContainsEndInclusiveInvalid (1023 of 1727) PASS: lldb-Unit :: Utility/./UtilityTests/StringListTest.SetSize (1024 of 1727) PASS: lldb-Unit :: Utility/./UtilityTests/ArchSpecTest.MergeFrom (1025 of 1727) PASS: lldb-Unit :: Utility/./UtilityTests/RecordReplayTest.InstrumentedFooSameThis (1026 of 1727) PASS: lldb-Unit :: Utility/./UtilityTests/StringListTest.CopyListEmpty (1027 of 1727) PASS: lldb-Unit :: Utility/./UtilityTests/Predicate.WaitForValueEqualTo (1028 of 1727) PASS: lldb-Unit :: ScriptInterpreter/Python/./ScriptInterpreterPythonTests/PythonDataObjectsTest.TestPythonIntegerToStructuredInteger (1029 of 1727) PASS: lldb-Suite :: lang/objc/variadic_methods/TestVariadicMethods.py (1030 of 1727) PASS: lldb-Unit :: Utility/./UtilityTests/StreamTest.QuotedCString (1031 of 1727) PASS: lldb-Unit :: Utility/./UtilityTests/UriParserTest.TypicalPortPath (1032 of 1727) PASS: lldb-Unit :: Host/./HostTests/NativeProcessProtocolTest.ReadMemoryWithoutTrap (1033 of 1727) PASS: lldb-Suite :: functionalities/thread/jump/TestThreadJump.py (1034 of 1727) PASS: lldb-Suite :: lang/cpp/template/TestTemplateArgs.py (1035 of 1727) PASS: LLDB :: Register/x86-64-read.test (1036 of 1727) PASS: lldb-Unit :: Utility/./UtilityTests/RangeTest.NotEqual (1037 of 1727) PASS: lldb-Suite :: python_api/watchpoint/TestWatchpointIter.py (1038 of 1727) PASS: lldb-Unit :: Utility/./UtilityTests/SerializationRountripTest.SerializeDeserializePod (1039 of 1727) PASS: LLDB :: SymbolFile/NativePDB/source-list.cpp (1040 of 1727) PASS: lldb-Unit :: SymbolFile/NativePDB/./SymbolFileNativePDBTests/PDBFPOProgramToDWARFExpressionTests.MultipleIndependentAssignments (1041 of 1727) PASS: lldb-Suite :: lang/cpp/overloaded-functions/TestOverloadedFunctions.py (1042 of 1727) PASS: lldb-Suite :: commands/frame/diagnose/inheritance/TestDiagnoseInheritance.py (1043 of 1727) PASS: lldb-Unit :: Utility/./UtilityTests/StreamTest.PutStringAsRawHex8 (1044 of 1727) PASS: lldb-Unit :: ScriptInterpreter/Python/./ScriptInterpreterPythonTests/PythonExceptionStateTest.TestResetSemantics (1045 of 1727) PASS: lldb-Unit :: Utility/./UtilityTests/StringListTest.AppendStringMove (1046 of 1727) PASS: lldb-Unit :: Utility/./UtilityTests/StringExtractorTest.DecodeHexU8_Extra (1047 of 1727) PASS: lldb-Unit :: Utility/./UtilityTests/StringLexerTest.PutBack (1048 of 1727) PASS: lldb-Unit :: Process/minidump/./LLDBMinidumpTests/MinidumpParserTest.MinidumpDuplicateModuleMinAddress (1049 of 1727) PASS: lldb-Suite :: python_api/findvalue_duplist/TestSBFrameFindValue.py (1050 of 1727) PASS: lldb-Suite :: commands/expression/timeout/TestCallWithTimeout.py (1051 of 1727) PASS: lldb-Unit :: Process/minidump/./LLDBMinidumpTests/MinidumpParserTest.GetLinuxProcStatus_no_stream (1052 of 1727) PASS: lldb-Unit :: Utility/./UtilityTests/ArgsTest.GetArgumentArrayRef (1053 of 1727) PASS: lldb-Unit :: Utility/./UtilityTests/StreamTest.ChangingByteOrder (1054 of 1727) PASS: lldb-Suite :: python_api/sbstructureddata/TestStructuredDataAPI.py (1055 of 1727) PASS: LLDB :: SymbolFile/NativePDB/ast-methods.cpp (1056 of 1727) PASS: lldb-Suite :: lang/objc/objc-new-syntax/TestObjCNewSyntaxArray.py (1057 of 1727) PASS: lldb-Unit :: Utility/./UtilityTests/StringListTest.Join (1058 of 1727) PASS: lldb-Suite :: functionalities/data-formatter/data-formatter-stl/libstdcpp/map/TestDataFormatterStdMap.py (1059 of 1727) PASS: lldb-Suite :: terminal/TestSTTYBeforeAndAfter.py (1060 of 1727) PASS: lldb-Suite :: python_api/objc_type/TestObjCType.py (1061 of 1727) PASS: lldb-Suite :: commands/expression/completion-crash1/TestCompletionCrash1.py (1062 of 1727) PASS: lldb-Suite :: commands/expression/import-std-module/shared_ptr/TestSharedPtr.py (1063 of 1727) UNSUPPORTED: LLDB :: SymbolFile/PDB/variables-locations.test (1064 of 1727) PASS: lldb-Unit :: Utility/./UtilityTests/StreamTest.PutHex16ByteOrderBig (1065 of 1727) PASS: lldb-Suite :: functionalities/postmortem/minidump-new/TestMiniDumpUUID.py (1066 of 1727) PASS: lldb-Suite :: lang/objc/self/TestObjCSelf.py (1067 of 1727) PASS: lldb-Unit :: Utility/./UtilityTests/ArchSpecTest.TestParseMachCPUDashSubtypeTripleSimple (1068 of 1727) PASS: lldb-Suite :: commands/expression/pr35310/TestExprsBug35310.py (1069 of 1727) PASS: LLDB :: Settings/TestEchoCommands.test (1070 of 1727) PASS: lldb-Unit :: Language/Highlighting/./HighlighterTests/HighlighterTest.ClangScalarLiterals (1071 of 1727) PASS: lldb-Suite :: tools/lldb-server/commandline/TestStubReverseConnect.py (1072 of 1727) PASS: lldb-Unit :: Utility/./UtilityTests/AnsiTerminal.KnownPrefix (1073 of 1727) PASS: lldb-Unit :: Utility/./UtilityTests/ArgsTest.DoubleQuotedItem (1074 of 1727) PASS: lldb-Suite :: functionalities/data-formatter/data-formatter-stl/libcxx/set/TestDataFormatterLibcxxSet.py (1075 of 1727) PASS: lldb-Unit :: Expression/./ExpressionTests/ClangHostTest.ComputeClangResourceDirectory (1076 of 1727) PASS: lldb-Suite :: python_api/value/linked_list/TestValueAPILinkedList.py (1077 of 1727) PASS: lldb-Unit :: Utility/./UtilityTests/BinaryStreamTest.PutULEB128Zero (1078 of 1727) PASS: lldb-Unit :: UnwindAssembly/x86/./UnwindAssemblyx86Tests/Testx86AssemblyInspectionEngine.TestPushEBX (1079 of 1727) PASS: lldb-Unit :: UnwindAssembly/x86/./UnwindAssemblyx86Tests/Testx86AssemblyInspectionEngine.TestPushR14 (1080 of 1727) PASS: lldb-Unit :: Core/./LLDBCoreTests/StreamCallbackTest.Callback (1081 of 1727) UNSUPPORTED: LLDB :: Register/x86-64-xmm16-read.test (1082 of 1727) PASS: LLDB :: Breakpoint/case-sensitive.test (1083 of 1727) PASS: lldb-Suite :: functionalities/data-formatter/typedef_array/TestTypedefArray.py (1084 of 1727) PASS: lldb-Suite :: lang/cpp/diamond/TestDiamond.py (1085 of 1727) PASS: lldb-Unit :: Utility/./UtilityTests/AnsiTerminal.Empty (1086 of 1727) PASS: lldb-Suite :: commands/expression/scoped_enums/TestScopedEnumType.py (1087 of 1727) PASS: lldb-Unit :: Utility/./UtilityTests/StreamTest.PutHex64ByteOrderBig (1088 of 1727) PASS: lldb-Suite :: lang/c/typedef/Testtypedef.py (1089 of 1727) PASS: lldb-Suite :: functionalities/data-formatter/nsarraysynth/TestNSArraySynthetic.py (1090 of 1727) PASS: lldb-Suite :: functionalities/data-formatter/data-formatter-stl/libcxx/unordered/TestDataFormatterUnordered.py (1091 of 1727) PASS: lldb-Unit :: Host/./HostTests/FileSystemTest.Exists (1092 of 1727) PASS: LLDB :: SymbolFile/NativePDB/ast-functions.cpp (1093 of 1727) PASS: lldb-Suite :: commands/command/script/TestCommandScript.py (1094 of 1727) PASS: lldb-Suite :: commands/reproducer/invalid-args/TestInvalidArgsReproducer.py (1095 of 1727) PASS: lldb-Suite :: python_api/value/change_values/TestChangeValueAPI.py (1096 of 1727) PASS: lldb-Unit :: Utility/./UtilityTests/CompletionRequest.DuplicateFiltering (1097 of 1727) PASS: lldb-Suite :: commands/expression/unicode-in-variable/TestUnicodeInVariable.py (1098 of 1727) PASS: lldb-Suite :: python_api/function_symbol/TestDisasmAPI.py (1099 of 1727) PASS: lldb-Suite :: lang/objc/foundation/TestSymbolTable.py (1100 of 1727) PASS: lldb-Suite :: functionalities/data-formatter/data-formatter-objc/nsindexpath/TestDataFormatterNSIndexPath.py (1101 of 1727) PASS: lldb-Unit :: Utility/./UtilityTests/UUIDTest.RelationalOperators (1102 of 1727) PASS: lldb-Unit :: UnwindAssembly/x86/./UnwindAssemblyx86Tests/Testx86AssemblyInspectionEngine.TestSimple32bitFrameFunction (1103 of 1727) PASS: lldb-Suite :: macosx/duplicate-archive-members/TestDuplicateMembers.py (1104 of 1727) PASS: lldb-Suite :: lang/objc/orderedset/TestOrderedSet.py (1105 of 1727) PASS: lldb-Unit :: Utility/./UtilityTests/LogChannelEnabledTest.LLDB_LOG_ERROR (1106 of 1727) PASS: LLDB :: Unwind/trap_frame_sym_ctx.test (1107 of 1727) PASS: lldb-Suite :: lang/cpp/modules-import/TestCXXModulesImport.py (1108 of 1727) PASS: LLDB :: Breakpoint/jitbp_elf.test (1109 of 1727) PASS: lldb-Suite :: commands/frame/var/TestFrameVar.py (1110 of 1727) PASS: lldb-Suite :: commands/expression/import-std-module/sysroot/TestStdModuleSysroot.py (1111 of 1727) PASS: lldb-Suite :: functionalities/postmortem/minidump/TestMiniDump.py (1112 of 1727) PASS: LLDB :: SymbolFile/NativePDB/function-types-classes.cpp (1113 of 1727) PASS: lldb-Unit :: Utility/./UtilityTests/ConstStringTest.CompareConstString (1114 of 1727) PASS: lldb-Unit :: UnwindAssembly/x86/./UnwindAssemblyx86Tests/Testx86AssemblyInspectionEngine.TestSimple64bitFrameFunction (1115 of 1727) PASS: lldb-Suite :: types/TestDoubleTypesExpr.py (1116 of 1727) PASS: lldb-Suite :: python_api/debugger/TestDebuggerAPI.py (1117 of 1727) PASS: LLDB :: Settings/TestStopCommandSourceOnError.test (1118 of 1727) PASS: lldb-Unit :: Host/./HostTests/MainLoopTest.DetectsEOF (1119 of 1727) PASS: lldb-Suite :: lang/c/enum_types/TestEnumTypes.py (1120 of 1727) PASS: lldb-Suite :: functionalities/thread/concurrent_events/TestConcurrentCrashWithBreak.py (1121 of 1727) PASS: lldb-Suite :: python_api/process/read-mem-cstring/TestReadMemCString.py (1122 of 1727) PASS: LLDB :: Modules/Breakpad/breakpad-identification.test (1123 of 1727) PASS: LLDB :: Modules/ELF/netbsd-core-amd64.test (1124 of 1727) PASS: lldb-Suite :: lang/cpp/std-function-step-into-callable/TestStdFunctionStepIntoCallable.py (1125 of 1727) PASS: lldb-Unit :: Utility/./UtilityTests/OptionsWithRawTest.SingleWordSuffix (1126 of 1727) PASS: lldb-Suite :: lang/cpp/global_operators/TestCppGlobalOperators.py (1127 of 1727) PASS: lldb-Suite :: commands/frame/diagnose/dereference-function-return/TestDiagnoseDereferenceFunctionReturn.py (1128 of 1727) PASS: lldb-Unit :: Language/Highlighting/./HighlighterTests/HighlighterTest.ClangComments (1129 of 1727) PASS: lldb-Suite :: commands/expression/expr-in-syscall/TestExpressionInSyscall.py (1130 of 1727) PASS: lldb-Unit :: Expression/./ExpressionTests/DiagnosticManagerTest.HasFixits (1131 of 1727) PASS: lldb-Suite :: commands/settings/quoting/TestQuoting.py (1132 of 1727) PASS: lldb-Unit :: Utility/./UtilityTests/EventTest.DumpEventDataBytes (1133 of 1727) PASS: lldb-Suite :: commands/expression/macros/TestMacros.py (1134 of 1727) PASS: lldb-Unit :: Language/Highlighting/./HighlighterTests/HighlighterTest.ClangCursorPosEndOfLine (1135 of 1727) PASS: lldb-Unit :: Utility/./UtilityTests/EnvironmentTest.EnvpConstruction (1136 of 1727) PASS: lldb-Suite :: functionalities/inferior-changed/TestInferiorChanged.py (1137 of 1727) PASS: lldb-Suite :: functionalities/thread/exit_during_break/TestExitDuringBreak.py (1138 of 1727) PASS: lldb-Suite :: functionalities/data-formatter/data-formatter-stl/libcxx/multimap/TestDataFormatterLibccMultiMap.py (1139 of 1727) PASS: lldb-Suite :: commands/expression/completion-crash2/TestCompletionCrash2.py (1140 of 1727) PASS: lldb-Unit :: Utility/./UtilityTests/StreamTest.PutMaxHex64ByteOrderLittle (1141 of 1727) PASS: lldb-Suite :: functionalities/ptr_refs/TestPtrRefs.py (1142 of 1727) PASS: lldb-Suite :: python_api/frame/inlines/TestInlinedFrame.py (1143 of 1727) PASS: lldb-Suite :: commands/frame/diagnose/array/TestArray.py (1144 of 1727) PASS: LLDB :: SymbolFile/DWARF/dir-separator-no-comp-dir.s (1145 of 1727) PASS: lldb-Unit :: Utility/./UtilityTests/StreamTeeTest.SetStreamAtIndexOverwrite (1146 of 1727) PASS: lldb-Unit :: Utility/./UtilityTests/RangeDataVector.FindEntryThatContains (1147 of 1727) PASS: lldb-Suite :: functionalities/data-formatter/data-formatter-stl/libstdcpp/vbool/TestDataFormatterStdVBool.py (1148 of 1727) PASS: lldb-Unit :: Utility/./UtilityTests/StringExtractorTest.GetHexBytes (1149 of 1727) PASS: lldb-Unit :: Symbol/./SymbolTests/TestClangASTContext.TestConvertAccessTypeToAccessSpecifier (1150 of 1727) UNSUPPORTED: LLDB :: Process/Windows/exception_access_violation.cpp (1151 of 1727) PASS: lldb-Suite :: commands/expression/call-function/TestCallUserDefinedFunction.py (1152 of 1727) PASS: lldb-Unit :: Utility/./UtilityTests/LogChannelEnabledTest.LogThread (1153 of 1727) PASS: LLDB :: SymbolFile/DWARF/find-basic-function.cpp (1154 of 1727) PASS: LLDB :: Quit/TestQuitExitCodeTooManyArgs.test (1155 of 1727) PASS: lldb-Suite :: functionalities/data-formatter/data-formatter-stl/libstdcpp/string/TestDataFormatterStdString.py (1156 of 1727) PASS: lldb-Suite :: lang/c/forward/TestForwardDeclaration.py (1157 of 1727) PASS: lldb-Suite :: commands/watchpoints/watchpoint_commands/command/TestWatchpointCommandPython.py (1158 of 1727) PASS: lldb-Unit :: Utility/./UtilityTests/StringExtractorTest.GetHexBytesAvail_Underflow (1159 of 1727) PASS: lldb-Suite :: tools/lldb-server/TestGdbRemoteProcessInfo.py (1160 of 1727) PASS: lldb-Unit :: Core/./LLDBCoreTests/RichManglingContextTest.SwitchProvider (1161 of 1727) PASS: lldb-Suite :: python_api/formatters/TestFormattersSBAPI.py (1162 of 1727) PASS: lldb-Unit :: Utility/./UtilityTests/ProcessInstanceInfo.Dump (1163 of 1727) PASS: lldb-Suite :: python_api/symbol-context/two-files/TestSymbolContextTwoFiles.py (1164 of 1727) PASS: lldb-Suite :: functionalities/thread/concurrent_events/TestConcurrentManyWatchpoints.py (1165 of 1727) PASS: lldb-Unit :: Utility/./UtilityTests/StringListTest.ForRange (1166 of 1727) PASS: lldb-Unit :: Symbol/./SymbolTests/TestClangASTContext.TemplateArguments (1167 of 1727) PASS: lldb-Unit :: Utility/./UtilityTests/UriParserTest.LongPath (1168 of 1727) PASS: lldb-Suite :: commands/expression/context-object-objc/TestContextObjectObjc.py (1169 of 1727) PASS: lldb-Unit :: Symbol/./SymbolTests/DWARFCallFrameInfoTest.Basic_dwarf4 (1170 of 1727) PASS: lldb-Unit :: Utility/./UtilityTests/StringListTest.GetMaxStringLengthMixed (1171 of 1727) PASS: lldb-Unit :: Utility/./UtilityTests/StringExtractorTest.GetHexBytesAvail (1172 of 1727) PASS: lldb-Suite :: lang/cpp/namespace_conflicts/TestNamespaceConflicts.py (1173 of 1727) PASS: lldb-Suite :: commands/apropos/basic/TestApropos.py (1174 of 1727) PASS: lldb-Suite :: functionalities/data-formatter/data-formatter-objc/TestDataFormatterObjCPlain.py (1175 of 1727) PASS: lldb-Suite :: lang/objc/objc-runtime-ivars/TestRuntimeIvars.py (1176 of 1727) PASS: LLDB :: Modules/PECOFF/uuid.yaml (1177 of 1727) PASS: lldb-Unit :: Utility/./UtilityTests/StringListTest.ShiftMove (1178 of 1727) PASS: lldb-Suite :: commands/platform/basic/TestPlatformCommand.py (1179 of 1727) PASS: lldb-Suite :: functionalities/abbreviation/TestAbbreviations.py (1180 of 1727) PASS: lldb-Suite :: functionalities/tsan/thread_numbers/TestTsanThreadNumbers.py (1181 of 1727) PASS: lldb-Suite :: lang/cpp/dynamic-value/TestCppValueCast.py (1182 of 1727) UNSUPPORTED: LLDB :: Register/x86-zmm-write.test (1183 of 1727) PASS: lldb-Unit :: UnwindAssembly/x86/./UnwindAssemblyx86Tests/Testx86AssemblyInspectionEngine.TestPushEDX (1184 of 1727) PASS: lldb-Unit :: Utility/./UtilityTests/LogChannelEnabledTest.log_options (1185 of 1727) PASS: lldb-Suite :: functionalities/thread/concurrent_events/TestConcurrentSignalWatch.py (1186 of 1727) PASS: LLDB :: Driver/TestConvenienceVariables.test (1187 of 1727) PASS: lldb-Unit :: Utility/./UtilityTests/RegularExpression.Valid (1188 of 1727) PASS: lldb-Unit :: Utility/./UtilityTests/RecordReplayTest.InstrumentedFoo (1189 of 1727) PASS: lldb-Unit :: Utility/./UtilityTests/RangeTest.ContainsAddr (1190 of 1727) PASS: lldb-Unit :: Utility/./UtilityTests/StringListTest.LongestCommonPrefixDuplicateElement (1191 of 1727) PASS: lldb-Suite :: functionalities/thread/concurrent_events/TestConcurrentCrashWithWatchpointBreakpointSignal.py (1192 of 1727) PASS: lldb-Unit :: UnwindAssembly/x86/./UnwindAssemblyx86Tests/Testx86AssemblyInspectionEngine.TestPushR15 (1193 of 1727) PASS: lldb-Unit :: Symbol/./SymbolTests/PostfixExpression.ParseOneExpression (1194 of 1727) PASS: lldb-Unit :: Utility/./UtilityTests/OptionsWithRawTest.QuotedSuffix (1195 of 1727) PASS: LLDB :: SymbolFile/NativePDB/globals-fundamental.cpp (1196 of 1727) PASS: lldb-Unit :: Utility/./UtilityTests/StreamTest.PutHex8 (1197 of 1727) PASS: lldb-Suite :: commands/frame/language/TestGuessLanguage.py (1198 of 1727) PASS: lldb-Suite :: commands/quit/TestQuit.py (1199 of 1727) PASS: lldb-Suite :: lang/cpp/char1632_t/TestChar1632T.py (1200 of 1727) PASS: lldb-Unit :: Target/./TargetTests/PathMappingListTest.RelativeTests (1201 of 1727) PASS: lldb-Unit :: Utility/./UtilityTests/StringListTest.AppendStringStdString (1202 of 1727) PASS: lldb-Unit :: Utility/./UtilityTests/AnsiTerminal.Unknown (1203 of 1727) PASS: lldb-Suite :: tools/lldb-vscode/attach/TestVSCode_attach.py (1204 of 1727) PASS: lldb-Unit :: Host/./HostTests/FileSystemTest.Readable (1205 of 1727) PASS: lldb-Suite :: functionalities/data-formatter/data-formatter-stl/libstdcpp/iterator/TestDataFormatterStdIterator.py (1206 of 1727) PASS: lldb-Unit :: Utility/./UtilityTests/StreamTeeTest.Constructor2Streams (1207 of 1727) PASS: lldb-Unit :: Utility/./UtilityTests/ArgsTest.ReplaceArgumentAtIndexFarOutOfRange (1208 of 1727) PASS: lldb-Unit :: UnwindAssembly/x86/./UnwindAssemblyx86Tests/Testx86AssemblyInspectionEngine.Test32BitOnlyInstruction (1209 of 1727) PASS: lldb-Suite :: functionalities/process_save_core/TestProcessSaveCore.py (1210 of 1727) PASS: lldb-Unit :: Symbol/./SymbolTests/DWARFCallFrameInfoTest.Basic_eh (1211 of 1727) PASS: lldb-Unit :: Process/gdb-remote/./ProcessGdbRemoteTests/GDBRemoteCommunicationServerTest.SendErrorResponse_ErrorNumber (1212 of 1727) PASS: LLDB :: Modules/ELF/compressed-sections.yaml (1213 of 1727) PASS: lldb-Unit :: Utility/./UtilityTests/ConstStringTest.CompareStringRef (1214 of 1727) PASS: lldb-Unit :: Utility/./UtilityTests/StreamTeeTest.Assignment (1215 of 1727) PASS: lldb-Unit :: UnwindAssembly/x86/./UnwindAssemblyx86Tests/Testx86AssemblyInspectionEngine.TestPopRBPWithREX (1216 of 1727) PASS: lldb-Suite :: commands/breakpoint/basic/TestBreakpointCommand.py (1217 of 1727) PASS: lldb-Suite :: lang/c/bitfields/TestBitfields.py (1218 of 1727) PASS: lldb-Suite :: functionalities/thread/concurrent_events/TestConcurrentTwoBreakpointThreads.py (1219 of 1727) PASS: lldb-Suite :: lang/objc/objc-static-method-stripped/TestObjCStaticMethodStripped.py (1220 of 1727) PASS: lldb-Unit :: Language/Highlighting/./HighlighterTests/HighlighterTest.DefaultHighlighterWithCursor (1221 of 1727) PASS: lldb-Unit :: Utility/./UtilityTests/BinaryStreamTest.PutSLEB128Zero (1222 of 1727) PASS: lldb-Unit :: Process/gdb-remote/./ProcessGdbRemoteTests/GDBRemoteCommunicationClientTest.GetModulesInfo (1223 of 1727) PASS: lldb-Unit :: ScriptInterpreter/Python/./ScriptInterpreterPythonTests/PythonExceptionStateTest.TestDiscardSemantics (1224 of 1727) PASS: lldb-Suite :: lang/objcxx/objcxx-ivar-vector/TestIvarVector.py (1225 of 1727) PASS: lldb-Unit :: Utility/./UtilityTests/FileSpecTest.EqualSeparator (1226 of 1727) PASS: lldb-Suite :: functionalities/thread/concurrent_events/TestConcurrentDelaySignalBreak.py (1227 of 1727) PASS: lldb-Suite :: functionalities/data-formatter/boolreference/TestFormattersBoolRefPtr.py (1228 of 1727) PASS: lldb-Unit :: Utility/./UtilityTests/ArgsTest.TestTrailingBackslash (1229 of 1727) PASS: lldb-Suite :: functionalities/data-formatter/data-formatter-stl/libcxx/variant/TestDataFormatterLibcxxVariant.py (1230 of 1727) PASS: lldb-Suite :: lang/objc/objc-new-syntax/TestObjCNewSyntaxDictionary.py (1231 of 1727) PASS: lldb-Unit :: Utility/./UtilityTests/StringListTest.Clear (1232 of 1727) PASS: lldb-Suite :: lang/cpp/function-template-parameter-pack/TestFunctionTemplateParameterPack.py (1233 of 1727) PASS: lldb-Suite :: python_api/watchpoint/watchlocation/TestSetWatchlocation.py (1234 of 1727) PASS: lldb-Suite :: lang/cpp/extern_c/TestExternCSymbols.py (1235 of 1727) PASS: lldb-Unit :: Utility/./UtilityTests/StreamTest.PutPtr (1236 of 1727) PASS: lldb-Suite :: lang/objc/conflicting-definition/TestConflictingDefinition.py (1237 of 1727) PASS: LLDB :: Modules/MachO/subsections.yaml (1238 of 1727) PASS: lldb-Unit :: Utility/./UtilityTests/ArchSpecTest.TripleComponentsWereSpecified (1239 of 1727) PASS: lldb-Unit :: UnwindAssembly/x86/./UnwindAssemblyx86Tests/Testx86AssemblyInspectionEngine.TestPopR13 (1240 of 1727) PASS: lldb-Suite :: functionalities/data-formatter/data-formatter-objc/TestDataFormatterObjCNSData.py (1241 of 1727) PASS: LLDB :: Expr/TestTypeOfDeclTypeExpr.test (1242 of 1727) PASS: lldb-Suite :: functionalities/data-formatter/data-formatter-stl/libcxx/forward_list/TestDataFormatterLibcxxForwardList.py (1243 of 1727) PASS: lldb-Suite :: functionalities/breakpoint/serialize/TestBreakpointSerialization.py (1244 of 1727) PASS: lldb-Unit :: Utility/./UtilityTests/StreamTeeTest.AppendStream (1245 of 1727) XFAIL: LLDB :: Register/x86-mm-xmm-write.test (1246 of 1727) PASS: lldb-Unit :: Host/./HostTests/ProcessLaunchInfoTest.Constructor (1247 of 1727) PASS: lldb-Suite :: commands/expression/persistent_types/TestNestedPersistentTypes.py (1248 of 1727) PASS: lldb-Suite :: python_api/disassemble-raw-data/TestDisassemble_VST1_64.py (1249 of 1727) PASS: lldb-Suite :: lang/objcxx/cxx-bridged-po/TestObjCXXBridgedPO.py (1250 of 1727) PASS: lldb-Unit :: Utility/./UtilityTests/BinaryStreamTest.PutSLEB128FourBytes (1251 of 1727) PASS: lldb-Suite :: commands/expression/import-std-module/queue/TestQueue.py (1252 of 1727) PASS: lldb-Suite :: lang/cpp/unique-types/TestUniqueTypes.py (1253 of 1727) PASS: lldb-Suite :: functionalities/breakpoint/breakpoint_ids/TestBreakpointIDs.py (1254 of 1727) PASS: LLDB :: SymbolFile/Breakpad/line-table-discontinuous-file-ids.test (1255 of 1727) PASS: lldb-Suite :: arm/emulation/TestEmulations.py (1256 of 1727) UNSUPPORTED: LLDB :: Register/x86-ymm-read.test (1257 of 1727) PASS: lldb-Unit :: UnwindAssembly/x86/./UnwindAssemblyx86Tests/Testx86AssemblyInspectionEngine.TestPushRBP (1258 of 1727) PASS: lldb-Suite :: commands/watchpoints/variable_out_of_scope/TestWatchedVarHitWhenInScope.py (1259 of 1727) PASS: LLDB :: SymbolFile/DWARF/debug-types-signature-loop.s (1260 of 1727) PASS: lldb-Unit :: Utility/./UtilityTests/StreamTest.PutBytesAsRawHex8ToBigEndian (1261 of 1727) PASS: lldb-Unit :: Target/./TargetTests/PathMappingListTest.RemapRoot (1262 of 1727) PASS: lldb-Suite :: functionalities/breakpoint/breakpoint_command/TestBreakpointCommand.py (1263 of 1727) PASS: lldb-Unit :: Process/minidump/./LLDBMinidumpTests/MinidumpParserTest.GetLinuxProcStatus (1264 of 1727) PASS: lldb-Unit :: Host/./HostTests/NativeProcessProtocolTest.SetBreakpointFailRead (1265 of 1727) PASS: lldb-Suite :: lang/cpp/bool/TestCPPBool.py (1266 of 1727) PASS: lldb-Unit :: Process/gdb-remote/./ProcessGdbRemoteTests/GDBRemoteCommunicationServerTest.SendErrorResponse_ErrorList (1267 of 1727) PASS: lldb-Suite :: functionalities/data-formatter/var-in-aggregate-misuse/TestVarInAggregateMisuse.py (1268 of 1727) PASS: lldb-Suite :: functionalities/data-formatter/type_summary_list_arg/TestTypeSummaryListArg.py (1269 of 1727) PASS: lldb-Suite :: functionalities/unwind/standard/TestStandardUnwind.py (1270 of 1727) PASS: lldb-Suite :: functionalities/data-formatter/data-formatter-objc/TestDataFormatterObjCNSContainer.py (1271 of 1727) PASS: lldb-Suite :: macosx/thread-names/TestInterruptThreadNames.py (1272 of 1727) PASS: lldb-Unit :: Language/CPlusPlus/./LanguageCPlusPlusTests/CPlusPlusLanguage.CPlusPlusNameParser (1273 of 1727) PASS: lldb-Suite :: commands/register/register/register_command/TestRegisters.py (1274 of 1727) PASS: LLDB :: Modules/ELF/section-permissions.yaml (1275 of 1727) PASS: LLDB :: SymbolFile/Breakpad/unwind-via-stack-cfi.test (1276 of 1727) PASS: lldb-Suite :: lang/cpp/thread_local/TestThreadLocal.py (1277 of 1727) PASS: lldb-Suite :: functionalities/pre_run_dylibs/TestPreRunDylibs.py (1278 of 1727) PASS: lldb-Suite :: commands/expression/import-std-module/no-std-module/TestMissingStdModule.py (1279 of 1727) PASS: lldb-Unit :: ScriptInterpreter/Python/./ScriptInterpreterPythonTests/PythonDataObjectsTest.TestObjectAttributes (1280 of 1727) PASS: lldb-Unit :: Utility/./UtilityTests/ScalarTest.GetBytes (1281 of 1727) PASS: lldb-Suite :: functionalities/deleted-executable/TestDeletedExecutable.py (1282 of 1727) PASS: lldb-Unit :: Utility/./UtilityTests/GeneratorTest.Create (1283 of 1727) PASS: lldb-Suite :: functionalities/thread/concurrent_events/TestConcurrentSignalDelayWatch.py (1284 of 1727) PASS: lldb-Suite :: python_api/lldbutil/frame/TestFrameUtils.py (1285 of 1727) PASS: lldb-Suite :: arm/breakpoint-it/TestBreakpointIt.py (1286 of 1727) PASS: lldb-Unit :: Utility/./UtilityTests/StringListTest.RemoveBlankLines (1287 of 1727) PASS: lldb-Suite :: functionalities/data-formatter/data-formatter-stl/libstdcpp/vector/TestDataFormatterStdVector.py (1288 of 1727) PASS: LLDB :: Driver/TestSingleQuote.test (1289 of 1727) PASS: lldb-Suite :: lang/cpp/this/TestCPPThis.py (1290 of 1727) PASS: lldb-Suite :: functionalities/abbreviation/TestCommonShortSpellings.py (1291 of 1727) PASS: LLDB :: Minidump/fb-dump.test (1292 of 1727) PASS: lldb-Suite :: lang/cpp/dynamic-value/TestDynamicValue.py (1293 of 1727) PASS: lldb-Unit :: Utility/./UtilityTests/BinaryStreamTest.PutULEB128One (1294 of 1727) PASS: lldb-Unit :: UnwindAssembly/x86/./UnwindAssemblyx86Tests/Testx86AssemblyInspectionEngine.TestSpillRegToStackViaMOVx86_64 (1295 of 1727) PASS: lldb-Suite :: tools/lldb-server/inferior-crash/TestGdbRemoteAbort.py (1296 of 1727) PASS: lldb-Suite :: functionalities/thread/exit_during_step/TestExitDuringStep.py (1297 of 1727) PASS: lldb-Unit :: Utility/./UtilityTests/ScalarTest.ComparisonFloat (1298 of 1727) PASS: lldb-Suite :: commands/expression/test/TestExprs2.py (1299 of 1727) PASS: LLDB :: Breakpoint/implicit_const_form_support.test (1300 of 1727) PASS: LLDB :: SymbolFile/DWARF/debug_ranges_and_rnglists.test (1301 of 1727) PASS: lldb-Suite :: lang/objc/forward-decl/TestForwardDecl.py (1302 of 1727) PASS: lldb-Suite :: functionalities/thread/concurrent_events/TestConcurrentWatchpointDelayWatchpointOneBreakpoint.py (1303 of 1727) PASS: lldb-Unit :: Utility/./UtilityTests/VMRange.ContainsAddr (1304 of 1727) PASS: lldb-Suite :: lang/objc/objc++/TestObjCXX.py (1305 of 1727) PASS: lldb-Suite :: commands/expression/import-std-module/vector-dbg-info-content/TestDbgInfoContentVector.py (1306 of 1727) PASS: LLDB :: Driver/TestCore.test (1307 of 1727) PASS: lldb-Suite :: functionalities/signal/handle-segv/TestHandleSegv.py (1308 of 1727) PASS: lldb-Suite :: lang/objc/modules-auto-import/TestModulesAutoImport.py (1309 of 1727) PASS: lldb-Unit :: Host/./HostTests/FileSystemTest.EnumerateDirectory (1310 of 1727) PASS: lldb-Suite :: functionalities/memory/cache/TestMemoryCache.py (1311 of 1727) PASS: LLDB :: Watchpoint/SetErrorCases.test (1312 of 1727) PASS: lldb-Suite :: functionalities/tsan/thread_leak/TestTsanThreadLeak.py (1313 of 1727) PASS: lldb-Unit :: Utility/./UtilityTests/StringListTest.AppendList (1314 of 1727) PASS: lldb-Suite :: functionalities/data-formatter/pyobjsynthprovider/TestPyObjSynthProvider.py (1315 of 1727) PASS: lldb-Suite :: arm/breakpoint-thumb-codesection/TestBreakpointThumbCodesection.py (1316 of 1727) PASS: lldb-Unit :: Utility/./UtilityTests/BinaryStreamTest.PutULEB128SixBytes (1317 of 1727) PASS: lldb-Unit :: Process/minidump/./LLDBMinidumpTests/MinidumpParserTest.GetExceptionStream (1318 of 1727) PASS: lldb-Unit :: ScriptInterpreter/Python/./ScriptInterpreterPythonTests/PythonExceptionStateTest.TestExceptionStateChecking (1319 of 1727) PASS: LLDB :: SymbolFile/DWARF/find-variable-file.cpp (1320 of 1727) PASS: lldb-Unit :: SymbolFile/DWARF/./SymbolFileDWARFTests/SymbolFileDWARFTests.TestAbbrevMissingTerminator (1321 of 1727) PASS: lldb-Unit :: Utility/./UtilityTests/FileSpecTest.GetNormalizedPath (1322 of 1727) PASS: LLDB :: Quit/TestQuitExitCode30.test (1323 of 1727) PASS: lldb-Unit :: Utility/./UtilityTests/LogChannelEnabledTest.LogGetLogThread (1324 of 1727) PASS: lldb-Unit :: Utility/./UtilityTests/StringListTest.LongestCommonPrefixEmpty (1325 of 1727) PASS: lldb-Suite :: tools/lldb-server/TestGdbRemoteSingleStep.py (1326 of 1727) PASS: lldb-Unit :: Utility/./UtilityTests/StringExtractorTest.GetHexBytes_FullString (1327 of 1727) PASS: lldb-Suite :: commands/expression/call-throws/TestCallThatThrows.py (1328 of 1727) PASS: lldb-Unit :: Utility/./UtilityTests/BinaryStreamTest.PutULEB128NineBytes (1329 of 1727) PASS: lldb-Suite :: functionalities/breakpoint/step_over_breakpoint/TestStepOverBreakpoint.py (1330 of 1727) PASS: lldb-Suite :: python_api/rdar-12481949/Test-rdar-12481949.py (1331 of 1727) PASS: lldb-Unit :: debugserver/./debugserverTests/RNBSocket.LoopBackListenIPv4 (1332 of 1727) PASS: LLDB :: SymbolFile/NativePDB/break-by-function.cpp (1333 of 1727) PASS: lldb-Unit :: Utility/./UtilityTests/StringListTest.CopyList (1334 of 1727) PASS: lldb-Unit :: Language/Highlighting/./HighlighterTests/HighlighterTest.ClangCursorPosInOtherToken (1335 of 1727) PASS: lldb-Unit :: Symbol/./SymbolTests/TestClangASTContext.TestGetBasicTypeFromEnum (1336 of 1727) PASS: lldb-Unit :: Utility/./UtilityTests/StringExtractorTest.GetHexBytes_Underflow (1337 of 1727) PASS: lldb-Suite :: functionalities/float-display/TestFloatDisplay.py (1338 of 1727) PASS: lldb-Suite :: functionalities/darwin_log/filter/exact_match/category/TestDarwinLogFilterMatchCategory.py (1339 of 1727) PASS: lldb-Unit :: Utility/./UtilityTests/ScalarTest.Equality (1340 of 1727) PASS: lldb-Suite :: functionalities/thread/num_threads/TestNumThreads.py (1341 of 1727) PASS: lldb-Unit :: Language/Highlighting/./HighlighterTests/HighlighterTest.ClangCursorPosAfterOtherToken (1342 of 1727) PASS: lldb-Unit :: Utility/./UtilityTests/NameMatchesTest.Ignore (1343 of 1727) PASS: lldb-Unit :: Symbol/./SymbolTests/TestClangASTContext.TestGetBasicTypeFromName (1344 of 1727) PASS: lldb-Unit :: SymbolFile/NativePDB/./SymbolFileNativePDBTests/PDBFPOProgramToDWARFExpressionTests.UnresolvedCyclicRegisterAssignmentReference (1345 of 1727) PASS: lldb-Suite :: functionalities/breakpoint/consecutive_breakpoints/TestConsecutiveBreakpoints.py (1346 of 1727) PASS: lldb-Suite :: functionalities/tail_call_frames/disambiguate_paths_to_common_sink/TestDisambiguatePathsToCommonSink.py (1347 of 1727) PASS: lldb-Suite :: functionalities/breakpoint/breakpoint_names/TestBreakpointNames.py (1348 of 1727) PASS: lldb-Suite :: functionalities/thread/concurrent_events/TestConcurrentTwoWatchpointThreads.py (1349 of 1727) PASS: lldb-Unit :: Utility/./UtilityTests/Flags.Test (1350 of 1727) UNSUPPORTED: LLDB :: Unwind/eh-frame-small-fde.test (1351 of 1727) PASS: LLDB :: Settings/TestDisassemblyFormat.test (1352 of 1727) PASS: lldb-Unit :: Utility/./UtilityTests/Flags.IsClear (1353 of 1727) PASS: lldb-Suite :: functionalities/data-formatter/data-formatter-enum-format/TestDataFormatterEnumFormat.py (1354 of 1727) PASS: LLDB :: Modules/ELF/duplicate-section.yaml (1355 of 1727) PASS: lldb-Suite :: functionalities/wrong_commands/TestWrongCommands.py (1356 of 1727) PASS: lldb-Suite :: lang/cpp/stl/TestSTL.py (1357 of 1727) PASS: lldb-Suite :: functionalities/thread/step_until/TestStepUntil.py (1358 of 1727) PASS: lldb-Unit :: UnwindAssembly/x86/./UnwindAssemblyx86Tests/Testx86AssemblyInspectionEngine.TestAddRSP (1359 of 1727) PASS: lldb-Suite :: tools/lldb-vscode/breakpoint/TestVSCode_setFunctionBreakpoints.py (1360 of 1727) PASS: lldb-Suite :: commands/expression/persist_objc_pointeetype/TestPersistObjCPointeeType.py (1361 of 1727) PASS: lldb-Suite :: functionalities/postmortem/elf-core/gcore/TestGCore.py (1362 of 1727) PASS: LLDB :: SymbolFile/DWARF/array-sizes.s (1363 of 1727) PASS: lldb-Unit :: SymbolFile/DWARF/./SymbolFileDWARFTests/DWARFASTParserClangTests.TestGetDIEForDeclContextReturnsOnlyMatchingEntries (1364 of 1727) PASS: lldb-Suite :: functionalities/data-formatter/nsdictionarysynth/TestNSDictionarySynthetic.py (1365 of 1727) PASS: lldb-Suite :: functionalities/data-formatter/data-formatter-objc/nsstring/TestDataFormatterNSString.py (1366 of 1727) PASS: lldb-Unit :: Utility/./UtilityTests/RecordReplayTest.InstrumentedBarPtr (1367 of 1727) PASS: lldb-Unit :: Utility/./UtilityTests/StringListTest.LongestCommonPrefixNoPrefix (1368 of 1727) PASS: lldb-Suite :: python_api/module_section/TestModuleAndSection.py (1369 of 1727) PASS: lldb-Suite :: lang/cpp/unsigned_types/TestUnsignedTypes.py (1370 of 1727) PASS: lldb-Suite :: lang/objc/hidden-ivars/TestHiddenIvars.py (1371 of 1727) PASS: lldb-Unit :: Utility/./UtilityTests/RangeTest.ContainsRange (1372 of 1727) PASS: lldb-Suite :: python_api/file_handle/TestFileHandle.py (1373 of 1727) PASS: lldb-Unit :: Host/./HostTests/ConnectionFileDescriptorTest.TCPGetURIv6 (1374 of 1727) XFAIL: LLDB :: SymbolFile/DWARF/find-type-in-function.cpp (1375 of 1727) PASS: lldb-Unit :: Utility/./UtilityTests/ArgsTest.TestAppendArg (1376 of 1727) PASS: lldb-Suite :: lang/objc/objc-static-method/TestObjCStaticMethod.py (1377 of 1727) PASS: LLDB :: SymbolFile/DWARF/find-qualified-variable.cpp (1378 of 1727) PASS: LLDB :: SymbolFile/DWARF/find-basic-variable.cpp (1379 of 1727) PASS: LLDB :: Settings/TestFrameFormatColor.test (1380 of 1727) PASS: lldb-Unit :: Process/gdb-remote/./ProcessGdbRemoteTests/GDBRemoteCommunicationClientTest.SendStopTracePacket (1381 of 1727) PASS: lldb-Suite :: commands/expression/context-object/TestContextObject.py (1382 of 1727) PASS: lldb-Suite :: commands/frame/recognizer/TestFrameRecognizer.py (1383 of 1727) PASS: lldb-Unit :: UnwindAssembly/x86/./UnwindAssemblyx86Tests/Testx86AssemblyInspectionEngine.Test32bitFramelessBigStackFrame (1384 of 1727) PASS: lldb-Unit :: Utility/./UtilityTests/StringLexerTest.GetUnlexed (1385 of 1727) PASS: lldb-Suite :: lang/cpp/inlines/TestInlines.py (1386 of 1727) PASS: lldb-Suite :: functionalities/longjmp/TestLongjmp.py (1387 of 1727) PASS: LLDB :: Expr/TestMultilineExpr.test (1388 of 1727) PASS: lldb-Unit :: Language/Highlighting/./HighlighterTests/HighlighterTest.ClangEmptyInput (1389 of 1727) PASS: LLDB :: SymbolFile/DWARF/dwarf5_locations.s (1390 of 1727) PASS: LLDB :: SymbolFile/DWARF/debug-types-address-ranges.s (1391 of 1727) PASS: lldb-Suite :: commands/expression/completion/TestExprCompletion.py (1392 of 1727) UNSUPPORTED: LLDB :: Register/x86-gp-read.test (1393 of 1727) PASS: lldb-Suite :: lang/objc/objc-stepping/TestObjCStepping.py (1394 of 1727) PASS: lldb-Suite :: functionalities/data-formatter/data-formatter-stl/libcxx/initializerlist/TestInitializerList.py (1395 of 1727) UNSUPPORTED: LLDB :: SymbolFile/PDB/pointers.test (1396 of 1727) PASS: lldb-Unit :: Utility/./UtilityTests/StringExtractorTest.GetHexBytes_OddPair (1397 of 1727) PASS: lldb-Unit :: Utility/./UtilityTests/RangeTest.SizeTypes (1398 of 1727) PASS: lldb-Suite :: functionalities/gdb_remote_client/TestRestartBug.py (1399 of 1727) PASS: lldb-Suite :: lang/c/vla/TestVLA.py (1400 of 1727) PASS: lldb-Unit :: ScriptInterpreter/Python/./ScriptInterpreterPythonTests/PythonDataObjectsTest.TestPythonTupleInitializerList (1401 of 1727) PASS: lldb-Suite :: functionalities/data-formatter/data-formatter-objc/TestDataFormatterObjCNSError.py (1402 of 1727) PASS: lldb-Unit :: Expression/./ExpressionTests/DiagnosticManagerTest.PutStringMultiple (1403 of 1727) PASS: lldb-Unit :: Language/Highlighting/./HighlighterTests/HighlighterTest.HighlighterSelectionType (1404 of 1727) PASS: lldb-Suite :: functionalities/postmortem/netbsd-core/TestNetBSDCore.py (1405 of 1727) PASS: lldb-Suite :: commands/expression/dollar-in-variable/TestDollarInVariable.py (1406 of 1727) PASS: LLDB :: Reproducer/TestReuseDirectory.test (1407 of 1727) PASS: lldb-Suite :: functionalities/breakpoint/breakpoint_conditions/TestBreakpointConditions.py (1408 of 1727) PASS: lldb-Unit :: Symbol/./SymbolTests/TestClangASTContext.TestRemoveFastQualifiers (1409 of 1727) PASS: lldb-Suite :: functionalities/breakpoint/inlined_breakpoints/TestInlinedBreakpoints.py (1410 of 1727) PASS: lldb-Suite :: commands/settings/TestSettings.py (1411 of 1727) PASS: lldb-Unit :: UnwindAssembly/x86/./UnwindAssemblyx86Tests/Testx86AssemblyInspectionEngine.TestPushRBPWithREX (1412 of 1727) PASS: lldb-Unit :: Utility/./UtilityTests/RangeTest.EqualInvalid (1413 of 1727) PASS: lldb-Unit :: Utility/./UtilityTests/OptionsWithRawTest.LeadingSpaceArgs (1414 of 1727) PASS: lldb-Unit :: Utility/./UtilityTests/ScalarTest.ExtractBitfield (1415 of 1727) PASS: LLDB :: Modules/ELF/PT_LOAD-overlap-PT_TLS.yaml (1416 of 1727) PASS: LLDB :: SymbolFile/NativePDB/nested-types.cpp (1417 of 1727) PASS: lldb-Unit :: Utility/./UtilityTests/NameMatchesTest.StartsWith (1418 of 1727) PASS: lldb-Unit :: ScriptInterpreter/Python/./ScriptInterpreterPythonTests/PythonDataObjectsTest.TestPythonListValueEquality (1419 of 1727) PASS: lldb-Unit :: Language/Highlighting/./HighlighterTests/HighlighterTest.ClangCursorOutOfBounds (1420 of 1727) PASS: lldb-Suite :: functionalities/data-formatter/data-formatter-skip-summary/TestDataFormatterSkipSummary.py (1421 of 1727) PASS: lldb-Suite :: commands/command/script/import/TestImport.py (1422 of 1727) PASS: lldb-Unit :: Utility/./UtilityTests/Flags.Clear (1423 of 1727) PASS: lldb-Unit :: Process/minidump/./LLDBMinidumpTests/MinidumpParserTest.GetArchitectureWindows (1424 of 1727) PASS: lldb-Suite :: lang/objc/modules-cache/TestClangModulesCache.py (1425 of 1727) PASS: lldb-Suite :: functionalities/plugins/python_os_plugin/TestPythonOSPlugin.py (1426 of 1727) PASS: LLDB :: Modules/ELF/short-build-id.yaml (1427 of 1727) PASS: lldb-Suite :: functionalities/object-file/TestImageListMultiArchitecture.py (1428 of 1727) PASS: lldb-Unit :: Utility/./UtilityTests/RangeTest.Equal (1429 of 1727) PASS: lldb-Unit :: Process/gdb-remote/./ProcessGdbRemoteTests/GDBRemoteCommunicationClientTest.SyncThreadState (1430 of 1727) PASS: lldb-Unit :: Process/gdb-remote/./ProcessGdbRemoteTests/GDBRemoteCommunicationTest.ReadPacket_checksum (1431 of 1727) PASS: lldb-Unit :: Symbol/./SymbolTests/Type.GetTypeScopeAndBasename (1432 of 1727) PASS: lldb-Suite :: lang/mixed/TestMixedLanguages.py (1433 of 1727) PASS: LLDB :: Reproducer/TestSynchronous.test (1434 of 1727) PASS: LLDB :: Driver/TestRepl.test (1435 of 1727) UNSUPPORTED: LLDB :: BuildScript/toolchain-clang-cl.test (1436 of 1727) PASS: lldb-Suite :: lang/c/array_types/TestArrayTypes.py (1437 of 1727) PASS: lldb-Unit :: tools/lldb-server/tests/./LLDBServerTests/StandardStartupTest.TestStopReplyContainsThreadPcs (1438 of 1727) PASS: lldb-Unit :: Utility/./UtilityTests/GeneratorTest.Get (1439 of 1727) PASS: lldb-Suite :: commands/expression/import-std-module/vector-of-vectors/TestVectorOfVectors.py (1440 of 1727) PASS: lldb-Unit :: Process/gdb-remote/./ProcessGdbRemoteTests/GDBRemoteCommunicationClientTest.WriteRegister (1441 of 1727) PASS: lldb-Suite :: functionalities/breakpoint/address_breakpoints/TestBadAddressBreakpoints.py (1442 of 1727) PASS: lldb-Suite :: functionalities/thread/concurrent_events/TestConcurrentCrashWithWatchpoint.py (1443 of 1727) PASS: lldb-Suite :: python_api/value/TestValueAPI.py (1444 of 1727) PASS: lldb-Suite :: commands/expression/unwind_expression/TestUnwindExpression.py (1445 of 1727) PASS: lldb-Unit :: ScriptInterpreter/Python/./ScriptInterpreterPythonTests/PythonExceptionStateTest.TestAutoRestoreSemantics (1446 of 1727) PASS: LLDB :: SymbolFile/DWARF/debug-types-line-tables.s (1447 of 1727) PASS: lldb-Unit :: Utility/./UtilityTests/CompletionRequest.DuplicateFilteringWithComments (1448 of 1727) PASS: lldb-Suite :: functionalities/data-formatter/data-formatter-proper-plurals/TestFormattersOneIsSingular.py (1449 of 1727) PASS: LLDB :: Settings/TestFrameFormatNoColor.test (1450 of 1727) PASS: lldb-Suite :: lang/objc/foundation/TestObjCMethodsNSError.py (1451 of 1727) PASS: lldb-Unit :: Expression/./ExpressionTests/DWARFExpression.DW_OP_convert (1452 of 1727) PASS: lldb-Suite :: tools/lldb-server/thread-name/TestGdbRemoteThreadName.py (1453 of 1727) PASS: lldb-Suite :: commands/watchpoints/step_over_watchpoint/TestStepOverWatchpoint.py (1454 of 1727) PASS: lldb-Suite :: lang/c/blocks/TestBlocks.py (1455 of 1727) PASS: lldb-Suite :: linux/sepdebugsymlink/TestTargetSymbolsSepDebugSymlink.py (1456 of 1727) PASS: lldb-Unit :: Interpreter/./InterpreterTests/OptionArgParserTest.toScriptLanguage (1457 of 1727) PASS: lldb-Suite :: lang/cpp/unicode-literals/TestUnicodeLiterals.py (1458 of 1727) PASS: lldb-Suite :: commands/expression/import-std-module/deque-dbg-info-content/TestDbgInfoContentDeque.py (1459 of 1727) PASS: lldb-Unit :: UnwindAssembly/x86/./UnwindAssemblyx86Tests/Testx86AssemblyInspectionEngine.TestMovRSPtoRBP (1460 of 1727) PASS: lldb-Unit :: Host/./HostTests/FileSystemTest.Resolve (1461 of 1727) PASS: lldb-Unit :: Utility/./UtilityTests/DataExtractorTest.GetBitfield (1462 of 1727) PASS: lldb-Unit :: Utility/./UtilityTests/BinaryStreamTest.PutSLEB128SevenBytes (1463 of 1727) PASS: LLDB :: SymbolFile/DWARF/dir-separator-posix.s (1464 of 1727) PASS: lldb-Unit :: Symbol/./SymbolTests/TestClangASTContext.TestBuiltinTypeForEncodingAndBitSize (1465 of 1727) PASS: lldb-Suite :: commands/expression/persistent_types/TestPersistentTypes.py (1466 of 1727) PASS: LLDB :: SymbolFile/Breakpad/line-table.test (1467 of 1727) PASS: lldb-Unit :: Process/minidump/./LLDBMinidumpTests/MinidumpParserTest.GetPidWindows (1468 of 1727) PASS: lldb-Unit :: Language/Highlighting/./HighlighterTests/HighlighterTest.ClangUnterminatedString (1469 of 1727) PASS: lldb-Unit :: Utility/./UtilityTests/ArgsTest.TestSingleArg (1470 of 1727) PASS: lldb-Suite :: functionalities/data-formatter/data-formatter-categories/TestDataFormatterCategories.py (1471 of 1727) PASS: lldb-Suite :: lang/objc/foundation/TestObjCMethods2.py (1472 of 1727) PASS: lldb-Suite :: commands/expression/vector_of_enums/TestVectorOfEnums.py (1473 of 1727) PASS: lldb-Unit :: Utility/./UtilityTests/StreamTest.ShiftOperatorChars (1474 of 1727) PASS: lldb-Suite :: linux/builtin_trap/TestBuiltinTrap.py (1475 of 1727) PASS: lldb-Suite :: lang/objc/objc-optimized/TestObjcOptimized.py (1476 of 1727) PASS: lldb-Suite :: functionalities/data-formatter/language_category_updates/TestDataFormatterLanguageCategoryUpdates.py (1477 of 1727) PASS: lldb-Suite :: tools/lldb-server/platform-process-connect/TestPlatformProcessConnect.py (1478 of 1727) UNSUPPORTED: LLDB :: SymbolFile/PDB/vbases.test (1479 of 1727) PASS: lldb-Unit :: Host/./HostTests/SocketTest.TCPListen0GetPort (1480 of 1727) PASS: lldb-Suite :: lang/cpp/breakpoint_in_member_func_w_non_primitive_params/TestBreakpointInMemberFuncWNonPrimitiveParams.py (1481 of 1727) PASS: lldb-Unit :: Utility/./UtilityTests/ConstStringTest.FromMidOfBufferStringRef (1482 of 1727) PASS: lldb-Suite :: functionalities/breakpoint/breakpoint_in_delayslot/TestAvoidBreakpointInDelaySlot.py (1483 of 1727) PASS: lldb-Suite :: functionalities/data-formatter/refpointer-recursion/TestDataFormatterRefPtrRecursion.py (1484 of 1727) PASS: lldb-Suite :: lang/cpp/enum_types/TestCPP11EnumTypes.py (1485 of 1727) PASS: lldb-Unit :: Language/Highlighting/./HighlighterTests/HighlighterTest.DefaultHighlighter (1486 of 1727) PASS: lldb-Unit :: Utility/./UtilityTests/FileSpecTest.EqualDotsWindows (1487 of 1727) PASS: lldb-Suite :: commands/frame/diagnose/bad-reference/TestBadReference.py (1488 of 1727) PASS: LLDB :: Quit/TestQuitExitCode0.test (1489 of 1727) PASS: lldb-Suite :: lang/c/local_variables/TestLocalVariables.py (1490 of 1727) UNSUPPORTED: LLDB :: SymbolFile/PDB/ast-restore.test (1491 of 1727) PASS: lldb-Unit :: Interpreter/./InterpreterTests/OptionArgParserTest.toChar (1492 of 1727) PASS: lldb-Suite :: lang/objc/modules-incomplete/TestIncompleteModules.py (1493 of 1727) PASS: lldb-Unit :: Process/gdb-remote/./ProcessGdbRemoteTests/GDBRemoteClientBaseTest.SendContinueAndWait (1494 of 1727) PASS: lldb-Suite :: functionalities/darwin_log/filter/exact_match/activity/TestDarwinLogFilterMatchActivity.py (1495 of 1727) PASS: lldb-Suite :: python_api/frame/get-variables/TestGetVariables.py (1496 of 1727) PASS: lldb-Unit :: Utility/./UtilityTests/UriParserTest.Minimal (1497 of 1727) PASS: lldb-Unit :: Utility/./UtilityTests/StreamTest.PutHex32ByteOrderBig (1498 of 1727) PASS: lldb-Unit :: UnwindAssembly/x86/./UnwindAssemblyx86Tests/Testx86AssemblyInspectionEngine.TestStackRealign32BitDisp_x86_64 (1499 of 1727) PASS: lldb-Suite :: commands/expression/test/TestExprs.py (1500 of 1727) PASS: lldb-Suite :: functionalities/data-formatter/data-formatter-stl/libcxx/list/TestDataFormatterLibcxxList.py (1501 of 1727) PASS: LLDB :: Driver/LocalLLDBInit.test (1502 of 1727) PASS: lldb-Suite :: functionalities/postmortem/elf-core/thread_crash/TestLinuxCoreThreads.py (1503 of 1727) PASS: lldb-Unit :: Utility/./UtilityTests/LogChannelTest.EnableOptions (1504 of 1727) PASS: lldb-Suite :: commands/expression/persistent_ptr_update/TestPersistentPtrUpdate.py (1505 of 1727) PASS: LLDB :: SymbolFile/DWARF/forward-declarations.s (1506 of 1727) PASS: lldb-Unit :: Utility/./UtilityTests/StringExtractorTest.DecodeHexU8_Exact (1507 of 1727) PASS: lldb-Suite :: functionalities/breakpoint/breakpoint_command/TestBreakpointCommandsFromPython.py (1508 of 1727) PASS: lldb-Suite :: lang/cpp/stl/TestStdCXXDisassembly.py (1509 of 1727) PASS: lldb-Suite :: lang/c/set_values/TestSetValues.py (1510 of 1727) PASS: LLDB :: SymbolFile/DWARF/gnu-style-compression.cpp (1511 of 1727) PASS: lldb-Suite :: functionalities/thread/concurrent_events/TestConcurrentTwoWatchpointsOneDelayBreakpoint.py (1512 of 1727) PASS: lldb-Unit :: Utility/./UtilityTests/SerializationRountripTest.SerializeDeserializePodPointers (1513 of 1727) PASS: lldb-Suite :: functionalities/tsan/multiple/TestTsanMultiple.py (1514 of 1727) PASS: lldb-Suite :: functionalities/data-formatter/data-formatter-named-summaries/TestDataFormatterNamedSummaries.py (1515 of 1727) PASS: LLDB :: SymbolFile/DWARF/find-method-local-struct.cpp (1516 of 1727) PASS: LLDB :: Commands/command-regex-delete.test (1517 of 1727) PASS: lldb-Suite :: functionalities/data-formatter/data-formatter-disabling/TestDataFormatterDisabling.py (1518 of 1727) PASS: LLDB :: Reproducer/TestGDBRemoteRepro.test (1519 of 1727) PASS: LLDB :: Modules/PECOFF/basic-info.yaml (1520 of 1727) PASS: lldb-Unit :: Utility/./UtilityTests/StatusTest.Formatv (1521 of 1727) PASS: lldb-Unit :: Utility/./UtilityTests/EnvironmentTest.EnvpConversion (1522 of 1727) PASS: lldb-Unit :: Utility/./UtilityTests/ScalarTest.Promotion (1523 of 1727) PASS: lldb-Unit :: Utility/./UtilityTests/TimerTest.CategoryTimes2 (1524 of 1727) PASS: lldb-Unit :: Utility/./UtilityTests/DataExtractorTest.GetMaxU64_unchecked (1525 of 1727) PASS: lldb-Suite :: commands/watchpoints/multiple_hits/TestMultipleHits.py (1526 of 1727) PASS: lldb-Unit :: Utility/./UtilityTests/LogChannelTest.Enable (1527 of 1727) PASS: lldb-Suite :: commands/watchpoints/watchpoint_commands/command/TestWatchpointCommandLLDB.py (1528 of 1727) PASS: lldb-Suite :: commands/expression/import-std-module/weak_ptr/TestWeakPtr.py (1529 of 1727) PASS: lldb-Unit :: Utility/./UtilityTests/VMRange.Comparison (1530 of 1727) UNSUPPORTED: LLDB :: Expr/TestIRMemoryMapWindows.test (1531 of 1727) PASS: lldb-Suite :: functionalities/thread/concurrent_events/TestConcurrentCrashWithSignal.py (1532 of 1727) PASS: lldb-Unit :: Utility/./UtilityTests/ScalarTest.RightShiftOperator (1533 of 1727) PASS: lldb-Unit :: Target/./TargetTests/ModuleCacheTest.GetAndPut (1534 of 1727) PASS: lldb-Unit :: Utility/./UtilityTests/StringListTest.AppendStringCString (1535 of 1727) PASS: lldb-Suite :: functionalities/non-overlapping-index-variable-i/TestIndexVariable.py (1536 of 1727) PASS: lldb-Suite :: functionalities/step_scripted/TestStepScripted.py (1537 of 1727) PASS: lldb-Suite :: commands/frame/diagnose/virtual-method-call/TestDiagnoseDereferenceVirtualMethodCall.py (1538 of 1727) PASS: lldb-Unit :: Utility/./UtilityTests/StringExtractorTest.GetNameColonValueNoColon (1539 of 1727) PASS: lldb-Suite :: functionalities/data-formatter/data-formatter-stl/libcxx/atomic/TestLibCxxAtomic.py (1540 of 1727) PASS: lldb-Unit :: Utility/./UtilityTests/NameMatchesTest.EndsWith (1541 of 1727) PASS: LLDB :: BuildScript/compiler-full-path.test (1542 of 1727) PASS: lldb-Suite :: lang/c/local_types/TestUseClosestType.py (1543 of 1727) PASS: lldb-Suite :: functionalities/darwin_log/filter/regex/subsystem/TestDarwinLogFilterRegexSubsystem.py (1544 of 1727) PASS: lldb-Suite :: commands/process/attach/attach_denied/TestAttachDenied.py (1545 of 1727) PASS: lldb-Suite :: functionalities/breakpoint/breakpoint_hit_count/TestBreakpointHitCount.py (1546 of 1727) PASS: lldb-Unit :: SymbolFile/NativePDB/./SymbolFileNativePDBTests/PDBFPOProgramToDWARFExpressionTests.MultipleDependentAssignments (1547 of 1727) UNSUPPORTED: LLDB :: SymbolFile/PDB/calling-conventions.test (1548 of 1727) PASS: lldb-Unit :: Utility/./UtilityTests/RangeTest.DefaultConstructor (1549 of 1727) PASS: lldb-Unit :: Utility/./UtilityTests/StringExtractorTest.DecodeHexU8_InvalidHex2 (1550 of 1727) PASS: lldb-Unit :: Utility/./UtilityTests/FileSpecTest.PrependPathComponent (1551 of 1727) PASS: lldb-Unit :: Process/gdb-remote/./ProcessGdbRemoteTests/GDBRemoteCommunicationClientTest.SendGetTraceConfigPacket (1552 of 1727) PASS: lldb-Suite :: functionalities/signal/raise/TestRaise.py (1553 of 1727) PASS: lldb-Suite :: python_api/lldbutil/iter/TestLLDBIterator.py (1554 of 1727) PASS: LLDB :: Modules/PECOFF/dep-modules.yaml (1555 of 1727) PASS: lldb-Suite :: commands/gui/invalid-args/TestInvalidArgsGui.py (1556 of 1727) PASS: lldb-Unit :: SymbolFile/NativePDB/./SymbolFileNativePDBTests/PDBFPOProgramToDWARFExpressionTests.MissingTargetRegister (1557 of 1727) PASS: lldb-Unit :: Core/./LLDBCoreTests/RichManglingContextTest.IPDRealloc (1558 of 1727) PASS: LLDB :: Minidump/disassemble-no-module.yaml (1559 of 1727) PASS: lldb-Unit :: Utility/./UtilityTests/StreamTest.PutChar (1560 of 1727) PASS: lldb-Unit :: Utility/./UtilityTests/OptionsWithRawTest.UnterminatedQuote (1561 of 1727) PASS: lldb-Suite :: lang/objc/objc-struct-argument/TestObjCStructArgument.py (1562 of 1727) UNSUPPORTED: LLDB :: Register/x86-64-gp-write.test (1563 of 1727) PASS: lldb-Unit :: Utility/./UtilityTests/StreamTest.PutCharWhitespace (1564 of 1727) PASS: lldb-Suite :: lang/c/register_variables/TestRegisterVariables.py (1565 of 1727) PASS: lldb-Unit :: Expression/./ExpressionTests/DiagnosticManagerTest.GetStringMultiline (1566 of 1727) UNSUPPORTED: LLDB :: SymbolFile/NativePDB/typedefs.cpp (1567 of 1727) UNSUPPORTED: LLDB :: Register/x86-zmm-read.test (1568 of 1727) PASS: lldb-Suite :: functionalities/data-formatter/compactvectors/TestCompactVectors.py (1569 of 1727) PASS: lldb-Suite :: commands/command/invalid-args/TestInvalidArgsCommand.py (1570 of 1727) PASS: lldb-Suite :: commands/expression/radar_9531204/TestPrintfAfterUp.py (1571 of 1727) PASS: lldb-Unit :: Utility/./UtilityTests/StreamTest.ShiftOperatorUInts (1572 of 1727) PASS: lldb-Suite :: python_api/symbol-context/TestSymbolContext.py (1573 of 1727) PASS: lldb-Suite :: functionalities/data-formatter/user-format-vs-summary/TestUserFormatVsSummary.py (1574 of 1727) UNSUPPORTED: LLDB :: SymbolFile/PDB/function-level-linking.test (1575 of 1727) PASS: lldb-Unit :: Utility/./UtilityTests/BinaryStreamTest.PutSLEB128One (1576 of 1727) PASS: lldb-Unit :: ObjectFile/Breakpad/./ObjectFileBreakpadTests/ModuleRecord.parse (1577 of 1727) PASS: LLDB :: SymbolFile/Breakpad/symtab.test (1578 of 1727) PASS: lldb-Unit :: ScriptInterpreter/Python/./ScriptInterpreterPythonTests/PythonDataObjectsTest.TestPythonFile (1579 of 1727) PASS: lldb-Unit :: Utility/./UtilityTests/VASprintfTest.BufferResize (1580 of 1727) PASS: lldb-Unit :: Utility/./UtilityTests/UUIDTest.Validity (1581 of 1727) PASS: lldb-Suite :: tools/lldb-server/signal-filtering/TestGdbRemote_QPassSignals.py (1582 of 1727) PASS: lldb-Unit :: Process/gdb-remote/./ProcessGdbRemoteTests/GDBRemoteCommunicationClientTest.SendSignalsToIgnore (1583 of 1727) PASS: LLDB :: Driver/TestCommands.test (1584 of 1727) PASS: lldb-Unit :: UnwindAssembly/x86/./UnwindAssemblyx86Tests/Testx86AssemblyInspectionEngine.TestPopEBP (1585 of 1727) PASS: lldb-Suite :: commands/expression/import-std-module/stack/TestStack.py (1586 of 1727) PASS: lldb-Unit :: Utility/./UtilityTests/SerializationRountripTest.SerializeDeserializeObjectReference (1587 of 1727) PASS: LLDB :: Modules/ELF/build-id-case.yaml (1588 of 1727) PASS: lldb-Unit :: ScriptInterpreter/Python/./ScriptInterpreterPythonTests/PythonDataObjectsTest.TestPythonTupleToStructuredList (1589 of 1727) PASS: lldb-Unit :: Utility/./UtilityTests/TimeoutTest.Construction (1590 of 1727) PASS: lldb-Suite :: functionalities/darwin_log/format/TestDarwinLogMessageFormat.py (1591 of 1727) PASS: lldb-Suite :: lang/objc/bitfield_ivars/TestBitfieldIvars.py (1592 of 1727) PASS: lldb-Suite :: functionalities/postmortem/minidump-new/TestMiniDumpNew.py (1593 of 1727) PASS: lldb-Suite :: commands/expression/ir-interpreter/TestIRInterpreter.py (1594 of 1727) PASS: lldb-Unit :: Utility/./UtilityTests/OptionsWithRawTest.ArgsButNoDelimiter (1595 of 1727) PASS: LLDB :: Expr/TestIRMemoryMap.test (1596 of 1727) PASS: LLDB :: Commands/command-source.test (1597 of 1727) PASS: lldb-Suite :: commands/frame/diagnose/dereference-this/TestDiagnoseDereferenceThis.py (1598 of 1727) PASS: lldb-Unit :: Utility/./UtilityTests/FileSpecTest.GuessPathStyle (1599 of 1727) PASS: lldb-Unit :: Utility/./UtilityTests/UriParserTest.PortOverflow (1600 of 1727) PASS: lldb-Unit :: Utility/./UtilityTests/StringLexerTest.NextIfList (1601 of 1727) PASS: lldb-Suite :: python_api/exprpath_synthetic/TestExprPathSynthetic.py (1602 of 1727) PASS: lldb-Unit :: Utility/./UtilityTests/BinaryStreamTest.PutULEB128TwoBytes (1603 of 1727) PASS: lldb-Suite :: functionalities/ubsan/user-expression/TestUbsanUserExpression.py (1604 of 1727) PASS: lldb-Suite :: commands/expression/import-std-module/conflicts/TestStdModuleWithConflicts.py (1605 of 1727) PASS: lldb-Unit :: UnwindAssembly/x86/./UnwindAssemblyx86Tests/Testx86AssemblyInspectionEngine.TestPushEAX (1606 of 1727) PASS: lldb-Unit :: Utility/./UtilityTests/ArchSpecTest.Compatibility (1607 of 1727) UNSUPPORTED: LLDB :: Register/x86-64-zmm-read.test (1608 of 1727) PASS: lldb-Unit :: Utility/./UtilityTests/StructuredDataTest.StringDump (1609 of 1727) PASS: lldb-Suite :: macosx/find-dsym/deep-bundle/TestDeepBundle.py (1610 of 1727) PASS: lldb-Unit :: Expression/./ExpressionTests/DiagnosticManagerTest.GetStringPreserveOrder (1611 of 1727) PASS: lldb-Unit :: Host/./HostTests/HostInfoTest.GetAugmentedArchSpec (1612 of 1727) PASS: LLDB :: Reproducer/TestFileRepro.test (1613 of 1727) PASS: lldb-Unit :: Utility/./UtilityTests/NameMatchesTest.Contains (1614 of 1727) PASS: lldb-Unit :: Host/./HostTests/Host.WaitStatusFormat (1615 of 1727) PASS: lldb-Suite :: functionalities/breakpoint/breakpoint_set_restart/TestBreakpointSetRestart.py (1616 of 1727) PASS: lldb-Suite :: tools/lldb-vscode/breakpoint/TestVSCode_setBreakpoints.py (1617 of 1727) PASS: lldb-Suite :: functionalities/breakpoint/move_nearest/TestMoveNearest.py (1618 of 1727) PASS: LLDB :: SymbolFile/DWARF/parallel-indexing-stress.s (1619 of 1727) PASS: lldb-Unit :: ScriptInterpreter/Python/./ScriptInterpreterPythonTests/PythonDataObjectsTest.TestExtractingUInt64ThroughStructuredData (1620 of 1727) PASS: lldb-Suite :: functionalities/breakpoint/address_breakpoints/TestAddressBreakpoints.py (1621 of 1727) PASS: lldb-Unit :: debugserver/./debugserverTests/RNBSocket.LoopBackListenIPv6 (1622 of 1727) PASS: lldb-Suite :: lang/objc/objc-ivar-protocols/TestIvarProtocols.py (1623 of 1727) UNSUPPORTED: LLDB :: Unwind/unwind-plan-dwarf-dump.test (1624 of 1727) PASS: lldb-Suite :: functionalities/memory/read/TestMemoryRead.py (1625 of 1727) PASS: lldb-Suite :: commands/register/register/intel_xtended_registers/TestMPXRegisters.py (1626 of 1727) PASS: lldb-Unit :: SymbolFile/NativePDB/./SymbolFileNativePDBTests/PDBFPOProgramToDWARFExpressionTests.InvalidAssignmentMultiple (1627 of 1727) PASS: lldb-Suite :: functionalities/paths/TestPaths.py (1628 of 1727) PASS: lldb-Suite :: tools/lldb-vscode/step/TestVSCode_step.py (1629 of 1727) PASS: lldb-Suite :: commands/process/attach/TestProcessAttach.py (1630 of 1727) PASS: lldb-Suite :: functionalities/thread/create_during_step/TestCreateDuringStep.py (1631 of 1727) PASS: lldb-Unit :: Utility/./UtilityTests/OptionsWithRawTest.EmptyArgsOnlySuffix (1632 of 1727) PASS: lldb-Suite :: commands/expression/import-std-module/weak_ptr-dbg-info-content/TestDbgInfoContentWeakPtr.py (1633 of 1727) PASS: lldb-Unit :: Process/gdb-remote/./ProcessGdbRemoteTests/GDBRemoteCommunicationClientTest.SaveRestoreRegistersNoSuffix (1634 of 1727) PASS: lldb-Suite :: benchmarks/libcxxmap/TestBenchmarkLibcxxMap.py (1635 of 1727) PASS: lldb-Unit :: Utility/./UtilityTests/StringListTest.GetMaxStringLengthDecreasingSize (1636 of 1727) PASS: lldb-Unit :: Utility/./UtilityTests/RangeTest.SlideZero (1637 of 1727) PASS: lldb-Suite :: commands/command/source/TestCommandSource.py (1638 of 1727) PASS: lldb-Suite :: benchmarks/continue/TestBenchmarkContinue.py (1639 of 1727) PASS: lldb-Suite :: tools/lldb-server/inferior-crash/TestGdbRemoteSegFault.py (1640 of 1727) PASS: lldb-Unit :: Host/./HostTests/SocketTest.UDPConnect (1641 of 1727) PASS: lldb-Suite :: commands/apropos/with-process/TestAproposWithProcess.py (1642 of 1727) PASS: LLDB :: SymbolFile/NativePDB/globals-bss.cpp (1643 of 1727) PASS: lldb-Unit :: Utility/./UtilityTests/VASprintfTest.NoBufferResize (1644 of 1727) PASS: lldb-Unit :: Utility/./UtilityTests/StreamTest.PutRawBytesToLittleEndian (1645 of 1727) PASS: lldb-Suite :: commands/expression/options/TestExprOptions.py (1646 of 1727) PASS: lldb-Suite :: commands/watchpoints/watchpoint_events/TestWatchpointEvents.py (1647 of 1727) PASS: lldb-Unit :: ObjectFile/Breakpad/./ObjectFileBreakpadTests/PublicRecord.parse (1648 of 1727) PASS: lldb-Suite :: benchmarks/turnaround/TestCompileRunToBreakpointTurnaround.py (1649 of 1727) PASS: lldb-Suite :: macosx/nslog/TestDarwinNSLogOutput.py (1650 of 1727) PASS: lldb-Suite :: macosx/version_zero/TestGetVersionZeroVersion.py (1651 of 1727) PASS: lldb-Unit :: Utility/./UtilityTests/ScalarTest.APIntConstructor (1652 of 1727) PASS: lldb-Suite :: python_api/section/TestSectionAPI.py (1653 of 1727) PASS: LLDB :: Breakpoint/debug_addrx.test (1654 of 1727) PASS: lldb-Unit :: Utility/./UtilityTests/StringListTest.InsertStringAtIndexOutOfBounds (1655 of 1727) PASS: lldb-Suite :: commands/frame/diagnose/local-variable/TestLocalVariable.py (1656 of 1727) PASS: lldb-Suite :: commands/watchpoints/watchpoint_commands/TestWatchpointCommands.py (1657 of 1727) PASS: lldb-Suite :: commands/watchpoints/watchpoint_commands/condition/TestWatchpointConditionCmd.py (1658 of 1727) PASS: lldb-Suite :: commands/expression/completion-crash-incomplete-record/TestCompletionCrashIncompleteRecord.py (1659 of 1727) PASS: lldb-Suite :: commands/register/register/intel_xtended_registers/mpx_bound_violation/TestBoundViolation.py (1660 of 1727) PASS: lldb-Unit :: Interpreter/./InterpreterTests/OptionArgParserTest.toBoolean (1661 of 1727) PASS: lldb-Suite :: lang/objc/radar-9691614/TestObjCMethodReturningBOOL.py (1662 of 1727) PASS: lldb-Unit :: Utility/./UtilityTests/TimerTest.CategoryTimesNested (1663 of 1727) PASS: lldb-Unit :: Utility/./UtilityTests/FileSpecTest.EqualDotsPosix (1664 of 1727) PASS: lldb-Suite :: python_api/watchpoint/condition/TestWatchpointConditionAPI.py (1665 of 1727) PASS: lldb-Unit :: Utility/./UtilityTests/ScalarTest.GetValue (1666 of 1727) PASS: lldb-Suite :: functionalities/tty/TestTerminal.py (1667 of 1727) PASS: lldb-Unit :: Utility/./UtilityTests/StringListTest.GetMaxStringLengthIncreasingSize (1668 of 1727) PASS: LLDB :: Reproducer/TestDriverOptions.test (1669 of 1727) PASS: lldb-Unit :: Utility/./UtilityTests/OptionsWithRawTest.EmptyInput (1670 of 1727) UNSUPPORTED: LLDB :: SymbolFile/NativePDB/local-variables.cpp (1671 of 1727) PASS: lldb-Unit :: SymbolFile/DWARF/./SymbolFileDWARFTests/SymbolFileDWARFTests.TestAbbrevNullAttrValidForm (1672 of 1727) PASS: lldb-Unit :: Utility/./UtilityTests/StringExtractorTest.GetHexBytesAvail_Partial (1673 of 1727) PASS: LLDB :: Modules/MachO/lc_build_version_notools.yaml (1674 of 1727) PASS: lldb-Suite :: lang/cpp/chained-calls/TestCppChainedCalls.py (1675 of 1727) PASS: lldb-Unit :: Utility/./UtilityTests/UriParserTest.Empty (1676 of 1727) PASS: lldb-Unit :: SymbolFile/DWARF/./SymbolFileDWARFTests/SymbolFileDWARFTests.TestAbbrevOrder1Start1 (1677 of 1727) PASS: lldb-Unit :: Signals/./SignalsTests/UnixSignalsTest.GetInfo (1678 of 1727) PASS: lldb-Unit :: UnwindAssembly/x86/./UnwindAssemblyx86Tests/Testx86AssemblyInspectionEngine.TestStackRealign8BitDisp_i386 (1679 of 1727) PASS: lldb-Unit :: Utility/./UtilityTests/StreamTest.PutHex16ByteOrderLittle (1680 of 1727) PASS: lldb-Unit :: Core/./LLDBCoreTests/RichManglingContextTest.FromCxxMethodName (1681 of 1727) PASS: LLDB :: SymbolFile/DWARF/split-dwarf-inlining.cpp (1682 of 1727) PASS: lldb-Unit :: Symbol/./SymbolTests/TestClangASTContext.TestRecordHasFields (1683 of 1727) PASS: lldb-Suite :: commands/expression/xvalue/TestXValuePrinting.py (1684 of 1727) FAIL: lldb-Suite :: functionalities/gdb_remote_client/TestGDBRemoteLoad.py (1685 of 1727) ******************** TEST 'lldb-Suite :: functionalities/gdb_remote_client/TestGDBRemoteLoad.py' FAILED ******************** lldb version 10.0.99 (http://labmaster3.local/git/llvm-project.git revision b2b0ccab2f76733679eeceecf31b21ebc1fe23ac) clang revision b2b0ccab2f76733679eeceecf31b21ebc1fe23ac llvm revision b2b0ccab2f76733679eeceecf31b21ebc1fe23ac LLDB library dir: /Users/buildslave/jenkins/workspace/lldb-cmake-sanitized/lldb-build/bin LLDB import library dir: /Users/buildslave/jenkins/workspace/lldb-cmake-sanitized/lldb-build/bin libstdcxx tests will not be run because: Don't know how to build with libstdcxx on macosx Skipping following debug info categories: ['dwo']

Hide Details

Session logs for test failures/errors/unexpected successes will go into directory '/Users/buildslave/jenkins/workspace/lldb-cmake-sanitized/test/logs' Command invoked: /Users/buildslave/jenkins/workspace/lldb-cmake-sanitized/llvm-project/lldb/test/dotest.py --arch=x86_64 -s /Users/buildslave/jenkins/workspace/lldb-cmake-sanitized/lldb-build/lldb-test-traces -S nm -u CXXFLAGS -u CFLAGS --executable /Users/buildslave/jenkins/workspace/lldb-cmake-sanitized/lldb-build/./bin/lldb --dsymutil /Users/buildslave/jenkins/workspace/lldb-cmake-sanitized/lldb-build/./bin/dsymutil --filecheck /Users/buildslave/jenkins/workspace/lldb-cmake-sanitized/lldb-build/./bin/FileCheck -C /Users/buildslave/jenkins/workspace/lldb-cmake-sanitized/host-compiler/bin/clang --codesign-identity lldb_codesign --server /Users/buildslave/jenkins/workspace/lldb-cmake-sanitized/lldb-build/./bin/debugserver --arch x86_64 --build-dir /Users/buildslave/jenkins/workspace/lldb-cmake-sanitized/lldb-build/lldb-test-build.noindex -s=/Users/buildslave/jenkins/workspace/lldb-cmake-sanitized/test/logs -t --env TERM=vt100 --env LLVM_LIBS_DIR=/Users/buildslave/jenkins/workspace/lldb-cmake-sanitized/lldb-build/./lib --build-dir /Users/buildslave/jenkins/workspace/lldb-cmake-sanitized/lldb-build/tools/lldb/lldb-test-build.noindex --module-cache-dir /Users/buildslave/jenkins/workspace/lldb-cmake-sanitized/lldb-build/tools/lldb/lldb-test-build.noindex/module-cache-lldb /Users/buildslave/jenkins/workspace/lldb-cmake-sanitized/llvm-project/lldb/packages/Python/lldbsuite/test/functionalities/gdb_remote_client -p TestGDBRemoteLoad.py Change dir to: /Users/buildslave/jenkins/workspace/lldb-cmake-sanitized/llvm-project/lldb/packages/Python/lldbsuite/test/functionalities/gdb_remote_client runCmd: settings set symbols.enable-external-lookup false output:

Hide Details

runCmd: settings set plugin.process.gdb-remote.packet-timeout 60 output:

Hide Details

runCmd: settings set symbols.clang-modules-cache-path "/Users/buildslave/jenkins/workspace/lldb-cmake-sanitized/lldb-build/tools/lldb/lldb-test-build.noindex/module-cache-lldb" output:

Hide Details

runCmd: settings set use-color false output:

Hide Details

<bound method SBProcess.Kill of <lldb.SBProcess; proxy of <Swig Object of type 'lldb::SBProcess *' at 0x11ebb0ae0> >>: success

Hide Details

PASS: LLDB (/Users/buildslave/jenkins/workspace/lldb-cmake-sanitized/host-compiler/bin/clang-10-x86_64) :: test_flash_load (TestGDBRemoteLoad.TestGDBRemoteLoad) runCmd: settings set symbols.enable-external-lookup false output:

Hide Details

runCmd: settings set plugin.process.gdb-remote.packet-timeout 60 output:

Hide Details

runCmd: settings set symbols.clang-modules-cache-path "/Users/buildslave/jenkins/workspace/lldb-cmake-sanitized/lldb-build/tools/lldb/lldb-test-build.noindex/module-cache-lldb" output:

Hide Details

runCmd: settings set use-color false output:

Hide Details

FAIL: LLDB (/Users/buildslave/jenkins/workspace/lldb-cmake-sanitized/host-compiler/bin/clang-10-x86_64) :: test_module_load_address (TestGDBRemoteLoad.TestGDBRemoteLoad) <bound method SBProcess.Kill of <lldb.SBProcess; proxy of <Swig Object of type 'lldb::SBProcess *' at 0x11ebb0a80> >>: success

Hide Details

runCmd: settings set symbols.enable-external-lookup false output:

Hide Details

runCmd: settings set plugin.process.gdb-remote.packet-timeout 60 output:

Hide Details

runCmd: settings set symbols.clang-modules-cache-path "/Users/buildslave/jenkins/workspace/lldb-cmake-sanitized/lldb-build/tools/lldb/lldb-test-build.noindex/module-cache-lldb" output:

Hide Details

runCmd: settings set use-color false output:

Hide Details

FAIL: LLDB (/Users/buildslave/jenkins/workspace/lldb-cmake-sanitized/host-compiler/bin/clang-10-x86_64) :: test_ram_load (TestGDBRemoteLoad.TestGDBRemoteLoad) <bound method SBProcess.Kill of <lldb.SBProcess; proxy of <Swig Object of type 'lldb::SBProcess *' at 0x11ec051e0> >>: success

Hide Details

Restore dir to: /Users/buildslave/jenkins/workspace/lldb-cmake-sanitized/lldb-build/tools/lldb/lit ====================================================================== FAIL: test_module_load_address (TestGDBRemoteLoad.TestGDBRemoteLoad) Test that setting the load address of a module uses virtual addresses ---------------------------------------------------------------------- Traceback (most recent call last): File "/Users/buildslave/jenkins/workspace/lldb-cmake-sanitized/llvm-project/lldb/packages/Python/lldbsuite/test/functionalities/gdb_remote_client/TestGDBRemoteLoad.py", line 20, in test_module_load_address process = self.connect(target) File "/Users/buildslave/jenkins/workspace/lldb-cmake-sanitized/llvm-project/lldb/packages/Python/lldbsuite/test/functionalities/gdb_remote_client/gdbclientutils.py", line 479, in connect self.assertTrue(error.Success(), error.description) AssertionError: False is not True : failed to get reply to handshake packet Config=x86_64-/Users/buildslave/jenkins/workspace/lldb-cmake-sanitized/host-compiler/bin/clang-10 ====================================================================== FAIL: test_ram_load (TestGDBRemoteLoad.TestGDBRemoteLoad) Test loading an object file to a target's ram ---------------------------------------------------------------------- Traceback (most recent call last): File "/Users/buildslave/jenkins/workspace/lldb-cmake-sanitized/llvm-project/lldb/packages/Python/lldbsuite/test/functionalities/gdb_remote_client/TestGDBRemoteLoad.py", line 31, in test_ram_load process = self.connect(target) File "/Users/buildslave/jenkins/workspace/lldb-cmake-sanitized/llvm-project/lldb/packages/Python/lldbsuite/test/functionalities/gdb_remote_client/gdbclientutils.py", line 479, in connect self.assertTrue(error.Success(), error.description) AssertionError: False is not True : failed to get reply to handshake packet Config=x86_64-/Users/buildslave/jenkins/workspace/lldb-cmake-sanitized/host-compiler/bin/clang-10 ---------------------------------------------------------------------- Ran 3 tests in 126.036s

Hide Details

RESULT: FAILED (1 passes, 2 failures, 0 errors, 0 skipped, 0 expected failures, 0 unexpected successes)

Hide Details

******************** PASS: lldb-Unit :: Utility/./UtilityTests/AnsiTerminal.WhiteSpace (1686 of 1727) PASS: lldb-Suite :: lang/c/function_types/TestFunctionTypes.py (1687 of 1727) PASS: lldb-Suite :: lang/cpp/char8_t/TestCxxChar8_t.py (1688 of 1727) PASS: lldb-Suite :: commands/command/delete/TestCommandDelete.py (1689 of 1727) PASS: lldb-Suite :: lang/cpp/class_static/TestStaticVariables.py (1690 of 1727) PASS: lldb-Suite :: functionalities/thread/concurrent_events/TestConcurrentTwoBreakpointsOneWatchpoint.py (1691 of 1727) PASS: lldb-Suite :: functionalities/return-value/TestReturnValue.py (1692 of 1727) PASS: lldb-Unit :: Utility/./UtilityTests/StringListTest.GetMaxStringLengthEmpty (1693 of 1727) PASS: lldb-Unit :: Utility/./UtilityTests/Flags.SetCount (1694 of 1727) PASS: lldb-Unit :: Utility/./UtilityTests/StringListTest.PopBack (1695 of 1727) UNSUPPORTED: LLDB :: SymbolFile/NativePDB/stack_unwinding01.cpp (1696 of 1727) PASS: lldb-Unit :: Utility/./UtilityTests/SerializationRountripTest.SerializeDeserializePodReferences (1697 of 1727) PASS: lldb-Unit :: Utility/./UtilityTests/RangeDataVector.FindEntryThatContains_Overlap (1698 of 1727) PASS: lldb-Unit :: Utility/./UtilityTests/StringListTest.ShiftCString (1699 of 1727) PASS: lldb-Suite :: linux/mix-dwo-and-regular-objects/TestMixedDwarfBinary.py (1700 of 1727) PASS: lldb-Unit :: Symbol/./SymbolTests/SymbolsTest.TerminateLocateExecutableSymbolFileForUnknownExecutableAndUnknownSymbolFile (1701 of 1727) PASS: lldb-Suite :: functionalities/darwin_log/filter/regex/category/TestDarwinLogFilterRegexCategory.py (1702 of 1727) PASS: lldb-Unit :: Symbol/./SymbolTests/DWARFCallFrameInfoTest.Basic_dwarf3 (1703 of 1727) PASS: lldb-Unit :: Utility/./UtilityTests/BinaryStreamTest.PutULEB128FourBytes (1704 of 1727) PASS: lldb-Suite :: commands/target/create-deps/TestTargetCreateDeps.py (1705 of 1727) PASS: lldb-Unit :: Utility/./UtilityTests/Flags.Reset (1706 of 1727) PASS: lldb-Unit :: Utility/./UtilityTests/StringExtractorTest.DecodeHexU8_Underflow (1707 of 1727) PASS: lldb-Suite :: commands/expression/function_template_specialization_temp_args/TestFunctionTemplateSpecializationTempArgs.py (1708 of 1727) PASS: lldb-Unit :: Utility/./UtilityTests/StringExtractorTest.GetHexBytesAvail_OddPair (1709 of 1727) PASS: lldb-Unit :: Utility/./UtilityTests/VMRange.Reset (1710 of 1727) PASS: lldb-Unit :: Utility/./UtilityTests/StreamTest.PutHex64ByteOrderLittle (1711 of 1727) PASS: lldb-Unit :: Language/Highlighting/./HighlighterTests/HighlighterTest.HighlighterSelectionPath (1712 of 1727) PASS: lldb-Suite :: python_api/thread/TestThreadAPI.py (1713 of 1727) PASS: lldb-Suite :: functionalities/type_completion/TestTypeCompletion.py (1714 of 1727) PASS: lldb-Suite :: functionalities/data-formatter/dump_dynamic/TestDumpDynamic.py (1715 of 1727) PASS: lldb-Suite :: functionalities/postmortem/mach-core/TestMachCore.py (1716 of 1727) PASS: lldb-Suite :: lang/c/unicode/TestUnicodeSymbols.py (1717 of 1727) PASS: lldb-Suite :: lang/cpp/class_types/TestClassTypesDisassembly.py (1718 of 1727) PASS: lldb-Suite :: lang/objc/objc-property/TestObjCProperty.py (1719 of 1727) PASS: lldb-Suite :: functionalities/jitloader_gdb/TestJITLoaderGDB.py (1720 of 1727) PASS: lldb-Suite :: lang/objc/rdar-10967107/TestRdar10967107.py (1721 of 1727) PASS: lldb-Suite :: functionalities/set-data/TestSetData.py (1722 of 1727) PASS: lldb-Suite :: api/multiple-targets/TestMultipleTargets.py (1723 of 1727) PASS: lldb-Suite :: functionalities/inferior-assert/TestInferiorAssert.py (1724 of 1727) PASS: lldb-Suite :: lang/c/anonymous/TestAnonymous.py (1725 of 1727) FAIL: lldb-Suite :: functionalities/gdb_remote_client/TestGDBRemoteClient.py (1726 of 1727) ******************** TEST 'lldb-Suite :: functionalities/gdb_remote_client/TestGDBRemoteClient.py' FAILED ******************** lldb version 10.0.99 (http://labmaster3.local/git/llvm-project.git revision b2b0ccab2f76733679eeceecf31b21ebc1fe23ac) clang revision b2b0ccab2f76733679eeceecf31b21ebc1fe23ac llvm revision b2b0ccab2f76733679eeceecf31b21ebc1fe23ac LLDB library dir: /Users/buildslave/jenkins/workspace/lldb-cmake-sanitized/lldb-build/bin LLDB import library dir: /Users/buildslave/jenkins/workspace/lldb-cmake-sanitized/lldb-build/bin libstdcxx tests will not be run because: Don't know how to build with libstdcxx on macosx Skipping following debug info categories: ['dwo']

Hide Details

Session logs for test failures/errors/unexpected successes will go into directory '/Users/buildslave/jenkins/workspace/lldb-cmake-sanitized/test/logs' Command invoked: /Users/buildslave/jenkins/workspace/lldb-cmake-sanitized/llvm-project/lldb/test/dotest.py --arch=x86_64 -s /Users/buildslave/jenkins/workspace/lldb-cmake-sanitized/lldb-build/lldb-test-traces -S nm -u CXXFLAGS -u CFLAGS --executable /Users/buildslave/jenkins/workspace/lldb-cmake-sanitized/lldb-build/./bin/lldb --dsymutil /Users/buildslave/jenkins/workspace/lldb-cmake-sanitized/lldb-build/./bin/dsymutil --filecheck /Users/buildslave/jenkins/workspace/lldb-cmake-sanitized/lldb-build/./bin/FileCheck -C /Users/buildslave/jenkins/workspace/lldb-cmake-sanitized/host-compiler/bin/clang --codesign-identity lldb_codesign --server /Users/buildslave/jenkins/workspace/lldb-cmake-sanitized/lldb-build/./bin/debugserver --arch x86_64 --build-dir /Users/buildslave/jenkins/workspace/lldb-cmake-sanitized/lldb-build/lldb-test-build.noindex -s=/Users/buildslave/jenkins/workspace/lldb-cmake-sanitized/test/logs -t --env TERM=vt100 --env LLVM_LIBS_DIR=/Users/buildslave/jenkins/workspace/lldb-cmake-sanitized/lldb-build/./lib --build-dir /Users/buildslave/jenkins/workspace/lldb-cmake-sanitized/lldb-build/tools/lldb/lldb-test-build.noindex --module-cache-dir /Users/buildslave/jenkins/workspace/lldb-cmake-sanitized/lldb-build/tools/lldb/lldb-test-build.noindex/module-cache-lldb /Users/buildslave/jenkins/workspace/lldb-cmake-sanitized/llvm-project/lldb/packages/Python/lldbsuite/test/functionalities/gdb_remote_client -p TestGDBRemoteClient.py Change dir to: /Users/buildslave/jenkins/workspace/lldb-cmake-sanitized/llvm-project/lldb/packages/Python/lldbsuite/test/functionalities/gdb_remote_client runCmd: settings set symbols.enable-external-lookup false output:

Hide Details

runCmd: settings set plugin.process.gdb-remote.packet-timeout 60 output:

Hide Details

runCmd: settings set symbols.clang-modules-cache-path "/Users/buildslave/jenkins/workspace/lldb-cmake-sanitized/lldb-build/tools/lldb/lldb-test-build.noindex/module-cache-lldb" output:

Hide Details

runCmd: settings set use-color false output:

Hide Details

<bound method SBProcess.Kill of <lldb.SBProcess; proxy of <Swig Object of type 'lldb::SBProcess *' at 0x10d0f5ba0> >>: success

Hide Details

PASS: LLDB (/Users/buildslave/jenkins/workspace/lldb-cmake-sanitized/host-compiler/bin/clang-10-x86_64) :: test_attach_fail (TestGDBRemoteClient.TestGDBRemoteClient) runCmd: settings set symbols.enable-external-lookup false output:

Hide Details

runCmd: settings set plugin.process.gdb-remote.packet-timeout 60 output:

Hide Details

runCmd: settings set symbols.clang-modules-cache-path "/Users/buildslave/jenkins/workspace/lldb-cmake-sanitized/lldb-build/tools/lldb/lldb-test-build.noindex/module-cache-lldb" output:

Hide Details

runCmd: settings set use-color false output:

Hide Details

FAIL: LLDB (/Users/buildslave/jenkins/workspace/lldb-cmake-sanitized/host-compiler/bin/clang-10-x86_64) :: test_connect (TestGDBRemoteClient.TestGDBRemoteClient) <bound method SBProcess.Kill of <lldb.SBProcess; proxy of <Swig Object of type 'lldb::SBProcess *' at 0x10d0f5900> >>: success

Hide Details

Restore dir to: /Users/buildslave/jenkins/workspace/lldb-cmake-sanitized/lldb-build/tools/lldb/lit ====================================================================== FAIL: test_connect (TestGDBRemoteClient.TestGDBRemoteClient) Test connecting to a remote gdb server ---------------------------------------------------------------------- Traceback (most recent call last): File "/Users/buildslave/jenkins/workspace/lldb-cmake-sanitized/llvm-project/lldb/packages/Python/lldbsuite/test/functionalities/gdb_remote_client/TestGDBRemoteClient.py", line 13, in test_connect process = self.connect(target) File "/Users/buildslave/jenkins/workspace/lldb-cmake-sanitized/llvm-project/lldb/packages/Python/lldbsuite/test/functionalities/gdb_remote_client/gdbclientutils.py", line 479, in connect self.assertTrue(error.Success(), error.description) AssertionError: False is not True : failed to get reply to handshake packet Config=x86_64-/Users/buildslave/jenkins/workspace/lldb-cmake-sanitized/host-compiler/bin/clang-10 ---------------------------------------------------------------------- Ran 2 tests in 62.240s

Hide Details

RESULT: FAILED (1 passes, 1 failures, 0 errors, 0 skipped, 0 expected failures, 0 unexpected successes)

Hide Details

******************** TIMEOUT: lldb-Suite :: lang/objc/foundation/TestFoundationDisassembly.py (1727 of 1727) ******************** TEST 'lldb-Suite :: lang/objc/foundation/TestFoundationDisassembly.py' FAILED ******************** Reached timeout of 1200 seconds ******************** Testing Time: 1983.42s ******************** Failing Tests (5): lldb-Suite :: iohandler/completion/TestIOHandlerCompletion.py lldb-Suite :: commands/gui/basic/TestGuiBasic.py lldb-Suite :: commands/expression/multiline-completion/TestMultilineCompletion.py lldb-Suite :: functionalities/gdb_remote_client/TestGDBRemoteLoad.py lldb-Suite :: functionalities/gdb_remote_client/TestGDBRemoteClient.py

Hide Details

******************** Timed Out Tests (1): lldb-Suite :: lang/objc/foundation/TestFoundationDisassembly.py

Hide Details

Hide Details

Slowest Tests: -------------------------------------------------------------------------- 131.56s: lldb-Suite :: lang/objc/foundation/TestObjCMethodsString.py 132.26s: lldb-Suite :: functionalities/gdb_remote_client/TestGDBRemoteLoad.py 140.07s: lldb-Suite :: commands/target/basic/TestTargetCommand.py 149.94s: lldb-Suite :: lang/objc/objc-new-syntax/TestObjCNewSyntaxDictionary.py 160.70s: lldb-Suite :: api/check_public_api_headers/TestPublicAPIHeaders.py 161.09s: lldb-Suite :: lang/objc/objc-new-syntax/TestObjCNewSyntaxArray.py 163.90s: lldb-Suite :: functionalities/recursion/TestValueObjectRecursion.py 164.96s: lldb-Suite :: functionalities/load_unload/TestLoadUnload.py 165.08s: lldb-Suite :: lang/objc/exceptions/TestObjCExceptions.py 173.33s: lldb-Suite :: functionalities/return-value/TestReturnValue.py 182.55s: lldb-Suite :: lang/cpp/namespace/TestNamespaceLookup.py 187.08s: lldb-Suite :: lang/cpp/enum_types/TestCPP11EnumTypes.py 213.57s: lldb-Suite :: tools/lldb-server/TestLldbGdbServer.py 235.57s: lldb-Suite :: lang/objc/foundation/TestObjCMethods.py 238.26s: lldb-Suite :: lang/objc/hidden-ivars/TestHiddenIvars.py 256.28s: lldb-Suite :: lang/objc/objc-new-syntax/TestObjCNewSyntaxLiteral.py 281.86s: lldb-Suite :: api/multithreaded/TestMultithreaded.py 354.17s: lldb-Suite :: types/TestIntegerTypes.py 535.90s: lldb-Suite :: types/TestIntegerTypesExpr.py 1200.68s: lldb-Suite :: lang/objc/foundation/TestFoundationDisassembly.py

Hide Details

Tests Times: -------------------------------------------------------------------------- [ Range ] :: [ Percentage ] :: [ Count ] -------------------------------------------------------------------------- [ 0s, 100s) :: [*************************************** ] :: [1703/1727] [ 100s, 200s) :: [ ] :: [ 15/1727] [ 200s, 300s) :: [ ] :: [ 5/1727] [ 300s, 400s) :: [ ] :: [ 2/1727] [ 400s, 500s) :: [ ] :: [ 0/1727] [ 500s, 600s) :: [ ] :: [ 1/1727] [ 600s, 700s) :: [ ] :: [ 0/1727] [ 700s, 800s) :: [ ] :: [ 0/1727] [ 800s, 900s) :: [ ] :: [ 0/1727] [ 900s,1000s) :: [ ] :: [ 0/1727] [1000s,1100s) :: [ ] :: [ 0/1727] [1100s,1200s) :: [ ] :: [ 0/1727] [1200s,1300s) :: [ ] :: [ 1/1727] Expected Passes : 1671 Expected Failures : 6 Unsupported Tests : 44 Unexpected Failures: 5 Individual Timeouts: 1 FAILED: tools/lldb/lit/CMakeFiles/check-lldb-lit cd /Users/buildslave/jenkins/workspace/lldb-cmake-sanitized/lldb-build/tools/lldb/lit && /usr/bin/python /Users/buildslave/jenkins/workspace/lldb-cmake-sanitized/lldb-build/./bin/llvm-lit -v --time-tests --shuffle --xunit-xml-output=/Users/buildslave/jenkins/workspace/lldb-cmake-sanitized/test/results.xml -v --timeout 1200 /Users/buildslave/jenkins/workspace/lldb-cmake-sanitized/lldb-build/tools/lldb/lit ninja: build stopped: subcommand failed. Command failed Command: ['/usr/bin/env', 'TERM=vt100', '/usr/local/bin/ninja', '-v', 'check-lldb'] [Pipeline] } [Pipeline] // timeout [Pipeline] } [Pipeline] // stage [Pipeline] stage [Pipeline] { (Declarative: Post Actions) [Pipeline] scanForIssues No credentials specified [Clang (LLVM based)] Sleeping for 5 seconds due to JENKINS-32191... [Clang (LLVM based)] Parsing console log (workspace: '/Users/buildslave/jenkins/workspace/lldb-cmake-sanitized') [Pipeline] junit Recording test results [Pipeline] } [Pipeline] // stage [Pipeline] } [Pipeline] // withEnv [Pipeline] } [Pipeline] // node [Pipeline] End of Pipeline [BFA] Scanning build for known causes... [BFA] Found failure cause(s): [BFA] Regression test failed from category Test [BFA] Ninja target failed from category Compile [BFA] Done. 1s ERROR: script returned exit code 1 Finished: FAILURE