FailedConsole Output

Skipping 608 KB.. Full Log
estGdbRemoteSegFault.py (1017 of 2020)
PASS: lldb-api :: python_api/module_section/TestModuleAndSection.py (1018 of 2020)
PASS: lldb-unit :: Utility/./UtilityTests/FileSpecTest.CopyByAppendingPathComponent (1019 of 2020)
FAIL: lldb-api :: python_api/thread/TestThreadAPI.py (1020 of 2020)
******************** TEST 'lldb-api :: python_api/thread/TestThreadAPI.py' FAILED ********************
Script:
--
/Users/buildslave/jenkins/workspace/lldb-cmake-sanitized/lldb-build/lldb-test-build.noindex/copied-system-python /Users/buildslave/jenkins/workspace/lldb-cmake-sanitized/llvm-project/lldb/test/API/dotest.py --arch x86_64 -s /Users/buildslave/jenkins/workspace/lldb-cmake-sanitized/lldb-build/lldb-test-traces -S nm -u CXXFLAGS -u CFLAGS --codesign-identity lldb_codesign --server /Users/buildslave/jenkins/workspace/lldb-cmake-sanitized/lldb-build/./bin/debugserver --arch x86_64 --build-dir /Users/buildslave/jenkins/workspace/lldb-cmake-sanitized/lldb-build/lldb-test-build.noindex -s=/Users/buildslave/jenkins/workspace/lldb-cmake-sanitized/test/logs -t --env TERM=vt100 --env LLVM_LIBS_DIR=/Users/buildslave/jenkins/workspace/lldb-cmake-sanitized/lldb-build/./lib --inferior-env ASAN_OPTIONS=detect_stack_use_after_return=1 --inferior-env DYLD_INSERT_LIBRARIES=/Users/buildslave/jenkins/workspace/lldb-cmake-sanitized/host-compiler/lib/clang/11.0.0/lib/darwin/libclang_rt.asan_osx_dynamic.dylib --build-dir /Users/buildslave/jenkins/workspace/lldb-cmake-sanitized/lldb-build/lldb-test-build.noindex --lldb-module-cache-dir /Users/buildslave/jenkins/workspace/lldb-cmake-sanitized/lldb-build/lldb-test-build.noindex/module-cache-lldb/lldb-api --clang-module-cache-dir /Users/buildslave/jenkins/workspace/lldb-cmake-sanitized/lldb-build/lldb-test-build.noindex/module-cache-clang/lldb-api --executable /Users/buildslave/jenkins/workspace/lldb-cmake-sanitized/lldb-build/./bin/lldb --compiler /Users/buildslave/jenkins/workspace/lldb-cmake-sanitized/lldb-build/./bin/clang --dsymutil /Users/buildslave/jenkins/workspace/lldb-cmake-sanitized/lldb-build/./bin/dsymutil --filecheck /Users/buildslave/jenkins/workspace/lldb-cmake-sanitized/lldb-build/./bin/FileCheck --lldb-libs-dir /Users/buildslave/jenkins/workspace/lldb-cmake-sanitized/lldb-build/./lib /Users/buildslave/jenkins/workspace/lldb-cmake-sanitized/llvm-project/lldb/test/API/python_api/thread -p TestThreadAPI.py
--
Exit Code: 1

Hide Details

Command Output (stdout): -- lldb version 11.0.99 clang revision a7abe8dd297baa3843f3623ae293525986649247 llvm revision a7abe8dd297baa3843f3623ae293525986649247 LLDB library dir: /Users/buildslave/jenkins/workspace/lldb-cmake-sanitized/lldb-build/bin LLDB import library dir: /Users/buildslave/jenkins/workspace/lldb-cmake-sanitized/lldb-build/./lib libstdcxx tests will not be run because: Don't know how to build with libstdcxx on macosx Skipping following debug info categories: ['dwo'] start addr: 0x106af6e66 end addr: 0x106af6e70 start addr: 0x10bbe9e66 end addr: 0x10bbe9e70 start addr: 0x10c5dce66 end addr: 0x10c5dce70

Hide Details

-- Command Output (stderr): --

Hide Details

Session logs for test failures/errors/unexpected successes will go into directory '/Users/buildslave/jenkins/workspace/lldb-cmake-sanitized/test/logs' Command invoked: /Users/buildslave/jenkins/workspace/lldb-cmake-sanitized/llvm-project/lldb/test/API/dotest.py --arch x86_64 -s /Users/buildslave/jenkins/workspace/lldb-cmake-sanitized/lldb-build/lldb-test-traces -S nm -u CXXFLAGS -u CFLAGS --codesign-identity lldb_codesign --server /Users/buildslave/jenkins/workspace/lldb-cmake-sanitized/lldb-build/./bin/debugserver --arch x86_64 --build-dir /Users/buildslave/jenkins/workspace/lldb-cmake-sanitized/lldb-build/lldb-test-build.noindex -s=/Users/buildslave/jenkins/workspace/lldb-cmake-sanitized/test/logs -t --env TERM=vt100 --env LLVM_LIBS_DIR=/Users/buildslave/jenkins/workspace/lldb-cmake-sanitized/lldb-build/./lib --inferior-env ASAN_OPTIONS=detect_stack_use_after_return=1 --inferior-env DYLD_INSERT_LIBRARIES=/Users/buildslave/jenkins/workspace/lldb-cmake-sanitized/host-compiler/lib/clang/11.0.0/lib/darwin/libclang_rt.asan_osx_dynamic.dylib --build-dir /Users/buildslave/jenkins/workspace/lldb-cmake-sanitized/lldb-build/lldb-test-build.noindex --lldb-module-cache-dir /Users/buildslave/jenkins/workspace/lldb-cmake-sanitized/lldb-build/lldb-test-build.noindex/module-cache-lldb/lldb-api --clang-module-cache-dir /Users/buildslave/jenkins/workspace/lldb-cmake-sanitized/lldb-build/lldb-test-build.noindex/module-cache-clang/lldb-api --executable /Users/buildslave/jenkins/workspace/lldb-cmake-sanitized/lldb-build/./bin/lldb --compiler /Users/buildslave/jenkins/workspace/lldb-cmake-sanitized/lldb-build/./bin/clang --dsymutil /Users/buildslave/jenkins/workspace/lldb-cmake-sanitized/lldb-build/./bin/dsymutil --filecheck /Users/buildslave/jenkins/workspace/lldb-cmake-sanitized/lldb-build/./bin/FileCheck --lldb-libs-dir /Users/buildslave/jenkins/workspace/lldb-cmake-sanitized/lldb-build/./lib /Users/buildslave/jenkins/workspace/lldb-cmake-sanitized/llvm-project/lldb/test/API/python_api/thread -p TestThreadAPI.py Change dir to: /Users/buildslave/jenkins/workspace/lldb-cmake-sanitized/llvm-project/lldb/test/API/python_api/thread runCmd: settings clear -all output:

Hide Details

runCmd: settings set symbols.enable-external-lookup false output:

Hide Details

runCmd: settings set target.auto-apply-fixits false output:

Hide Details

runCmd: settings set plugin.process.gdb-remote.packet-timeout 60 output:

Hide Details

runCmd: settings set symbols.clang-modules-cache-path "/Users/buildslave/jenkins/workspace/lldb-cmake-sanitized/lldb-build/lldb-test-build.noindex/module-cache-lldb/lldb-api" output:

Hide Details

runCmd: settings set use-color false output:

Hide Details

runCmd: setting set target.prefer-dynamic-value no-dynamic-values output:

Hide Details

runCmd: settings set target.env-vars ASAN_OPTIONS=detect_stack_use_after_return=1 DYLD_INSERT_LIBRARIES=/Users/buildslave/jenkins/workspace/lldb-cmake-sanitized/host-compiler/lib/clang/11.0.0/lib/darwin/libclang_rt.asan_osx_dynamic.dylib output:

Hide Details

runCmd: breakpoint list output: Current breakpoints: 1: file = 'main.cpp', line = 17, exact_match = 0, locations = 1 1.1: where = a.out`main + 115 at main.cpp:17:5, address = a.out[0x0000000100000f53], unresolved, hit count = 0

Hide Details

Hide Details

Hide Details

runCmd: process status output: Process 85957 stopped * thread #1, queue = 'com.apple.main-thread', stop reason = breakpoint 1.1 frame #0: 0x00000001050b9f53 a.out`main(argc=1, argv=0x00007ffeeab464c8) at main.cpp:17:5 14 15 printf("after the loop: my_char='%c'\n", my_char); // 'my_char' should print out as 'x'. 16 -> 17 return 0; // Set break point at this line and check variable 'my_char'. ^ 18 }

Hide Details

Hide Details

<bound method SBProcess.Kill of <lldb.SBProcess; proxy of <Swig Object of type 'lldb::SBProcess *' at 0x10b6ef570> >>: success

Hide Details

PASS: LLDB (/Users/buildslave/jenkins/workspace/lldb-cmake-sanitized/lldb-build/bin/clang-11-x86_64) :: test_get_process_dsym (TestThreadAPI.ThreadAPITestCase) runCmd: settings clear -all output:

Hide Details

runCmd: settings set symbols.enable-external-lookup false output:

Hide Details

runCmd: settings set target.auto-apply-fixits false output:

Hide Details

runCmd: settings set plugin.process.gdb-remote.packet-timeout 60 output:

Hide Details

runCmd: settings set symbols.clang-modules-cache-path "/Users/buildslave/jenkins/workspace/lldb-cmake-sanitized/lldb-build/lldb-test-build.noindex/module-cache-lldb/lldb-api" output:

Hide Details

runCmd: settings set use-color false output:

Hide Details

runCmd: setting set target.prefer-dynamic-value no-dynamic-values output:

Hide Details

runCmd: settings set target.env-vars ASAN_OPTIONS=detect_stack_use_after_return=1 DYLD_INSERT_LIBRARIES=/Users/buildslave/jenkins/workspace/lldb-cmake-sanitized/host-compiler/lib/clang/11.0.0/lib/darwin/libclang_rt.asan_osx_dynamic.dylib output:

Hide Details

runCmd: breakpoint list output: Current breakpoints: 1: file = 'main.cpp', line = 17, exact_match = 0, locations = 1 1.1: where = a.out`main + 115 at main.cpp:17:5, address = a.out[0x0000000100000f53], unresolved, hit count = 0

Hide Details

Hide Details

Hide Details

runCmd: process status output: Process 86156 stopped * thread #1, queue = 'com.apple.main-thread', stop reason = breakpoint 1.1 frame #0: 0x0000000108d13f53 a.out`main(argc=1, argv=0x00007ffee6eec498) at main.cpp:17:5 14 15 printf("after the loop: my_char='%c'\n", my_char); // 'my_char' should print out as 'x'. 16 -> 17 return 0; // Set break point at this line and check variable 'my_char'. ^ 18 }

Hide Details

Hide Details

<bound method SBProcess.Kill of <lldb.SBProcess; proxy of <Swig Object of type 'lldb::SBProcess *' at 0x10aed6b10> >>: success

Hide Details

PASS: LLDB (/Users/buildslave/jenkins/workspace/lldb-cmake-sanitized/lldb-build/bin/clang-11-x86_64) :: test_get_process_dwarf (TestThreadAPI.ThreadAPITestCase) UNSUPPORTED: LLDB (/Users/buildslave/jenkins/workspace/lldb-cmake-sanitized/lldb-build/bin/clang-11-x86_64) :: test_get_process_dwo (TestThreadAPI.ThreadAPITestCase) (test case does not fall in any category of interest for this run) runCmd: settings clear -all output:

Hide Details

runCmd: settings set symbols.enable-external-lookup false output:

Hide Details

runCmd: settings set target.auto-apply-fixits false output:

Hide Details

runCmd: settings set plugin.process.gdb-remote.packet-timeout 60 output:

Hide Details

runCmd: settings set symbols.clang-modules-cache-path "/Users/buildslave/jenkins/workspace/lldb-cmake-sanitized/lldb-build/lldb-test-build.noindex/module-cache-lldb/lldb-api" output:

Hide Details

runCmd: settings set use-color false output:

Hide Details

runCmd: setting set target.prefer-dynamic-value no-dynamic-values output:

Hide Details

runCmd: settings set target.env-vars ASAN_OPTIONS=detect_stack_use_after_return=1 DYLD_INSERT_LIBRARIES=/Users/buildslave/jenkins/workspace/lldb-cmake-sanitized/host-compiler/lib/clang/11.0.0/lib/darwin/libclang_rt.asan_osx_dynamic.dylib output:

Hide Details

runCmd: breakpoint list output: Current breakpoints: 1: file = 'main.cpp', line = 17, exact_match = 0, locations = 1 1.1: where = a.out`main + 115 at main.cpp:17:5, address = a.out[0x0000000100000f53], unresolved, hit count = 0

Hide Details

Hide Details

Hide Details

runCmd: process status output: Process 86327 stopped * thread #1, queue = 'com.apple.main-thread', stop reason = breakpoint 1.1 frame #0: 0x000000010b174f53 a.out`main(argc=1, argv=0x00007ffee4a8b498) at main.cpp:17:5 14 15 printf("after the loop: my_char='%c'\n", my_char); // 'my_char' should print out as 'x'. 16 -> 17 return 0; // Set break point at this line and check variable 'my_char'. ^ 18 }

Hide Details

Hide Details

<bound method SBProcess.Kill of <lldb.SBProcess; proxy of <Swig Object of type 'lldb::SBProcess *' at 0x10b3ac480> >>: success

Hide Details

PASS: LLDB (/Users/buildslave/jenkins/workspace/lldb-cmake-sanitized/lldb-build/bin/clang-11-x86_64) :: test_get_process_gmodules (TestThreadAPI.ThreadAPITestCase) runCmd: settings clear -all output:

Hide Details

runCmd: settings set symbols.enable-external-lookup false output:

Hide Details

runCmd: settings set target.auto-apply-fixits false output:

Hide Details

runCmd: settings set plugin.process.gdb-remote.packet-timeout 60 output:

Hide Details

runCmd: settings set symbols.clang-modules-cache-path "/Users/buildslave/jenkins/workspace/lldb-cmake-sanitized/lldb-build/lldb-test-build.noindex/module-cache-lldb/lldb-api" output:

Hide Details

runCmd: settings set use-color false output:

Hide Details

runCmd: setting set target.prefer-dynamic-value no-dynamic-values output:

Hide Details

runCmd: settings set target.env-vars ASAN_OPTIONS=detect_stack_use_after_return=1 DYLD_INSERT_LIBRARIES=/Users/buildslave/jenkins/workspace/lldb-cmake-sanitized/host-compiler/lib/clang/11.0.0/lib/darwin/libclang_rt.asan_osx_dynamic.dylib output:

Hide Details

<bound method SBProcess.Kill of <lldb.SBProcess; proxy of <Swig Object of type 'lldb::SBProcess *' at 0x10aed61e0> >>: success

Hide Details

PASS: LLDB (/Users/buildslave/jenkins/workspace/lldb-cmake-sanitized/lldb-build/bin/clang-11-x86_64) :: test_get_stop_description_dsym (TestThreadAPI.ThreadAPITestCase) runCmd: settings clear -all output:

Hide Details

runCmd: settings set symbols.enable-external-lookup false output:

Hide Details

runCmd: settings set target.auto-apply-fixits false output:

Hide Details

runCmd: settings set plugin.process.gdb-remote.packet-timeout 60 output:

Hide Details

runCmd: settings set symbols.clang-modules-cache-path "/Users/buildslave/jenkins/workspace/lldb-cmake-sanitized/lldb-build/lldb-test-build.noindex/module-cache-lldb/lldb-api" output:

Hide Details

runCmd: settings set use-color false output:

Hide Details

runCmd: setting set target.prefer-dynamic-value no-dynamic-values output:

Hide Details

runCmd: settings set target.env-vars ASAN_OPTIONS=detect_stack_use_after_return=1 DYLD_INSERT_LIBRARIES=/Users/buildslave/jenkins/workspace/lldb-cmake-sanitized/host-compiler/lib/clang/11.0.0/lib/darwin/libclang_rt.asan_osx_dynamic.dylib output:

Hide Details

<bound method SBProcess.Kill of <lldb.SBProcess; proxy of <Swig Object of type 'lldb::SBProcess *' at 0x10b3ac480> >>: success

Hide Details

PASS: LLDB (/Users/buildslave/jenkins/workspace/lldb-cmake-sanitized/lldb-build/bin/clang-11-x86_64) :: test_get_stop_description_dwarf (TestThreadAPI.ThreadAPITestCase) UNSUPPORTED: LLDB (/Users/buildslave/jenkins/workspace/lldb-cmake-sanitized/lldb-build/bin/clang-11-x86_64) :: test_get_stop_description_dwo (TestThreadAPI.ThreadAPITestCase) (test case does not fall in any category of interest for this run) runCmd: settings clear -all output:

Hide Details

runCmd: settings set symbols.enable-external-lookup false output:

Hide Details

runCmd: settings set target.auto-apply-fixits false output:

Hide Details

runCmd: settings set plugin.process.gdb-remote.packet-timeout 60 output:

Hide Details

runCmd: settings set symbols.clang-modules-cache-path "/Users/buildslave/jenkins/workspace/lldb-cmake-sanitized/lldb-build/lldb-test-build.noindex/module-cache-lldb/lldb-api" output:

Hide Details

runCmd: settings set use-color false output:

Hide Details

runCmd: setting set target.prefer-dynamic-value no-dynamic-values output:

Hide Details

runCmd: settings set target.env-vars ASAN_OPTIONS=detect_stack_use_after_return=1 DYLD_INSERT_LIBRARIES=/Users/buildslave/jenkins/workspace/lldb-cmake-sanitized/host-compiler/lib/clang/11.0.0/lib/darwin/libclang_rt.asan_osx_dynamic.dylib output:

Hide Details

<bound method SBProcess.Kill of <lldb.SBProcess; proxy of <Swig Object of type 'lldb::SBProcess *' at 0x10aed6b10> >>: success

Hide Details

PASS: LLDB (/Users/buildslave/jenkins/workspace/lldb-cmake-sanitized/lldb-build/bin/clang-11-x86_64) :: test_get_stop_description_gmodules (TestThreadAPI.ThreadAPITestCase) runCmd: settings clear -all output:

Hide Details

runCmd: settings set symbols.enable-external-lookup false output:

Hide Details

runCmd: settings set target.auto-apply-fixits false output:

Hide Details

runCmd: settings set plugin.process.gdb-remote.packet-timeout 60 output:

Hide Details

runCmd: settings set symbols.clang-modules-cache-path "/Users/buildslave/jenkins/workspace/lldb-cmake-sanitized/lldb-build/lldb-test-build.noindex/module-cache-lldb/lldb-api" output:

Hide Details

runCmd: settings set use-color false output:

Hide Details

runCmd: setting set target.prefer-dynamic-value no-dynamic-values output:

Hide Details

runCmd: settings set target.env-vars ASAN_OPTIONS=detect_stack_use_after_return=1 DYLD_INSERT_LIBRARIES=/Users/buildslave/jenkins/workspace/lldb-cmake-sanitized/host-compiler/lib/clang/11.0.0/lib/darwin/libclang_rt.asan_osx_dynamic.dylib output:

Hide Details

runCmd: breakpoint list output: Current breakpoints: 1: file = 'main2.cpp', line = 21, exact_match = 0, locations = 1 1.1: where = test_run_to_address_dsym`b(int) + 22 at main2.cpp:21:17, address = test_run_to_address_dsym[0x0000000100000e66], unresolved, hit count = 0

Hide Details

Hide Details

Hide Details

runCmd: thread backtrace output: * thread #1, queue = 'com.apple.main-thread', stop reason = breakpoint 1.1 * frame #0: 0x0000000106af6e66 test_run_to_address_dsym`b(val=1) at main2.cpp:21:17 frame #1: 0x0000000106af6e0d test_run_to_address_dsym`a(val=1) at main2.cpp:11:16 frame #2: 0x0000000106af6ee0 test_run_to_address_dsym`main(argc=1, argv=0x00007ffee9109470) at main2.cpp:36:14 frame #3: 0x00007fff7e20e085 libdyld.dylib`start + 1

Hide Details

Hide Details

runCmd: breakpoint list output: Current breakpoints: 1: file = 'main2.cpp', line = 21, exact_match = 0, locations = 1 Options: disabled 1.1: where = test_run_to_address_dsym`b(int) + 22 at main2.cpp:21:17, address = 0x0000000106af6e66, unresolved, hit count = 1

Hide Details

Hide Details

Hide Details

runCmd: thread backtrace output: * thread #1, queue = 'com.apple.main-thread', stop reason = step over * frame #0: 0x0000000106af6e9d test_run_to_address_dsym`b(val=1) at main2.cpp:26:12 frame #1: 0x0000000106af6e0d test_run_to_address_dsym`a(val=1) at main2.cpp:11:16 frame #2: 0x0000000106af6ee0 test_run_to_address_dsym`main(argc=1, argv=0x00007ffee9109470) at main2.cpp:36:14 frame #3: 0x00007fff7e20e085 libdyld.dylib`start + 1

Hide Details

Hide Details

runCmd: process status output: Process 86908 stopped * thread #1, queue = 'com.apple.main-thread', stop reason = run to address: 0x0000000106af6e66 frame #0: 0x0000000106af6e66 test_run_to_address_dsym`b(val=2) at main2.cpp:21:17 18 int b(int val) 19 { 20 int rc = c(val); -> 21 void *ptr = malloc(1024); // thread step-out of malloc into function b. ^ 22 if (!ptr) 23 return -1; 24 else

Hide Details

Hide Details

<bound method SBProcess.Kill of <lldb.SBProcess; proxy of <Swig Object of type 'lldb::SBProcess *' at 0x10b3ac480> >>: success

Hide Details

PASS: LLDB (/Users/buildslave/jenkins/workspace/lldb-cmake-sanitized/lldb-build/bin/clang-11-x86_64) :: test_run_to_address_dsym (TestThreadAPI.ThreadAPITestCase) runCmd: settings clear -all output:

Hide Details

runCmd: settings set symbols.enable-external-lookup false output:

Hide Details

runCmd: settings set target.auto-apply-fixits false output:

Hide Details

runCmd: settings set plugin.process.gdb-remote.packet-timeout 60 output:

Hide Details

runCmd: settings set symbols.clang-modules-cache-path "/Users/buildslave/jenkins/workspace/lldb-cmake-sanitized/lldb-build/lldb-test-build.noindex/module-cache-lldb/lldb-api" output:

Hide Details

runCmd: settings set use-color false output:

Hide Details

runCmd: setting set target.prefer-dynamic-value no-dynamic-values output:

Hide Details

runCmd: settings set target.env-vars ASAN_OPTIONS=detect_stack_use_after_return=1 DYLD_INSERT_LIBRARIES=/Users/buildslave/jenkins/workspace/lldb-cmake-sanitized/host-compiler/lib/clang/11.0.0/lib/darwin/libclang_rt.asan_osx_dynamic.dylib output:

Hide Details

runCmd: breakpoint list output: Current breakpoints: 1: file = 'main2.cpp', line = 21, exact_match = 0, locations = 1 1.1: where = test_run_to_address_dwarf`b(int) + 22 at main2.cpp:21:17, address = test_run_to_address_dwarf[0x0000000100000e66], unresolved, hit count = 0

Hide Details

Hide Details

Hide Details

runCmd: thread backtrace output: * thread #1, queue = 'com.apple.main-thread', stop reason = breakpoint 1.1 * frame #0: 0x000000010bbe9e66 test_run_to_address_dwarf`b(val=1) at main2.cpp:21:17 frame #1: 0x000000010bbe9e0d test_run_to_address_dwarf`a(val=1) at main2.cpp:11:16 frame #2: 0x000000010bbe9ee0 test_run_to_address_dwarf`main(argc=1, argv=0x00007ffee4016470) at main2.cpp:36:14 frame #3: 0x00007fff7e20e085 libdyld.dylib`start + 1

Hide Details

Hide Details

runCmd: breakpoint list output: Current breakpoints: 1: file = 'main2.cpp', line = 21, exact_match = 0, locations = 1 Options: disabled 1.1: where = test_run_to_address_dwarf`b(int) + 22 at main2.cpp:21:17, address = 0x000000010bbe9e66, unresolved, hit count = 1

Hide Details

Hide Details

Hide Details

runCmd: thread backtrace output: * thread #1, queue = 'com.apple.main-thread', stop reason = step over * frame #0: 0x000000010bbe9e9d test_run_to_address_dwarf`b(val=1) at main2.cpp:26:12 frame #1: 0x000000010bbe9e0d test_run_to_address_dwarf`a(val=1) at main2.cpp:11:16 frame #2: 0x000000010bbe9ee0 test_run_to_address_dwarf`main(argc=1, argv=0x00007ffee4016470) at main2.cpp:36:14 frame #3: 0x00007fff7e20e085 libdyld.dylib`start + 1

Hide Details

Hide Details

runCmd: process status output: Process 87060 stopped * thread #1, queue = 'com.apple.main-thread', stop reason = run to address: 0x000000010bbe9e66 frame #0: 0x000000010bbe9e66 test_run_to_address_dwarf`b(val=2) at main2.cpp:21:17 18 int b(int val) 19 { 20 int rc = c(val); -> 21 void *ptr = malloc(1024); // thread step-out of malloc into function b. ^ 22 if (!ptr) 23 return -1; 24 else

Hide Details

Hide Details

<bound method SBProcess.Kill of <lldb.SBProcess; proxy of <Swig Object of type 'lldb::SBProcess *' at 0x10aed61e0> >>: success

Hide Details

PASS: LLDB (/Users/buildslave/jenkins/workspace/lldb-cmake-sanitized/lldb-build/bin/clang-11-x86_64) :: test_run_to_address_dwarf (TestThreadAPI.ThreadAPITestCase) UNSUPPORTED: LLDB (/Users/buildslave/jenkins/workspace/lldb-cmake-sanitized/lldb-build/bin/clang-11-x86_64) :: test_run_to_address_dwo (TestThreadAPI.ThreadAPITestCase) (test case does not fall in any category of interest for this run) runCmd: settings clear -all output:

Hide Details

runCmd: settings set symbols.enable-external-lookup false output:

Hide Details

runCmd: settings set target.auto-apply-fixits false output:

Hide Details

runCmd: settings set plugin.process.gdb-remote.packet-timeout 60 output:

Hide Details

runCmd: settings set symbols.clang-modules-cache-path "/Users/buildslave/jenkins/workspace/lldb-cmake-sanitized/lldb-build/lldb-test-build.noindex/module-cache-lldb/lldb-api" output:

Hide Details

runCmd: settings set use-color false output:

Hide Details

runCmd: setting set target.prefer-dynamic-value no-dynamic-values output:

Hide Details

runCmd: settings set target.env-vars ASAN_OPTIONS=detect_stack_use_after_return=1 DYLD_INSERT_LIBRARIES=/Users/buildslave/jenkins/workspace/lldb-cmake-sanitized/host-compiler/lib/clang/11.0.0/lib/darwin/libclang_rt.asan_osx_dynamic.dylib output:

Hide Details

runCmd: breakpoint list output: Current breakpoints: 1: file = 'main2.cpp', line = 21, exact_match = 0, locations = 1 1.1: where = test_run_to_address_gmodules`b(int) + 22 at main2.cpp:21:17, address = test_run_to_address_gmodules[0x0000000100000e66], unresolved, hit count = 0

Hide Details

Hide Details

Hide Details

runCmd: thread backtrace output: * thread #1, queue = 'com.apple.main-thread', stop reason = breakpoint 1.1 * frame #0: 0x000000010c5dce66 test_run_to_address_gmodules`b(val=1) at main2.cpp:21:17 frame #1: 0x000000010c5dce0d test_run_to_address_gmodules`a(val=1) at main2.cpp:11:16 frame #2: 0x000000010c5dcee0 test_run_to_address_gmodules`main(argc=1, argv=0x00007ffee3623460) at main2.cpp:36:14 frame #3: 0x00007fff7e20e085 libdyld.dylib`start + 1

Hide Details

Hide Details

runCmd: breakpoint list output: Current breakpoints: 1: file = 'main2.cpp', line = 21, exact_match = 0, locations = 1 Options: disabled 1.1: where = test_run_to_address_gmodules`b(int) + 22 at main2.cpp:21:17, address = 0x000000010c5dce66, unresolved, hit count = 1

Hide Details

Hide Details

Hide Details

runCmd: thread backtrace output: * thread #1, queue = 'com.apple.main-thread', stop reason = step over * frame #0: 0x000000010c5dce9d test_run_to_address_gmodules`b(val=1) at main2.cpp:26:12 frame #1: 0x000000010c5dce0d test_run_to_address_gmodules`a(val=1) at main2.cpp:11:16 frame #2: 0x000000010c5dcee0 test_run_to_address_gmodules`main(argc=1, argv=0x00007ffee3623460) at main2.cpp:36:14 frame #3: 0x00007fff7e20e085 libdyld.dylib`start + 1

Hide Details

Hide Details

runCmd: process status output: Process 87244 stopped * thread #1, queue = 'com.apple.main-thread', stop reason = run to address: 0x000000010c5dce66 frame #0: 0x000000010c5dce66 test_run_to_address_gmodules`b(val=2) at main2.cpp:21:17 18 int b(int val) 19 { 20 int rc = c(val); -> 21 void *ptr = malloc(1024); // thread step-out of malloc into function b. ^ 22 if (!ptr) 23 return -1; 24 else

Hide Details

Hide Details

<bound method SBProcess.Kill of <lldb.SBProcess; proxy of <Swig Object of type 'lldb::SBProcess *' at 0x10b3ac480> >>: success

Hide Details

PASS: LLDB (/Users/buildslave/jenkins/workspace/lldb-cmake-sanitized/lldb-build/bin/clang-11-x86_64) :: test_run_to_address_gmodules (TestThreadAPI.ThreadAPITestCase) runCmd: settings clear -all output:

Hide Details

runCmd: settings set symbols.enable-external-lookup false output:

Hide Details

runCmd: settings set target.auto-apply-fixits false output:

Hide Details

runCmd: settings set plugin.process.gdb-remote.packet-timeout 60 output:

Hide Details

runCmd: settings set symbols.clang-modules-cache-path "/Users/buildslave/jenkins/workspace/lldb-cmake-sanitized/lldb-build/lldb-test-build.noindex/module-cache-lldb/lldb-api" output:

Hide Details

runCmd: settings set use-color false output:

Hide Details

runCmd: setting set target.prefer-dynamic-value no-dynamic-values output:

Hide Details

runCmd: settings set target.env-vars ASAN_OPTIONS=detect_stack_use_after_return=1 DYLD_INSERT_LIBRARIES=/Users/buildslave/jenkins/workspace/lldb-cmake-sanitized/host-compiler/lib/clang/11.0.0/lib/darwin/libclang_rt.asan_osx_dynamic.dylib output:

Hide Details

FAIL: LLDB (/Users/buildslave/jenkins/workspace/lldb-cmake-sanitized/lldb-build/bin/clang-11-x86_64) :: test_step_out_of_malloc_into_function_b_dsym (TestThreadAPI.ThreadAPITestCase) <bound method SBProcess.Kill of <lldb.SBProcess; proxy of <Swig Object of type 'lldb::SBProcess *' at 0x10aed6b10> >>: success

Hide Details

runCmd: settings clear -all output:

Hide Details

runCmd: settings set symbols.enable-external-lookup false output:

Hide Details

runCmd: settings set target.auto-apply-fixits false output:

Hide Details

runCmd: settings set plugin.process.gdb-remote.packet-timeout 60 output:

Hide Details

runCmd: settings set symbols.clang-modules-cache-path "/Users/buildslave/jenkins/workspace/lldb-cmake-sanitized/lldb-build/lldb-test-build.noindex/module-cache-lldb/lldb-api" output:

Hide Details

runCmd: settings set use-color false output:

Hide Details

runCmd: setting set target.prefer-dynamic-value no-dynamic-values output:

Hide Details

runCmd: settings set target.env-vars ASAN_OPTIONS=detect_stack_use_after_return=1 DYLD_INSERT_LIBRARIES=/Users/buildslave/jenkins/workspace/lldb-cmake-sanitized/host-compiler/lib/clang/11.0.0/lib/darwin/libclang_rt.asan_osx_dynamic.dylib output:

Hide Details

FAIL: LLDB (/Users/buildslave/jenkins/workspace/lldb-cmake-sanitized/lldb-build/bin/clang-11-x86_64) :: test_step_out_of_malloc_into_function_b_dwarf (TestThreadAPI.ThreadAPITestCase) <bound method SBProcess.Kill of <lldb.SBProcess; proxy of <Swig Object of type 'lldb::SBProcess *' at 0x10b3ac480> >>: success

Hide Details

UNSUPPORTED: LLDB (/Users/buildslave/jenkins/workspace/lldb-cmake-sanitized/lldb-build/bin/clang-11-x86_64) :: test_step_out_of_malloc_into_function_b_dwo (TestThreadAPI.ThreadAPITestCase) (test case does not fall in any category of interest for this run) runCmd: settings clear -all output:

Hide Details

runCmd: settings set symbols.enable-external-lookup false output:

Hide Details

runCmd: settings set target.auto-apply-fixits false output:

Hide Details

runCmd: settings set plugin.process.gdb-remote.packet-timeout 60 output:

Hide Details

runCmd: settings set symbols.clang-modules-cache-path "/Users/buildslave/jenkins/workspace/lldb-cmake-sanitized/lldb-build/lldb-test-build.noindex/module-cache-lldb/lldb-api" output:

Hide Details

runCmd: settings set use-color false output:

Hide Details

runCmd: setting set target.prefer-dynamic-value no-dynamic-values output:

Hide Details

runCmd: settings set target.env-vars ASAN_OPTIONS=detect_stack_use_after_return=1 DYLD_INSERT_LIBRARIES=/Users/buildslave/jenkins/workspace/lldb-cmake-sanitized/host-compiler/lib/clang/11.0.0/lib/darwin/libclang_rt.asan_osx_dynamic.dylib output:

Hide Details

FAIL: LLDB (/Users/buildslave/jenkins/workspace/lldb-cmake-sanitized/lldb-build/bin/clang-11-x86_64) :: test_step_out_of_malloc_into_function_b_gmodules (TestThreadAPI.ThreadAPITestCase) <bound method SBProcess.Kill of <lldb.SBProcess; proxy of <Swig Object of type 'lldb::SBProcess *' at 0x10aed6b10> >>: success

Hide Details

runCmd: settings clear -all output:

Hide Details

runCmd: settings set symbols.enable-external-lookup false output:

Hide Details

runCmd: settings set target.auto-apply-fixits false output:

Hide Details

runCmd: settings set plugin.process.gdb-remote.packet-timeout 60 output:

Hide Details

runCmd: settings set symbols.clang-modules-cache-path "/Users/buildslave/jenkins/workspace/lldb-cmake-sanitized/lldb-build/lldb-test-build.noindex/module-cache-lldb/lldb-api" output:

Hide Details

runCmd: settings set use-color false output:

Hide Details

runCmd: setting set target.prefer-dynamic-value no-dynamic-values output:

Hide Details

runCmd: settings set target.env-vars ASAN_OPTIONS=detect_stack_use_after_return=1 DYLD_INSERT_LIBRARIES=/Users/buildslave/jenkins/workspace/lldb-cmake-sanitized/host-compiler/lib/clang/11.0.0/lib/darwin/libclang_rt.asan_osx_dynamic.dylib output:

Hide Details

runCmd: breakpoint list output: Current breakpoints: 1: file = 'main2.cpp', line = 21, exact_match = 0, locations = 1 1.1: where = test_step_over_3_times_dsym`b(int) + 22 at main2.cpp:21:17, address = test_step_over_3_times_dsym[0x0000000100000e66], unresolved, hit count = 0

Hide Details

Hide Details

Hide Details

runCmd: thread backtrace output: * thread #1, queue = 'com.apple.main-thread', stop reason = breakpoint 1.1 * frame #0: 0x000000010be3be66 test_step_over_3_times_dsym`b(val=1) at main2.cpp:21:17 frame #1: 0x000000010be3be0d test_step_over_3_times_dsym`a(val=1) at main2.cpp:11:16 frame #2: 0x000000010be3bee0 test_step_over_3_times_dsym`main(argc=1, argv=0x00007ffee3dc4468) at main2.cpp:36:14 frame #3: 0x00007fff7e20e085 libdyld.dylib`start + 1 frame #4: 0x00007fff7e20e085 libdyld.dylib`start + 1

Hide Details

Hide Details

runCmd: thread backtrace output: * thread #1, queue = 'com.apple.main-thread', stop reason = step over * frame #0: 0x000000010be3be9d test_step_over_3_times_dsym`b(val=1) at main2.cpp:26:12 frame #1: 0x000000010be3be0d test_step_over_3_times_dsym`a(val=1) at main2.cpp:11:16 frame #2: 0x000000010be3bee0 test_step_over_3_times_dsym`main(argc=1, argv=0x00007ffee3dc4468) at main2.cpp:36:14 frame #3: 0x00007fff7e20e085 libdyld.dylib`start + 1 frame #4: 0x00007fff7e20e085 libdyld.dylib`start + 1

Hide Details

Hide Details

<bound method SBProcess.Kill of <lldb.SBProcess; proxy of <Swig Object of type 'lldb::SBProcess *' at 0x10b3ac480> >>: success

Hide Details

PASS: LLDB (/Users/buildslave/jenkins/workspace/lldb-cmake-sanitized/lldb-build/bin/clang-11-x86_64) :: test_step_over_3_times_dsym (TestThreadAPI.ThreadAPITestCase) runCmd: settings clear -all output:

Hide Details

runCmd: settings set symbols.enable-external-lookup false output:

Hide Details

runCmd: settings set target.auto-apply-fixits false output:

Hide Details

runCmd: settings set plugin.process.gdb-remote.packet-timeout 60 output:

Hide Details

runCmd: settings set symbols.clang-modules-cache-path "/Users/buildslave/jenkins/workspace/lldb-cmake-sanitized/lldb-build/lldb-test-build.noindex/module-cache-lldb/lldb-api" output:

Hide Details

runCmd: settings set use-color false output:

Hide Details

runCmd: setting set target.prefer-dynamic-value no-dynamic-values output:

Hide Details

runCmd: settings set target.env-vars ASAN_OPTIONS=detect_stack_use_after_return=1 DYLD_INSERT_LIBRARIES=/Users/buildslave/jenkins/workspace/lldb-cmake-sanitized/host-compiler/lib/clang/11.0.0/lib/darwin/libclang_rt.asan_osx_dynamic.dylib output:

Hide Details

runCmd: breakpoint list output: Current breakpoints: 1: file = 'main2.cpp', line = 21, exact_match = 0, locations = 1 1.1: where = test_step_over_3_times_dwarf`b(int) + 22 at main2.cpp:21:17, address = test_step_over_3_times_dwarf[0x0000000100000e66], unresolved, hit count = 0

Hide Details

Hide Details

Hide Details

runCmd: thread backtrace output: * thread #1, queue = 'com.apple.main-thread', stop reason = breakpoint 1.1 * frame #0: 0x0000000109e02e66 test_step_over_3_times_dwarf`b(val=1) at main2.cpp:21:17 frame #1: 0x0000000109e02e0d test_step_over_3_times_dwarf`a(val=1) at main2.cpp:11:16 frame #2: 0x0000000109e02ee0 test_step_over_3_times_dwarf`main(argc=1, argv=0x00007ffee5dfd460) at main2.cpp:36:14 frame #3: 0x00007fff7e20e085 libdyld.dylib`start + 1

Hide Details

Hide Details

runCmd: thread backtrace output: * thread #1, queue = 'com.apple.main-thread', stop reason = step over * frame #0: 0x0000000109e02e9d test_step_over_3_times_dwarf`b(val=1) at main2.cpp:26:12 frame #1: 0x0000000109e02e0d test_step_over_3_times_dwarf`a(val=1) at main2.cpp:11:16 frame #2: 0x0000000109e02ee0 test_step_over_3_times_dwarf`main(argc=1, argv=0x00007ffee5dfd460) at main2.cpp:36:14 frame #3: 0x00007fff7e20e085 libdyld.dylib`start + 1

Hide Details

Hide Details

<bound method SBProcess.Kill of <lldb.SBProcess; proxy of <Swig Object of type 'lldb::SBProcess *' at 0x10aed6b10> >>: success

Hide Details

PASS: LLDB (/Users/buildslave/jenkins/workspace/lldb-cmake-sanitized/lldb-build/bin/clang-11-x86_64) :: test_step_over_3_times_dwarf (TestThreadAPI.ThreadAPITestCase) UNSUPPORTED: LLDB (/Users/buildslave/jenkins/workspace/lldb-cmake-sanitized/lldb-build/bin/clang-11-x86_64) :: test_step_over_3_times_dwo (TestThreadAPI.ThreadAPITestCase) (test case does not fall in any category of interest for this run) runCmd: settings clear -all output:

Hide Details

runCmd: settings set symbols.enable-external-lookup false output:

Hide Details

runCmd: settings set target.auto-apply-fixits false output:

Hide Details

runCmd: settings set plugin.process.gdb-remote.packet-timeout 60 output:

Hide Details

runCmd: settings set symbols.clang-modules-cache-path "/Users/buildslave/jenkins/workspace/lldb-cmake-sanitized/lldb-build/lldb-test-build.noindex/module-cache-lldb/lldb-api" output:

Hide Details

runCmd: settings set use-color false output:

Hide Details

runCmd: setting set target.prefer-dynamic-value no-dynamic-values output:

Hide Details

runCmd: settings set target.env-vars ASAN_OPTIONS=detect_stack_use_after_return=1 DYLD_INSERT_LIBRARIES=/Users/buildslave/jenkins/workspace/lldb-cmake-sanitized/host-compiler/lib/clang/11.0.0/lib/darwin/libclang_rt.asan_osx_dynamic.dylib output:

Hide Details

runCmd: breakpoint list output: Current breakpoints: 1: file = 'main2.cpp', line = 21, exact_match = 0, locations = 1 1.1: where = test_step_over_3_times_gmodules`b(int) + 22 at main2.cpp:21:17, address = test_step_over_3_times_gmodules[0x0000000100000e66], unresolved, hit count = 0

Hide Details

Hide Details

Hide Details

runCmd: thread backtrace output: * thread #1, queue = 'com.apple.main-thread', stop reason = breakpoint 1.1 * frame #0: 0x000000010cc8de66 test_step_over_3_times_gmodules`b(val=1) at main2.cpp:21:17 frame #1: 0x000000010cc8de0d test_step_over_3_times_gmodules`a(val=1) at main2.cpp:11:16 frame #2: 0x000000010cc8dee0 test_step_over_3_times_gmodules`main(argc=1, argv=0x00007ffee2f72458) at main2.cpp:36:14 frame #3: 0x00007fff7e20e085 libdyld.dylib`start + 1 frame #4: 0x00007fff7e20e085 libdyld.dylib`start + 1

Hide Details

Hide Details

runCmd: thread backtrace output: * thread #1, queue = 'com.apple.main-thread', stop reason = step over * frame #0: 0x000000010cc8de9d test_step_over_3_times_gmodules`b(val=1) at main2.cpp:26:12 frame #1: 0x000000010cc8de0d test_step_over_3_times_gmodules`a(val=1) at main2.cpp:11:16 frame #2: 0x000000010cc8dee0 test_step_over_3_times_gmodules`main(argc=1, argv=0x00007ffee2f72458) at main2.cpp:36:14 frame #3: 0x00007fff7e20e085 libdyld.dylib`start + 1 frame #4: 0x00007fff7e20e085 libdyld.dylib`start + 1

Hide Details

Hide Details

<bound method SBProcess.Kill of <lldb.SBProcess; proxy of <Swig Object of type 'lldb::SBProcess *' at 0x10b3ac480> >>: success

Hide Details

PASS: LLDB (/Users/buildslave/jenkins/workspace/lldb-cmake-sanitized/lldb-build/bin/clang-11-x86_64) :: test_step_over_3_times_gmodules (TestThreadAPI.ThreadAPITestCase) Restore dir to: /Users/buildslave/jenkins/workspace/lldb-cmake-sanitized/lldb-build/tools/lldb/test ====================================================================== ERROR: test_step_out_of_malloc_into_function_b_dsym (TestThreadAPI.ThreadAPITestCase) Test Python SBThread.StepOut() API to step out of a malloc call where the call site is at function b(). ---------------------------------------------------------------------- Traceback (most recent call last): File "/Users/buildslave/jenkins/workspace/lldb-cmake-sanitized/llvm-project/lldb/packages/Python/lldbsuite/test/lldbtest.py", line 1752, in test_method return attrvalue(self) File "/Users/buildslave/jenkins/workspace/lldb-cmake-sanitized/llvm-project/lldb/packages/Python/lldbsuite/test/decorators.py", line 110, in wrapper func(*args, **kwargs) File "/Users/buildslave/jenkins/workspace/lldb-cmake-sanitized/llvm-project/lldb/packages/Python/lldbsuite/test/decorators.py", line 110, in wrapper func(*args, **kwargs) File "/Users/buildslave/jenkins/workspace/lldb-cmake-sanitized/llvm-project/lldb/packages/Python/lldbsuite/test/decorators.py", line 110, in wrapper func(*args, **kwargs) File "/Users/buildslave/jenkins/workspace/lldb-cmake-sanitized/llvm-project/lldb/test/API/python_api/thread/TestThreadAPI.py", line 51, in test_step_out_of_malloc_into_function_b self.step_out_of_malloc_into_function_b(self.exe_name) File "/Users/buildslave/jenkins/workspace/lldb-cmake-sanitized/llvm-project/lldb/test/API/python_api/thread/TestThreadAPI.py", line 158, in step_out_of_malloc_into_function_b thread.IsValid(), AttributeError: 'NoneType' object has no attribute 'IsValid' Config=x86_64-/Users/buildslave/jenkins/workspace/lldb-cmake-sanitized/lldb-build/bin/clang-11 ====================================================================== ERROR: test_step_out_of_malloc_into_function_b_dwarf (TestThreadAPI.ThreadAPITestCase) Test Python SBThread.StepOut() API to step out of a malloc call where the call site is at function b(). ---------------------------------------------------------------------- Traceback (most recent call last): File "/Users/buildslave/jenkins/workspace/lldb-cmake-sanitized/llvm-project/lldb/packages/Python/lldbsuite/test/lldbtest.py", line 1752, in test_method return attrvalue(self) File "/Users/buildslave/jenkins/workspace/lldb-cmake-sanitized/llvm-project/lldb/packages/Python/lldbsuite/test/decorators.py", line 110, in wrapper func(*args, **kwargs) File "/Users/buildslave/jenkins/workspace/lldb-cmake-sanitized/llvm-project/lldb/packages/Python/lldbsuite/test/decorators.py", line 110, in wrapper func(*args, **kwargs) File "/Users/buildslave/jenkins/workspace/lldb-cmake-sanitized/llvm-project/lldb/packages/Python/lldbsuite/test/decorators.py", line 110, in wrapper func(*args, **kwargs) File "/Users/buildslave/jenkins/workspace/lldb-cmake-sanitized/llvm-project/lldb/test/API/python_api/thread/TestThreadAPI.py", line 51, in test_step_out_of_malloc_into_function_b self.step_out_of_malloc_into_function_b(self.exe_name) File "/Users/buildslave/jenkins/workspace/lldb-cmake-sanitized/llvm-project/lldb/test/API/python_api/thread/TestThreadAPI.py", line 158, in step_out_of_malloc_into_function_b thread.IsValid(), AttributeError: 'NoneType' object has no attribute 'IsValid' Config=x86_64-/Users/buildslave/jenkins/workspace/lldb-cmake-sanitized/lldb-build/bin/clang-11 ====================================================================== ERROR: test_step_out_of_malloc_into_function_b_gmodules (TestThreadAPI.ThreadAPITestCase) Test Python SBThread.StepOut() API to step out of a malloc call where the call site is at function b(). ---------------------------------------------------------------------- Traceback (most recent call last): File "/Users/buildslave/jenkins/workspace/lldb-cmake-sanitized/llvm-project/lldb/packages/Python/lldbsuite/test/lldbtest.py", line 1752, in test_method return attrvalue(self) File "/Users/buildslave/jenkins/workspace/lldb-cmake-sanitized/llvm-project/lldb/packages/Python/lldbsuite/test/decorators.py", line 110, in wrapper func(*args, **kwargs) File "/Users/buildslave/jenkins/workspace/lldb-cmake-sanitized/llvm-project/lldb/packages/Python/lldbsuite/test/decorators.py", line 110, in wrapper func(*args, **kwargs) File "/Users/buildslave/jenkins/workspace/lldb-cmake-sanitized/llvm-project/lldb/packages/Python/lldbsuite/test/decorators.py", line 110, in wrapper func(*args, **kwargs) File "/Users/buildslave/jenkins/workspace/lldb-cmake-sanitized/llvm-project/lldb/test/API/python_api/thread/TestThreadAPI.py", line 51, in test_step_out_of_malloc_into_function_b self.step_out_of_malloc_into_function_b(self.exe_name) File "/Users/buildslave/jenkins/workspace/lldb-cmake-sanitized/llvm-project/lldb/test/API/python_api/thread/TestThreadAPI.py", line 158, in step_out_of_malloc_into_function_b thread.IsValid(), AttributeError: 'NoneType' object has no attribute 'IsValid' Config=x86_64-/Users/buildslave/jenkins/workspace/lldb-cmake-sanitized/lldb-build/bin/clang-11 ---------------------------------------------------------------------- Ran 20 tests in 39.288s

Hide Details

RESULT: FAILED (12 passes, 0 failures, 3 errors, 5 skipped, 0 expected failures, 0 unexpected successes)

Hide Details

--

Hide Details

******************** PASS: lldb-unit :: Editline/./EditlineTests/EditlineTestFixture.EditlineReceivesMultiLineText (1021 of 2020) PASS: lldb-api :: commands/expression/regression-access-function-template-in-record/TestRegressionAccessFunctionTemplateInRecord.py (1022 of 2020) PASS: lldb-unit :: UnwindAssembly/x86/./UnwindAssemblyx86Tests/Testx86AssemblyInspectionEngine.TestPushR12 (1023 of 2020) PASS: lldb-api :: commands/expression/import-std-module/list/TestListFromStdModule.py (1024 of 2020) UNSUPPORTED: lldb-api :: commands/register/register/intel_xtended_registers/mpx_offset_intersection/TestMPXOffsetIntersection.py (1025 of 2020) PASS: lldb-api :: lang/objc/unicode-string/TestUnicodeString.py (1026 of 2020) PASS: lldb-api :: functionalities/data-formatter/data-formatter-advanced/TestDataFormatterAdv.py (1027 of 2020) PASS: lldb-unit :: Utility/./UtilityTests/SerializationRountripTest.SerializeDeserializePodPointers (1028 of 2020) PASS: lldb-shell :: ObjectFile/Breakpad/sections-trailing-func.test (1029 of 2020) PASS: lldb-api :: functionalities/data-formatter/data-formatter-objc/TestDataFormatterObjCNSURL.py (1030 of 2020) PASS: lldb-api :: functionalities/inferior-changed/TestInferiorChanged.py (1031 of 2020) PASS: lldb-api :: functionalities/data-formatter/user-format-vs-summary/TestUserFormatVsSummary.py (1032 of 2020) PASS: lldb-shell :: ObjectFile/PECOFF/basic-info-arm.yaml (1033 of 2020) PASS: lldb-api :: types/TestDoubleTypesExpr.py (1034 of 2020) PASS: lldb-unit :: SymbolFile/NativePDB/./SymbolFileNativePDBTests/PDBFPOProgramToDWARFExpressionTests.MultipleIndependentAssignments (1035 of 2020) PASS: lldb-unit :: Utility/./UtilityTests/FileSpecTest.PrependPathComponent (1036 of 2020) PASS: lldb-unit :: UnwindAssembly/x86/./UnwindAssemblyx86Tests/Testx86AssemblyInspectionEngine.TestStackRealignMSVC_i386 (1037 of 2020) PASS: lldb-unit :: Host/./HostTests/NativeProcessProtocolTest.SetBreakpointFailWrite (1038 of 2020) PASS: lldb-unit :: UnwindAssembly/x86/./UnwindAssemblyx86Tests/Testx86AssemblyInspectionEngine.TestPushRBX (1039 of 2020) PASS: lldb-unit :: Utility/./UtilityTests/OptionsWithRawTest.WhitespaceSuffix (1040 of 2020) PASS: lldb-unit :: Utility/./UtilityTests/RangeTest.EqualInvalid (1041 of 2020) PASS: lldb-shell :: SymbolFile/DWARF/find-basic-type.cpp (1042 of 2020) PASS: lldb-api :: lang/objc/self/TestObjCSelf.py (1043 of 2020) UNSUPPORTED: lldb-shell :: ObjectFile/ELF/minidebuginfo-set-and-hit-breakpoint.test (1044 of 2020) PASS: lldb-unit :: SymbolFile/NativePDB/./SymbolFileNativePDBTests/PDBFPOProgramToDWARFExpressionTests.MissingTargetRegister (1045 of 2020) PASS: lldb-shell :: SymbolFile/NativePDB/nested-types.cpp (1046 of 2020) PASS: lldb-api :: commands/expression/save_jit_objects/TestSaveJITObjects.py (1047 of 2020) PASS: lldb-api :: types/TestLongTypes.py (1048 of 2020) PASS: lldb-api :: functionalities/breakpoint/breakpoint_names/TestBreakpointNames.py (1049 of 2020) PASS: lldb-unit :: Utility/./UtilityTests/StringListTest.LongestCommonPrefixSingleElement (1050 of 2020) PASS: lldb-api :: lang/cpp/char1632_t/TestChar1632T.py (1051 of 2020) PASS: lldb-unit :: Symbol/./SymbolTests/TestTypeSystemClang.TemplateArguments (1052 of 2020) PASS: lldb-api :: functionalities/memory-region/TestMemoryRegion.py (1053 of 2020) PASS: lldb-unit :: Utility/./UtilityTests/BinaryStreamTest.PutSLEB128ThreeBytes (1054 of 2020) PASS: lldb-api :: functionalities/breakpoint/breakpoint_ids/TestBreakpointIDs.py (1055 of 2020) UNSUPPORTED: lldb-api :: functionalities/darwin_log/filter/exact_match/activity-chain/TestDarwinLogFilterMatchActivityChain.py (1056 of 2020) UNSUPPORTED: lldb-api :: python_api/disassemble-raw-data/TestDisassemble_VST1_64.py (1057 of 2020) PASS: lldb-api :: lang/mixed/TestMixedLanguages.py (1058 of 2020) PASS: lldb-unit :: Utility/./UtilityTests/StreamTest.PutCString (1059 of 2020) PASS: lldb-api :: functionalities/data-formatter/data-formatter-stl/libcxx/iterator/TestDataFormatterLibccIterator.py (1060 of 2020) PASS: lldb-api :: functionalities/gdb_remote_client/TestGDBRemoteLoad.py (1061 of 2020) PASS: lldb-api :: python_api/lldbutil/frame/TestFrameUtils.py (1062 of 2020) PASS: lldb-unit :: Utility/./UtilityTests/StringListTest.SplitIntoLinesSingleTrailingCR (1063 of 2020) PASS: lldb-unit :: Symbol/./SymbolTests/TestTypeSystemClang.TestGetTypeClassTypeOf (1064 of 2020) PASS: lldb-api :: lang/c/blocks/TestBlocks.py (1065 of 2020) PASS: lldb-unit :: Expression/./ExpressionTests/DiagnosticManagerTest.PutString (1066 of 2020) UNSUPPORTED: lldb-api :: functionalities/tsan/thread_numbers/TestTsanThreadNumbers.py (1067 of 2020) PASS: lldb-shell :: SymbolFile/Breakpad/unwind-via-stack-cfi.test (1068 of 2020) PASS: lldb-unit :: Symbol/./SymbolTests/TestTypeSystemClang.TestGetTypeClassNested (1069 of 2020) PASS: lldb-unit :: Utility/./UtilityTests/ScalarTest.GetValue (1070 of 2020) PASS: lldb-api :: functionalities/breakpoint/breakpoint_options/TestBreakpointOptions.py (1071 of 2020) PASS: lldb-api :: lang/objc/variadic_methods/TestVariadicMethods.py (1072 of 2020) UNSUPPORTED: lldb-api :: functionalities/darwin_log/format/TestDarwinLogMessageFormat.py (1073 of 2020) PASS: lldb-shell :: SymbolFile/NativePDB/bitfields.cpp (1074 of 2020) PASS: lldb-unit :: Utility/./UtilityTests/ArgsTest.ReplaceArgumentAtIndexShort (1075 of 2020) PASS: lldb-api :: commands/target/dump-symtab-demangle/TestDumpSymtabDemangle.py (1076 of 2020) PASS: lldb-api :: functionalities/step_scripted/TestStepScripted.py (1077 of 2020) PASS: lldb-unit :: Utility/./UtilityTests/BinaryStreamTest.PutULEB128Zero (1078 of 2020) PASS: lldb-unit :: UnwindAssembly/x86/./UnwindAssemblyx86Tests/Testx86AssemblyInspectionEngine.TestPushRBP (1079 of 2020) PASS: lldb-unit :: ScriptInterpreter/Python/./ScriptInterpreterPythonTests/PythonDataObjectsTest.TestDictionaryResolutionWithDot (1080 of 2020) UNSUPPORTED: lldb-api :: terminal/TestEditline.py (1081 of 2020) PASS: lldb-unit :: Utility/./UtilityTests/StreamTest.PutMaxHex64ByteOrderLittle (1082 of 2020) PASS: lldb-unit :: Utility/./UtilityTests/StreamTest.PutRawBytesToLittleEndian (1083 of 2020) PASS: lldb-api :: functionalities/data-formatter/data-formatter-stl/libcxx/variant/TestDataFormatterLibcxxVariant.py (1084 of 2020) PASS: lldb-unit :: Utility/./UtilityTests/UriParserTest.BracketedHostname (1085 of 2020) PASS: lldb-shell :: ObjectFile/PECOFF/section-types.yaml (1086 of 2020) PASS: lldb-unit :: Utility/./UtilityTests/OptionsWithRawTest.SingleWhitespaceInput (1087 of 2020) PASS: lldb-api :: commands/breakpoint/set/func-regex/TestBreakpointRegexError.py (1088 of 2020) UNSUPPORTED: lldb-api :: tools/lldb-server/TestGdbRemote_vContThreads.py (1089 of 2020) PASS: lldb-unit :: Utility/./UtilityTests/StringListTest.SplitIntoLinesEmpty (1090 of 2020) PASS: lldb-shell :: ObjectFile/ELF/section-overlap.yaml (1091 of 2020) PASS: lldb-shell :: Minidump/dump-all.test (1092 of 2020) UNSUPPORTED: lldb-shell :: Register/x86-gp-write.test (1093 of 2020) PASS: lldb-unit :: UnwindAssembly/x86/./UnwindAssemblyx86Tests/Testx86AssemblyInspectionEngine.TestSpArithx86_64Augmented (1094 of 2020) PASS: lldb-api :: functionalities/breakpoint/breakpoint_by_line_and_column/TestBreakpointByLineAndColumn.py (1095 of 2020) PASS: lldb-unit :: Expression/./ExpressionTests/CppModuleConfigurationTest.LibCppV2 (1096 of 2020) PASS: lldb-unit :: UnwindAssembly/x86/./UnwindAssemblyx86Tests/Testx86AssemblyInspectionEngine.TestSimple32bitFrameFunction (1097 of 2020) PASS: lldb-api :: functionalities/float-display/TestFloatDisplay.py (1098 of 2020) PASS: lldb-unit :: Utility/./UtilityTests/DataExtractorTest.GetCStr (1099 of 2020) PASS: lldb-unit :: Target/./TargetTests/ExecutionContextTest.GetByteOrder (1100 of 2020) PASS: lldb-unit :: SymbolFile/DWARF/./SymbolFileDWARFTests/SymbolFileDWARFTests.TestAbbrevOrder1Start5 (1101 of 2020) PASS: lldb-shell :: Breakpoint/split-dwarf-5-addrbase.test (1102 of 2020) PASS: lldb-api :: lang/cpp/call-function/TestCallCPPFunction.py (1103 of 2020) PASS: lldb-api :: lang/objc/objc-dyn-sbtype/TestObjCDynamicSBType.py (1104 of 2020) PASS: lldb-api :: functionalities/value_md5_crash/TestValueMD5Crash.py (1105 of 2020) PASS: lldb-unit :: ScriptInterpreter/Python/./ScriptInterpreterPythonTests/PythonDataObjectsTest.TestPythonBoolean (1106 of 2020) PASS: lldb-unit :: Utility/./UtilityTests/FileSpecTest.FormatFileSpec (1107 of 2020) PASS: lldb-shell :: Reproducer/Modules/TestModuleCXX.test (1108 of 2020) PASS: lldb-unit :: Utility/./UtilityTests/ProcessInstanceInfo.DumpTable (1109 of 2020) PASS: lldb-api :: functionalities/thread/thread_specific_break/TestThreadSpecificBreakpoint.py (1110 of 2020) PASS: lldb-api :: tools/lldb-server/TestGdbRemoteHostInfo.py (1111 of 2020) PASS: lldb-unit :: Utility/./UtilityTests/RangeTest.DoesIntersect (1112 of 2020) PASS: lldb-unit :: Process/minidump/./LLDBMinidumpTests/MinidumpParserTest.FindMemoryRange (1113 of 2020) PASS: lldb-api :: functionalities/data-formatter/data-formatter-cpp/TestDataFormatterCpp.py (1114 of 2020) PASS: lldb-unit :: Target/./TargetTests/MemoryRegionInfoTest.Formatv (1115 of 2020) PASS: lldb-api :: functionalities/data-formatter/type_summary_list_script/TestTypeSummaryListScript.py (1116 of 2020) PASS: lldb-unit :: Interpreter/./InterpreterTests/CompletionTest.DirCompletionAbsolute (1117 of 2020) PASS: lldb-unit :: Utility/./UtilityTests/RangeTest.ContainsRange (1118 of 2020) PASS: lldb-shell :: Breakpoint/debug_rnglist_offset_pair.test (1119 of 2020) UNSUPPORTED: lldb-shell :: Breakpoint/ppc64-localentry.test (1120 of 2020) PASS: lldb-api :: functionalities/thread/concurrent_events/TestConcurrentDelayedCrashWithBreakpointSignal.py (1121 of 2020) PASS: lldb-api :: python_api/frame/TestFrames.py (1122 of 2020) PASS: lldb-api :: functionalities/type_completion/TestTypeCompletion.py (1123 of 2020) PASS: lldb-unit :: Utility/./UtilityTests/StreamTest.PutULEB128 (1124 of 2020) PASS: lldb-unit :: Symbol/./SymbolTests/Type.CompilerContextPattern (1125 of 2020) PASS: lldb-api :: tools/lldb-vscode/breakpoint/TestVSCode_setExceptionBreakpoints.py (1126 of 2020) PASS: lldb-api :: functionalities/memory/find/TestMemoryFind.py (1127 of 2020) PASS: lldb-api :: functionalities/stats_api/TestStatisticsAPI.py (1128 of 2020) PASS: lldb-unit :: Utility/./UtilityTests/CompletionRequest.TryCompleteCurrentArgBad (1129 of 2020) PASS: lldb-unit :: UnwindAssembly/x86/./UnwindAssemblyx86Tests/Testx86AssemblyInspectionEngine.TestDisassemblyJunkBytes (1130 of 2020) PASS: lldb-unit :: UnwindAssembly/x86/./UnwindAssemblyx86Tests/Testx86AssemblyInspectionEngine.TestReturnDetect (1131 of 2020) PASS: lldb-unit :: ScriptInterpreter/Python/./ScriptInterpreterPythonTests/PythonDataObjectsTest.TestPythonListValueEquality (1132 of 2020) PASS: lldb-api :: lang/objc/objc-struct-argument/TestObjCStructArgument.py (1133 of 2020) UNSUPPORTED: lldb-api :: benchmarks/expression/TestRepeatedExprs.py (1134 of 2020) PASS: lldb-shell :: Reproducer/TestGDBRemoteRepro.test (1135 of 2020) PASS: lldb-unit :: ScriptInterpreter/Python/./ScriptInterpreterPythonTests/PythonDataObjectsTest.TestOwnedReferences (1136 of 2020) PASS: lldb-unit :: Utility/./UtilityTests/Flags.AllSet (1137 of 2020) PASS: lldb-api :: lang/objc/global_ptrs/TestGlobalObjects.py (1138 of 2020) PASS: lldb-api :: sanity/TestSettingSkipping.py (1139 of 2020) PASS: lldb-api :: functionalities/gdb_remote_client/TestNestedRegDefinitions.py (1140 of 2020) PASS: lldb-unit :: Host/./HostTests/FileSystemTest.OpenErrno (1141 of 2020) PASS: lldb-api :: commands/command/delete/TestCommandDelete.py (1142 of 2020) UNSUPPORTED: lldb-api :: macosx/macabi/TestMacABImacOSFramework.py (1143 of 2020) PASS: lldb-api :: functionalities/data-formatter/data-formatter-stl/libcxx/map/TestDataFormatterLibccMap.py (1144 of 2020) PASS: lldb-shell :: Register/x86-64-read.test (1145 of 2020) PASS: lldb-api :: commands/expression/import-std-module/queue/TestQueueFromStdModule.py (1146 of 2020) PASS: lldb-api :: commands/expression/unicode-in-variable/TestUnicodeInVariable.py (1147 of 2020) PASS: lldb-unit :: SymbolFile/DWARF/./SymbolFileDWARFTests/SymbolFileDWARFTests.TestAbbrevValidAttrNullForm (1148 of 2020) UNSUPPORTED: lldb-shell :: ScriptInterpreter/Lua/watchpoint_callback.test (1149 of 2020) PASS: lldb-api :: functionalities/target_var/TestTargetVar.py (1150 of 2020) PASS: lldb-shell :: Breakpoint/debug_rnglistx_rlex.test (1151 of 2020) PASS: lldb-api :: commands/expression/char/TestExprsChar.py (1152 of 2020) PASS: lldb-unit :: Host/./HostTests/FileSystemTest.FileAndDirectoryComponents (1153 of 2020) PASS: lldb-api :: commands/expression/import-std-module/conflicts/TestStdModuleWithConflicts.py (1154 of 2020) PASS: lldb-unit :: Utility/./UtilityTests/UriParserTest.Empty (1155 of 2020) PASS: lldb-api :: functionalities/data-formatter/data-formatter-objc/TestDataFormatterObjCNSBundle.py (1156 of 2020) PASS: lldb-unit :: ScriptInterpreter/Python/./ScriptInterpreterPythonTests/PythonDataObjectsTest.TestPythonDictionaryToStructuredDictionary (1157 of 2020) UNSUPPORTED: lldb-api :: iohandler/unicode/TestUnicode.py (1158 of 2020) PASS: lldb-unit :: Expression/./ExpressionTests/DWARFExpression.DW_OP_stack_value (1159 of 2020) PASS: lldb-shell :: Driver/TestRepl.test (1160 of 2020) UNSUPPORTED: lldb-api :: functionalities/data-formatter/data-formatter-stl/libstdcpp/vbool/TestDataFormatterStdVBool.py (1161 of 2020) PASS: lldb-shell :: SymbolFile/DWARF/find-function-regex.cpp (1162 of 2020) PASS: lldb-unit :: Utility/./UtilityTests/Flags.AllClear (1163 of 2020) PASS: lldb-unit :: Utility/./UtilityTests/ScalarTest.ExtractBitfield (1164 of 2020) PASS: lldb-api :: commands/expression/import-std-module/empty-module/TestEmptyStdModule.py (1165 of 2020) PASS: lldb-api :: python_api/process/read-mem-cstring/TestReadMemCString.py (1166 of 2020) PASS: lldb-unit :: Utility/./UtilityTests/NameMatchesTest.Contains (1167 of 2020) PASS: lldb-api :: lang/cpp/this/TestCPPThis.py (1168 of 2020) PASS: lldb-unit :: Host/./HostTests/SocketTest.TCPListen0GetPort (1169 of 2020) PASS: lldb-unit :: Symbol/./SymbolTests/TestClangASTImporter.ImportInvalidType (1170 of 2020) PASS: lldb-api :: lang/cpp/offsetof/TestOffsetofCpp.py (1171 of 2020) PASS: lldb-api :: lang/objc/forward-decl/TestForwardDecl.py (1172 of 2020) PASS: lldb-api :: lang/objc/objc-checker/TestObjCCheckers.py (1173 of 2020) PASS: lldb-unit :: Language/Highlighting/./HighlighterTests/HighlighterTest.ClangEmptyInput (1174 of 2020) PASS: lldb-unit :: Utility/./UtilityTests/UriParserTest.BracketedHostnameWithPortIPv4 (1175 of 2020) FAIL: lldb-api :: functionalities/ptr_refs/TestPtrRefs.py (1176 of 2020) ******************** TEST 'lldb-api :: functionalities/ptr_refs/TestPtrRefs.py' FAILED ******************** Script: -- /Users/buildslave/jenkins/workspace/lldb-cmake-sanitized/lldb-build/lldb-test-build.noindex/copied-system-python /Users/buildslave/jenkins/workspace/lldb-cmake-sanitized/llvm-project/lldb/test/API/dotest.py --arch x86_64 -s /Users/buildslave/jenkins/workspace/lldb-cmake-sanitized/lldb-build/lldb-test-traces -S nm -u CXXFLAGS -u CFLAGS --codesign-identity lldb_codesign --server /Users/buildslave/jenkins/workspace/lldb-cmake-sanitized/lldb-build/./bin/debugserver --arch x86_64 --build-dir /Users/buildslave/jenkins/workspace/lldb-cmake-sanitized/lldb-build/lldb-test-build.noindex -s=/Users/buildslave/jenkins/workspace/lldb-cmake-sanitized/test/logs -t --env TERM=vt100 --env LLVM_LIBS_DIR=/Users/buildslave/jenkins/workspace/lldb-cmake-sanitized/lldb-build/./lib --inferior-env ASAN_OPTIONS=detect_stack_use_after_return=1 --inferior-env DYLD_INSERT_LIBRARIES=/Users/buildslave/jenkins/workspace/lldb-cmake-sanitized/host-compiler/lib/clang/11.0.0/lib/darwin/libclang_rt.asan_osx_dynamic.dylib --build-dir /Users/buildslave/jenkins/workspace/lldb-cmake-sanitized/lldb-build/lldb-test-build.noindex --lldb-module-cache-dir /Users/buildslave/jenkins/workspace/lldb-cmake-sanitized/lldb-build/lldb-test-build.noindex/module-cache-lldb/lldb-api --clang-module-cache-dir /Users/buildslave/jenkins/workspace/lldb-cmake-sanitized/lldb-build/lldb-test-build.noindex/module-cache-clang/lldb-api --executable /Users/buildslave/jenkins/workspace/lldb-cmake-sanitized/lldb-build/./bin/lldb --compiler /Users/buildslave/jenkins/workspace/lldb-cmake-sanitized/lldb-build/./bin/clang --dsymutil /Users/buildslave/jenkins/workspace/lldb-cmake-sanitized/lldb-build/./bin/dsymutil --filecheck /Users/buildslave/jenkins/workspace/lldb-cmake-sanitized/lldb-build/./bin/FileCheck --lldb-libs-dir /Users/buildslave/jenkins/workspace/lldb-cmake-sanitized/lldb-build/./lib /Users/buildslave/jenkins/workspace/lldb-cmake-sanitized/llvm-project/lldb/test/API/functionalities/ptr_refs -p TestPtrRefs.py -- Exit Code: 1

Hide Details

Command Output (stdout): -- lldb version 11.0.99 clang revision a7abe8dd297baa3843f3623ae293525986649247 llvm revision a7abe8dd297baa3843f3623ae293525986649247 "crashlog" and "save_crashlog" command installed, use the "--help" option for detailed help "malloc_info", "ptr_refs", "cstr_refs", "find_variable", and "objc_refs" commands have been installed, use the "--help" options on these commands for detailed help. LLDB library dir: /Users/buildslave/jenkins/workspace/lldb-cmake-sanitized/lldb-build/bin LLDB import library dir: /Users/buildslave/jenkins/workspace/lldb-cmake-sanitized/lldb-build/./lib libstdcxx tests will not be run because: Don't know how to build with libstdcxx on macosx Skipping following debug info categories: ['dwo'] 0x00007ffeebc0e478: stack in frame #0 of thread #1: tid 0x1808910 in variable at 0x7ffeebc0e478: (const char *) my_ptr = 0x00006020000000b0 "hello" 0x00007ffeebc0e410: stack (red zone)

Hide Details

-- Command Output (stderr): -- error: 'ptr_refs' is not a valid command. error: 'ptr_refs' is not a valid command.

Hide Details

Session logs for test failures/errors/unexpected successes will go into directory '/Users/buildslave/jenkins/workspace/lldb-cmake-sanitized/test/logs' Command invoked: /Users/buildslave/jenkins/workspace/lldb-cmake-sanitized/llvm-project/lldb/test/API/dotest.py --arch x86_64 -s /Users/buildslave/jenkins/workspace/lldb-cmake-sanitized/lldb-build/lldb-test-traces -S nm -u CXXFLAGS -u CFLAGS --codesign-identity lldb_codesign --server /Users/buildslave/jenkins/workspace/lldb-cmake-sanitized/lldb-build/./bin/debugserver --arch x86_64 --build-dir /Users/buildslave/jenkins/workspace/lldb-cmake-sanitized/lldb-build/lldb-test-build.noindex -s=/Users/buildslave/jenkins/workspace/lldb-cmake-sanitized/test/logs -t --env TERM=vt100 --env LLVM_LIBS_DIR=/Users/buildslave/jenkins/workspace/lldb-cmake-sanitized/lldb-build/./lib --inferior-env ASAN_OPTIONS=detect_stack_use_after_return=1 --inferior-env DYLD_INSERT_LIBRARIES=/Users/buildslave/jenkins/workspace/lldb-cmake-sanitized/host-compiler/lib/clang/11.0.0/lib/darwin/libclang_rt.asan_osx_dynamic.dylib --build-dir /Users/buildslave/jenkins/workspace/lldb-cmake-sanitized/lldb-build/lldb-test-build.noindex --lldb-module-cache-dir /Users/buildslave/jenkins/workspace/lldb-cmake-sanitized/lldb-build/lldb-test-build.noindex/module-cache-lldb/lldb-api --clang-module-cache-dir /Users/buildslave/jenkins/workspace/lldb-cmake-sanitized/lldb-build/lldb-test-build.noindex/module-cache-clang/lldb-api --executable /Users/buildslave/jenkins/workspace/lldb-cmake-sanitized/lldb-build/./bin/lldb --compiler /Users/buildslave/jenkins/workspace/lldb-cmake-sanitized/lldb-build/./bin/clang --dsymutil /Users/buildslave/jenkins/workspace/lldb-cmake-sanitized/lldb-build/./bin/dsymutil --filecheck /Users/buildslave/jenkins/workspace/lldb-cmake-sanitized/lldb-build/./bin/FileCheck --lldb-libs-dir /Users/buildslave/jenkins/workspace/lldb-cmake-sanitized/lldb-build/./lib /Users/buildslave/jenkins/workspace/lldb-cmake-sanitized/llvm-project/lldb/test/API/functionalities/ptr_refs -p TestPtrRefs.py Change dir to: /Users/buildslave/jenkins/workspace/lldb-cmake-sanitized/llvm-project/lldb/test/API/functionalities/ptr_refs runCmd: settings clear -all output:

Hide Details

runCmd: settings set symbols.enable-external-lookup false output:

Hide Details

runCmd: settings set target.auto-apply-fixits false output:

Hide Details

runCmd: settings set plugin.process.gdb-remote.packet-timeout 60 output:

Hide Details

runCmd: settings set symbols.clang-modules-cache-path "/Users/buildslave/jenkins/workspace/lldb-cmake-sanitized/lldb-build/lldb-test-build.noindex/module-cache-lldb/lldb-api" output:

Hide Details

runCmd: settings set use-color false output:

Hide Details

runCmd: setting set target.prefer-dynamic-value no-dynamic-values output:

Hide Details

runCmd: settings set target.env-vars ASAN_OPTIONS=detect_stack_use_after_return=1 DYLD_INSERT_LIBRARIES=/Users/buildslave/jenkins/workspace/lldb-cmake-sanitized/host-compiler/lib/clang/11.0.0/lib/darwin/libclang_rt.asan_osx_dynamic.dylib output:

Hide Details

runCmd: script import lldb.macosx.heap output: "crashlog" and "save_crashlog" command installed, use the "--help" option for detailed help "malloc_info", "ptr_refs", "cstr_refs", "find_variable", and "objc_refs" commands have been installed, use the "--help" options on these commands for detailed help.

Hide Details

Hide Details

runCmd: ptr_refs my_ptr output: 0x00007ffeebc0e478: stack in frame #0 of thread #1: tid 0x1808910 in variable at 0x7ffeebc0e478: (const char *) my_ptr = 0x00006020000000b0 "hello" 0x00007ffeebc0e410: stack (red zone)

Hide Details

Hide Details

Expecting sub string: malloc Not matched

Hide Details

FAIL: LLDB (/Users/buildslave/jenkins/workspace/lldb-cmake-sanitized/lldb-build/bin/clang-11-x86_64) :: test_ptr_refs_dsym (TestPtrRefs.TestPtrRefs) <bound method SBProcess.Kill of <lldb.SBProcess; proxy of <Swig Object of type 'lldb::SBProcess *' at 0x10de73bd0> >>: success

Hide Details

runCmd: settings clear -all output:

Hide Details

runCmd: settings set symbols.enable-external-lookup false output:

Hide Details

runCmd: settings set target.auto-apply-fixits false output:

Hide Details

runCmd: settings set plugin.process.gdb-remote.packet-timeout 60 output:

Hide Details

runCmd: settings set symbols.clang-modules-cache-path "/Users/buildslave/jenkins/workspace/lldb-cmake-sanitized/lldb-build/lldb-test-build.noindex/module-cache-lldb/lldb-api" output:

Hide Details

runCmd: settings set use-color false output:

Hide Details

runCmd: setting set target.prefer-dynamic-value no-dynamic-values output:

Hide Details

runCmd: settings set target.env-vars ASAN_OPTIONS=detect_stack_use_after_return=1 DYLD_INSERT_LIBRARIES=/Users/buildslave/jenkins/workspace/lldb-cmake-sanitized/host-compiler/lib/clang/11.0.0/lib/darwin/libclang_rt.asan_osx_dynamic.dylib output:

Hide Details

runCmd: script import lldb.macosx.heap output:

Hide Details

runCmd: ptr_refs my_ptr runCmd failed! error: 'ptr_refs' is not a valid command.

Hide Details

Hide Details

XFAIL: LLDB (/Users/buildslave/jenkins/workspace/lldb-cmake-sanitized/lldb-build/bin/clang-11-x86_64) :: test_ptr_refs_dwarf (TestPtrRefs.TestPtrRefs) <bound method SBProcess.Kill of <lldb.SBProcess; proxy of <Swig Object of type 'lldb::SBProcess *' at 0x10d20d750> >>: success

Hide Details

UNSUPPORTED: LLDB (/Users/buildslave/jenkins/workspace/lldb-cmake-sanitized/lldb-build/bin/clang-11-x86_64) :: test_ptr_refs_dwo (TestPtrRefs.TestPtrRefs) (test case does not fall in any category of interest for this run) runCmd: settings clear -all output:

Hide Details

runCmd: settings set symbols.enable-external-lookup false output:

Hide Details

runCmd: settings set target.auto-apply-fixits false output:

Hide Details

runCmd: settings set plugin.process.gdb-remote.packet-timeout 60 output:

Hide Details

runCmd: settings set symbols.clang-modules-cache-path "/Users/buildslave/jenkins/workspace/lldb-cmake-sanitized/lldb-build/lldb-test-build.noindex/module-cache-lldb/lldb-api" output:

Hide Details

runCmd: settings set use-color false output:

Hide Details

runCmd: setting set target.prefer-dynamic-value no-dynamic-values output:

Hide Details

runCmd: settings set target.env-vars ASAN_OPTIONS=detect_stack_use_after_return=1 DYLD_INSERT_LIBRARIES=/Users/buildslave/jenkins/workspace/lldb-cmake-sanitized/host-compiler/lib/clang/11.0.0/lib/darwin/libclang_rt.asan_osx_dynamic.dylib output:

Hide Details

runCmd: script import lldb.macosx.heap output:

Hide Details

runCmd: ptr_refs my_ptr runCmd failed! error: 'ptr_refs' is not a valid command.

Hide Details

Hide Details

XFAIL: LLDB (/Users/buildslave/jenkins/workspace/lldb-cmake-sanitized/lldb-build/bin/clang-11-x86_64) :: test_ptr_refs_gmodules (TestPtrRefs.TestPtrRefs) <bound method SBProcess.Kill of <lldb.SBProcess; proxy of <Swig Object of type 'lldb::SBProcess *' at 0x10da161b0> >>: success

Hide Details

Restore dir to: /Users/buildslave/jenkins/workspace/lldb-cmake-sanitized/lldb-build/tools/lldb/test ====================================================================== FAIL: test_ptr_refs_dsym (TestPtrRefs.TestPtrRefs) Test format string functionality. ---------------------------------------------------------------------- Traceback (most recent call last): File "/Users/buildslave/jenkins/workspace/lldb-cmake-sanitized/llvm-project/lldb/packages/Python/lldbsuite/test/lldbtest.py", line 1752, in test_method return attrvalue(self) File "/Users/buildslave/jenkins/workspace/lldb-cmake-sanitized/llvm-project/lldb/packages/Python/lldbsuite/test/decorators.py", line 110, in wrapper func(*args, **kwargs) File "/Users/buildslave/jenkins/workspace/lldb-cmake-sanitized/llvm-project/lldb/test/API/functionalities/ptr_refs/TestPtrRefs.py", line 47, in test_ptr_refs self.expect("ptr_refs my_ptr", substrs=["malloc", "stack"]) File "/Users/buildslave/jenkins/workspace/lldb-cmake-sanitized/llvm-project/lldb/packages/Python/lldbsuite/test/lldbtest.py", line 2392, in expect if msg else EXP_MSG(str, output, exe)) AssertionError: False is not True : 'ptr_refs my_ptr' returns expected result, got '0x00007ffeebc0e478: stack in frame #0 of thread #1: tid 0x1808910 in variable at 0x7ffeebc0e478: (const char *) my_ptr = 0x00006020000000b0 "hello" 0x00007ffeebc0e410: stack (red zone)' Config=x86_64-/Users/buildslave/jenkins/workspace/lldb-cmake-sanitized/lldb-build/bin/clang-11 ---------------------------------------------------------------------- Ran 4 tests in 8.806s

Hide Details

RESULT: FAILED (0 passes, 1 failures, 0 errors, 1 skipped, 2 expected failures, 0 unexpected successes)

Hide Details

--

Hide Details

******************** PASS: lldb-shell :: Driver/TestConvenienceVariables.test (1177 of 2020) PASS: lldb-unit :: Symbol/./SymbolTests/TestClangASTImporter.DeportTypeTagDecl (1178 of 2020) PASS: lldb-shell :: ObjectFile/ELF/base-address.yaml (1179 of 2020) UNSUPPORTED: lldb-shell :: SymbolFile/Breakpad/stack-cfi-arm.yaml (1180 of 2020) PASS: lldb-api :: lang/cpp/stl/TestStdCXXDisassembly.py (1181 of 2020) PASS: lldb-unit :: Utility/./UtilityTests/StreamTeeTest.Flush (1182 of 2020) PASS: lldb-api :: macosx/universal/TestUniversal.py (1183 of 2020) PASS: lldb-api :: commands/expression/pr35310/TestExprsBug35310.py (1184 of 2020) PASS: lldb-shell :: ObjectFile/MachO/lc_build_version_notools.yaml (1185 of 2020) PASS: lldb-api :: commands/expression/weak_symbols/TestWeakSymbols.py (1186 of 2020) PASS: lldb-api :: commands/expression/import-std-module/list-dbg-info-content/TestDbgInfoContentListFromStdModule.py (1187 of 2020) PASS: lldb-api :: commands/expression/namespace_local_var_same_name_cpp_and_c/TestNamespaceLocalVarSameNameCppAndC.py (1188 of 2020) PASS: lldb-unit :: Process/gdb-remote/./ProcessGdbRemoteTests/GDBRemoteCommunicationServerTest.SendErrorResponse_ErrorNumber (1189 of 2020) PASS: lldb-api :: tools/lldb-vscode/launch/TestVSCode_launch.py (1190 of 2020) PASS: lldb-api :: functionalities/breakpoint/breakpoint_ignore_count/TestBreakpointIgnoreCount.py (1191 of 2020) PASS: lldb-unit :: UnwindAssembly/x86/./UnwindAssemblyx86Tests/Testx86AssemblyInspectionEngine.TestPushEAX (1192 of 2020) PASS: lldb-api :: lang/cpp/template/TestTemplateArgs.py (1193 of 2020) UNSUPPORTED: lldb-shell :: SymbolFile/PDB/compilands.test (1194 of 2020) PASS: lldb-shell :: Expr/TestTypeOfDeclTypeExpr.test (1195 of 2020) PASS: lldb-unit :: Utility/./UtilityTests/TimeoutTest.Construction (1196 of 2020) PASS: lldb-api :: lang/c/stepping/TestStepAndBreakpoints.py (1197 of 2020) PASS: lldb-api :: macosx/indirect_symbol/TestIndirectSymbols.py (1198 of 2020) PASS: lldb-shell :: SymbolFile/DWARF/module-ownership.mm (1199 of 2020) UNSUPPORTED: lldb-shell :: SymbolFile/PDB/variables-locations.test (1200 of 2020) PASS: lldb-api :: lang/c/stepping/TestThreadStepping.py (1201 of 2020) PASS: lldb-unit :: ObjectFile/Breakpad/./ObjectFileBreakpadTests/InfoRecord.parse (1202 of 2020) PASS: lldb-api :: python_api/formatters/TestFormattersSBAPI.py (1203 of 2020) PASS: lldb-unit :: Utility/./UtilityTests/StreamTeeTest.Assignment (1204 of 2020) PASS: lldb-unit :: Utility/./UtilityTests/RegularExpression.Empty (1205 of 2020) PASS: lldb-api :: functionalities/breakpoint/inlined_breakpoints/TestInlinedBreakpoints.py (1206 of 2020) PASS: lldb-api :: functionalities/tail_call_frames/disambiguate_paths_to_common_sink/TestDisambiguatePathsToCommonSink.py (1207 of 2020) PASS: lldb-shell :: SymbolFile/DWARF/debug_aranges-empty-section.s (1208 of 2020) PASS: lldb-api :: api/check_public_api_headers/TestPublicAPIHeaders.py (1209 of 2020) PASS: lldb-unit :: Utility/./UtilityTests/UriParserTest.BracketedHostnameWithColon (1210 of 2020) PASS: lldb-api :: functionalities/data-formatter/type_summary_list_arg/TestTypeSummaryListArg.py (1211 of 2020) PASS: lldb-unit :: Utility/./UtilityTests/AnsiTerminal.Incomplete (1212 of 2020) PASS: lldb-unit :: ScriptInterpreter/Python/./ScriptInterpreterPythonTests/PythonDataObjectsTest.TestPythonInteger (1213 of 2020) PASS: lldb-unit :: Utility/./UtilityTests/Flags.AnyClear (1214 of 2020) PASS: lldb-unit :: Host/./HostTests/NativeProcessProtocolTest.SetBreakpointFailVerify (1215 of 2020) PASS: lldb-unit :: Symbol/./SymbolTests/TestTypeSystemClang.TestRecordHasFields (1216 of 2020) PASS: lldb-unit :: Target/./TargetTests/ModuleCacheTest.GetAndPutUuidExists (1217 of 2020) PASS: lldb-unit :: Host/./HostTests/MainLoopTest.UnmonitoredSignal (1218 of 2020) PASS: lldb-unit :: Utility/./UtilityTests/StreamTest.ShiftOperatorPtr (1219 of 2020) PASS: lldb-unit :: Process/gdb-remote/./ProcessGdbRemoteTests/GDBRemoteClientBaseTest.SendContinueAndLateInterrupt (1220 of 2020) PASS: lldb-unit :: SymbolFile/NativePDB/./SymbolFileNativePDBTests/PDBFPOProgramToDWARFExpressionTests.UnresolvedRegisterReference (1221 of 2020) PASS: lldb-api :: python_api/objc_type/TestObjCType.py (1222 of 2020) PASS: lldb-unit :: Utility/./UtilityTests/ArgsTest.TestTrailingBackslash (1223 of 2020) PASS: lldb-api :: functionalities/postmortem/mach-core/TestMachCore.py (1224 of 2020) UNSUPPORTED: lldb-shell :: SymbolFile/PDB/enums-layout.test (1225 of 2020) PASS: lldb-shell :: SymbolFile/DWARF/find-inline-method.s (1226 of 2020) PASS: lldb-unit :: Language/Highlighting/./HighlighterTests/HighlighterTest.ClangUnterminatedString (1227 of 2020) PASS: lldb-unit :: Utility/./UtilityTests/DataExtractorTest.GetCStrEmpty (1228 of 2020) PASS: lldb-api :: commands/expression/import_base_class_when_class_has_derived_member/TestImportBaseClassWhenClassHasDerivedMember.py (1229 of 2020) PASS: lldb-unit :: Utility/./UtilityTests/UriParserTest.BracketedHostnamePort (1230 of 2020) PASS: lldb-unit :: Utility/./UtilityTests/StringListTest.InsertStringAtIndexMove (1231 of 2020) PASS: lldb-api :: functionalities/gdb_remote_client/TestGDBRemoteClient.py (1232 of 2020) PASS: lldb-unit :: Interpreter/./InterpreterTests/CompletionTest.FileCompletionAbsolute (1233 of 2020) PASS: lldb-shell :: SymbolFile/NativePDB/ast-functions.cpp (1234 of 2020) PASS: lldb-shell :: Commands/command-regex-delete.test (1235 of 2020) PASS: lldb-unit :: Utility/./UtilityTests/UriParserTest.SchemeHostSeparator2 (1236 of 2020) PASS: lldb-api :: lang/c/global_variables/TestGlobalVariables.py (1237 of 2020) PASS: lldb-unit :: Core/./LLDBCoreTests/MangledTest.ResultForBlockInvocation (1238 of 2020) UNSUPPORTED: lldb-api :: commands/expression/multiline-navigation/TestMultilineNavigation.py (1239 of 2020) UNSUPPORTED: lldb-api :: commands/register/register/intel_xtended_registers/mpx_bound_violation/TestBoundViolation.py (1240 of 2020) PASS: lldb-unit :: UnwindAssembly/x86/./UnwindAssemblyx86Tests/Testx86AssemblyInspectionEngine.TestSimplei386ugmented (1241 of 2020) PASS: lldb-api :: commands/expression/import-std-module/forward_list/TestForwardListFromStdModule.py (1242 of 2020) PASS: lldb-api :: tools/lldb-server/TestGdbRemoteKill.py (1243 of 2020) PASS: lldb-unit :: Utility/./UtilityTests/ConstStringTest.NullAndEmptyStates (1244 of 2020) PASS: lldb-api :: python_api/sbvalue_const_addrof/TestSBValueConstAddrOf.py (1245 of 2020) PASS: lldb-unit :: Language/CPlusPlus/./LanguageCPlusPlusTests/CPlusPlusLanguage.MethodNameParsing (1246 of 2020) PASS: lldb-api :: functionalities/completion/TestCompletion.py (1247 of 2020) PASS: lldb-unit :: Utility/./UtilityTests/RangeDataVector.CustomSort (1248 of 2020) PASS: lldb-api :: python_api/signals/TestSignalsAPI.py (1249 of 2020) PASS: lldb-api :: commands/expression/import-std-module/weak_ptr-dbg-info-content/TestDbgInfoContentWeakPtrFromStdModule.py (1250 of 2020) PASS: lldb-unit :: Utility/./UtilityTests/StringListTest.ForRange (1251 of 2020) PASS: lldb-shell :: Quit/TestQuitExitCodeHex0.test (1252 of 2020) UNSUPPORTED: lldb-api :: functionalities/darwin_log/filter/regex/category/TestDarwinLogFilterRegexCategory.py (1253 of 2020) PASS: lldb-unit :: Utility/./UtilityTests/OptionsWithRawTest.EmptyArgsOnlySuffix (1254 of 2020) PASS: lldb-api :: functionalities/process_crash_info/TestProcessCrashInfo.py (1255 of 2020) PASS: lldb-api :: commands/watchpoints/watchpoint_commands/TestWatchpointCommands.py (1256 of 2020) PASS: lldb-shell :: SymbolFile/DWARF/debug-types-dwarf5.s (1257 of 2020) PASS: lldb-api :: commands/expression/dollar-in-variable/TestDollarInVariable.py (1258 of 2020) PASS: lldb-unit :: Utility/./UtilityTests/DataExtractorTest.PeekData (1259 of 2020) PASS: lldb-unit :: Utility/./UtilityTests/OptionsWithRawTest.QuotedSuffix (1260 of 2020) UNSUPPORTED: lldb-api :: functionalities/asan/TestReportData.py (1261 of 2020) PASS: lldb-unit :: Utility/./UtilityTests/FileSpecTest.FileAndDirectoryComponents (1262 of 2020) PASS: lldb-unit :: Utility/./UtilityTests/FileSpecTest.EqualDotsPosixRoot (1263 of 2020) PASS: lldb-api :: functionalities/postmortem/elf-core/TestLinuxCore.py (1264 of 2020) PASS: lldb-unit :: Signals/./SignalsTests/UnixSignalsTest.Iteration (1265 of 2020) PASS: lldb-unit :: Utility/./UtilityTests/UserIDResolver.GetUserName (1266 of 2020) PASS: lldb-unit :: ScriptInterpreter/Python/./ScriptInterpreterPythonTests/PythonDataObjectsTest.TestPythonByteArray (1267 of 2020) PASS: lldb-unit :: ScriptInterpreter/Python/./ScriptInterpreterPythonTests/PythonDataObjectsTest.TestGlobalNameResolutionWithDot (1268 of 2020) UNSUPPORTED: lldb-shell :: Register/x86-64-xmm16-read.test (1269 of 2020) PASS: lldb-shell :: Settings/TestEchoCommands.test (1270 of 2020) PASS: lldb-unit :: Process/gdb-remote/./ProcessGdbRemoteTests/GDBRemoteClientBaseTest.SendContinueAndInterrupt2PacketBug (1271 of 2020) PASS: lldb-api :: commands/watchpoints/hello_watchpoint/TestMyFirstWatchpoint.py (1272 of 2020) PASS: lldb-unit :: Process/minidump/./LLDBMinidumpTests/MinidumpParserTest.GetPid (1273 of 2020) PASS: lldb-unit :: Utility/./UtilityTests/ScalarTest.Promotion (1274 of 2020) PASS: lldb-api :: functionalities/backticks/TestBackticksWithoutATarget.py (1275 of 2020) PASS: lldb-unit :: API/./APITests/SBCommandInterpreterTest.SingleWordCommand (1276 of 2020) PASS: lldb-unit :: Utility/./UtilityTests/BinaryStreamTest.PutSLEB128NineBytes (1277 of 2020) PASS: lldb-api :: functionalities/gdb_remote_client/TestThreadSelectionBug.py (1278 of 2020) PASS: lldb-shell :: ObjectFile/wasm/stripped-debug-sections.yaml (1279 of 2020) PASS: lldb-api :: functionalities/thread/concurrent_events/TestConcurrentWatchBreakDelay.py (1280 of 2020) PASS: lldb-unit :: Utility/./UtilityTests/FileSpecTest.OperatorBool (1281 of 2020) PASS: lldb-api :: python_api/function_symbol/TestSymbolAPI.py (1282 of 2020) PASS: lldb-api :: lang/cpp/member-and-local-vars-with-same-name/TestMembersAndLocalsWithSameName.py (1283 of 2020) UNSUPPORTED: lldb-shell :: SymbolFile/PDB/pointers.test (1284 of 2020) PASS: lldb-api :: functionalities/load_using_paths/TestLoadUsingPaths.py (1285 of 2020) PASS: lldb-api :: commands/disassemble/basic/TestDisassembleBreakpoint.py (1286 of 2020) PASS: lldb-unit :: Utility/./UtilityTests/StringListTest.GetMaxStringLengthDecreasingSize (1287 of 2020) PASS: lldb-shell :: Commands/CommandScriptImmediateOutput/CommandScriptImmediateOutputFile.test (1288 of 2020) PASS: lldb-unit :: Utility/./UtilityTests/StreamTest.ChangingByteOrder (1289 of 2020) PASS: lldb-api :: lang/cpp/namespace/TestNamespace.py (1290 of 2020) UNSUPPORTED: lldb-shell :: SymbolFile/PDB/udt-layout.test (1291 of 2020) PASS: lldb-api :: functionalities/data-formatter/data-formatter-stl/libcxx/atomic/TestLibCxxAtomic.py (1292 of 2020) PASS: lldb-unit :: Utility/./UtilityTests/StringExtractorTest.GetHexBytes_Partial (1293 of 2020) PASS: lldb-api :: lang/objc/objc_direct-methods/TestObjCDirectMethods.py (1294 of 2020) PASS: lldb-api :: commands/expression/ir-interpreter/TestIRInterpreter.py (1295 of 2020) PASS: lldb-unit :: Host/./HostTests/FileActionTest.Open (1296 of 2020) PASS: lldb-unit :: Language/Highlighting/./HighlighterTests/HighlighterTest.ClangTrailingBackslashBeforeNewline (1297 of 2020) PASS: lldb-api :: functionalities/thread/concurrent_events/TestConcurrentWatchBreak.py (1298 of 2020) PASS: lldb-unit :: Utility/./UtilityTests/StreamTest.AddressRangeSize (1299 of 2020) PASS: lldb-api :: functionalities/tail_call_frames/cross_dso/TestCrossDSOTailCalls.py (1300 of 2020) PASS: lldb-unit :: Utility/./UtilityTests/StringExtractorTest.GetU32LittleEndian (1301 of 2020) PASS: lldb-unit :: Utility/./UtilityTests/PassiveReplayTest.InstrumentedFooInvalid (1302 of 2020) PASS: lldb-unit :: Utility/./UtilityTests/ScalarTest.SetValueFromCString (1303 of 2020) PASS: lldb-shell :: Settings/TestFrameFormatMangling.test (1304 of 2020) PASS: lldb-api :: lang/objc/objc-runtime-ivars/TestRuntimeIvars.py (1305 of 2020) PASS: lldb-unit :: Process/minidump/./LLDBMinidumpTests/RegisterContextMinidump.CheckRegisterContextMinidump_ARM (1306 of 2020) PASS: lldb-api :: functionalities/thread/num_threads/TestNumThreads.py (1307 of 2020) PASS: lldb-api :: functionalities/unwind/noreturn/module-end/TestNoReturnModuleEnd.py (1308 of 2020) PASS: lldb-shell :: Reproducer/TestRelativePath.test (1309 of 2020) PASS: lldb-api :: commands/expression/import-std-module/no-std-module/TestMissingStdModule.py (1310 of 2020) PASS: lldb-api :: commands/expression/import-std-module/vector/TestVectorFromStdModule.py (1311 of 2020) PASS: lldb-unit :: Utility/./UtilityTests/StreamTest.PutHex32ByteOrderBig (1312 of 2020) PASS: lldb-shell :: SymbolFile/Breakpad/line-table-edgecases.test (1313 of 2020) PASS: lldb-shell :: Expr/TestMultilineExpr.test (1314 of 2020) PASS: lldb-api :: lang/objc/objc-struct-return/TestObjCStructReturn.py (1315 of 2020) UNSUPPORTED: lldb-api :: tools/lldb-server/libraries-svr4/TestGdbRemoteLibrariesSvr4Support.py (1316 of 2020) PASS: lldb-api :: lang/objcxx/cxx-bridged-po/TestObjCXXBridgedPO.py (1317 of 2020) PASS: lldb-api :: functionalities/fat_archives/TestFatArchives.py (1318 of 2020) PASS: lldb-unit :: Language/Highlighting/./HighlighterTests/HighlighterTest.FallbackHighlighter (1319 of 2020) PASS: lldb-api :: commands/expression/vector_of_enums/TestVectorOfEnums.py (1320 of 2020) PASS: lldb-shell :: SymbolFile/NativePDB/s_constant.cpp (1321 of 2020) PASS: lldb-unit :: Utility/./UtilityTests/StreamTeeTest.Write (1322 of 2020) PASS: lldb-unit :: Utility/./UtilityTests/StatusTest.ErrorConversion (1323 of 2020) PASS: lldb-unit :: Host/./HostTests/SocketTest.TCPGetConnectURI (1324 of 2020) PASS: lldb-unit :: Utility/./UtilityTests/StringExtractorTest.GetNameColonValueNoSemicolon (1325 of 2020) PASS: lldb-api :: commands/watchpoints/watchpoint_commands/command/TestWatchpointCommandLLDB.py (1326 of 2020) PASS: lldb-api :: functionalities/gdb_remote_client/TestJLink6Armv7RegisterDefinition.py (1327 of 2020) PASS: lldb-shell :: SymbolFile/DWARF/find-variable-dwo.cpp (1328 of 2020) PASS: lldb-api :: commands/platform/basic/TestPlatformPython.py (1329 of 2020) PASS: lldb-unit :: ScriptInterpreter/Python/./ScriptInterpreterPythonTests/PythonDataObjectsTest.TestPythonStringToStr (1330 of 2020) PASS: lldb-unit :: Host/./HostTests/File.GetStreamFromDescriptor (1331 of 2020) PASS: lldb-api :: api/multiple-targets/TestMultipleTargets.py (1332 of 2020) PASS: lldb-api :: lang/objc/rdar-11355592/TestRdar11355592.py (1333 of 2020) PASS: lldb-api :: commands/expression/completion-in-lambda-and-unnamed-class/TestCompletionInLambdaAndUnnamedClass.py (1334 of 2020) PASS: lldb-api :: sample_test/TestSampleInlineTest.py (1335 of 2020) PASS: lldb-unit :: Process/gdb-remote/./ProcessGdbRemoteTests/GDBRemoteCommunicationClientTest.ReadRegister (1336 of 2020) PASS: lldb-unit :: Utility/./UtilityTests/EventTest.DumpEventDataBytes (1337 of 2020) PASS: lldb-unit :: Process/gdb-remote/./ProcessGdbRemoteTests/GDBRemoteCommunicationClientTest.SendSignalsToIgnore (1338 of 2020) PASS: lldb-unit :: Process/gdb-remote/./ProcessGdbRemoteTests/GDBRemoteClientBaseTest.SendContinueAndAsyncSignal (1339 of 2020) PASS: lldb-unit :: Host/./HostTests/SocketTest.UDPGetConnectURI (1340 of 2020) PASS: lldb-shell :: SymbolFile/DWARF/dwp-separate-debug-file.cpp (1341 of 2020) UNSUPPORTED: lldb-api :: functionalities/signal/handle-segv/TestHandleSegv.py (1342 of 2020) UNSUPPORTED: lldb-api :: tools/lldb-server/signal-filtering/TestGdbRemote_QPassSignals.py (1343 of 2020) PASS: lldb-shell :: Heap/heap-cstr.test (1344 of 2020) UNSUPPORTED: lldb-api :: benchmarks/stepping/TestSteppingSpeed.py (1345 of 2020) PASS: lldb-unit :: Utility/./UtilityTests/ArchSpecTest.MergeFrom (1346 of 2020) PASS: lldb-api :: lang/objc/radar-9691614/TestObjCMethodReturningBOOL.py (1347 of 2020) PASS: lldb-unit :: Symbol/./SymbolTests/TestTypeSystemClang.TestConvertAccessTypeToAccessSpecifier (1348 of 2020) PASS: lldb-api :: functionalities/gdb_remote_client/TestRegDefinitionInParts.py (1349 of 2020) PASS: lldb-unit :: Expression/./ExpressionTests/ClangExpressionDeclMapTest.TestPersistentDeclLookup (1350 of 2020) PASS: lldb-unit :: Utility/./UtilityTests/CompletionRequest.TryCompleteCurrentArgMode (1351 of 2020) UNSUPPORTED: lldb-shell :: SymbolFile/DWARF/debug-types-expressions.test (1352 of 2020) PASS: lldb-unit :: UnwindAssembly/x86/./UnwindAssemblyx86Tests/Testx86AssemblyInspectionEngine.Test32bitFramelessBigStackFrame (1353 of 2020) PASS: lldb-unit :: Target/./TargetTests/MCBasedABI.MapRegisterName (1354 of 2020) PASS: lldb-shell :: Breakpoint/debug_addrx.test (1355 of 2020) PASS: lldb-unit :: Host/./HostTests/ProcessLaunchInfoTest.Constructor (1356 of 2020) UNSUPPORTED: lldb-api :: commands/watchpoints/variable_out_of_scope/TestWatchedVarHitWhenInScope.py (1357 of 2020) PASS: lldb-api :: commands/expression/import-std-module/sysroot/TestStdModuleSysroot.py (1358 of 2020) UNSUPPORTED: lldb-api :: iohandler/resize/TestIOHandlerResize.py (1359 of 2020) PASS: lldb-api :: commands/log/invalid-args/TestInvalidArgsLog.py (1360 of 2020) PASS: lldb-api :: lang/cpp/bool/TestCPPBool.py (1361 of 2020) PASS: lldb-shell :: SymbolFile/NativePDB/globals-fundamental.cpp (1362 of 2020) PASS: lldb-api :: commands/expression/fixits/TestFixIts.py (1363 of 2020) PASS: lldb-api :: functionalities/gdb_remote_client/TestRecognizeBreakpoint.py (1364 of 2020) PASS: lldb-unit :: Expression/./ExpressionTests/ClangHostTest.ComputeClangResourceDirectory (1365 of 2020) PASS: lldb-shell :: SymbolFile/DWARF/parallel-indexing-stress.s (1366 of 2020) PASS: lldb-unit :: Utility/./UtilityTests/StreamTest.PutHex8 (1367 of 2020) PASS: lldb-unit :: Utility/./UtilityTests/ScalarTest.Equality (1368 of 2020) PASS: lldb-unit :: Utility/./UtilityTests/StringListTest.GetSize (1369 of 2020) PASS: lldb-unit :: ScriptInterpreter/Python/./ScriptInterpreterPythonTests/PythonDataObjectsTest.TestGlobalNameResolutionNoDot (1370 of 2020) PASS: lldb-unit :: UnwindAssembly/x86/./UnwindAssemblyx86Tests/Testx86AssemblyInspectionEngine.TestSubRSP (1371 of 2020) PASS: lldb-api :: lang/c/unicode/TestUnicodeSymbols.py (1372 of 2020) PASS: lldb-api :: commands/settings/quoting/TestQuoting.py (1373 of 2020) PASS: lldb-unit :: Utility/./UtilityTests/VMRange.CollectionContains (1374 of 2020) PASS: lldb-unit :: Utility/./UtilityTests/StreamTest.ShiftOperatorChars (1375 of 2020) PASS: lldb-api :: functionalities/breakpoint/breakpoint_set_restart/TestBreakpointSetRestart.py (1376 of 2020) PASS: lldb-api :: lang/cpp/global_variables/TestCPPGlobalVariables.py (1377 of 2020) PASS: lldb-api :: types/TestFloatTypes.py (1378 of 2020) PASS: lldb-unit :: Utility/./UtilityTests/StreamTest.PutSLEB128 (1379 of 2020) PASS: lldb-unit :: Interpreter/./InterpreterTests/OptionArgParserTest.toScriptLanguage (1380 of 2020) PASS: lldb-shell :: Breakpoint/single-file-split-dwarf.test (1381 of 2020) PASS: lldb-api :: functionalities/deleted-executable/TestDeletedExecutable.py (1382 of 2020) PASS: lldb-api :: lang/c/enum_types/TestEnumTypes.py (1383 of 2020) PASS: lldb-api :: tools/lldb-vscode/attach/TestVSCode_attach.py (1384 of 2020) PASS: lldb-api :: python_api/hello_world/TestHelloWorld.py (1385 of 2020) PASS: lldb-unit :: Utility/./UtilityTests/StreamTeeTest.Constructor2Streams (1386 of 2020) PASS: lldb-unit :: Symbol/./SymbolTests/LineEntryTest.GetSameLineContiguousAddressRangeNoInlines (1387 of 2020) PASS: lldb-unit :: Utility/./UtilityTests/DataExtractorTest.UncommonAddressSize (1388 of 2020) PASS: lldb-unit :: Utility/./UtilityTests/FileSpecTest.GuessPathStyle (1389 of 2020) PASS: lldb-api :: functionalities/data-formatter/data-formatter-stl/libcxx/queue/TestDataFormatterLibcxxQueue.py (1390 of 2020) PASS: lldb-api :: functionalities/paths/TestPaths.py (1391 of 2020) PASS: lldb-unit :: Expression/./ExpressionTests/DWARFExpression.DW_OP_pick (1392 of 2020) PASS: lldb-api :: commands/expression/issue_11588/Test11588.py (1393 of 2020) PASS: lldb-unit :: Utility/./UtilityTests/BinaryStreamTest.PutULEB128MaxValue (1394 of 2020) PASS: lldb-unit :: Utility/./UtilityTests/NameMatchesTest.Ignore (1395 of 2020) PASS: lldb-api :: lang/c/set_values/TestSetValues.py (1396 of 2020) PASS: lldb-unit :: Utility/./UtilityTests/ArgsTest.TestArgv (1397 of 2020) PASS: lldb-unit :: Process/gdb-remote/./ProcessGdbRemoteTests/GDBRemoteClientBaseTest.InterruptNoResponse (1398 of 2020) PASS: lldb-api :: lang/cpp/accelerator-table/TestCPPAccelerator.py (1399 of 2020) PASS: lldb-api :: python_api/name_lookup/TestNameLookup.py (1400 of 2020) PASS: lldb-unit :: Utility/./UtilityTests/FileSpecTest.Yaml (1401 of 2020) PASS: lldb-unit :: Utility/./UtilityTests/ConstStringTest.format_provider (1402 of 2020) PASS: lldb-api :: functionalities/thread/concurrent_events/TestConcurrentSignalNWatchNBreak.py (1403 of 2020) UNSUPPORTED: lldb-shell :: ScriptInterpreter/Lua/breakpoint_callback.test (1404 of 2020) PASS: lldb-shell :: Reproducer/TestMultipleTargets.test (1405 of 2020) UNSUPPORTED: lldb-api :: functionalities/exec/TestExec.py (1406 of 2020) PASS: lldb-unit :: Utility/./UtilityTests/StringListTest.LongestCommonPrefixEmpty (1407 of 2020) PASS: lldb-api :: functionalities/type_lookup/TestTypeLookup.py (1408 of 2020) PASS: lldb-unit :: Utility/./UtilityTests/DataExtractorTest.GetCStrAtEnd (1409 of 2020) PASS: lldb-unit :: Utility/./UtilityTests/UriParserTest.BadPort (1410 of 2020) UNSUPPORTED: lldb-api :: arm/breakpoint-thumb-codesection/TestBreakpointThumbCodesection.py (1411 of 2020) PASS: lldb-unit :: Process/minidump/./LLDBMinidumpTests/MinidumpParserTest.FindMemoryRangeWithFullMemoryMinidump (1412 of 2020) PASS: lldb-unit :: ObjectFile/ELF/./ObjectFileELFTests/ObjectFileELFTest.GetModuleSpecifications_EarlySectionHeaders (1413 of 2020) PASS: lldb-api :: functionalities/gdb_remote_client/TestStopPCs.py (1414 of 2020) PASS: lldb-api :: functionalities/breakpoint/step_over_breakpoint/TestStepOverBreakpoint.py (1415 of 2020) PASS: lldb-shell :: ScriptInterpreter/Python/crashlog.test (1416 of 2020) PASS: lldb-shell :: ObjectFile/ELF/PT_LOAD-empty.yaml (1417 of 2020) PASS: lldb-unit :: Process/gdb-remote/./ProcessGdbRemoteTests/GDBRemoteCommunicationClientTest.SendGetMetaDataPacket (1418 of 2020) PASS: lldb-shell :: ObjectFile/ELF/section-permissions.yaml (1419 of 2020) PASS: lldb-api :: tools/lldb-vscode/console/TestVSCode_console.py (1420 of 2020) PASS: lldb-api :: functionalities/data-formatter/hexcaps/TestDataFormatterHexCaps.py (1421 of 2020) PASS: lldb-api :: macosx/thread_suspend/TestInternalThreadSuspension.py (1422 of 2020) PASS: lldb-unit :: Utility/./UtilityTests/UriParserTest.BadPort2 (1423 of 2020) UNSUPPORTED: lldb-api :: functionalities/breakpoint/breakpoint_in_delayslot/TestAvoidBreakpointInDelaySlot.py (1424 of 2020) PASS: lldb-api :: commands/command/history/TestCommandHistory.py (1425 of 2020) PASS: lldb-unit :: Utility/./UtilityTests/VMRange.ContainsRange (1426 of 2020) PASS: lldb-unit :: Process/minidump/./LLDBMinidumpTests/MinidumpParserTest.GetPidWindows (1427 of 2020) PASS: lldb-unit :: Utility/./UtilityTests/SubsystemRAIITest.NormalSubsystem (1428 of 2020) UNSUPPORTED: lldb-api :: functionalities/darwin_log/filter/exact_match/subsystem/TestDarwinLogFilterMatchSubsystem.py (1429 of 2020) UNSUPPORTED: lldb-api :: functionalities/unwind/ehframe/TestEhFrameUnwind.py (1430 of 2020) PASS: lldb-unit :: Utility/./UtilityTests/StringLexerTest.AdvanceIf (1431 of 2020) PASS: lldb-api :: functionalities/postmortem/minidump-new/TestMiniDumpNew.py (1432 of 2020) PASS: lldb-unit :: Expression/./ExpressionTests/DiagnosticManagerTest.AppendMessageNoDiag (1433 of 2020) PASS: lldb-api :: commands/expression/completion-crash-incomplete-record/TestCompletionCrashIncompleteRecord.py (1434 of 2020) PASS: lldb-api :: commands/expression/persistent_types/TestPersistentTypes.py (1435 of 2020) PASS: lldb-api :: lang/objc/modules-incomplete/TestIncompleteModules.py (1436 of 2020) PASS: lldb-shell :: SymbolFile/DWARF/DW_TAG_basic_type_DW_ATE_UTF_nonC.ll (1437 of 2020) PASS: lldb-shell :: Reproducer/Functionalities/TestDataFormatter.test (1438 of 2020) PASS: lldb-api :: commands/frame/diagnose/dereference-this/TestDiagnoseDereferenceThis.py (1439 of 2020) UNSUPPORTED: lldb-shell :: Expr/TestIRMemoryMapWindows.test (1440 of 2020) PASS: lldb-api :: python_api/process/io/TestProcessIO.py (1441 of 2020) PASS: lldb-shell :: Reproducer/TestCrash.test (1442 of 2020) PASS: lldb-unit :: Utility/./UtilityTests/VASprintfTest.NoBufferResize (1443 of 2020) PASS: lldb-shell :: SymbolFile/NativePDB/break-by-function.cpp (1444 of 2020) PASS: lldb-api :: functionalities/thread/concurrent_events/TestConcurrentSignalDelayBreak.py (1445 of 2020) PASS: lldb-unit :: Expression/./ExpressionTests/DiagnosticManagerTest.GetStringMultiline (1446 of 2020) PASS: lldb-api :: commands/expression/namespace_local_var_same_name_obj_c/TestNamespaceLocalVarSameNameObjC.py (1447 of 2020) PASS: lldb-unit :: Utility/./UtilityTests/BinaryStreamTest.PutULEB128NineBytes (1448 of 2020) PASS: lldb-unit :: DataFormatter/./LLDBFormatterTests/FormatManagerTests.CompatibleLangs (1449 of 2020) PASS: lldb-api :: functionalities/inline-stepping/TestInlineStepping.py (1450 of 2020) PASS: lldb-api :: lang/cpp/class_types/TestClassTypesDisassembly.py (1451 of 2020) PASS: lldb-api :: functionalities/data-formatter/data-formatter-proper-plurals/TestFormattersOneIsSingular.py (1452 of 2020) PASS: lldb-unit :: Utility/./UtilityTests/BinaryStreamTest.PutSLEB128SixBytes (1453 of 2020) PASS: lldb-api :: lang/cpp/unique-types/TestUniqueTypes.py (1454 of 2020) PASS: lldb-unit :: Utility/./UtilityTests/DataExtractorTest.GetMaxU64 (1455 of 2020) PASS: lldb-shell :: SymbolFile/NativePDB/function-types-calling-conv.cpp (1456 of 2020) PASS: lldb-unit :: Expression/./ExpressionTests/DiagnosticManagerTest.PutStringMultiple (1457 of 2020) UNSUPPORTED: lldb-api :: functionalities/gdb_remote_client/TestWasm.py (1458 of 2020) PASS: lldb-unit :: SymbolFile/NativePDB/./SymbolFileNativePDBTests/PDBFPOProgramToDWARFExpressionTests.UnknownOp (1459 of 2020) PASS: lldb-unit :: Utility/./UtilityTests/FileSpecTest.EqualDotsPosix (1460 of 2020) PASS: lldb-api :: lang/objc/foundation/TestObjCMethodsNSArray.py (1461 of 2020) PASS: lldb-api :: functionalities/thread/concurrent_events/TestConcurrentCrashWithWatchpointBreakpointSignal.py (1462 of 2020) PASS: lldb-shell :: Breakpoint/debug_rnglist_rlestartend.test (1463 of 2020) PASS: lldb-unit :: ScriptInterpreter/Python/./ScriptInterpreterPythonTests/PythonDataObjectsTest.TestScript (1464 of 2020) PASS: lldb-unit :: Utility/./UtilityTests/StringExtractorTest.GetHexU8_Underflow2_NoEof (1465 of 2020) PASS: lldb-unit :: Utility/./UtilityTests/OptionsWithRawTest.EmptySuffixSingleWhitespace (1466 of 2020) PASS: lldb-api :: tools/lldb-server/TestAppleSimulatorOSType.py (1467 of 2020) PASS: lldb-shell :: SymbolFile/DWARF/dwarf5-partial-index.cpp (1468 of 2020) PASS: lldb-shell :: SymbolFile/DWARF/debug_ranges_and_rnglists.test (1469 of 2020) PASS: lldb-unit :: Language/Highlighting/./HighlighterTests/HighlighterTest.ClangCursorPos (1470 of 2020) UNSUPPORTED: lldb-shell :: Register/x86-ymm-write.test (1471 of 2020) PASS: lldb-shell :: SymbolFile/DWARF/debug_loc_and_loclists.s (1472 of 2020) PASS: lldb-unit :: Utility/./UtilityTests/StreamTest.AddressSize (1473 of 2020) PASS: lldb-api :: commands/expression/formatters/TestFormatters.py (1474 of 2020) PASS: lldb-shell :: SymbolFile/DWARF/dir-separator-no-comp-dir.s (1475 of 2020) PASS: lldb-api :: python_api/sbtype_typeclass/TestSBTypeTypeClass.py (1476 of 2020) PASS: lldb-api :: functionalities/tail_call_frames/disambiguate_call_site/TestDisambiguateCallSite.py (1477 of 2020) PASS: lldb-unit :: Utility/./UtilityTests/RangeDataVector.FindEntryThatContains (1478 of 2020) PASS: lldb-api :: functionalities/tail_call_frames/ambiguous_tail_call_seq2/TestAmbiguousTailCallSeq2.py (1479 of 2020) PASS: lldb-api :: lang/c/shared_lib/TestSharedLib.py (1480 of 2020) PASS: lldb-api :: functionalities/data-formatter/nssetsynth/TestNSSetSynthetic.py (1481 of 2020) PASS: lldb-api :: types/TestRecursiveTypes.py (1482 of 2020) PASS: lldb-unit :: Process/gdb-remote/./ProcessGdbRemoteTests/GDBRemoteCommunicationServerTest.SendErrorResponse_StringError (1483 of 2020) PASS: lldb-unit :: Utility/./UtilityTests/StringExtractorTest.DecodeHexU8_InvalidHex (1484 of 2020) PASS: lldb-unit :: Utility/./UtilityTests/ArchSpecTest.OperatorBool (1485 of 2020) UNSUPPORTED: lldb-api :: lang/objc/objc-dynamic-value/TestObjCDynamicValue.py (1486 of 2020) PASS: lldb-unit :: Utility/./UtilityTests/RangeTest.ContainsRangeStartingFromZero (1487 of 2020) PASS: lldb-api :: functionalities/data-formatter/data-formatter-objc/nsstring/TestDataFormatterNSString.py (1488 of 2020) PASS: lldb-unit :: Utility/./UtilityTests/StringExtractorTest.DecodeHexU8_Extra (1489 of 2020) PASS: lldb-unit :: Utility/./UtilityTests/StreamTest.PutBytesAsRawHex8ToMixedEndian (1490 of 2020) PASS: lldb-unit :: Utility/./UtilityTests/StringExtractorTest.DecodeHexU8_Underflow2 (1491 of 2020) PASS: lldb-unit :: Utility/./UtilityTests/NameMatchesTest.EndsWith (1492 of 2020) PASS: lldb-api :: tools/lldb-server/TestLldbGdbServer.py (1493 of 2020) PASS: lldb-api :: functionalities/avoids-fd-leak/TestFdLeak.py (1494 of 2020) PASS: lldb-api :: commands/frame/diagnose/local-variable/TestLocalVariable.py (1495 of 2020) PASS: lldb-unit :: Utility/./UtilityTests/StreamTest.AddressRange (1496 of 2020) PASS: lldb-unit :: Language/Highlighting/./HighlighterTests/HighlighterTest.ClangCursorOutOfBounds (1497 of 2020) PASS: lldb-unit :: Utility/./UtilityTests/ArgsTest.ReplaceArgumentAtIndexOutOfRange (1498 of 2020) PASS: lldb-shell :: ObjectFile/ELF/many-sections.s (1499 of 2020) PASS: lldb-api :: commands/frame/select/TestFrameSelect.py (1500 of 2020) PASS: lldb-api :: functionalities/data-formatter/synthcapping/TestSyntheticCapping.py (1501 of 2020) PASS: lldb-shell :: ObjectFile/PECOFF/basic-info.yaml (1502 of 2020) PASS: lldb-shell :: SymbolFile/DWARF/debug_ranges.s (1503 of 2020) PASS: lldb-unit :: ObjectFile/ELF/./ObjectFileELFTests/ObjectFileELFTest.GetSymtab_NoSymEntryPointArmAddressClass (1504 of 2020) PASS: lldb-unit :: UnwindAssembly/x86/./UnwindAssemblyx86Tests/Testx86AssemblyInspectionEngine.TestPopR14 (1505 of 2020) PASS: lldb-unit :: UnwindAssembly/x86/./UnwindAssemblyx86Tests/Testx86AssemblyInspectionEngine.TestPushEDI (1506 of 2020) PASS: lldb-api :: functionalities/data-formatter/data-formatter-smart-array/TestDataFormatterSmartArray.py (1507 of 2020) PASS: lldb-api :: commands/expression/completion/TestExprCompletion.py (1508 of 2020) PASS: lldb-unit :: Utility/./UtilityTests/ArgsTest.GetArgumentArrayRef (1509 of 2020) PASS: lldb-unit :: Utility/./UtilityTests/RangeTest.NotEqual (1510 of 2020) PASS: lldb-shell :: SymbolFile/NativePDB/ast-types.cpp (1511 of 2020) PASS: lldb-unit :: Signals/./SignalsTests/UnixSignalsTest.GetFilteredSignals (1512 of 2020) PASS: lldb-unit :: UnwindAssembly/x86/./UnwindAssemblyx86Tests/Testx86AssemblyInspectionEngine.TestPopR15 (1513 of 2020) PASS: lldb-unit :: Utility/./UtilityTests/StringListTest.InsertStringAtIndexOutOfBounds (1514 of 2020) UNSUPPORTED: lldb-shell :: Register/aarch64-gp-read.test (1515 of 2020) PASS: lldb-unit :: Utility/./UtilityTests/ScalarTest.APIntConstructor (1516 of 2020) PASS: lldb-api :: commands/watchpoints/multiple_hits/TestMultipleHits.py (1517 of 2020) PASS: lldb-api :: commands/frame/diagnose/dereference-function-return/TestDiagnoseDereferenceFunctionReturn.py (1518 of 2020) UNSUPPORTED: lldb-api :: commands/watchpoints/multi_watchpoint_slots/TestWatchpointMultipleSlots.py (1519 of 2020) PASS: lldb-api :: lang/objc/objc-baseclass-sbtype/TestObjCBaseClassSBType.py (1520 of 2020) PASS: lldb-api :: lang/cpp/unsigned_types/TestUnsignedTypes.py (1521 of 2020) PASS: lldb-api :: functionalities/breakpoint/global_constructor/TestBreakpointInGlobalConstructor.py (1522 of 2020) PASS: lldb-unit :: Language/Highlighting/./HighlighterTests/HighlighterTest.ClangTrailingBackslashMissingNewLine (1523 of 2020) PASS: lldb-unit :: Symbol/./SymbolTests/TestTypeSystemClang.TestDisplayName (1524 of 2020) PASS: lldb-api :: commands/gui/invalid-args/TestInvalidArgsGui.py (1525 of 2020) PASS: lldb-api :: python_api/function_symbol/TestDisasmAPI.py (1526 of 2020) PASS: lldb-unit :: Utility/./UtilityTests/BinaryStreamTest.PutSLEB128FourBytes (1527 of 2020) PASS: lldb-unit :: Host/./HostTests/FileSystemTest.Exists (1528 of 2020) PASS: lldb-api :: python_api/frame/get-variables/TestGetVariables.py (1529 of 2020) PASS: lldb-api :: functionalities/breakpoint/serialize/TestBreakpointSerialization.py (1530 of 2020) PASS: lldb-unit :: Symbol/./SymbolTests/DWARFCallFrameInfoTest.Basic_dwarf4 (1531 of 2020) PASS: lldb-api :: lang/objc/foundation/TestObjCMethods2.py (1532 of 2020) PASS: lldb-api :: commands/frame/recognizer/TestFrameRecognizer.py (1533 of 2020) PASS: lldb-unit :: Utility/./UtilityTests/StructuredDataTest.StringDump (1534 of 2020) PASS: lldb-unit :: Utility/./UtilityTests/RangeTest.Constructor (1535 of 2020) PASS: lldb-shell :: SymbolFile/DWARF/inline-function-address.ll (1536 of 2020) PASS: lldb-api :: functionalities/tail_call_frames/thread_step_out_or_return/TestSteppingOutWithArtificialFrames.py (1537 of 2020) PASS: lldb-unit :: Utility/./UtilityTests/ScalarTest.RightShiftOperator (1538 of 2020) PASS: lldb-unit :: Language/Highlighting/./HighlighterTests/HighlighterTest.DefaultHighlighterWithCursor (1539 of 2020) PASS: lldb-unit :: Utility/./UtilityTests/BinaryStreamTest.PutULEB128ThreeBytes (1540 of 2020) PASS: lldb-api :: commands/apropos/with-process/TestAproposWithProcess.py (1541 of 2020) PASS: lldb-api :: functionalities/gdb_remote_client/TestArmRegisterDefinition.py (1542 of 2020) PASS: lldb-shell :: Settings/TestSettingsSet.test (1543 of 2020) PASS: lldb-unit :: Utility/./UtilityTests/StreamTeeTest.CopyConstructor (1544 of 2020) PASS: lldb-api :: functionalities/data-formatter/data-formatter-objc/TestDataFormatterObjCKVO.py (1545 of 2020) PASS: lldb-unit :: ObjectFile/PECOFF/./ObjectFilePECOFFTests/PECallFrameInfoTest.Basic_eh (1546 of 2020) PASS: lldb-shell :: SymbolFile/DWARF/dwarf5-atomic.s (1547 of 2020) PASS: lldb-api :: functionalities/data-formatter/data-formatter-enum-format/TestDataFormatterEnumFormat.py (1548 of 2020) PASS: lldb-api :: functionalities/thread/concurrent_events/TestConcurrentTwoBreakpointsOneWatchpoint.py (1549 of 2020) PASS: lldb-shell :: SymbolFile/DWARF/debug-types-missing-signature.test (1550 of 2020) PASS: lldb-unit :: Utility/./UtilityTests/StreamTest.PutBytesAsRawHex8ToLittleEndian (1551 of 2020) PASS: lldb-api :: commands/expression/top-level/TestTopLevelExprs.py (1552 of 2020) PASS: lldb-api :: functionalities/data-formatter/data-formatter-objc/TestDataFormatterObjCNSError.py (1553 of 2020) PASS: lldb-api :: functionalities/breakpoint/objc/TestObjCBreakpoints.py (1554 of 2020) PASS: lldb-unit :: Utility/./UtilityTests/AnsiTerminal.Unknown (1555 of 2020) PASS: lldb-shell :: SymbolFile/DWARF/inline-function-address-shared.test (1556 of 2020) PASS: lldb-api :: macosx/load-kext/TestLoadKext.py (1557 of 2020) PASS: lldb-shell :: Breakpoint/jitbp_elf.test (1558 of 2020) PASS: lldb-unit :: Process/gdb-remote/./ProcessGdbRemoteTests/GDBRemoteCommunicationServerTest.SendErrorResponse_Status (1559 of 2020) PASS: lldb-unit :: Utility/./UtilityTests/AnsiTerminal.Twice (1560 of 2020) PASS: lldb-api :: python_api/target/TestTargetAPI.py (1561 of 2020) PASS: lldb-api :: lang/cpp/signed_types/TestSignedTypes.py (1562 of 2020) PASS: lldb-unit :: Utility/./UtilityTests/StructuredDataTest.ParseJSONFromFile (1563 of 2020) PASS: lldb-api :: functionalities/reproducers/attach/TestReproducerAttach.py (1564 of 2020) PASS: lldb-unit :: ScriptInterpreter/Python/./ScriptInterpreterPythonTests/PythonDataObjectsTest.TestExceptions (1565 of 2020) PASS: lldb-api :: commands/expression/inline-namespace/TestInlineNamespace.py (1566 of 2020) PASS: lldb-unit :: Language/Highlighting/./HighlighterTests/HighlighterTest.ClangBraces (1567 of 2020) PASS: lldb-api :: commands/disassemble/basic/TestFrameDisassemble.py (1568 of 2020) PASS: lldb-api :: functionalities/data-formatter/parray/TestPrintArray.py (1569 of 2020) PASS: lldb-unit :: Breakpoint/./LLDBBreakpointTests/BreakpointIDTest.StringIsBreakpointName (1570 of 2020) PASS: lldb-api :: functionalities/postmortem/elf-core/thread_crash/TestLinuxCoreThreads.py (1571 of 2020) PASS: lldb-unit :: Utility/./UtilityTests/StringListTest.InsertStringAtIndexStdString (1572 of 2020) PASS: lldb-unit :: ScriptInterpreter/Python/./ScriptInterpreterPythonTests/PythonDataObjectsTest.TestModuleNameResolutionNoDot (1573 of 2020) PASS: lldb-api :: commands/expression/persistent_variables/TestPersistentVariables.py (1574 of 2020) PASS: lldb-shell :: SymbolFile/Breakpad/symtab.test (1575 of 2020) PASS: lldb-unit :: Utility/./UtilityTests/SerializationRountripTest.SerializeDeserializeCStringArrayNullptr (1576 of 2020) PASS: lldb-unit :: Utility/./UtilityTests/StreamTest.PutNHex8 (1577 of 2020) PASS: lldb-unit :: Expression/./ExpressionTests/DiagnosticManagerTest.PutStringSeverities (1578 of 2020) PASS: lldb-api :: lang/cpp/dynamic-value-same-basename/TestDynamicValueSameBase.py (1579 of 2020) PASS: lldb-unit :: ScriptInterpreter/Python/./ScriptInterpreterPythonTests/PythonDataObjectsTest.TestPythonString (1580 of 2020) PASS: lldb-api :: lang/cpp/virtual-overload/TestVirtualOverload.py (1581 of 2020) PASS: lldb-shell :: SymbolFile/DWARF/find-method-local-struct.cpp (1582 of 2020) PASS: lldb-unit :: Utility/./UtilityTests/ArgsTest.ReplaceArgumentAtIndexEqual (1583 of 2020) PASS: lldb-unit :: Host/./HostTests/MainLoopTest.DetectsEOF (1584 of 2020) UNSUPPORTED: lldb-api :: commands/expression/multiline-completion/TestMultilineCompletion.py (1585 of 2020) PASS: lldb-api :: lang/objc/foundation/TestRuntimeTypes.py (1586 of 2020) PASS: lldb-unit :: Utility/./UtilityTests/XcodeSDKTest.SDKSupportsModules (1587 of 2020) PASS: lldb-api :: commands/frame/diagnose/virtual-method-call/TestDiagnoseDereferenceVirtualMethodCall.py (1588 of 2020) PASS: lldb-unit :: Symbol/./SymbolTests/TestTypeSystemClang.TestOwningModule (1589 of 2020) PASS: lldb-shell :: Register/x86-64-gp-read.test (1590 of 2020) PASS: lldb-shell :: VSCode/TestOptions.test (1591 of 2020) PASS: lldb-api :: lang/objc/modules-update/TestClangModulesUpdate.py (1592 of 2020) PASS: lldb-api :: lang/cpp/operator-overload/TestOperatorOverload.py (1593 of 2020) PASS: lldb-api :: functionalities/data-formatter/data-formatter-stl/libcxx/tuple/TestDataFormatterLibcxxTuple.py (1594 of 2020) PASS: lldb-api :: functionalities/gdb_remote_client/TestPlatformClient.py (1595 of 2020) PASS: lldb-unit :: Interpreter/./InterpreterTests/OptionArgParserTest.toChar (1596 of 2020) PASS: lldb-unit :: ScriptInterpreter/Python/./ScriptInterpreterPythonTests/PythonDataObjectsTest.TestCallable (1597 of 2020) PASS: lldb-shell :: Driver/TestNoUseColor.test (1598 of 2020) UNSUPPORTED: lldb-api :: linux/sepdebugsymlink/TestTargetSymbolsSepDebugSymlink.py (1599 of 2020) PASS: lldb-unit :: Utility/./UtilityTests/SerializationRountripTest.SerializeDeserializePodReferences (1600 of 2020) PASS: lldb-api :: functionalities/tail_call_frames/disambiguate_tail_call_seq/TestDisambiguateTailCallSeq.py (1601 of 2020) UNSUPPORTED: lldb-shell :: ScriptInterpreter/Lua/bindings.test (1602 of 2020) PASS: lldb-unit :: Process/minidump/./LLDBMinidumpTests/MinidumpParserTest.MinidumpModuleOrder (1603 of 2020) PASS: lldb-unit :: Utility/./UtilityTests/StreamTest.QuotedCString (1604 of 2020) PASS: lldb-unit :: Utility/./UtilityTests/RangeTest.SetRangeBase (1605 of 2020) PASS: lldb-api :: functionalities/thread/concurrent_events/TestConcurrentDelayedCrashWithBreakpointWatchpoint.py (1606 of 2020) PASS: lldb-api :: lang/cpp/breakpoint_in_member_func_w_non_primitive_params/TestBreakpointInMemberFuncWNonPrimitiveParams.py (1607 of 2020) PASS: lldb-unit :: Utility/./UtilityTests/StringListTest.Assignment (1608 of 2020) PASS: lldb-unit :: SymbolFile/DWARF/./SymbolFileDWARFTests/SymbolFileDWARFTests.ParseArangesNonzeroSegmentSize (1609 of 2020) PASS: lldb-unit :: Utility/./UtilityTests/ScalarTest.CastOperations (1610 of 2020) PASS: lldb-unit :: Host/./HostTests/SocketTest.TCPListen0ConnectAccept (1611 of 2020) PASS: lldb-api :: lang/cpp/operators/TestCppOperators.py (1612 of 2020) PASS: lldb-shell :: SymbolFile/Breakpad/unwind-via-stack-win-no-memory-info.yaml (1613 of 2020) XFAIL: lldb-shell :: Register/x86-mm-xmm-write.test (1614 of 2020) PASS: lldb-api :: functionalities/thread/concurrent_events/TestConcurrentManyWatchpoints.py (1615 of 2020) PASS: lldb-unit :: Utility/./UtilityTests/Predicate.WaitForValueNotEqualTo (1616 of 2020) UNSUPPORTED: lldb-shell :: Register/x86-64-ymm16-read.test (1617 of 2020) PASS: lldb-api :: python_api/process/TestProcessAPI.py (1618 of 2020) PASS: lldb-api :: commands/settings/use_source_cache/TestUseSourceCache.py (1619 of 2020) PASS: lldb-api :: tools/lldb-server/commandline/TestStubReverseConnect.py (1620 of 2020) PASS: lldb-api :: lang/objc/foundation/TestSymbolTable.py (1621 of 2020) PASS: lldb-api :: lang/objc/objc-new-syntax/TestObjCNewSyntaxArray.py (1622 of 2020) PASS: lldb-shell :: ObjectFile/ELF/gnu-debuglink.yaml (1623 of 2020) PASS: lldb-unit :: Utility/./UtilityTests/OptionsWithRawTest.WhitespaceInput (1624 of 2020) PASS: lldb-api :: commands/expression/argument_passing_restrictions/TestArgumentPassingRestrictions.py (1625 of 2020) PASS: lldb-api :: commands/expression/radar_8638051/Test8638051.py (1626 of 2020) UNSUPPORTED: lldb-api :: functionalities/asan/TestMemoryHistory.py (1627 of 2020) PASS: lldb-api :: lang/objcxx/hide-runtime-values/TestObjCXXHideRuntimeValues.py (1628 of 2020) PASS: lldb-api :: python_api/default-constructor/TestDefaultConstructorForAPIObjects.py (1629 of 2020) PASS: lldb-api :: functionalities/data-formatter/data-formatter-synth/TestDataFormatterSynth.py (1630 of 2020) PASS: lldb-api :: commands/expression/dont_allow_jit/TestAllowJIT.py (1631 of 2020) PASS: lldb-api :: lang/objc/single-entry-dictionary/TestObjCSingleEntryDictionary.py (1632 of 2020) PASS: lldb-unit :: Utility/./UtilityTests/StringListTest.InsertStringAtIndexEnd (1633 of 2020) UNSUPPORTED: lldb-api :: functionalities/thread/create_during_step/TestCreateDuringStep.py (1634 of 2020) PASS: lldb-api :: python_api/watchpoint/TestSetWatchpoint.py (1635 of 2020) PASS: lldb-api :: functionalities/thread/exit_during_step/TestExitDuringStep.py (1636 of 2020) PASS: lldb-unit :: Utility/./UtilityTests/StringListTest.AppendStringMove (1637 of 2020) PASS: lldb-unit :: Expression/./ExpressionTests/CppModuleConfigurationTest.AmbiguousLibCpp (1638 of 2020) PASS: lldb-unit :: Utility/./UtilityTests/VASprintfTest.BufferResize (1639 of 2020) PASS: lldb-api :: lang/objc/exceptions/TestObjCExceptions.py (1640 of 2020) PASS: lldb-unit :: Symbol/./SymbolTests/TestClangASTImporter.CopyTypeTagDecl (1641 of 2020) PASS: lldb-shell :: ObjectFile/ELF/netbsd-core-amd64.test (1642 of 2020) PASS: lldb-api :: commands/target/basic/TestTargetCommand.py (1643 of 2020) UNSUPPORTED: lldb-api :: benchmarks/continue/TestBenchmarkContinue.py (1644 of 2020) PASS: lldb-unit :: Host/./HostTests/FileSystemTest.MakeAbsolute (1645 of 2020) PASS: lldb-shell :: SymbolFile/DWARF/static_scope.s (1646 of 2020) PASS: lldb-unit :: Symbol/./SymbolTests/TestTypeSystemClang.TestIsClangType (1647 of 2020) PASS: lldb-unit :: Utility/./UtilityTests/ArgsTest.TestMultipleArgs (1648 of 2020) PASS: lldb-api :: functionalities/unwind/sigtramp/TestSigtrampUnwind.py (1649 of 2020) PASS: lldb-unit :: Language/Highlighting/./HighlighterTests/HighlighterTest.ClangCursorPosBeforeOtherToken (1650 of 2020) PASS: lldb-shell :: SymbolFile/Breakpad/line-table-discontinuous-file-ids.test (1651 of 2020) PASS: lldb-unit :: Expression/./ExpressionTests/DiagnosticManagerTest.HasFixits (1652 of 2020) PASS: lldb-api :: functionalities/thread/concurrent_events/TestConcurrentManyBreakpoints.py (1653 of 2020) PASS: lldb-shell :: Breakpoint/implicit_const_form_support.test (1654 of 2020) PASS: lldb-unit :: Utility/./UtilityTests/StringListTest.ShiftMove (1655 of 2020) PASS: lldb-unit :: Expression/./ExpressionTests/DiagnosticManagerTest.AppendMessageSubsequentDiags (1656 of 2020) PASS: lldb-unit :: Process/gdb-remote/./ProcessGdbRemoteTests/GDBRemoteCommunicationClientTest.GetModulesInfo (1657 of 2020) PASS: lldb-shell :: Commands/command-script-import.test (1658 of 2020) PASS: lldb-unit :: Utility/./UtilityTests/StringExtractorTest.GetHexU8_Exact (1659 of 2020) PASS: lldb-api :: lang/cpp/gmodules/TestWithModuleDebugging.py (1660 of 2020) PASS: lldb-shell :: Unwind/thread-step-out-ret-addr-check.test (1661 of 2020) PASS: lldb-unit :: Utility/./UtilityTests/LogChannelEnabledTest.LogGetLogThread (1662 of 2020) PASS: lldb-api :: commands/watchpoints/watchpoint_commands/condition/TestWatchpointConditionCmd.py (1663 of 2020) PASS: lldb-api :: functionalities/data-formatter/nsdictionarysynth/TestNSDictionarySynthetic.py (1664 of 2020) PASS: lldb-unit :: Utility/./UtilityTests/StringExtractorTest.GetHexBytes_OddPair2 (1665 of 2020) PASS: lldb-api :: functionalities/step-avoids-no-debug/TestStepNoDebug.py (1666 of 2020) PASS: lldb-unit :: Symbol/./SymbolTests/LineEntryTest.GetSameLineContiguousAddressRangeNestedInline (1667 of 2020) UNSUPPORTED: lldb-api :: lang/c/typedef/Testtypedef.py (1668 of 2020) PASS: lldb-unit :: Expression/./ExpressionTests/DiagnosticManagerTest.GetStringBasic (1669 of 2020) PASS: lldb-unit :: Utility/./UtilityTests/BinaryStreamTest.PutULEB128FiveBytes (1670 of 2020) PASS: lldb-api :: commands/quit/TestQuit.py (1671 of 2020) PASS: lldb-unit :: Utility/./UtilityTests/StringExtractorTest.GetHexU8_Exact_NoEof (1672 of 2020) PASS: lldb-unit :: Utility/./UtilityTests/StringListTest.SplitIntoLines (1673 of 2020) PASS: lldb-unit :: Utility/./UtilityTests/StatusTest.ErrorConstructor (1674 of 2020) PASS: lldb-shell :: SymbolFile/DWARF/DW_OP_piece-struct.s (1675 of 2020) PASS: lldb-unit :: Utility/./UtilityTests/StringListTest.AppendListCStringArrayEmpty (1676 of 2020) PASS: lldb-shell :: Minidump/disassemble-no-module.yaml (1677 of 2020) PASS: lldb-shell :: Breakpoint/dummy-target.test (1678 of 2020) PASS: lldb-unit :: Utility/./UtilityTests/StringListTest.CopyListEmpty (1679 of 2020) PASS: lldb-api :: lang/cpp/dynamic-value/TestDynamicValue.py (1680 of 2020) PASS: lldb-unit :: SymbolFile/NativePDB/./SymbolFileNativePDBTests/PDBFPOProgramToDWARFExpressionTests.MultipleDependentAssignments (1681 of 2020) UNSUPPORTED: lldb-api :: commands/watchpoints/hello_watchlocation/TestWatchLocation.py (1682 of 2020) PASS: lldb-unit :: Utility/./UtilityTests/DataExtractorTest.GetCStrAtNullOffset (1683 of 2020) PASS: lldb-api :: commands/expression/import-std-module/vector-bool/TestVectorBoolFromStdModule.py (1684 of 2020) PASS: lldb-unit :: SymbolFile/NativePDB/./SymbolFileNativePDBTests/PDBFPOProgramToDWARFExpressionTests.DependencyChain (1685 of 2020) PASS: lldb-unit :: Utility/./UtilityTests/LogTest.Unregister (1686 of 2020) PASS: lldb-unit :: UnwindAssembly/x86/./UnwindAssemblyx86Tests/Testx86AssemblyInspectionEngine.TestPopRBX (1687 of 2020) PASS: lldb-shell :: ObjectFile/ELF/section-addresses.yaml (1688 of 2020) PASS: lldb-unit :: UnwindAssembly/x86/./UnwindAssemblyx86Tests/Testx86AssemblyInspectionEngine.TestStackRealign8BitDisp_i386 (1689 of 2020) UNSUPPORTED: lldb-api :: functionalities/data-formatter/data-formatter-stl/libstdcpp/smart_ptr/TestDataFormatterStdSmartPtr.py (1690 of 2020) PASS: lldb-unit :: UnwindAssembly/x86/./UnwindAssemblyx86Tests/Testx86AssemblyInspectionEngine.TestPopRBPWithREX (1691 of 2020) PASS: lldb-api :: lang/cpp/breakpoint-commands/TestCPPBreakpointCommands.py (1692 of 2020) PASS: lldb-unit :: SymbolFile/NativePDB/./SymbolFileNativePDBTests/PDBFPOProgramToDWARFExpressionTests.InvalidAssignmentSingle (1693 of 2020) PASS: lldb-unit :: ObjectFile/Breakpad/./ObjectFileBreakpadTests/StackWinRecord.parse (1694 of 2020) PASS: lldb-api :: functionalities/thread/concurrent_events/TestConcurrentNWatchNBreak.py (1695 of 2020) PASS: lldb-shell :: Driver/TestProcessAttach.test (1696 of 2020) PASS: lldb-api :: functionalities/data-formatter/data-formatter-stl/libcxx/unordered/TestDataFormatterUnordered.py (1697 of 2020) PASS: lldb-api :: lang/objc/print-obj/TestPrintObj.py (1698 of 2020) PASS: lldb-shell :: SymbolFile/DWARF/split-dwarf-inlining.cpp (1699 of 2020) PASS: lldb-api :: lang/c/forward/TestForwardDeclaration.py (1700 of 2020) PASS: lldb-shell :: SymbolFile/Breakpad/unwind-via-raSearch.test (1701 of 2020) PASS: lldb-unit :: Host/./HostTests/FileSystemTest.GetPermissions (1702 of 2020) PASS: lldb-shell :: Minidump/no-process-id.yaml (1703 of 2020) PASS: lldb-shell :: ObjectFile/ELF/section-types-edgecases.yaml (1704 of 2020) PASS: lldb-shell :: ObjectFile/ELF/avr-basic-info.yaml (1705 of 2020) PASS: lldb-api :: functionalities/data-formatter/refpointer-recursion/TestDataFormatterRefPtrRecursion.py (1706 of 2020) PASS: lldb-api :: python_api/lldbutil/process/TestPrintStackTraces.py (1707 of 2020) PASS: lldb-api :: lang/cpp/overloaded-functions/TestOverloadedFunctions.py (1708 of 2020) PASS: lldb-shell :: Breakpoint/debug_rnglist_basic.test (1709 of 2020) PASS: lldb-api :: functionalities/data-formatter/var-in-aggregate-misuse/TestVarInAggregateMisuse.py (1710 of 2020) PASS: lldb-unit :: Host/./HostTests/Host.WaitStatusFormat (1711 of 2020) PASS: lldb-unit :: Utility/./UtilityTests/PassiveReplayTest.InstrumentedFoo (1712 of 2020) PASS: lldb-api :: functionalities/tail_call_frames/inlining_and_tail_calls/TestInliningAndTailCalls.py (1713 of 2020) PASS: lldb-shell :: ObjectFile/ELF/section-types.yaml (1714 of 2020) PASS: lldb-unit :: Utility/./UtilityTests/FileSpecTest.RemoveLastPathComponent (1715 of 2020) PASS: lldb-api :: lang/cpp/global_operators/TestCppGlobalOperators.py (1716 of 2020) UNSUPPORTED: lldb-api :: benchmarks/turnaround/TestCompileRunToBreakpointTurnaround.py (1717 of 2020) PASS: lldb-api :: functionalities/gdb_remote_client/TestqOffsets.py (1718 of 2020) PASS: lldb-unit :: Expression/./ExpressionTests/CppModuleConfigurationTest.Xcode (1719 of 2020) PASS: lldb-shell :: ObjectFile/ELF/compressed-sections.yaml (1720 of 2020) PASS: lldb-shell :: SymbolFile/NativePDB/disassembly.cpp (1721 of 2020) PASS: lldb-unit :: Utility/./UtilityTests/StreamTest.ShiftOperatorStrings (1722 of 2020) PASS: lldb-unit :: Utility/./UtilityTests/AnsiTerminal.Basic (1723 of 2020) PASS: lldb-api :: lang/c/local_types/TestUseClosestType.py (1724 of 2020) PASS: lldb-unit :: Utility/./UtilityTests/RegularExpression.Match (1725 of 2020) PASS: lldb-unit :: Utility/./UtilityTests/ListenerTest.GetEventWait (1726 of 2020) PASS: lldb-api :: lang/objc/modules-inline-functions/TestModulesInlineFunctions.py (1727 of 2020) PASS: lldb-unit :: Utility/./UtilityTests/StringListTest.AppendList (1728 of 2020) PASS: lldb-unit :: Utility/./UtilityTests/StreamTest.Indent (1729 of 2020) PASS: lldb-unit :: Utility/./UtilityTests/StringListTest.AppendStringStdString (1730 of 2020) PASS: lldb-api :: functionalities/breakpoint/auto_continue/TestBreakpointAutoContinue.py (1731 of 2020) PASS: lldb-api :: python_api/disassemble-raw-data/TestDisassembleRawData.py (1732 of 2020) PASS: lldb-unit :: Utility/./UtilityTests/ArgsTest.Yaml (1733 of 2020) PASS: lldb-shell :: Reproducer/TestReuseDirectory.test (1734 of 2020) PASS: lldb-api :: functionalities/thread/step_out/TestThreadStepOut.py (1735 of 2020) PASS: lldb-api :: tools/lldb-server/TestGdbRemoteThreadsInStopReply.py (1736 of 2020) PASS: lldb-unit :: Utility/./UtilityTests/StringLexerTest.HasAtLeast (1737 of 2020) PASS: lldb-api :: functionalities/data-formatter/nsarraysynth/TestNSArraySynthetic.py (1738 of 2020) PASS: lldb-unit :: Utility/./UtilityTests/StringExtractorTest.GetHexBytesAvail_OddPair2 (1739 of 2020) PASS: lldb-unit :: Utility/./UtilityTests/ProcessInfoTest.Constructor (1740 of 2020) PASS: lldb-api :: lang/c/shared_lib_stripped_symbols/TestSharedLibStrippedSymbols.py (1741 of 2020) PASS: lldb-api :: commands/watchpoints/watchpoint_events/TestWatchpointEvents.py (1742 of 2020) PASS: lldb-unit :: Utility/./UtilityTests/StreamTeeTest.GetStreamAtIndexOutOfBoundsEmpty (1743 of 2020) PASS: lldb-unit :: Utility/./UtilityTests/VMRange.Reset (1744 of 2020) PASS: lldb-shell :: SymbolFile/NativePDB/break-by-line.cpp (1745 of 2020) PASS: lldb-api :: lang/cpp/modules-import/TestCXXModulesImport.py (1746 of 2020) PASS: lldb-unit :: Utility/./UtilityTests/StatusTest.Formatv (1747 of 2020) PASS: lldb-api :: python_api/frame/inlines/TestInlinedFrame.py (1748 of 2020) PASS: lldb-shell :: SymbolFile/DWARF/dwarf5-debug_line.s (1749 of 2020) PASS: lldb-api :: functionalities/plugins/command_plugin/TestPluginCommands.py (1750 of 2020) PASS: lldb-api :: lang/c/array_types/TestArrayTypes.py (1751 of 2020) PASS: lldb-api :: lang/cpp/class-template-parameter-pack/TestClassTemplateParameterPack.py (1752 of 2020) PASS: lldb-shell :: ObjectFile/PECOFF/export-dllfunc.yaml (1753 of 2020) PASS: lldb-unit :: Symbol/./SymbolTests/TestTypeSystemClang.TestNotDeletingUserCopyCstrDueToMoveCStr (1754 of 2020) PASS: lldb-unit :: Process/minidump/./LLDBMinidumpTests/MinidumpParserTest.GetPidWow64 (1755 of 2020) PASS: lldb-unit :: Core/./LLDBCoreTests/MangledTest.NameIndexes_FindFunctionSymbols (1756 of 2020) PASS: lldb-shell :: SymbolFile/DWARF/DW_AT_low_pc-addrx.s (1757 of 2020) PASS: lldb-unit :: Utility/./UtilityTests/SubsystemRAIITest.SubsystemWithErrorFailure (1758 of 2020) PASS: lldb-api :: functionalities/gdb_remote_client/TestTargetXMLArch.py (1759 of 2020) PASS: lldb-unit :: Utility/./UtilityTests/StreamTest.PutCharNull (1760 of 2020) PASS: lldb-shell :: Register/x86-64-ymm-read.test (1761 of 2020) PASS: lldb-unit :: Target/./TargetTests/PathMappingListTest.AbsoluteTests (1762 of 2020) PASS: lldb-api :: lang/c/step_over_no_deadlock/TestStepOverDoesntBlock.py (1763 of 2020) PASS: lldb-api :: functionalities/gdb_remote_client/TestRestartBug.py (1764 of 2020) PASS: lldb-unit :: UnwindAssembly/x86/./UnwindAssemblyx86Tests/Testx86AssemblyInspectionEngine.TestPushEBP (1765 of 2020) PASS: lldb-unit :: Utility/./UtilityTests/TimeoutTest.Format (1766 of 2020) PASS: lldb-api :: commands/source/info/TestSourceInfo.py (1767 of 2020) PASS: lldb-unit :: ObjectFile/ELF/./ObjectFileELFTests/ObjectFileELFTest.SectionsResolveConsistently (1768 of 2020) PASS: lldb-unit :: Utility/./UtilityTests/UUIDTest.StringConverion (1769 of 2020) PASS: lldb-api :: lang/c/local_variables/TestLocalVariables.py (1770 of 2020) PASS: lldb-api :: functionalities/signal/TestSendSignal.py (1771 of 2020) PASS: lldb-unit :: UnwindAssembly/x86/./UnwindAssemblyx86Tests/Testx86AssemblyInspectionEngine.Test64bitFramelessSmallStackFrame (1772 of 2020) UNSUPPORTED: lldb-api :: commands/expression/completion-crash-invalid-iterator/TestInvalidIteratorCompletionCrash.py (1773 of 2020) PASS: lldb-unit :: debugserver/./debugserverTests/JSON.Parse (1774 of 2020) PASS: lldb-api :: commands/process/launch-with-shellexpand/TestLaunchWithShellExpand.py (1775 of 2020) UNSUPPORTED: lldb-api :: functionalities/longjmp/TestLongjmp.py (1776 of 2020) PASS: lldb-unit :: Symbol/./SymbolTests/TestTypeSystemClang.TestGetTypeClassTypeOfExpr (1777 of 2020) UNSUPPORTED: lldb-shell :: Register/x86-ymm-read.test (1778 of 2020) PASS: lldb-api :: functionalities/testid/TestTestId.py (1779 of 2020) PASS: lldb-api :: commands/platform/process/list/TestProcessList.py (1780 of 2020) PASS: lldb-api :: commands/settings/TestSettings.py (1781 of 2020) PASS: lldb-unit :: Utility/./UtilityTests/VMRange.ContainsAddr (1782 of 2020) PASS: lldb-unit :: Process/gdb-remote/./ProcessGdbRemoteTests/GDBRemoteCommunicationClientTest.SendStopTracePacket (1783 of 2020) UNSUPPORTED: lldb-shell :: SymbolFile/PDB/class-layout.test (1784 of 2020) PASS: lldb-unit :: DataFormatter/./LLDBFormatterTests/StringPrinterTests.CxxUTF8 (1785 of 2020) PASS: lldb-shell :: Driver/TestFile.test (1786 of 2020) PASS: lldb-api :: lang/objc/objc-ivar-offsets/TestObjCIvarOffsets.py (1787 of 2020) PASS: lldb-unit :: ScriptInterpreter/Python/./ScriptInterpreterPythonTests/PythonDataObjectsTest.TestPythonFile (1788 of 2020) PASS: lldb-api :: functionalities/thread/concurrent_events/TestConcurrentTwoWatchpointsOneDelayBreakpoint.py (1789 of 2020) PASS: lldb-unit :: Symbol/./SymbolTests/TestClangASTImporter.CompleteFwdDeclWithOtherOrigin (1790 of 2020) PASS: lldb-api :: functionalities/thread/step_until/TestStepUntil.py (1791 of 2020) PASS: lldb-unit :: Symbol/./SymbolTests/PostfixExpression.ToDWARF (1792 of 2020) PASS: lldb-unit :: Utility/./UtilityTests/StringListTest.LongestCommonPrefixNoPrefix (1793 of 2020) PASS: lldb-unit :: Core/./LLDBCoreTests/SourceFileCache.FindSourceFileFound (1794 of 2020) PASS: lldb-api :: functionalities/signal/handle-abrt/TestHandleAbort.py (1795 of 2020) PASS: lldb-unit :: Utility/./UtilityTests/ConstStringTest.YAML (1796 of 2020) PASS: lldb-unit :: SymbolFile/NativePDB/./SymbolFileNativePDBTests/PDBFPOProgramToDWARFExpressionTests.UnresolvedDependentCyclicRegisterAssignmentReference (1797 of 2020) PASS: lldb-api :: python_api/interpreter/TestCommandInterpreterAPI.py (1798 of 2020) PASS: lldb-api :: python_api/sbplatform/TestSBPlatform.py (1799 of 2020) PASS: lldb-api :: lang/objc/objc-foundation-dictionary-empty/TestNSDictionary0.py (1800 of 2020) PASS: lldb-api :: functionalities/thread/concurrent_events/TestConcurrentDelaySignalBreak.py (1801 of 2020) PASS: lldb-unit :: Utility/./UtilityTests/StreamTeeTest.SetStreamAtIndexOutOfBounds (1802 of 2020) PASS: lldb-unit :: Utility/./UtilityTests/BinaryStreamTest.PutSLEB128MaxValue (1803 of 2020) UNSUPPORTED: lldb-api :: functionalities/darwin_log/filter/exact_match/message/TestDarwinLogFilterMatchMessage.py (1804 of 2020) PASS: lldb-api :: commands/expression/xvalue/TestXValuePrinting.py (1805 of 2020) UNSUPPORTED: lldb-shell :: ScriptInterpreter/Lua/lua.test (1806 of 2020) PASS: lldb-api :: lang/objc/blocks/TestObjCIvarsInBlocks.py (1807 of 2020) PASS: lldb-unit :: Target/./TargetTests/StackFrameRecognizerTest.NullModuleRegex (1808 of 2020) PASS: lldb-unit :: Utility/./UtilityTests/StringExtractorTest.GetHexU8_InvalidHex (1809 of 2020) PASS: lldb-api :: commands/expression/import-std-module/stack/TestStackFromStdModule.py (1810 of 2020) PASS: lldb-unit :: Expression/./ExpressionTests/CppModuleConfigurationTest.AmbiguousCLib (1811 of 2020) PASS: lldb-shell :: Driver/LocalLLDBInit.test (1812 of 2020) PASS: lldb-unit :: Utility/./UtilityTests/StreamTest.AddressEmptyPrefix (1813 of 2020) PASS: lldb-api :: lang/objc/objc-ivar-stripped/TestObjCIvarStripped.py (1814 of 2020) UNSUPPORTED: lldb-api :: tools/lldb-server/platform-process-connect/TestPlatformProcessConnect.py (1815 of 2020) PASS: lldb-unit :: Symbol/./SymbolTests/TestTypeSystemClang.TestDeletingImplicitCopyCstrDueToMoveCStr (1816 of 2020) PASS: lldb-api :: functionalities/history/TestHistoryRecall.py (1817 of 2020) PASS: lldb-unit :: Process/gdb-remote/./ProcessGdbRemoteTests/GDBRemoteCommunicationClientTest.WriteRegisterNoSuffix (1818 of 2020) PASS: lldb-api :: functionalities/thread/concurrent_events/TestConcurrentSignalDelayWatch.py (1819 of 2020) UNSUPPORTED: lldb-api :: lang/objc/rdar-12408181/TestRdar12408181.py (1820 of 2020) PASS: lldb-api :: commands/expression/po_verbosity/TestPoVerbosity.py (1821 of 2020) PASS: lldb-shell :: SymbolFile/DWARF/dir-separator-windows.s (1822 of 2020) PASS: lldb-api :: commands/add-dsym/uuid/TestAddDsymCommand.py (1823 of 2020) PASS: lldb-unit :: Utility/./UtilityTests/StringExtractorTest.GetHexU8_Extra (1824 of 2020) PASS: lldb-unit :: SymbolFile/NativePDB/./SymbolFileNativePDBTests/PDBFPOProgramToDWARFExpressionTests.SingleAssignmentRegisterRef (1825 of 2020) PASS: lldb-api :: functionalities/data-formatter/poarray/TestPrintObjectArray.py (1826 of 2020) PASS: lldb-api :: functionalities/optimized_code/TestNoASanExceptionAfterEvalOP_piece.py (1827 of 2020) PASS: lldb-api :: functionalities/jitloader_gdb/TestJITLoaderGDB.py (1828 of 2020) PASS: lldb-unit :: Utility/./UtilityTests/UriParserTest.Minimal (1829 of 2020) PASS: lldb-api :: commands/expression/class_template_specialization_empty_pack/TestClassTemplateSpecializationParametersHandling.py (1830 of 2020) PASS: lldb-api :: lang/cpp/frame-var-anon-unions/TestFrameVariableAnonymousUnions.py (1831 of 2020) PASS: lldb-api :: commands/expression/two-files/TestObjCTypeQueryFromOtherCompileUnit.py (1832 of 2020) PASS: lldb-api :: functionalities/data-formatter/setvaluefromcstring/TestSetValueFromCString.py (1833 of 2020) PASS: lldb-unit :: Utility/./UtilityTests/StringListTest.AppendStringCString (1834 of 2020) UNSUPPORTED: lldb-shell :: ScriptInterpreter/Lua/persistent_state.test (1835 of 2020) PASS: lldb-unit :: Utility/./UtilityTests/StreamTest.PutHex64ByteOrderLittle (1836 of 2020) UNSUPPORTED: lldb-api :: linux/thread/create_during_instruction_step/TestCreateDuringInstructionStep.py (1837 of 2020) PASS: lldb-unit :: Utility/./UtilityTests/OptionsWithRawTest.EmptySuffix (1838 of 2020) PASS: lldb-api :: commands/expression/radar_9673664/TestExprHelpExamples.py (1839 of 2020) PASS: lldb-unit :: Utility/./UtilityTests/StringExtractorTest.GetHexBytesAvail (1840 of 2020) PASS: lldb-unit :: Symbol/./SymbolTests/SymbolsTest.TerminateLocateExecutableSymbolFileForUnknownExecutableAndUnknownSymbolFile (1841 of 2020) PASS: lldb-api :: commands/breakpoint/command/list/TestBreakpointCommandList.py (1842 of 2020) PASS: lldb-unit :: ObjectFile/Breakpad/./ObjectFileBreakpadTests/FuncRecord.parse (1843 of 2020) PASS: lldb-api :: commands/expression/import_builtin_fileid/TestImportBuiltinFileID.py (1844 of 2020) PASS: lldb-unit :: Utility/./UtilityTests/ArgsTest.TestUnknownEscape (1845 of 2020) UNSUPPORTED: lldb-shell :: ObjectFile/ELF/minidebuginfo-no-lzma.yaml (1846 of 2020) PASS: lldb-api :: functionalities/data-formatter/data-formatter-script/TestDataFormatterScript.py (1847 of 2020) PASS: lldb-unit :: Host/./HostTests/HostInfoTest.GetXcodeSDK (1848 of 2020) PASS: lldb-unit :: Utility/./UtilityTests/RangeTest.Equal (1849 of 2020) PASS: lldb-api :: commands/expression/scoped_enums/TestScopedEnumType.py (1850 of 2020) PASS: lldb-unit :: Utility/./UtilityTests/BroadcasterTest.EventTypeHasListeners (1851 of 2020) PASS: lldb-api :: functionalities/tail_call_frames/sbapi_support/TestTailCallFrameSBAPI.py (1852 of 2020) PASS: lldb-unit :: Utility/./UtilityTests/ArgsTest.TestInsertArg (1853 of 2020) PASS: lldb-unit :: Utility/./UtilityTests/DeserializerTest.HasData (1854 of 2020) PASS: lldb-api :: python_api/sblaunchinfo/TestSBLaunchInfo.py (1855 of 2020) PASS: lldb-api :: commands/expression/invalid-args/TestInvalidArgsExpression.py (1856 of 2020) PASS: lldb-unit :: UnwindAssembly/x86/./UnwindAssemblyx86Tests/Testx86AssemblyInspectionEngine.TestSimplex86_64Augmented (1857 of 2020) PASS: lldb-unit :: Utility/./UtilityTests/DataExtractorTest.GetMaxS64 (1858 of 2020) PASS: lldb-api :: commands/expression/persist_objc_pointeetype/TestPersistObjCPointeeType.py (1859 of 2020) PASS: lldb-api :: functionalities/data-formatter/data-formatter-disabling/TestDataFormatterDisabling.py (1860 of 2020) PASS: lldb-shell :: ObjectFile/ELF/aarch64-relocations.yaml (1861 of 2020) PASS: lldb-unit :: Utility/./UtilityTests/ArchSpecTest.TestParseMachCPUDashSubtypeTripleExtra (1862 of 2020) PASS: lldb-unit :: Target/./TargetTests/ExecutionContextTest.GetByteOrderTarget (1863 of 2020) PASS: lldb-unit :: Utility/./UtilityTests/FileSpecTest.AppendPathComponent (1864 of 2020) PASS: lldb-shell :: SymbolFile/DWARF/debug-types-line-tables.s (1865 of 2020) PASS: lldb-unit :: UnwindAssembly/x86/./UnwindAssemblyx86Tests/Testx86AssemblyInspectionEngine.TestPush0 (1866 of 2020) PASS: lldb-unit :: Utility/./UtilityTests/RangeTest.SlideZero (1867 of 2020) PASS: lldb-unit :: Symbol/./SymbolTests/TestTypeSystemClang.TestGetBasicTypeFromEnum (1868 of 2020) PASS: lldb-api :: functionalities/data-formatter/data-formatter-objc/TestDataFormatterObjCCF.py (1869 of 2020) PASS: lldb-api :: lang/objc/modules-compile-error/TestModulesCompileError.py (1870 of 2020) PASS: lldb-api :: functionalities/abbreviation/TestCommonShortSpellings.py (1871 of 2020) PASS: lldb-api :: python_api/breakpoint/TestBreakpointAPI.py (1872 of 2020) PASS: lldb-unit :: debugserver/./debugserverTests/RNBSocket.LoopBackListenIPv4 (1873 of 2020) PASS: lldb-shell :: SymbolFile/NativePDB/function-types-builtins.cpp (1874 of 2020) PASS: lldb-unit :: Expression/./ExpressionTests/CppModuleConfigurationTest.MissingUsrInclude (1875 of 2020) PASS: lldb-api :: functionalities/dynamic_value_child_count/TestDynamicValueChildCount.py (1876 of 2020) PASS: lldb-unit :: Utility/./UtilityTests/StringLexerTest.PutBack (1877 of 2020) PASS: lldb-unit :: Utility/./UtilityTests/BinaryStreamTest.PutSLEB128Zero (1878 of 2020) PASS: lldb-api :: macosx/function-starts/TestFunctionStarts.py (1879 of 2020) PASS: lldb-api :: functionalities/mtc/simple/TestMTCSimple.py (1880 of 2020) PASS: lldb-unit :: UnwindAssembly/x86/./UnwindAssemblyx86Tests/Testx86AssemblyInspectionEngine.TestPushEDX (1881 of 2020) PASS: lldb-shell :: SymbolFile/DWARF/anon_class_w_and_wo_export_symbols.ll (1882 of 2020) PASS: lldb-unit :: Process/minidump/./LLDBMinidumpTests/MinidumpParserTest.GetMiscInfo_no_stream (1883 of 2020) PASS: lldb-api :: macosx/dyld-trie-symbols/TestDyldTrieSymbols.py (1884 of 2020) PASS: lldb-shell :: SymbolFile/DWARF/debug_loc-aslr.s (1885 of 2020) PASS: lldb-api :: functionalities/unwind/zeroth_frame/TestZerothFrame.py (1886 of 2020) PASS: lldb-api :: functionalities/data-formatter/data-formatter-objc/TestDataFormatterObjCNSContainer.py (1887 of 2020) PASS: lldb-api :: lang/cpp/dynamic-value/TestCppValueCast.py (1888 of 2020) PASS: lldb-api :: lang/cpp/namespace/TestNamespaceLookup.py (1889 of 2020) PASS: lldb-api :: functionalities/thread/concurrent_events/TestConcurrentSignalWatchBreak.py (1890 of 2020) PASS: lldb-unit :: Utility/./UtilityTests/StringListTest.AppendListCStringArray (1891 of 2020) PASS: lldb-unit :: Core/./LLDBCoreTests/RichManglingContextTest.Basic (1892 of 2020) PASS: lldb-unit :: Utility/./UtilityTests/UserIDResolver.GetGroupName (1893 of 2020) PASS: lldb-unit :: Utility/./UtilityTests/OptionsWithRawTest.SingleWordSuffix (1894 of 2020) PASS: lldb-api :: commands/target/create-deps/TestTargetCreateDeps.py (1895 of 2020) PASS: lldb-api :: functionalities/inferior-crashing/recursive-inferior/TestRecursiveInferiorStep.py (1896 of 2020) PASS: lldb-api :: commands/watchpoints/watchpoint_set_command/TestWatchLocationWithWatchSet.py (1897 of 2020) PASS: lldb-unit :: Utility/./UtilityTests/AnsiTerminal.Empty (1898 of 2020) PASS: lldb-unit :: SymbolFile/NativePDB/./SymbolFileNativePDBTests/PDBFPOProgramToDWARFExpressionTests.InvalidOpBinary (1899 of 2020) PASS: lldb-shell :: SymbolFile/Breakpad/line-table.test (1900 of 2020) UNSUPPORTED: lldb-shell :: SymbolFile/NativePDB/local-variables.cpp (1901 of 2020) UNSUPPORTED: lldb-api :: python_api/event/TestEvents.py (1902 of 2020) PASS: lldb-unit :: ObjectFile/Breakpad/./ObjectFileBreakpadTests/FileRecord.parse (1903 of 2020) PASS: lldb-shell :: Reproducer/Functionalities/TestImageList.test (1904 of 2020) PASS: lldb-api :: lang/objc/direct-dispatch-step/TestObjCDirectDispatchStepping.py (1905 of 2020) PASS: lldb-api :: functionalities/thread/concurrent_events/TestConcurrentWatchpointDelayWatchpointOneBreakpoint.py (1906 of 2020) PASS: lldb-api :: commands/expression/context-object-objc/TestContextObjectObjc.py (1907 of 2020) PASS: lldb-api :: functionalities/breakpoint/require_hw_breakpoints/TestRequireHWBreakpoints.py (1908 of 2020) UNSUPPORTED: lldb-api :: functionalities/darwin_log/filter/regex/subsystem/TestDarwinLogFilterRegexSubsystem.py (1909 of 2020) PASS: lldb-unit :: Utility/./UtilityTests/OptionsWithRawTest.UnterminatedQuote (1910 of 2020) PASS: lldb-shell :: ObjectFile/MachO/symtab.yaml (1911 of 2020) PASS: lldb-api :: commands/command/script/import/rdar-12586188/TestRdar12586188.py (1912 of 2020) PASS: lldb-unit :: Utility/./UtilityTests/StringExtractorTest.InitEmpty (1913 of 2020) UNSUPPORTED: lldb-api :: functionalities/darwin_log/source/info/TestDarwinLogSourceInfo.py (1914 of 2020) PASS: lldb-unit :: Expression/./ExpressionTests/DiagnosticManagerTest.GetStringNoDiags (1915 of 2020) PASS: lldb-api :: functionalities/breakpoint/cpp_exception/TestCPPExceptionBreakpoint.py (1916 of 2020) PASS: lldb-api :: lang/objcxx/objcxx-ivar-vector/TestIvarVector.py (1917 of 2020) PASS: lldb-shell :: Reproducer/Functionalities/TestExpressionEvaluation.test (1918 of 2020) PASS: lldb-unit :: Language/Highlighting/./HighlighterTests/HighlighterTest.ClangTrailingBackslashWithWhitespace (1919 of 2020) PASS: lldb-api :: python_api/lldbutil/TestSwigVersion.py (1920 of 2020) PASS: lldb-unit :: Process/gdb-remote/./ProcessGdbRemoteTests/GDBRemoteCommunicationClientTest.GetQOffsets (1921 of 2020) PASS: lldb-unit :: SymbolFile/DWARF/./SymbolFileDWARFTests/SymbolFileDWARFTests.TestAbbrevInvalidNULLTag (1922 of 2020) PASS: lldb-shell :: ObjectFile/PECOFF/invalid-export-table.yaml (1923 of 2020) PASS: lldb-shell :: ObjectFile/ELF/PT_TLS-overlap-PT_LOAD.yaml (1924 of 2020) PASS: lldb-api :: commands/expression/cast_int_to_anonymous_enum/TestCastIntToAnonymousEnum.py (1925 of 2020) PASS: lldb-unit :: Utility/./UtilityTests/BinaryStreamTest.PutULEB128One (1926 of 2020) PASS: lldb-unit :: Utility/./UtilityTests/AnsiTerminal.WhiteSpace (1927 of 2020) PASS: lldb-shell :: Driver/TestCommands.test (1928 of 2020) PASS: lldb-unit :: Utility/./UtilityTests/StringListTest.JoinMultiCharSeparator (1929 of 2020) PASS: lldb-unit :: Symbol/./SymbolTests/TestTypeSystemClang.TestDisplayNameEmpty (1930 of 2020) PASS: lldb-api :: commands/expression/diagnostics/TestExprDiagnostics.py (1931 of 2020) PASS: lldb-unit :: UnwindAssembly/x86/./UnwindAssemblyx86Tests/Testx86AssemblyInspectionEngine.TestDisassemblyMidFunctionEpilogues (1932 of 2020) PASS: lldb-unit :: API/./APITests/SBCommandInterpreterTest.MultiWordCommand (1933 of 2020) UNSUPPORTED: lldb-shell :: ScriptInterpreter/Lua/nested_sessions.test (1934 of 2020) PASS: lldb-unit :: Utility/./UtilityTests/StreamTest.PutMaxHex64ByteOrderBig (1935 of 2020) PASS: lldb-api :: functionalities/breakpoint/comp_dir_symlink/TestCompDirSymLink.py (1936 of 2020) PASS: lldb-unit :: Language/Highlighting/./HighlighterTests/HighlighterTest.ClangCursorPosInOtherToken (1937 of 2020) PASS: lldb-shell :: Unwind/eh-frame-dwarf-unwind.test (1938 of 2020) PASS: lldb-api :: functionalities/breakpoint/debugbreak/TestDebugBreak.py (1939 of 2020) PASS: lldb-unit :: Utility/./UtilityTests/StringExtractorTest.GetHexBytesAvail_FullString (1940 of 2020) PASS: lldb-api :: functionalities/data-formatter/data-formatter-ptr-to-array/TestPtrToArrayFormatting.py (1941 of 2020) PASS: lldb-unit :: Language/Highlighting/./HighlighterTests/HighlighterTest.ClangStringLiterals (1942 of 2020) PASS: lldb-shell :: SymbolFile/Breakpad/unwind-via-stack-win.test (1943 of 2020) PASS: lldb-unit :: Utility/./UtilityTests/UriParserTest.LongPath (1944 of 2020) PASS: lldb-api :: python_api/type/TestTypeList.py (1945 of 2020) PASS: lldb-api :: functionalities/breakpoint/cpp/TestCPPBreakpointLocations.py (1946 of 2020) PASS: lldb-api :: lang/c/vla/TestVLA.py (1947 of 2020) PASS: lldb-unit :: Utility/./UtilityTests/ScalarTest.GetBytes (1948 of 2020) PASS: lldb-unit :: Process/minidump/./LLDBMinidumpTests/MinidumpParserTest.GetFilteredModuleList (1949 of 2020) PASS: lldb-shell :: SymbolFile/DWARF/debug_loclists-dwo.s (1950 of 2020) PASS: lldb-api :: commands/expression/import-std-module/vector-of-vectors/TestVectorOfVectorsFromStdModule.py (1951 of 2020) UNSUPPORTED: lldb-api :: tools/intel-features/intel-pt/test/TestIntelPTSimpleBinary.py (1952 of 2020) PASS: lldb-api :: tools/lldb-server/TestGdbRemoteRegisterState.py (1953 of 2020) PASS: lldb-shell :: SymbolFile/DWARF/dwo-type-in-main-file.s (1954 of 2020) PASS: lldb-unit :: ScriptInterpreter/Python/./ScriptInterpreterPythonTests/PythonDataObjectsTest.TestPythonTupleToStructuredList (1955 of 2020) PASS: lldb-unit :: Process/gdb-remote/./ProcessGdbRemoteTests/GDBRemoteCommunicationClientTest.WriteRegister (1956 of 2020) PASS: lldb-api :: commands/expression/import-std-module/forward_list-dbg-info-content/TestDbgInfoContentForwardListFromStdModule.py (1957 of 2020) PASS: lldb-api :: functionalities/tail_call_frames/ambiguous_tail_call_seq1/TestAmbiguousTailCallSeq1.py (1958 of 2020) PASS: lldb-api :: functionalities/data-formatter/summary-string-onfail/Test-rdar-9974002.py (1959 of 2020) PASS: lldb-api :: functionalities/thread/concurrent_events/TestConcurrentTwoWatchpointsOneSignal.py (1960 of 2020) PASS: lldb-unit :: Utility/./UtilityTests/DataExtractorTest.GetBitfield (1961 of 2020) PASS: lldb-api :: lang/objc/real-definition/TestRealDefinition.py (1962 of 2020) PASS: lldb-api :: lang/cpp/nested-class-other-compilation-unit/TestNestedClassWithParentInAnotherCU.py (1963 of 2020) PASS: lldb-api :: python_api/class_members/TestSBTypeClassMembers.py (1964 of 2020) PASS: lldb-api :: functionalities/thread/thread_exit/TestThreadExit.py (1965 of 2020) PASS: lldb-api :: functionalities/data-formatter/data-formatter-objc/cmtime/TestDataFormatterCMTime.py (1966 of 2020) PASS: lldb-api :: functionalities/data-formatter/array_typedef/TestArrayTypedef.py (1967 of 2020) PASS: lldb-api :: lang/cpp/thread_local/TestThreadLocal.py (1968 of 2020) PASS: lldb-api :: functionalities/archives/TestBSDArchives.py (1969 of 2020) PASS: lldb-shell :: ObjectFile/wasm/embedded-debug-sections.yaml (1970 of 2020) PASS: lldb-unit :: Language/Highlighting/./HighlighterTests/HighlighterTest.ClangCommas (1971 of 2020) PASS: lldb-api :: types/TestFloatTypesExpr.py (1972 of 2020) PASS: lldb-unit :: Process/gdb-remote/./ProcessGdbRemoteTests/GDBRemoteCommunicationClientTest.GetMemoryRegionInfoInvalidResponse (1973 of 2020) PASS: lldb-unit :: Process/minidump/./LLDBMinidumpTests/MinidumpParserTest.GetThreadContext_x86_32 (1974 of 2020) PASS: lldb-unit :: Host/./HostTests/FileSystemTest.EmptyTest (1975 of 2020) UNSUPPORTED: lldb-api :: functionalities/tsan/multiple/TestTsanMultiple.py (1976 of 2020) PASS: lldb-api :: lang/cpp/inlines/TestInlines.py (1977 of 2020) PASS: lldb-shell :: Recognizer/assert.test (1978 of 2020) PASS: lldb-unit :: Utility/./UtilityTests/UriParserTest.BracketedHostnameWithPortIPv6 (1979 of 2020) PASS: lldb-shell :: Driver/TestSingleQuote.test (1980 of 2020) PASS: lldb-api :: lang/objc/modules-non-objc-target/TestObjCModulesNonObjCTarget.py (1981 of 2020) PASS: lldb-api :: python_api/sbenvironment/TestSBEnvironment.py (1982 of 2020) PASS: lldb-shell :: SymbolFile/DWARF/gnu-style-compression.cpp (1983 of 2020) PASS: lldb-shell :: ScriptInterpreter/None/import_module.test (1984 of 2020) PASS: lldb-unit :: Utility/./UtilityTests/StringExtractorTest.GetHexBytes_Underflow (1985 of 2020) PASS: lldb-unit :: Utility/./UtilityTests/RegularExpression.CopyAssignment (1986 of 2020) PASS: lldb-shell :: Minidump/memory-region.yaml (1987 of 2020) UNSUPPORTED: lldb-shell :: SymbolFile/PDB/type-quals.test (1988 of 2020) PASS: lldb-unit :: Expression/./ExpressionTests/CppModuleConfigurationTest.UnrelatedLibrary (1989 of 2020) PASS: lldb-api :: api/log/TestAPILog.py (1990 of 2020) PASS: lldb-unit :: Language/Highlighting/./HighlighterTests/HighlighterTest.Keywords (1991 of 2020) PASS: lldb-api :: lang/objc/objc-property/TestObjCProperty.py (1992 of 2020) PASS: lldb-api :: commands/expression/unwind_expression/TestUnwindExpression.py (1993 of 2020) PASS: lldb-unit :: Utility/./UtilityTests/ArgsTest.ReplaceArgumentAtIndexLonger (1994 of 2020) PASS: lldb-api :: types/TestCharType.py (1995 of 2020) PASS: lldb-api :: commands/process/attach/attach_denied/TestAttachDenied.py (1996 of 2020) PASS: lldb-api :: lang/cpp/covariant-return-types/TestCovariantReturnTypes.py (1997 of 2020) PASS: lldb-unit :: Utility/./UtilityTests/CompletionRequest.FakeLastArg (1998 of 2020) PASS: lldb-shell :: SymbolFile/DWARF/debug_rnglists.s (1999 of 2020) PASS: lldb-unit :: Utility/./UtilityTests/StringLexerTest.Next (2000 of 2020) PASS: lldb-unit :: tools/lldb-server/tests/./LLDBServerTests/TestBase.DebugserverEnv (2001 of 2020) PASS: lldb-api :: functionalities/breakpoint/consecutive_breakpoints/TestConsecutiveBreakpoints.py (2002 of 2020) PASS: lldb-unit :: ScriptInterpreter/Python/./ScriptInterpreterPythonTests/PythonDataObjectsTest.TestBorrowedReferences (2003 of 2020) PASS: lldb-api :: commands/frame/language/TestGuessLanguage.py (2004 of 2020) UNSUPPORTED: lldb-shell :: Register/x86-64-zmm-write.test (2005 of 2020) PASS: lldb-unit :: Language/CPlusPlus/./LanguageCPlusPlusTests/CPlusPlusLanguage.ExtractContextAndIdentifier (2006 of 2020) UNSUPPORTED: lldb-shell :: Watchpoint/netbsd-nouserdbregs.test (2007 of 2020) PASS: lldb-api :: python_api/lldbutil/iter/TestRegistersIterator.py (2008 of 2020) PASS: lldb-unit :: UnwindAssembly/x86/./UnwindAssemblyx86Tests/Testx86AssemblyInspectionEngine.TestMovRSPtoRBP (2009 of 2020) UNSUPPORTED: lldb-api :: benchmarks/frame_variable/TestFrameVariableResponse.py (2010 of 2020) PASS: lldb-api :: functionalities/gdb_remote_client/TestIOSSimulator.py (2011 of 2020) PASS: lldb-api :: commands/expression/import-std-module/shared_ptr-dbg-info-content/TestSharedPtrDbgInfoContentFromStdModule.py (2012 of 2020) PASS: lldb-unit :: Utility/./UtilityTests/UriParserTest.TypicalPortPathIPv6 (2013 of 2020) PASS: lldb-unit :: Symbol/./SymbolTests/TestTypeSystemClang.TestGetEnumIntegerTypeBasicTypes (2014 of 2020) PASS: lldb-api :: lang/cpp/nsimport/TestCppNsImport.py (2015 of 2020) PASS: lldb-api :: python_api/sbvalue_persist/TestSBValuePersist.py (2016 of 2020) PASS: lldb-api :: lang/cpp/gmodules-templates/TestGModules.py (2017 of 2020) PASS: lldb-unit :: UnwindAssembly/x86/./UnwindAssemblyx86Tests/Testx86AssemblyInspectionEngine.TestAddESP (2018 of 2020) PASS: lldb-api :: python_api/value/change_values/TestChangeValueAPI.py (2019 of 2020) PASS: lldb-api :: lang/objc/foundation/TestObjectDescriptionAPI.py (2020 of 2020) Slowest Tests: -------------------------------------------------------------------------- 359.20s: lldb-api :: tools/lldb-server/TestLldbGdbServer.py 280.21s: lldb-api :: lang/cpp/enum_types/TestCPP11EnumTypes.py 267.03s: lldb-api :: api/multithreaded/TestMultithreaded.py 250.34s: lldb-api :: lang/objc/hidden-ivars/TestHiddenIvars.py 249.56s: lldb-api :: tools/lldb-server/TestGdbRemoteThreadsInStopReply.py 226.12s: lldb-api :: lang/objc/foundation/TestObjCMethods.py 163.01s: lldb-api :: lang/objc/objc-new-syntax/TestObjCNewSyntaxLiteral.py 159.02s: lldb-api :: lang/objc/exceptions/TestObjCExceptions.py 156.88s: lldb-api :: lang/cpp/namespace/TestNamespaceLookup.py 145.40s: lldb-api :: lang/objc/real-definition/TestRealDefinition.py 125.30s: lldb-api :: types/TestLongTypesExpr.py 123.37s: lldb-api :: lang/objc/objc-new-syntax/TestObjCNewSyntaxArray.py 123.18s: lldb-api :: lang/objc/objc-new-syntax/TestObjCNewSyntaxDictionary.py 120.53s: lldb-api :: lang/objc/foundation/TestObjCMethodsNSError.py 120.40s: lldb-api :: tools/lldb-server/TestGdbRemote_qThreadStopInfo.py 118.70s: lldb-api :: lang/objc/foundation/TestObjCMethodsString.py 110.13s: lldb-api :: python_api/lldbutil/iter/TestLLDBIterator.py 94.21s: lldb-api :: commands/settings/TestSettings.py 92.83s: lldb-api :: functionalities/data-formatter/boolreference/TestFormattersBoolRefPtr.py 91.68s: lldb-api :: functionalities/gdb_remote_client/TestWasm.py

Hide Details

Tests Times: -------------------------------------------------------------------------- [ Range ] :: [ Percentage ] :: [ Count ] -------------------------------------------------------------------------- [340s,360s) :: [ ] :: [ 1/2020] [320s,340s) :: [ ] :: [ 0/2020] [300s,320s) :: [ ] :: [ 0/2020] [280s,300s) :: [ ] :: [ 1/2020] [260s,280s) :: [ ] :: [ 1/2020] [240s,260s) :: [ ] :: [ 2/2020] [220s,240s) :: [ ] :: [ 1/2020] [200s,220s) :: [ ] :: [ 0/2020] [180s,200s) :: [ ] :: [ 0/2020] [160s,180s) :: [ ] :: [ 1/2020] [140s,160s) :: [ ] :: [ 3/2020] [120s,140s) :: [ ] :: [ 5/2020] [100s,120s) :: [ ] :: [ 2/2020] [ 80s,100s) :: [ ] :: [ 10/2020] [ 60s, 80s) :: [ ] :: [ 20/2020] [ 40s, 60s) :: [* ] :: [ 90/2020] [ 20s, 40s) :: [** ] :: [ 113/2020] [ 0s, 20s) :: [*********************************** ] :: [1770/2020] -------------------------------------------------------------------------- ******************** Failing Tests (3): lldb-api :: lang/objc/ptr_refs/TestPtrRefsObjC.py lldb-api :: python_api/thread/TestThreadAPI.py lldb-api :: functionalities/ptr_refs/TestPtrRefs.py

Hide Details

Hide Details

Testing Time: 4486.66s Unsupported Tests : 169 Expected Passes : 1842 Expected Failures : 6 Unexpected Failures: 3 FAILED: tools/lldb/test/CMakeFiles/check-lldb-lit cd /Users/buildslave/jenkins/workspace/lldb-cmake-sanitized/lldb-build/tools/lldb/test && /usr/local/Frameworks/Python.framework/Versions/3.7/bin/python3.7 /Users/buildslave/jenkins/workspace/lldb-cmake-sanitized/lldb-build/./bin/llvm-lit -v --time-tests --shuffle --xunit-xml-output=/Users/buildslave/jenkins/workspace/lldb-cmake-sanitized/test/results.xml -v -j 4 --timeout 1200 /Users/buildslave/jenkins/workspace/lldb-cmake-sanitized/lldb-build/tools/lldb/test ninja: build stopped: subcommand failed. Command failed: Command '['/usr/bin/env', 'TERM=vt100', '/usr/local/bin/ninja', '-v', 'check-lldb']' returned non-zero exit status 1. Command: ['/usr/bin/env', 'TERM=vt100', '/usr/local/bin/ninja', '-v', 'check-lldb'] [Pipeline] } [Pipeline] // timeout [Pipeline] } [Pipeline] // stage [Pipeline] stage [Pipeline] { (Declarative: Post Actions) [Pipeline] scanForIssues [Clang (LLVM based)] Sleeping for 5 seconds due to JENKINS-32191... [Clang (LLVM based)] Parsing console log (workspace: '/Users/buildslave/jenkins/workspace/lldb-cmake-sanitized') [Clang (LLVM based)] Successfully parsed console log [Clang (LLVM based)] -> found 0 issues (skipped 0 duplicates) [Clang (LLVM based)] Skipping post processing [Clang (LLVM based)] No filter has been set, publishing all 0 issues [Pipeline] junit Recording test results [Pipeline] } [Pipeline] // stage [Pipeline] } [Pipeline] // withEnv [Pipeline] } [Pipeline] // node [Pipeline] End of Pipeline ERROR: script returned exit code 1 Finished: FAILURE