FailedConsole Output

Skipping 4,677 KB.. Full Log
lse
output: 

Hide Details

runCmd: settings set plugin.process.gdb-remote.packet-timeout 60 output:

Hide Details

runCmd: settings set symbols.clang-modules-cache-path "/Users/buildslave/jenkins/workspace/lldb-cmake-sanitized/lldb-build/tools/lldb/lldb-test-build.noindex/module-cache-lldb" output:

Hide Details

runCmd: settings set use-color false output:

Hide Details

UNSUPPORTED: LLDB (/Users/buildslave/jenkins/workspace/lldb-cmake-sanitized/host-compiler/bin/clang-10-x86_64) :: test_thread_suffix_supported_llgs (TestLldbGdbServer.LldbGdbServerTestCase) (llgs tests) runCmd: settings set symbols.enable-external-lookup false output:

Hide Details

runCmd: settings set plugin.process.gdb-remote.packet-timeout 60 output:

Hide Details

runCmd: settings set symbols.clang-modules-cache-path "/Users/buildslave/jenkins/workspace/lldb-cmake-sanitized/lldb-build/tools/lldb/lldb-test-build.noindex/module-cache-lldb" output:

Hide Details

runCmd: settings set use-color false output:

Hide Details

Adding tearDown hook: def shutdown_named_pipe(): # Close the pipe. try: named_pipe.close() except: print("failed to close named pipe") None

Hide Details

# Delete the pipe. try: os.remove(named_pipe_path) except: print("failed to delete named pipe: {}".format(named_pipe_path)) None

Hide Details

# Delete the temp directory. try: os.rmdir(temp_dir) except: print( "failed to delete temp dir: {}, directory contents: '{}'".format( temp_dir, os.listdir(temp_dir))) None

Hide Details

Hide Details

Adding tearDown hook: def cleanupSubprocesses(self): # Ensure any subprocesses are cleaned up for p in self.subprocesses: p.terminate() del p del self.subprocesses[:] # Ensure any forked processes are cleaned up for pid in self.forkedProcessPids: if os.path.exists("/proc/" + str(pid)): os.kill(pid, signal.SIGTERM)

Hide Details

Hide Details

Adding tearDown hook: def shutdown_debug_monitor(): try: server.terminate() except: logger.warning( "failed to terminate server for debug monitor: {}; ignoring".format( sys.exc_info()[0]))

Hide Details

Hide Details

Adding tearDown hook: def shutdown_socket(): if sock: try: # send the kill packet so lldb-server shuts down gracefully sock.sendall(GdbRemoteTestCaseBase._GDBREMOTE_KILL_PACKET) except: logger.warning( "failed to send kill packet to debug monitor: {}; ignoring".format( sys.exc_info()[0]))

Hide Details

try: sock.close() except: logger.warning( "failed to close socket to debug monitor: {}; ignoring".format( sys.exc_info()[0]))

Hide Details

Hide Details

Executing tearDown hook: def shutdown_socket(): if sock: try: # send the kill packet so lldb-server shuts down gracefully sock.sendall(GdbRemoteTestCaseBase._GDBREMOTE_KILL_PACKET) except: logger.warning( "failed to send kill packet to debug monitor: {}; ignoring".format( sys.exc_info()[0]))

Hide Details

try: sock.close() except: logger.warning( "failed to close socket to debug monitor: {}; ignoring".format( sys.exc_info()[0]))

Hide Details

Hide Details

Executing tearDown hook: def shutdown_debug_monitor(): try: server.terminate() except: logger.warning( "failed to terminate server for debug monitor: {}; ignoring".format( sys.exc_info()[0]))

Hide Details

Hide Details

Executing tearDown hook: def cleanupSubprocesses(self): # Ensure any subprocesses are cleaned up for p in self.subprocesses: p.terminate() del p del self.subprocesses[:] # Ensure any forked processes are cleaned up for pid in self.forkedProcessPids: if os.path.exists("/proc/" + str(pid)): os.kill(pid, signal.SIGTERM)

Hide Details

Hide Details

Executing tearDown hook: def shutdown_named_pipe(): # Close the pipe. try: named_pipe.close() except: print("failed to close named pipe") None

Hide Details

# Delete the pipe. try: os.remove(named_pipe_path) except: print("failed to delete named pipe: {}".format(named_pipe_path)) None

Hide Details

# Delete the temp directory. try: os.rmdir(temp_dir) except: print( "failed to delete temp dir: {}, directory contents: '{}'".format( temp_dir, os.listdir(temp_dir))) None

Hide Details

Hide Details

PASS: LLDB (/Users/buildslave/jenkins/workspace/lldb-cmake-sanitized/host-compiler/bin/clang-10-x86_64) :: test_written_M_content_reads_back_correctly_debugserver (TestLldbGdbServer.LldbGdbServerTestCase) runCmd: settings set symbols.enable-external-lookup false output:

Hide Details

runCmd: settings set plugin.process.gdb-remote.packet-timeout 60 output:

Hide Details

runCmd: settings set symbols.clang-modules-cache-path "/Users/buildslave/jenkins/workspace/lldb-cmake-sanitized/lldb-build/tools/lldb/lldb-test-build.noindex/module-cache-lldb" output:

Hide Details

runCmd: settings set use-color false output:

Hide Details

UNSUPPORTED: LLDB (/Users/buildslave/jenkins/workspace/lldb-cmake-sanitized/host-compiler/bin/clang-10-x86_64) :: test_written_M_content_reads_back_correctly_llgs (TestLldbGdbServer.LldbGdbServerTestCase) (llgs tests) Restore dir to: /Users/buildslave/jenkins/workspace/lldb-cmake-sanitized/lldb-build/tools/lldb/lit ====================================================================== FAIL: test_p_returns_correct_data_size_for_each_qRegisterInfo_attach_debugserver (TestLldbGdbServer.LldbGdbServerTestCase) ---------------------------------------------------------------------- Traceback (most recent call last): File "/Users/buildslave/jenkins/workspace/lldb-cmake-sanitized/llvm-project/lldb/packages/Python/lldbsuite/test/decorators.py", line 141, in wrapper func(*args, **kwargs) File "/Users/buildslave/jenkins/workspace/lldb-cmake-sanitized/llvm-project/lldb/packages/Python/lldbsuite/test/tools/lldb-server/TestLldbGdbServer.py", line 621, in test_p_returns_correct_data_size_for_each_qRegisterInfo_attach_debugserver self.p_returns_correct_data_size_for_each_qRegisterInfo() File "/Users/buildslave/jenkins/workspace/lldb-cmake-sanitized/llvm-project/lldb/packages/Python/lldbsuite/test/tools/lldb-server/TestLldbGdbServer.py", line 551, in p_returns_correct_data_size_for_each_qRegisterInfo procs = self.prep_debug_monitor_and_inferior() File "/Users/buildslave/jenkins/workspace/lldb-cmake-sanitized/llvm-project/lldb/packages/Python/lldbsuite/test/tools/lldb-server/gdbremote_testcase.py", line 581, in prep_debug_monitor_and_inferior server = self.connect_to_debug_monitor(attach_pid=attach_pid) File "/Users/buildslave/jenkins/workspace/lldb-cmake-sanitized/llvm-project/lldb/packages/Python/lldbsuite/test/tools/lldb-server/gdbremote_testcase.py", line 415, in connect_to_debug_monitor server = self.launch_debug_monitor(attach_pid=attach_pid) File "/Users/buildslave/jenkins/workspace/lldb-cmake-sanitized/llvm-project/lldb/packages/Python/lldbsuite/test/tools/lldb-server/gdbremote_testcase.py", line 408, in launch_debug_monitor self.port = self.get_stub_port_from_named_socket() File "/Users/buildslave/jenkins/workspace/lldb-cmake-sanitized/llvm-project/lldb/packages/Python/lldbsuite/test/tools/lldb-server/gdbremote_testcase.py", line 214, in get_stub_port_from_named_socket "write side of pipe has not written anything - stub isn't writing to pipe.") AssertionError: 0 == 0 : write side of pipe has not written anything - stub isn't writing to pipe. Config=x86_64-/Users/buildslave/jenkins/workspace/lldb-cmake-sanitized/host-compiler/bin/clang-10 ====================================================================== FAIL: test_qThreadInfo_contains_thread_attach_debugserver (TestLldbGdbServer.LldbGdbServerTestCase) ---------------------------------------------------------------------- Traceback (most recent call last): File "/Users/buildslave/jenkins/workspace/lldb-cmake-sanitized/llvm-project/lldb/packages/Python/lldbsuite/test/decorators.py", line 141, in wrapper func(*args, **kwargs) File "/Users/buildslave/jenkins/workspace/lldb-cmake-sanitized/llvm-project/lldb/packages/Python/lldbsuite/test/tools/lldb-server/TestLldbGdbServer.py", line 481, in test_qThreadInfo_contains_thread_attach_debugserver self.qThreadInfo_contains_thread() File "/Users/buildslave/jenkins/workspace/lldb-cmake-sanitized/llvm-project/lldb/packages/Python/lldbsuite/test/tools/lldb-server/TestLldbGdbServer.py", line 446, in qThreadInfo_contains_thread procs = self.prep_debug_monitor_and_inferior() File "/Users/buildslave/jenkins/workspace/lldb-cmake-sanitized/llvm-project/lldb/packages/Python/lldbsuite/test/tools/lldb-server/gdbremote_testcase.py", line 581, in prep_debug_monitor_and_inferior server = self.connect_to_debug_monitor(attach_pid=attach_pid) File "/Users/buildslave/jenkins/workspace/lldb-cmake-sanitized/llvm-project/lldb/packages/Python/lldbsuite/test/tools/lldb-server/gdbremote_testcase.py", line 415, in connect_to_debug_monitor server = self.launch_debug_monitor(attach_pid=attach_pid) File "/Users/buildslave/jenkins/workspace/lldb-cmake-sanitized/llvm-project/lldb/packages/Python/lldbsuite/test/tools/lldb-server/gdbremote_testcase.py", line 408, in launch_debug_monitor self.port = self.get_stub_port_from_named_socket() File "/Users/buildslave/jenkins/workspace/lldb-cmake-sanitized/llvm-project/lldb/packages/Python/lldbsuite/test/tools/lldb-server/gdbremote_testcase.py", line 214, in get_stub_port_from_named_socket "write side of pipe has not written anything - stub isn't writing to pipe.") AssertionError: 0 == 0 : write side of pipe has not written anything - stub isn't writing to pipe. Config=x86_64-/Users/buildslave/jenkins/workspace/lldb-cmake-sanitized/host-compiler/bin/clang-10 ---------------------------------------------------------------------- Ran 65 tests in 228.127s

Hide Details

RESULT: FAILED (28 passes, 2 failures, 0 errors, 34 skipped, 1 expected failures, 0 unexpected successes)

Hide Details

******************** PASS: lldb-Suite :: tools/lldb-server/platform-process-connect/TestPlatformProcessConnect.py (724 of 1725) PASS: lldb-Suite :: functionalities/breakpoint/breakpoint_locations/TestBreakpointLocations.py (725 of 1725) PASS: lldb-Suite :: functionalities/thread/exit_during_step/TestExitDuringStep.py (726 of 1725) PASS: LLDB :: Modules/ELF/aarch64-relocations.yaml (727 of 1725) PASS: lldb-Unit :: Utility/./UtilityTests/StringExtractorTest.GetU32LittleEndian (728 of 1725) PASS: lldb-Suite :: functionalities/tail_call_frames/disambiguate_call_site/TestDisambiguateCallSite.py (729 of 1725) UNSUPPORTED: LLDB :: SymbolFile/PDB/type-quals.test (730 of 1725) PASS: lldb-Unit :: Process/minidump/./LLDBMinidumpTests/MinidumpParserTest.GetLinuxProcStatus_no_stream (731 of 1725) PASS: lldb-Suite :: python_api/process/io/TestProcessIO.py (732 of 1725) PASS: lldb-Suite :: functionalities/data-formatter/compactvectors/TestCompactVectors.py (733 of 1725) PASS: lldb-Unit :: Host/./HostTests/TaskPoolTest.RunTasks (734 of 1725) PASS: lldb-Unit :: Expression/./ExpressionTests/ClangHostTest.ComputeClangResourceDirectory (735 of 1725) PASS: LLDB :: SymbolFile/DWARF/forward-declarations.s (736 of 1725) PASS: lldb-Suite :: linux/sepdebugsymlink/TestTargetSymbolsSepDebugSymlink.py (737 of 1725) PASS: lldb-Suite :: lang/objc/modules-incomplete/TestIncompleteModules.py (738 of 1725) UNSUPPORTED: LLDB :: Register/x86-64-zmm-read.test (739 of 1725) PASS: lldb-Unit :: Utility/./UtilityTests/StreamTest.PutRawBytesToLittleEndian (740 of 1725) PASS: lldb-Unit :: Utility/./UtilityTests/StringExtractorTest.GetHexU8_Extra_NoEof (741 of 1725) PASS: lldb-Suite :: functionalities/breakpoint/consecutive_breakpoints/TestConsecutiveBreakpoints.py (742 of 1725) PASS: lldb-Unit :: Process/minidump/./LLDBMinidumpTests/MinidumpParserTest.GetMemoryRegionInfoLinuxMaps (743 of 1725) PASS: lldb-Suite :: functionalities/data-formatter/data-formatter-disabling/TestDataFormatterDisabling.py (744 of 1725) PASS: lldb-Suite :: functionalities/data-formatter/parray/TestPrintArray.py (745 of 1725) PASS: lldb-Unit :: Utility/./UtilityTests/RangeTest.Copy (746 of 1725) PASS: lldb-Unit :: Host/./HostTests/ProcessLaunchInfoTest.Constructor (747 of 1725) PASS: lldb-Suite :: functionalities/data-formatter/data-formatter-stl/libcxx/bitset/TestDataFormatterLibcxxBitset.py (748 of 1725) PASS: LLDB :: SymbolFile/DWARF/debug-types-dwarf5.s (749 of 1725) PASS: LLDB :: Settings/TestSettingsWrite.test (750 of 1725) PASS: lldb-Unit :: Core/./LLDBCoreTests/MangledTest.EmptyForInvalidName (751 of 1725) PASS: lldb-Unit :: Host/./HostTests/TaskPoolTest.AddTask (752 of 1725) PASS: lldb-Suite :: tools/lldb-server/TestGdbRemote_qThreadStopInfo.py (753 of 1725) PASS: lldb-Suite :: python_api/watchpoint/TestWatchpointIter.py (754 of 1725) PASS: lldb-Unit :: Utility/./UtilityTests/RegularExpression.Empty (755 of 1725) PASS: LLDB :: Commands/CommandScriptImmediateOutput/CommandScriptImmediateOutputFile.test (756 of 1725) PASS: lldb-Suite :: commands/target/create-no-such-arch/TestNoSuchArch.py (757 of 1725) PASS: LLDB :: Settings/TestDisassemblyFormat.test (758 of 1725) PASS: lldb-Suite :: macosx/function-starts/TestFunctionStarts.py (759 of 1725) PASS: lldb-Suite :: functionalities/data-formatter/data-formatter-objc/TestDataFormatterObjCKVO.py (760 of 1725) PASS: lldb-Unit :: Utility/./UtilityTests/BinaryStreamTest.PutULEB128One (761 of 1725) PASS: lldb-Suite :: functionalities/darwin_log/filter/regex/message/TestDarwinLogFilterRegexMessage.py (762 of 1725) PASS: lldb-Suite :: python_api/lldbutil/TestSwigVersion.py (763 of 1725) PASS: lldb-Unit :: Language/Highlighting/./HighlighterTests/HighlighterTest.ClangIdentifiers (764 of 1725) PASS: lldb-Unit :: Utility/./UtilityTests/OptionsWithRawTest.ArgsButNoLeadingDash (765 of 1725) PASS: lldb-Suite :: functionalities/unwind/standard/TestStandardUnwind.py (766 of 1725) PASS: lldb-Suite :: functionalities/tsan/global_location/TestTsanGlobalLocation.py (767 of 1725) PASS: lldb-Suite :: macosx/nslog/TestDarwinNSLogOutput.py (768 of 1725) PASS: LLDB :: Modules/ELF/short-build-id.yaml (769 of 1725) PASS: lldb-Unit :: Utility/./UtilityTests/StringListTest.PopBack (770 of 1725) PASS: lldb-Unit :: ScriptInterpreter/Python/./ScriptInterpreterPythonTests/PythonDataObjectsTest.TestPythonCallableInvoke (771 of 1725) PASS: lldb-Unit :: Utility/./UtilityTests/RangeTest.SetRangeBase (772 of 1725) PASS: lldb-Suite :: functionalities/data-formatter/data-formatter-named-summaries/TestDataFormatterNamedSummaries.py (773 of 1725) PASS: lldb-Suite :: functionalities/tail_call_frames/thread_step_out_message/TestArtificialFrameStepOutMessage.py (774 of 1725) PASS: lldb-Suite :: functionalities/signal/handle-segv/TestHandleSegv.py (775 of 1725) PASS: lldb-Suite :: lang/cpp/breakpoint_in_member_func_w_non_primitive_params/TestBreakpointInMemberFuncWNonPrimitiveParams.py (776 of 1725) UNSUPPORTED: LLDB :: SymbolFile/PDB/func-symbols.test (777 of 1725) PASS: lldb-Unit :: Utility/./UtilityTests/ConstStringTest.NullAndEmptyStates (778 of 1725) PASS: lldb-Unit :: Process/gdb-remote/./ProcessGdbRemoteTests/GDBRemoteCommunicationClientTest.SendGetDataPacket (779 of 1725) PASS: lldb-Unit :: SymbolFile/NativePDB/./SymbolFileNativePDBTests/PDBFPOProgramToDWARFExpressionTests.DependencyChain (780 of 1725) PASS: lldb-Unit :: Utility/./UtilityTests/Flags.IsClear (781 of 1725) PASS: lldb-Suite :: tools/lldb-vscode/variables/TestVSCode_variables.py (782 of 1725) PASS: lldb-Suite :: commands/expression/ir-interpreter/TestIRInterpreter.py (783 of 1725) PASS: lldb-Unit :: Process/gdb-remote/./ProcessGdbRemoteTests/GDBRemoteClientBaseTest.SendContinueAndAsyncSignal (784 of 1725) PASS: lldb-Unit :: Target/./TargetTests/PathMappingListTest.AbsoluteTests (785 of 1725) PASS: LLDB :: SymbolFile/DWARF/debug-types-dwo-cross-reference.cpp (786 of 1725) PASS: lldb-Unit :: Utility/./UtilityTests/RecordReplayTest.InstrumentedBarRef (787 of 1725) PASS: lldb-Suite :: commands/expression/import-std-module/no-std-module/TestMissingStdModule.py (788 of 1725) PASS: lldb-Suite :: functionalities/breakpoint/breakpoint_command/TestRegexpBreakCommand.py (789 of 1725) PASS: lldb-Unit :: Utility/./UtilityTests/StringListTest.CopyList (790 of 1725) PASS: LLDB :: Quit/TestQuitExitCode-30.test (791 of 1725) PASS: LLDB :: SymbolFile/DWARF/dwarf5-index-is-used.cpp (792 of 1725) PASS: lldb-Unit :: ScriptInterpreter/Python/./ScriptInterpreterPythonTests/PythonExceptionStateTest.TestAcquisitionSemantics (793 of 1725) PASS: lldb-Unit :: Utility/./UtilityTests/BinaryStreamTest.PutSLEB128FourBytes (794 of 1725) PASS: lldb-Unit :: UnwindAssembly/x86/./UnwindAssemblyx86Tests/Testx86AssemblyInspectionEngine.TestPushEBP (795 of 1725) PASS: LLDB :: SymbolFile/NativePDB/nested-types.cpp (796 of 1725) PASS: lldb-Unit :: Host/./HostTests/ConnectionFileDescriptorTest.TCPGetURIv4 (797 of 1725) PASS: lldb-Suite :: functionalities/inferior-crashing/TestInferiorCrashing.py (798 of 1725) PASS: lldb-Unit :: Utility/./UtilityTests/StringExtractorTest.GetU64LittleEndian (799 of 1725) PASS: lldb-Unit :: SymbolFile/NativePDB/./SymbolFileNativePDBTests/PDBFPOProgramToDWARFExpressionTests.InvalidAssignmentMultiple (800 of 1725) PASS: lldb-Suite :: lang/cpp/namespace/TestNamespace.py (801 of 1725) PASS: lldb-Unit :: Utility/./UtilityTests/StringListTest.AppendList (802 of 1725) PASS: lldb-Suite :: lang/cpp/incomplete-types/TestCppIncompleteTypes.py (803 of 1725) PASS: lldb-Unit :: Utility/./UtilityTests/GeneratorTest.GetOrCreate (804 of 1725) PASS: lldb-Unit :: UnwindAssembly/x86/./UnwindAssemblyx86Tests/Testx86AssemblyInspectionEngine.TestPushR13 (805 of 1725) PASS: lldb-Unit :: Utility/./UtilityTests/UriParserTest.SchemeHostSeparator (806 of 1725) PASS: lldb-Suite :: lang/c/inlines/TestRedefinitionsInInlines.py (807 of 1725) PASS: lldb-Suite :: functionalities/darwin_log/format/TestDarwinLogMessageFormat.py (808 of 1725) PASS: lldb-Suite :: functionalities/completion/TestCompletion.py (809 of 1725) PASS: lldb-Suite :: functionalities/thread/concurrent_events/TestConcurrentSignalWatchBreak.py (810 of 1725) PASS: lldb-Unit :: Utility/./UtilityTests/UriParserTest.Minimal (811 of 1725) PASS: LLDB :: Modules/MachO/lc_build_version.yaml (812 of 1725) PASS: lldb-Unit :: Utility/./UtilityTests/StringLexerTest.NextIfList (813 of 1725) PASS: lldb-Suite :: tools/lldb-server/TestGdbRemoteHostInfo.py (814 of 1725) PASS: lldb-Unit :: Utility/./UtilityTests/StringExtractorTest.GetHexBytesAvail_Underflow (815 of 1725) PASS: lldb-Unit :: Utility/./UtilityTests/LogChannelEnabledTest.LogGetLogThread (816 of 1725) PASS: lldb-Unit :: Utility/./UtilityTests/TimerTest.CategoryTimesStats (817 of 1725) PASS: LLDB :: Modules/ELF/PT_LOAD.yaml (818 of 1725) PASS: lldb-Suite :: functionalities/breakpoint/breakpoint_ids/TestBreakpointIDs.py (819 of 1725) PASS: lldb-Unit :: Utility/./UtilityTests/BinaryStreamTest.PutSLEB128FiveBytes (820 of 1725) PASS: LLDB :: SymbolFile/Breakpad/line-table-edgecases.test (821 of 1725) PASS: lldb-Unit :: Utility/./UtilityTests/RangeTest.ContainsEndInclusiveInvalid (822 of 1725) PASS: lldb-Unit :: Utility/./UtilityTests/StringExtractorTest.GetHexU8_Underflow2_NoEof (823 of 1725) PASS: lldb-Unit :: ScriptInterpreter/Python/./ScriptInterpreterPythonTests/PythonDataObjectsTest.TestPythonDictionaryToStructuredDictionary (824 of 1725) PASS: lldb-Unit :: Process/minidump/./LLDBMinidumpTests/MinidumpParserTest.GetPid (825 of 1725) PASS: lldb-Suite :: python_api/value/linked_list/TestValueAPILinkedList.py (826 of 1725) PASS: lldb-Unit :: Utility/./UtilityTests/StringLexerTest.NextIf (827 of 1725) PASS: lldb-Suite :: python_api/watchpoint/TestSetWatchpoint.py (828 of 1725) PASS: lldb-Unit :: Language/Highlighting/./HighlighterTests/HighlighterTest.ClangCursorPos (829 of 1725) PASS: lldb-Unit :: Process/gdb-remote/./ProcessGdbRemoteTests/GDBRemoteClientBaseTest.SendContinueAndInterrupt2PacketBug (830 of 1725) PASS: lldb-Unit :: Utility/./UtilityTests/ScalarTest.GetBytes (831 of 1725) PASS: lldb-Unit :: Utility/./UtilityTests/Flags.Reset (832 of 1725) PASS: lldb-Suite :: functionalities/data-formatter/type_summary_list_arg/TestTypeSummaryListArg.py (833 of 1725) PASS: lldb-Unit :: Process/minidump/./LLDBMinidumpTests/MinidumpParserTest.InvalidMinidump (834 of 1725) PASS: lldb-Suite :: commands/expression/class_template_specialization_empty_pack/TestClassTemplateSpecializationParametersHandling.py (835 of 1725) PASS: lldb-Unit :: Process/gdb-remote/./ProcessGdbRemoteTests/GDBRemoteClientBaseTest.SendContinueDelegateStructuredDataReceipt (836 of 1725) PASS: lldb-Suite :: lang/c/unions/TestUnionMembers.py (837 of 1725) PASS: LLDB :: Breakpoint/split-dwarf-5-addrbase.test (838 of 1725) PASS: lldb-Unit :: Utility/./UtilityTests/ConstStringTest.UpdateMangledCounterpart (839 of 1725) PASS: lldb-Unit :: Process/minidump/./LLDBMinidumpTests/RegisterContextMinidump.ConvertMinidumpContext_x86_64 (840 of 1725) PASS: lldb-Suite :: lang/c/stepping/TestStepAndBreakpoints.py (841 of 1725) PASS: lldb-Unit :: Utility/./UtilityTests/RegisterValueTest.GetSet8 (842 of 1725) PASS: LLDB :: Breakpoint/split-dwarf5-debug-stroffsets.test (843 of 1725) PASS: lldb-Suite :: tools/lldb-server/commandline/TestStubSetSID.py (844 of 1725) PASS: lldb-Suite :: macosx/lc-note/kern-ver-str/TestKernVerStrLCNOTE.py (845 of 1725) PASS: lldb-Unit :: Breakpoint/./LLDBBreakpointTests/BreakpointIDTest.StringIsBreakpointName (846 of 1725) PASS: LLDB :: Breakpoint/single-file-split-dwarf.test (847 of 1725) PASS: lldb-Suite :: lang/objc/objc-ivar-stripped/TestObjCIvarStripped.py (848 of 1725) PASS: lldb-Suite :: functionalities/tail_call_frames/inlining_and_tail_calls/TestInliningAndTailCalls.py (849 of 1725) PASS: lldb-Suite :: functionalities/type_lookup/TestTypeLookup.py (850 of 1725) PASS: lldb-Suite :: lang/objc/self/TestObjCSelf.py (851 of 1725) PASS: lldb-Unit :: Language/Highlighting/./HighlighterTests/HighlighterTest.HighlighterSelectionPath (852 of 1725) PASS: lldb-Suite :: commands/apropos/basic/TestApropos.py (853 of 1725) PASS: LLDB :: Modules/ELF/many-sections.s (854 of 1725) PASS: lldb-Suite :: lang/cpp/virtual/TestVirtual.py (855 of 1725) PASS: lldb-Unit :: Utility/./UtilityTests/StreamTeeTest.Constructor2Streams (856 of 1725) PASS: lldb-Suite :: functionalities/breakpoint/cpp_exception/TestCPPExceptionBreakpoint.py (857 of 1725) PASS: lldb-Suite :: types/TestIntegerTypes.py (858 of 1725) PASS: lldb-Unit :: Utility/./UtilityTests/ScalarTest.ExtractBitfield (859 of 1725) PASS: lldb-Unit :: Utility/./UtilityTests/BinaryStreamTest.PutSLEB128TwoBytes (860 of 1725) PASS: lldb-Unit :: Process/gdb-remote/./ProcessGdbRemoteTests/GDBRemoteCommunicationClientTest.SendGetTraceConfigPacket (861 of 1725) PASS: lldb-Suite :: macosx/find-app-in-bundle/TestFindAppInBundle.py (862 of 1725) XFAIL: LLDB :: Register/x86-64-write.test (863 of 1725) PASS: lldb-Unit :: Utility/./UtilityTests/StreamTest.PutMaxHex64ByteOrderLittle (864 of 1725) PASS: lldb-Suite :: python_api/hello_world/TestHelloWorld.py (865 of 1725) PASS: lldb-Unit :: Utility/./UtilityTests/LogChannelEnabledTest.LogVerboseThread (866 of 1725) PASS: LLDB :: SymbolFile/NativePDB/break-by-function.cpp (867 of 1725) PASS: lldb-Suite :: commands/frame/diagnose/inheritance/TestDiagnoseInheritance.py (868 of 1725) PASS: lldb-Suite :: functionalities/data-formatter/format-propagation/TestFormatPropagation.py (869 of 1725) PASS: lldb-Suite :: functionalities/darwin_log/filter/exact_match/category/TestDarwinLogFilterMatchCategory.py (870 of 1725) PASS: LLDB :: SymbolFile/Breakpad/unwind-via-stack-win.test (871 of 1725) PASS: lldb-Suite :: functionalities/thread/concurrent_events/TestConcurrentManyCrash.py (872 of 1725) PASS: LLDB :: SymbolFile/DWARF/find-basic-namespace.cpp (873 of 1725) PASS: lldb-Suite :: api/multiple-debuggers/TestMultipleDebuggers.py (874 of 1725) PASS: LLDB :: Breakpoint/debug_rnglist_basic.test (875 of 1725) PASS: lldb-Suite :: lang/cpp/signed_types/TestSignedTypes.py (876 of 1725) PASS: lldb-Unit :: Utility/./UtilityTests/ArchSpecTest.TestParseMachCPUDashSubtypeTripleExtra (877 of 1725) PASS: lldb-Suite :: commands/watchpoints/multiple_threads/TestWatchpointMultipleThreads.py (878 of 1725) PASS: lldb-Unit :: Utility/./UtilityTests/ScalarTest.Division (879 of 1725) PASS: LLDB :: SymbolFile/NativePDB/globals-bss.cpp (880 of 1725) PASS: lldb-Unit :: Utility/./UtilityTests/StructuredDataTest.ParseJSONFromFile (881 of 1725) PASS: LLDB :: SymbolFile/NativePDB/ast-types.cpp (882 of 1725) PASS: lldb-Unit :: Utility/./UtilityTests/BinaryStreamTest.PutULEB128Zero (883 of 1725) PASS: lldb-Suite :: lang/cpp/inlines/TestInlines.py (884 of 1725) PASS: LLDB :: Modules/ELF/duplicate-section.yaml (885 of 1725) PASS: lldb-Unit :: Utility/./UtilityTests/ArgsTest.TestMultipleArgs (886 of 1725) PASS: lldb-Suite :: python_api/event/TestEvents.py (887 of 1725) PASS: lldb-Suite :: python_api/symbol-context/two-files/TestSymbolContextTwoFiles.py (888 of 1725) PASS: lldb-Suite :: benchmarks/libcxxlist/TestBenchmarkLibcxxList.py (889 of 1725) PASS: lldb-Suite :: functionalities/thread/concurrent_events/TestConcurrentTwoBreakpointsOneSignal.py (890 of 1725) UNSUPPORTED: LLDB :: SymbolFile/NativePDB/stack_unwinding01.cpp (891 of 1725) PASS: lldb-Unit :: Utility/./UtilityTests/StreamTest.ShiftOperatorUInts (892 of 1725) PASS: lldb-Unit :: Utility/./UtilityTests/StreamTest.PutRawBytesToBigEndian (893 of 1725) PASS: lldb-Unit :: Utility/./UtilityTests/ArchSpecTest.OperatorBool (894 of 1725) PASS: lldb-Unit :: Process/gdb-remote/./ProcessGdbRemoteTests/GDBRemoteCommunicationClientTest.GetMemoryRegionInfo (895 of 1725) PASS: lldb-Unit :: Utility/./UtilityTests/BinaryStreamTest.PutSLEB128NineBytes (896 of 1725) PASS: LLDB :: SymbolFile/DWARF/find-basic-type.cpp (897 of 1725) PASS: lldb-Unit :: Utility/./UtilityTests/StringListTest.ShiftCString (898 of 1725) PASS: lldb-Suite :: commands/expression/rdar44436068/Test128BitsInteger.py (899 of 1725) PASS: lldb-Suite :: functionalities/thread/crash_during_step/TestCrashDuringStep.py (900 of 1725) PASS: lldb-Suite :: functionalities/tty/TestTerminal.py (901 of 1725) PASS: lldb-Suite :: functionalities/thread/concurrent_events/TestConcurrentTwoWatchpointThreads.py (902 of 1725) PASS: lldb-Suite :: python_api/lldbutil/iter/TestLLDBIterator.py (903 of 1725) PASS: lldb-Suite :: functionalities/thread/step_until/TestStepUntil.py (904 of 1725) PASS: lldb-Unit :: Utility/./UtilityTests/DataExtractorTest.GetBitfield (905 of 1725) PASS: lldb-Suite :: tools/lldb-vscode/breakpoint/TestVSCode_setBreakpoints.py (906 of 1725) UNSUPPORTED: LLDB :: SymbolFile/PDB/calling-conventions.test (907 of 1725) PASS: lldb-Unit :: Language/Highlighting/./HighlighterTests/HighlighterTest.FallbackHighlighter (908 of 1725) PASS: lldb-Suite :: lang/cpp/operator-overload/TestOperatorOverload.py (909 of 1725) PASS: lldb-Suite :: functionalities/inferior-assert/TestInferiorAssert.py (910 of 1725) PASS: lldb-Unit :: Utility/./UtilityTests/StringListTest.RemoveBlankLines (911 of 1725) PASS: lldb-Unit :: Utility/./UtilityTests/VMRange.Ordering (912 of 1725) PASS: lldb-Suite :: lang/objc/foundation/TestObjCMethodsString.py (913 of 1725) PASS: lldb-Unit :: Utility/./UtilityTests/StringExtractorTest.GetHexBytesAvail_OddPair2 (914 of 1725) XFAIL: LLDB :: Unwind/prefer-debug-over-eh-frame.test (915 of 1725) PASS: lldb-Suite :: lang/objc/print-obj/TestPrintObj.py (916 of 1725) PASS: lldb-Unit :: Process/gdb-remote/./ProcessGdbRemoteTests/GDBRemoteCommunicationClientTest.GetModulesInfo (917 of 1725) PASS: lldb-Suite :: python_api/process/read-mem-cstring/TestReadMemCString.py (918 of 1725) PASS: lldb-Unit :: Utility/./UtilityTests/RangeTest.LessThanInvalid (919 of 1725) PASS: lldb-Suite :: functionalities/breakpoint/breakpoint_conditions/TestBreakpointConditions.py (920 of 1725) PASS: lldb-Unit :: UnwindAssembly/x86/./UnwindAssemblyx86Tests/Testx86AssemblyInspectionEngine.TestPushR14 (921 of 1725) PASS: lldb-Unit :: Utility/./UtilityTests/StringExtractorTest.GetHexU8_Underflow2 (922 of 1725) PASS: lldb-Suite :: commands/expression/unwind_expression/TestUnwindExpression.py (923 of 1725) UNSUPPORTED: LLDB :: SymbolFile/PDB/ast-restore.test (924 of 1725) PASS: lldb-Unit :: Language/Highlighting/./HighlighterTests/HighlighterTest.ClangSquareBrackets (925 of 1725) PASS: lldb-Unit :: Symbol/./SymbolTests/TestClangASTContext.TestRemoveFastQualifiers (926 of 1725) PASS: lldb-Unit :: Utility/./UtilityTests/StringListTest.GetMaxStringLengthEmpty (927 of 1725) PASS: lldb-Unit :: ScriptInterpreter/Python/./ScriptInterpreterPythonTests/PythonDataObjectsTest.TestPythonTupleToStructuredList (928 of 1725) PASS: lldb-Unit :: UnwindAssembly/x86/./UnwindAssemblyx86Tests/Testx86AssemblyInspectionEngine.TestCALLNextInsn (929 of 1725) PASS: lldb-Suite :: commands/expression/call-function/TestCallUserDefinedFunction.py (930 of 1725) PASS: lldb-Suite :: commands/gui/invalid-args/TestInvalidArgsGui.py (931 of 1725) PASS: lldb-Suite :: types/TestFloatTypes.py (932 of 1725) PASS: LLDB :: Modules/ELF/PT_TLS-overlap-PT_LOAD.yaml (933 of 1725) PASS: lldb-Unit :: Utility/./UtilityTests/StringExtractorTest.GetHexBytes_FullString (934 of 1725) PASS: lldb-Suite :: functionalities/gdb_remote_client/TestRecognizeBreakpoint.py (935 of 1725) PASS: lldb-Unit :: Language/Highlighting/./HighlighterTests/HighlighterTest.ClangBraces (936 of 1725) PASS: LLDB :: Modules/ELF/netbsd-exec-8.99.30-amd64.yaml (937 of 1725) PASS: lldb-Unit :: Target/./TargetTests/ExecutionContextTest.GetByteOrderProcess (938 of 1725) PASS: lldb-Unit :: Utility/./UtilityTests/SerializationRountripTest.SerializeDeserializeCString (939 of 1725) PASS: lldb-Unit :: SymbolFile/DWARF/./SymbolFileDWARFTests/DWARFASTParserClangTests.TestGetDIEForDeclContextReturnsOnlyMatchingEntries (940 of 1725) PASS: lldb-Suite :: arm/emulation/TestEmulations.py (941 of 1725) PASS: lldb-Suite :: python_api/value/empty_class/TestValueAPIEmptyClass.py (942 of 1725) PASS: lldb-Suite :: arm/breakpoint-thumb-codesection/TestBreakpointThumbCodesection.py (943 of 1725) PASS: lldb-Suite :: python_api/sbvalue_const_addrof/TestSBValueConstAddrOf.py (944 of 1725) PASS: LLDB :: SymbolFile/DWARF/deterministic-build.cpp (945 of 1725) PASS: lldb-Unit :: Symbol/./SymbolTests/TestClangASTContext.TestGetBasicTypeFromEnum (946 of 1725) PASS: lldb-Suite :: commands/expression/import-std-module/sysroot/TestStdModuleSysroot.py (947 of 1725) PASS: lldb-Unit :: Utility/./UtilityTests/StringLexerTest.GetUnlexed (948 of 1725) PASS: LLDB :: SymbolFile/DWARF/dir-separator-windows.s (949 of 1725) PASS: lldb-Unit :: Utility/./UtilityTests/VMRange.ContainsAddr (950 of 1725) PASS: lldb-Unit :: Host/./HostTests/SocketTest.DomainGetConnectURI (951 of 1725) PASS: lldb-Suite :: functionalities/data-formatter/data-formatter-stl/libcxx/list/loop/TestDataFormatterLibcxxListLoop.py (952 of 1725) PASS: LLDB :: Modules/ELF/PT_LOAD-empty.yaml (953 of 1725) PASS: lldb-Unit :: Utility/./UtilityTests/StreamTest.ShiftOperatorPtr (954 of 1725) PASS: lldb-Suite :: lang/objc/ptr_refs/TestPtrRefsObjC.py (955 of 1725) PASS: lldb-Suite :: functionalities/data-formatter/data-formatter-objc/nsstring/TestDataFormatterNSString.py (956 of 1725) PASS: lldb-Suite :: functionalities/data-formatter/ostypeformatting/TestFormattersOsType.py (957 of 1725) PASS: lldb-Suite :: lang/objc/foundation/TestObjCMethodsNSArray.py (958 of 1725) PASS: lldb-Unit :: Utility/./UtilityTests/StringExtractorTest.GetHexBytes_Underflow (959 of 1725) PASS: lldb-Unit :: Utility/./UtilityTests/OptionsWithRawTest.UnterminatedQuote (960 of 1725) PASS: lldb-Suite :: commands/expression/xvalue/TestXValuePrinting.py (961 of 1725) PASS: lldb-Unit :: Utility/./UtilityTests/ArgsTest.GetQuotedCommandString (962 of 1725) PASS: lldb-Suite :: tools/lldb-server/thread-name/TestGdbRemoteThreadName.py (963 of 1725) PASS: lldb-Suite :: commands/expression/import-std-module/weak_ptr/TestWeakPtr.py (964 of 1725) PASS: lldb-Unit :: Utility/./UtilityTests/GeneratorTest.Create (965 of 1725) XFAIL: LLDB :: Register/x86-mm-xmm-read.test (966 of 1725) PASS: LLDB :: SymbolFile/NativePDB/disassembly.cpp (967 of 1725) PASS: lldb-Unit :: UnwindAssembly/x86/./UnwindAssemblyx86Tests/Testx86AssemblyInspectionEngine.TestPushESI (968 of 1725) PASS: lldb-Unit :: ScriptInterpreter/Python/./ScriptInterpreterPythonTests/PythonExceptionStateTest.TestDiscardSemantics (969 of 1725) PASS: lldb-Suite :: commands/watchpoints/watchpoint_size/TestWatchpointSizes.py (970 of 1725) PASS: lldb-Suite :: functionalities/float-display/TestFloatDisplay.py (971 of 1725) PASS: lldb-Unit :: ScriptInterpreter/Python/./ScriptInterpreterPythonTests/PythonDataObjectsTest.TestGlobalNameResolutionWithDot (972 of 1725) PASS: lldb-Unit :: Utility/./UtilityTests/RecordReplayTest.InstrumentedFoo (973 of 1725) PASS: lldb-Unit :: Interpreter/./InterpreterTests/OptionArgParserTest.toChar (974 of 1725) PASS: lldb-Unit :: Utility/./UtilityTests/UUIDTest.Validity (975 of 1725) PASS: lldb-Unit :: Utility/./UtilityTests/StringListTest.AppendStringStdString (976 of 1725) PASS: lldb-Suite :: lang/c/step-target/TestStepTarget.py (977 of 1725) PASS: lldb-Suite :: commands/command/script/import/TestImport.py (978 of 1725) PASS: lldb-Suite :: python_api/interpreter/TestCommandInterpreterAPI.py (979 of 1725) PASS: lldb-Suite :: python_api/thread/TestThreadAPI.py (980 of 1725) PASS: LLDB :: Breakpoint/debug_rnglistx_rlex.test (981 of 1725) PASS: lldb-Unit :: Utility/./UtilityTests/AnsiTerminal.WhiteSpace (982 of 1725) PASS: lldb-Suite :: functionalities/thread/jump/TestThreadJump.py (983 of 1725) PASS: lldb-Suite :: functionalities/data-formatter/data-formatter-advanced/TestDataFormatterAdv.py (984 of 1725) PASS: lldb-Suite :: functionalities/thread/concurrent_events/TestConcurrentTwoWatchpointsOneBreakpoint.py (985 of 1725) PASS: lldb-Suite :: lang/objcxx/objcxx-ivar-vector/TestIvarVector.py (986 of 1725) PASS: lldb-Suite :: lang/c/stepping/TestThreadStepping.py (987 of 1725) PASS: lldb-Suite :: commands/process/attach-resume/TestAttachResume.py (988 of 1725) PASS: lldb-Unit :: Utility/./UtilityTests/JSONTest.Newlines (989 of 1725) PASS: LLDB :: Minidump/disassemble-no-module.yaml (990 of 1725) PASS: lldb-Suite :: lang/cpp/this/TestCPPThis.py (991 of 1725) PASS: lldb-Unit :: ObjectFile/Breakpad/./ObjectFileBreakpadTests/ModuleRecord.parse (992 of 1725) PASS: lldb-Suite :: commands/expression/test/TestExprs2.py (993 of 1725) PASS: lldb-Unit :: Utility/./UtilityTests/UUIDTest.StringConverion (994 of 1725) PASS: lldb-Unit :: ObjectFile/Breakpad/./ObjectFileBreakpadTests/FileRecord.parse (995 of 1725) PASS: lldb-Unit :: UnwindAssembly/x86/./UnwindAssemblyx86Tests/Testx86AssemblyInspectionEngine.TestMovRSPtoRBP (996 of 1725) PASS: lldb-Suite :: lang/cpp/std-function-step-into-callable/TestStdFunctionStepIntoCallable.py (997 of 1725) PASS: LLDB :: SymbolFile/DWARF/find-variable-dwo.cpp (998 of 1725) PASS: lldb-Suite :: tools/lldb-server/TestGdbRemoteAttach.py (999 of 1725) PASS: lldb-Suite :: lang/c/find_struct_type/TestFindStructTypes.py (1000 of 1725) PASS: lldb-Suite :: lang/cpp/global_operators/TestCppGlobalOperators.py (1001 of 1725) PASS: LLDB :: SymbolFile/DWARF/dwarf5-partial-index.cpp (1002 of 1725) PASS: lldb-Unit :: Utility/./UtilityTests/StringLexerTest.AdvanceIf (1003 of 1725) PASS: lldb-Unit :: UnwindAssembly/x86/./UnwindAssemblyx86Tests/Testx86AssemblyInspectionEngine.TestPushR12 (1004 of 1725) PASS: lldb-Suite :: macosx/queues/TestQueues.py (1005 of 1725) PASS: lldb-Suite :: functionalities/gdb_remote_client/TestTargetXMLArch.py (1006 of 1725) PASS: lldb-Suite :: functionalities/param_entry_vals/basic_entry_values_x86_64/TestBasicEntryValuesX86_64.py (1007 of 1725) PASS: lldb-Unit :: Process/minidump/./LLDBMinidumpTests/MinidumpParserTest.GetMemoryRegionInfo (1008 of 1725) PASS: lldb-Suite :: lang/objc/real-definition/TestRealDefinition.py (1009 of 1725) PASS: lldb-Unit :: Utility/./UtilityTests/RecordReplayTest.InstrumentedBarPtr (1010 of 1725) PASS: lldb-Unit :: Utility/./UtilityTests/StringLexerTest.Peek (1011 of 1725) PASS: lldb-Suite :: lang/cpp/llvm-style/TestLLVMStyle.py (1012 of 1725) PASS: lldb-Suite :: commands/expression/two-files/TestObjCTypeQueryFromOtherCompileUnit.py (1013 of 1725) PASS: lldb-Suite :: commands/apropos/with-process/TestAproposWithProcess.py (1014 of 1725) PASS: lldb-Suite :: functionalities/thread/thread_specific_break_plus_condition/TestThreadSpecificBpPlusCondition.py (1015 of 1725) PASS: lldb-Unit :: Process/gdb-remote/./ProcessGdbRemoteTests/GDBRemoteClientBaseTest.SendContinueAndLateInterrupt (1016 of 1725) PASS: lldb-Unit :: Utility/./UtilityTests/ConstStringTest.MangledCounterpart (1017 of 1725) PASS: lldb-Unit :: Utility/./UtilityTests/VMRange.Comparison (1018 of 1725) PASS: lldb-Unit :: ScriptInterpreter/Python/./ScriptInterpreterPythonTests/PythonDataObjectsTest.TestPythonFile (1019 of 1725) PASS: lldb-Suite :: tools/lldb-server/TestGdbRemoteProcessInfo.py (1020 of 1725) PASS: LLDB :: SymbolFile/DWARF/debug_rnglists.s (1021 of 1725) PASS: lldb-Suite :: lang/objc/foundation/TestObjCMethods.py (1022 of 1725) PASS: lldb-Unit :: Target/./TargetTests/ModuleCacheTest.GetAndPutStrangeHostname (1023 of 1725) PASS: lldb-Suite :: commands/watchpoints/watchpoint_on_vectors/TestValueOfVectorVariable.py (1024 of 1725) PASS: lldb-Suite :: lang/c/global_variables/TestGlobalVariables.py (1025 of 1725) PASS: lldb-Unit :: ObjectFile/Breakpad/./ObjectFileBreakpadTests/PublicRecord.parse (1026 of 1725) PASS: lldb-Suite :: functionalities/breakpoint/require_hw_breakpoints/TestRequireHWBreakpoints.py (1027 of 1725) PASS: lldb-Unit :: Utility/./UtilityTests/TimeoutTest.Format (1028 of 1725) PASS: lldb-Unit :: Utility/./UtilityTests/Flags.ClearCount (1029 of 1725) PASS: lldb-Suite :: commands/frame/diagnose/array/TestArray.py (1030 of 1725) PASS: lldb-Unit :: Utility/./UtilityTests/StringExtractorTest.GetU32BigEndian (1031 of 1725) PASS: lldb-Unit :: Host/./HostTests/SocketAddressTest.Set (1032 of 1725) PASS: lldb-Suite :: functionalities/thread/state/TestThreadStates.py (1033 of 1725) PASS: lldb-Unit :: debugserver/./debugserverTests/RNBSocket.LoopBackListenIPv4 (1034 of 1725) PASS: LLDB :: SymbolFile/DWARF/dir-separator-no-comp-dir-relative-name.s (1035 of 1725) PASS: lldb-Suite :: functionalities/data-formatter/data-formatter-objc/TestDataFormatterObjCPlain.py (1036 of 1725) PASS: lldb-Unit :: Utility/./UtilityTests/LogTest.Unregister (1037 of 1725) PASS: lldb-Unit :: Utility/./UtilityTests/UriParserTest.BracketedHostname (1038 of 1725) UNSUPPORTED: LLDB :: BuildScript/toolchain-msvc.test (1039 of 1725) PASS: lldb-Unit :: Utility/./UtilityTests/NameMatchesTest.RegularExpression (1040 of 1725) PASS: lldb-Suite :: functionalities/abbreviation/TestAbbreviations.py (1041 of 1725) PASS: lldb-Suite :: api/listeners/TestListener.py (1042 of 1725) PASS: lldb-Unit :: ScriptInterpreter/Python/./ScriptInterpreterPythonTests/PythonDataObjectsTest.TestPythonByteArray (1043 of 1725) PASS: lldb-Suite :: functionalities/tail_call_frames/thread_step_out_or_return/TestSteppingOutWithArtificialFrames.py (1044 of 1725) PASS: lldb-Suite :: lang/objc/radar-9691614/TestObjCMethodReturningBOOL.py (1045 of 1725) UNSUPPORTED: LLDB :: Register/x86-64-xmm16-write.test (1046 of 1725) PASS: lldb-Suite :: tools/lldb-vscode/stackTrace/TestVSCode_stackTrace.py (1047 of 1725) PASS: lldb-Suite :: lang/cpp/wchar_t/TestCxxWCharT.py (1048 of 1725) PASS: lldb-Suite :: functionalities/gdb_remote_client/TestArmRegisterDefinition.py (1049 of 1725) PASS: lldb-Suite :: commands/log/invalid-args/TestInvalidArgsLog.py (1050 of 1725) PASS: lldb-Suite :: lang/c/set_values/TestSetValues.py (1051 of 1725) FAIL: lldb-Suite :: functionalities/gdb_remote_client/TestThreadSelectionBug.py (1052 of 1725) ******************** TEST 'lldb-Suite :: functionalities/gdb_remote_client/TestThreadSelectionBug.py' FAILED ******************** lldb version 10.0.99 (http://labmaster3.local/git/llvm-project.git revision e78a7a0ecddc747129512fabf4836e22d1805f00) clang revision c624510f134ceee9bdb5308b6f4892890c61938f llvm revision c624510f134ceee9bdb5308b6f4892890c61938f LLDB library dir: /Users/buildslave/jenkins/workspace/lldb-cmake-sanitized/lldb-build/bin LLDB import library dir: /Users/buildslave/jenkins/workspace/lldb-cmake-sanitized/lldb-build/bin libstdcxx tests will not be run because: Don't know how to build with libstdcxx on macosx Skipping following debug info categories: ['dwo']

Hide Details

Session logs for test failures/errors/unexpected successes will go into directory '/Users/buildslave/jenkins/workspace/lldb-cmake-sanitized/test/logs' Command invoked: /Users/buildslave/jenkins/workspace/lldb-cmake-sanitized/llvm-project/lldb/test/dotest.py --arch=x86_64 -s /Users/buildslave/jenkins/workspace/lldb-cmake-sanitized/lldb-build/lldb-test-traces -S nm -u CXXFLAGS -u CFLAGS --executable /Users/buildslave/jenkins/workspace/lldb-cmake-sanitized/lldb-build/./bin/lldb --dsymutil /Users/buildslave/jenkins/workspace/lldb-cmake-sanitized/lldb-build/./bin/dsymutil --filecheck /Users/buildslave/jenkins/workspace/lldb-cmake-sanitized/lldb-build/./bin/FileCheck -C /Users/buildslave/jenkins/workspace/lldb-cmake-sanitized/host-compiler/bin/clang --codesign-identity lldb_codesign --server /Users/buildslave/jenkins/workspace/lldb-cmake-sanitized/lldb-build/./bin/debugserver --arch x86_64 --build-dir /Users/buildslave/jenkins/workspace/lldb-cmake-sanitized/lldb-build/lldb-test-build.noindex -s=/Users/buildslave/jenkins/workspace/lldb-cmake-sanitized/test/logs -t --env TERM=vt100 --env LLVM_LIBS_DIR=/Users/buildslave/jenkins/workspace/lldb-cmake-sanitized/lldb-build/./lib --build-dir /Users/buildslave/jenkins/workspace/lldb-cmake-sanitized/lldb-build/tools/lldb/lldb-test-build.noindex --module-cache-dir /Users/buildslave/jenkins/workspace/lldb-cmake-sanitized/lldb-build/tools/lldb/lldb-test-build.noindex/module-cache-lldb /Users/buildslave/jenkins/workspace/lldb-cmake-sanitized/llvm-project/lldb/packages/Python/lldbsuite/test/functionalities/gdb_remote_client -p TestThreadSelectionBug.py Change dir to: /Users/buildslave/jenkins/workspace/lldb-cmake-sanitized/llvm-project/lldb/packages/Python/lldbsuite/test/functionalities/gdb_remote_client runCmd: settings set symbols.enable-external-lookup false output:

Hide Details

runCmd: settings set plugin.process.gdb-remote.packet-timeout 60 output:

Hide Details

runCmd: settings set symbols.clang-modules-cache-path "/Users/buildslave/jenkins/workspace/lldb-cmake-sanitized/lldb-build/tools/lldb/lldb-test-build.noindex/module-cache-lldb" output:

Hide Details

runCmd: settings set use-color false output:

Hide Details

FAIL: LLDB (/Users/buildslave/jenkins/workspace/lldb-cmake-sanitized/host-compiler/bin/clang-10-x86_64) :: test (TestThreadSelectionBug.TestThreadSelectionBug) <bound method SBProcess.Kill of <lldb.SBProcess; proxy of <Swig Object of type 'lldb::SBProcess *' at 0x10b08c960> >>: success

Hide Details

Restore dir to: /Users/buildslave/jenkins/workspace/lldb-cmake-sanitized/lldb-build/tools/lldb/lit ====================================================================== FAIL: test (TestThreadSelectionBug.TestThreadSelectionBug) ---------------------------------------------------------------------- Traceback (most recent call last): File "/Users/buildslave/jenkins/workspace/lldb-cmake-sanitized/llvm-project/lldb/packages/Python/lldbsuite/test/functionalities/gdb_remote_client/TestThreadSelectionBug.py", line 17, in test process = self.connect(target) File "/Users/buildslave/jenkins/workspace/lldb-cmake-sanitized/llvm-project/lldb/packages/Python/lldbsuite/test/functionalities/gdb_remote_client/gdbclientutils.py", line 479, in connect self.assertTrue(error.Success(), error.description) AssertionError: False is not True : failed to get reply to handshake packet Config=x86_64-/Users/buildslave/jenkins/workspace/lldb-cmake-sanitized/host-compiler/bin/clang-10 ---------------------------------------------------------------------- Ran 1 test in 62.354s

Hide Details

RESULT: FAILED (0 passes, 1 failures, 0 errors, 0 skipped, 0 expected failures, 0 unexpected successes)

Hide Details

******************** PASS: lldb-Suite :: functionalities/breakpoint/comp_dir_symlink/TestCompDirSymLink.py (1053 of 1725) PASS: lldb-Unit :: Utility/./UtilityTests/ScalarTest.RightShiftOperator (1054 of 1725) PASS: lldb-Suite :: lang/c/vla/TestVLA.py (1055 of 1725) PASS: lldb-Unit :: Symbol/./SymbolTests/Type.CompilerContextPattern (1056 of 1725) PASS: lldb-Unit :: Utility/./UtilityTests/BinaryStreamTest.PutULEB128EightBytes (1057 of 1725) PASS: lldb-Unit :: Process/gdb-remote/./ProcessGdbRemoteTests/GDBRemoteCommunicationClientTest.SendStopTracePacket (1058 of 1725) PASS: lldb-Suite :: commands/quit/TestQuit.py (1059 of 1725) PASS: lldb-Unit :: ScriptInterpreter/Python/./ScriptInterpreterPythonTests/PythonDataObjectsTest.TestPythonStringToStr (1060 of 1725) PASS: lldb-Unit :: ObjectFile/Breakpad/./ObjectFileBreakpadTests/StackWinRecord.parse (1061 of 1725) PASS: lldb-Suite :: functionalities/step-avoids-no-debug/TestStepNoDebug.py (1062 of 1725) PASS: lldb-Unit :: Utility/./UtilityTests/StringExtractorTest.GetHexU8_Underflow (1063 of 1725) PASS: lldb-Suite :: functionalities/data-formatter/varscript_formatting/TestDataFormatterVarScriptFormatting.py (1064 of 1725) PASS: lldb-Suite :: python_api/interpreter/TestRunCommandInterpreterAPI.py (1065 of 1725) PASS: lldb-Suite :: commands/command/invalid-args/TestInvalidArgsCommand.py (1066 of 1725) PASS: lldb-Suite :: functionalities/data-formatter/setvaluefromcstring/TestSetValueFromCString.py (1067 of 1725) PASS: lldb-Unit :: SymbolFile/NativePDB/./SymbolFileNativePDBTests/PDBFPOProgramToDWARFExpressionTests.UnresolvedRegisterReference (1068 of 1725) PASS: lldb-Unit :: Utility/./UtilityTests/VASprintfTest.NoBufferResize (1069 of 1725) PASS: lldb-Suite :: functionalities/breakpoint/breakpoint_options/TestBreakpointOptions.py (1070 of 1725) PASS: lldb-Suite :: lang/cpp/function-template-parameter-pack/TestFunctionTemplateParameterPack.py (1071 of 1725) PASS: lldb-Suite :: python_api/frame/TestFrames.py (1072 of 1725) PASS: lldb-Suite :: functionalities/thread/concurrent_events/TestConcurrentDelaySignalBreak.py (1073 of 1725) PASS: lldb-Unit :: Utility/./UtilityTests/ScalarTest.ComparisonFloat (1074 of 1725) PASS: lldb-Unit :: Utility/./UtilityTests/Flags.SetCount (1075 of 1725) PASS: lldb-Unit :: Utility/./UtilityTests/EnvironmentTest.EnvpConstruction (1076 of 1725) PASS: lldb-Unit :: Utility/./UtilityTests/StringListTest.Assignment (1077 of 1725) PASS: lldb-Suite :: commands/expression/import-std-module/queue/TestQueue.py (1078 of 1725) PASS: lldb-Unit :: Utility/./UtilityTests/StreamTest.PutCharWhitespace (1079 of 1725) PASS: lldb-Suite :: lang/objcxx/class-name-clash/TestNameClash.py (1080 of 1725) PASS: lldb-Unit :: Utility/./UtilityTests/TildeExpressionResolver.ResolveFullPath (1081 of 1725) PASS: lldb-Unit :: Process/minidump/./LLDBMinidumpTests/MinidumpParserTest.GetExceptionStream (1082 of 1725) PASS: lldb-Suite :: functionalities/tail_call_frames/disambiguate_tail_call_seq/TestDisambiguateTailCallSeq.py (1083 of 1725) PASS: lldb-Unit :: Expression/./ExpressionTests/DiagnosticManagerTest.AppendMessageAttachToLastDiag (1084 of 1725) PASS: lldb-Suite :: benchmarks/continue/TestBenchmarkContinue.py (1085 of 1725) PASS: lldb-Unit :: Utility/./UtilityTests/VASprintfTest.EncodingError (1086 of 1725) PASS: lldb-Unit :: Utility/./UtilityTests/AnsiTerminal.AtEnd (1087 of 1725) PASS: lldb-Suite :: commands/platform/basic/TestPlatformCommand.py (1088 of 1725) PASS: lldb-Suite :: macosx/order/TestOrderFile.py (1089 of 1725) PASS: lldb-Suite :: lang/objc/foundation/TestObjCMethods2.py (1090 of 1725) PASS: lldb-Suite :: lang/objc/modules-auto-import/TestModulesAutoImport.py (1091 of 1725) PASS: lldb-Unit :: Expression/./ExpressionTests/DWARFExpression.DW_OP_convert (1092 of 1725) PASS: lldb-Unit :: Utility/./UtilityTests/LogTest.LLDB_LOG_nullptr (1093 of 1725) PASS: lldb-Unit :: Utility/./UtilityTests/UriParserTest.BadPort (1094 of 1725) UNSUPPORTED: LLDB :: SymbolFile/target-symbols-add-unwind.test (1095 of 1725) PASS: LLDB :: SymbolFile/DWARF/gnu-style-compression.cpp (1096 of 1725) PASS: lldb-Unit :: Utility/./UtilityTests/LogChannelEnabledTest.LLDB_LOG_ERROR (1097 of 1725) PASS: lldb-Suite :: python_api/default-constructor/TestDefaultConstructorForAPIObjects.py (1098 of 1725) PASS: LLDB :: Modules/Breakpad/sections.test (1099 of 1725) PASS: lldb-Unit :: Utility/./UtilityTests/StringListTest.DefaultConstructor (1100 of 1725) PASS: lldb-Unit :: ScriptInterpreter/Python/./ScriptInterpreterPythonTests/PythonDataObjectsTest.TestObjectAttributes (1101 of 1725) PASS: lldb-Unit :: SymbolFile/DWARF/./SymbolFileDWARFTests/SymbolFileDWARFTests.TestAbbrevValidAttrNullForm (1102 of 1725) PASS: lldb-Suite :: lang/cpp/overloaded-functions/TestOverloadedFunctions.py (1103 of 1725) PASS: lldb-Unit :: tools/lldb-server/tests/./LLDBServerTests/TestBase.LaunchModePreservesEnvironment (1104 of 1725) PASS: lldb-Suite :: commands/command/delete/TestCommandDelete.py (1105 of 1725) FAIL: lldb-Suite :: commands/gui/basic/TestGuiBasic.py (1106 of 1725) ******************** TEST 'lldb-Suite :: commands/gui/basic/TestGuiBasic.py' FAILED ******************** lldb version 10.0.99 (http://labmaster3.local/git/llvm-project.git revision e78a7a0ecddc747129512fabf4836e22d1805f00) clang revision c624510f134ceee9bdb5308b6f4892890c61938f llvm revision c624510f134ceee9bdb5308b6f4892890c61938f LLDB library dir: /Users/buildslave/jenkins/workspace/lldb-cmake-sanitized/lldb-build/bin LLDB import library dir: /Users/buildslave/jenkins/workspace/lldb-cmake-sanitized/lldb-build/bin libstdcxx tests will not be run because: Don't know how to build with libstdcxx on macosx Skipping following debug info categories: ['dwo'] (lldb) settings set symbols.enable-external-lookup false (lldb) settings set plugin.process.gdb-remote.packet-timeout 60 (lldb) settings set symbols.clang-modules-cache-path "/Users/buildslave/jenkins/workspace/lldb-cmake-sanitized/lldb-build/tools/lldb/lldb-test-build.noindex/module-cache-lldb" (lldb) settings set use-color false (lldb) target create "/Users/buildslave/jenkins/workspace/lldb-cmake-sanitized/lldb-build/tools/lldb/lldb-test-build.noindex/commands/gui/basic/TestGuiBasic.test_gui/a.out" Current executable set to '/Users/buildslave/jenkins/workspace/lldb-cmake-sanitized/lldb-build/tools/lldb/lldb-test-build.noindex/commands/gui/basic/TestGuiBasic.test_gui/a.out' (x86_64). (lldb) br set -f main.c -p "// Break here" br set -f main.c -p "// Break here" Breakpoint 1: where = a.out`main + 27 at main.c:3:3, address = 0x0000000100000fab (lldb) run run Process 48158 launched: '/Users/buildslave/jenkins/workspace/lldb-cmake-sanitized/lldb-build/tools/lldb/lldb-test-build.noindex/commands/gui/basic/TestGuiBasic.test_gui/a.out' (x86_64) Process 48158 stopped * thread #1, queue = 'com.apple.main-thread', stop reason = breakpoint 1.1 frame #0: 0x0000000100000fab a.out`main(argc=1, argv=0x00007ffeefbff530) at main.c:3:3 1 int main(int argc, char **argv) { 2 int funky_var_name_that_should_be_rendered = 22; -> 3 return 0; // Break here ^ 4 } (lldb) gui gui (B)0[?7h[?1h=| LLDB (F1) | Target (F2) | Process (F3) | Thread (F4) | View (F5) | Help (F6) | lqq<Sources>qqqqqqqqqqqqqqqqqqqqqqqqqqqqqqqqqqqqqqqqqqqqqqqqqqqqqqqqqqqqqqqqqqqqqqqqqqqqqqqqqqqqqqqqqqqqqqqqqqqqqqqqqqqqqqqqqqqqqqqqqqqqqqqqqqqqqqqqqqqqqqqqqqqqqqqqqqqqqqqqqqqqqqqqqqqqqqqqqqqqqqqqqqqqqqqqqqqqqqqqqqqqqqqqqqqqqqqqqqqqqqqqqqqqqqqqqqqqqqqqqqqqqqqqqqqqqqqqqqqqqqqqqqqqqqqqqqqqqqqqqqqqqqqqqqqqqqqqqqqqqqqqqqqqqqqqqqqqqqqqqqqqqqqqqqqqqqqqqqqqqqqqqqqqqqqqqqqqqqqqqqqqqqqqqqqqqqqqqqqqqqqqqqqklqq<Threads>qqqqqqqqqqqqqqqqqqqqqqqqqqqqqqqqqqqqqqqqqqqqqqqqqqqqqqqqqqqqqqqqqqqqqqqqqqqqqqqqqqqqqqqkx a.out`main xx `qprocess 48158xx 1 x int main(int argc, char **argv) {xxxx 2 x int funky_var_name_that_should_be_rendered = 22;xxxx 3 x` return 0; // Break here <<< Thread 1: breakpoint 1.1 xxxx 4 x }xxxx 5 xxxxxxxxxxxxxxxxxxxxxxxxxxxxxxxxxxxxxxxxxxxxxxxxxxxxxxxxxxxxxxxxxxxxxxxxxxxxxxxxxxxxxxxxxxxxxxxxxxxxxxxxxxxxxxxxxxxxxxxxxxxxxxxxxxxxxxxxxlqq<Help>qqqqqqqqqqqqqqqqqqqqqqqqqqqqqqqqqqqqqqqqqqqqqqqqqqqqqqqqqqqqqqqqqqqqqqqqqqqqqqqkxxxxx Welcome to the LLDB curses GUI.xxxxxxxxxxxx Press the TAB key to change the selected view.xxxxxx Each view has its own keyboard shortcuts, press 'h' to open a dialog to display them. xxxxxxxxxxxx Common key bindings for all views:xxxxxxxxxxxxtab - Select next viewxxxxxxh - Show help dialog with view specific key bindingsxxxxxx, - Page upxxxxxx. - Page downxxxxxxup - Select previousxxxxxxdown - Select nextxxxxxxleft - Unexpand or select parentxxxxxxright - Expandxxxxxx page-up - Page upxxxxxx page-down - Page downxxxxxmqqqqqqqqqqqqqqqqqqqqqqqqqqqqqqqqqqqqqqqqqqqqqqqqqqqqqqqqqqqqqq[Press any key to exit]qqjxxxxxxxxxxxxxxxxxxxxxxxxxxxxxxxxxxxmqqqqqqqqqqqqqqqqqqqqqqqqqqqqqqqqqqqqqqqqqqqqqqqqqqqqqqqqqqqqqqqqqqqqqqqqqqqqqqqqqqqqqqqqqqqqqqqqqqqqqqqqqqqqqqqqqqqqqqqqqqqqqqqqqqqqqqqqqqqqqqqqqqqqqqqqqqqqqqqqqqqqqqqqqqqqqqqqqqqqqqqqqqqqqqqqqqqqqqqqqqqqqqqqqqqqqqqqqqqqqqqqqqqqqqqqqqqqqqqqqqqqqqqqqqqqqqqqqqqqqqqqqqqqqqqqqqqqqqqqqqqqqqqqqqqqqqqqqqqqqqqqqqqqqqqqqqqqqqqqqqqqqqqqqqqqqqqqqqqqqqqqqqqqqqqqqqqqqqqqqqqqqqqqqqqqqqqqqqqqqqqqqqqqqqqqqqqqqqjxxlqq<Variables>qqqqqqqqqqqqqqqqqqqqqqqqqqqqqqqqqqqqqqqqqqqqqqqqqqqqqqqqqqqqqqqqqqqqqqqqqqqqqqqqqqqqqqqqqqqqqqqqqqqqqqqqqqqqqqqqqqqqqqqqqqqqqqqqqqqqqqqqqqqqqqqqqqqqqqqqqqqqqqqqqqqqqqqqqqqqqqqqqqqqqqqqqqqqqqqqqqqqqqqqqqqqqqqqqqqqqqqqqqqqqqqqqqqqqqqqqqqqqqqqqqqqqqqqqqqqqqqqqqqqqqqqqqqqqqqqqqqqqqqqqqqqqqqqqqqqqqqqqqqqqqqqqqqqqqqqqqqqqqqqqqqqqqqqqqqqqqqqqqqqqqqqqqqqqqqqqqqqqqqqqqqqqqqqqqqqqqqqqqqqqqqqqkxxx (int) argc = 1xxxx `q(char **) argv = 0x00007ffeefbff530xxxx (int) funky_var_name_that_should_be_rendered = 22xxxxxxxxxxxxxxxxxxxxxxxxxxxxxxxxxxxxxxxxxxxxxxxxxxxxxxxxxxxxxxxxxxxxxxxxxxxxxxxxxxxxxxxxxxxxxxxxxxxxxxxmqqqqqqqqqqqqqqqqqqqqqqqqqqqqqqqqqqqqqqqqqqqqqqqqqqqqqqqqqqqqqqqqqqqqqqqqqqqqqqqqqqqqqqqqqqqqqqqqqqqqqqqqqqqqqqqqqqqqqqqqqqqqqqqqqqqqqqqqqqqqqqqqqqqqqqqqqqqqqqqqqqqqqqqqqqqqqqqqqqqqqqqqqqqqqqqqqqqqqqqqqqqqqqqqqqqqqqqqqqqqqqqqqqqqqqqqqqqqqqqqqqqqqqqqqqqqqqqqqqqqqqqqqqqqqqqqqqqqqqqqqqqqqqqqqqqqqqqqqqqqqqqqqqqqqqqqqqqqqqqqqqqqqqqqqqqqqqqqqqqqqqqqqqqqqqqqqqqqqqqqqqqqqqqqqqqqqqqqqqqqqqqqqqqqqqqqqqqqqqjmqqqqqqqqqqqqqqqqqqqqqqqqqqqqqqqqqqqqqqqqqqqqqqqqqqqqqqqqqqqqqqqqqqqqqqqqqqqqqqqqqqqqqqqqqqqqqqqqqqjProcess: 48158 stopped Thread: 0x5b176e Frame: 0 PC = 0x0000000100000fab lqq<Sources>qqqqqqqqqqqqqqqqqqqqqqqqqqqqqqqqqqqqqqqqqqqqqqqqqqqqqqqqqqqqqqqqqqqqqqqqqqqqqqqqqqqqqqqqqqqqqqqqqqqqqqqqqqqqqqqqqqqqqqqqqqqqqqqqqqqqqqqqqqqqqqqqqqqqqqqqqqqqqqqqqqqqqqqqqqqqqqqqqqqqqqqqqqqqqqqqqqqqqqqqqqqqqqqqqqqqqqqqqqqqqqqqqqqqqqqqqqqqqqqqqqqqqqqqqqqqqqqqqqqqqqqqqqqqqqqqqqqqqqqqqqqqqqqqqqqqqqqqqqqqqqqqqqqqqqqqqqqqqqqqqqqqqqqqqqqqqqqqqqqqqqqqqqqqqqqqqqqqqqqqqqqqqqqqqqqqqqqqqqqqqqqqqqqk xx xx xx xx xx xx xx xx xx xx xx xx xx xx xx xx xx xx xx xx xx xx xx xx xx xx xx xx xx xx xx xx xx xx xx xx xx xx xx x x x  x x  x x  x x x x  x x  x x  x x   x x   x x   x x   x x   x x   x x   x x   x x  x x  x x x xx xx xx xx xx xx xx xx mqqqqqqqqqqqqqqqqqqqqqqqqqqqqqqqqqqqqqqqqqqqqqqqqqqqqqqqqqqqqqqqqqqqqqqqqqqqqqqqqqqqqqqqqqqqqqqqqqqqqqqqqqqqqqqqqqqqqqqqqqqqqqqqqqqqqqqqqqqqqqqqqqqqqqqqqqqqqqqqqqqqqqqqqqqqqqqqqqqqqqqqqqqqqqqqqqqqqqqqqqqqqqqqqqqqqqqqqqqqqqqqqqqqqqqqqqqqqqqqqqqqqqqqqqqqqqqqqqqqqqqqqqqqqqqqqqqqqqqqqqqqqqqqqqqqqqqqqqqqqqqqqqqqqqqqqqqqqqqqqqqqqqqqqqqqqqqqqqqqqqqqqqqqqqqqqqqqqqqqqqqqqqqqqqqqqqqqqqqqqqqqqqqqqqqqqqqqqqqj [?1l>(lldb) gui gui (B)0[?7h[?1h=| LLDB (F1) | Target (F2) | Process (F3) | Thread (F4) | View (F5) | Help (F6) | lqq<Sources>qqqqqqqqqqqqqqqqqqqqqqqqqqqqqqqqqqqqqqqqqqqqqqqqqqqqqqqqqqqqqqqqqqqqqqqqqqqqqqqqqqqqqqqqqqqqqqqqqqqqqqqqqqqqqqqqqqqqqqqqqqqqqqqqqqqqqqqqqqqqqqqqqqqqqqqqqqqqqqqqqqqqqqqqqqqqqqqqqqqqqqqqqqqqqqqqqqqqqqqqqqqqqqqqqqqqqqqqqqqqqqqqqqqqqqqqqqqqqqqqqqqqqqqqqqqqqqqqqqqqqqqqqqqqqqqqqqqqqqqqqqqqqqqqqqqqqqqqqqqqqqqqqqqqqqqqqqqqqqqqqqqqqqqqqqqqqqqqqqqqqqqqqqqqqqqqqqqqqqqqqqqqqqqqqqqqqqqqqqqqqqqqqqqklqq<Threads>qqqqqqqqqqqqqqqqqqqqqqqqqqqqqqqqqqqqqqqqqqqqqqqqqqqqqqqqqqqqqqqqqqqqqqqqqqqqqqqqqqqqqqqkx a.out`main xx `qprocess 48158xx 1 x int main(int argc, char **argv) {xxxx 2 x int funky_var_name_that_should_be_rendered = 22;xxxx 3 x` return 0; // Break here <<< Thread 1: breakpoint 1.1 xxxx 4 x }xxxx 5 xxxxxxxxxxxxxxxxxxxxxxxxxxxxxxxxxxxxxxxxxxxxxxxxxxxxxxxxxxxxxxxxxxxxxxxxxxxxxxxxxxxxxxxxxxxxxxxxxxxxxxxxxxxxxxxxxxxxxxxxxxxxxxxxxxxxxxxxxxxxxxxxxxxxxxxxxxxxxxxxxxxxxxxxxxxxxxxxxxxxxxxxxxxxxxxxxxxxxxxxxxxxxxxxxxxxxxxxxxxxxxxxxxxxxxxxxxxxxxxxxxxxmqqqqqqqqqqqqqqqqqqqqqqqqqqqqqqqqqqqqqqqqqqqqqqqqqqqqqqqqqqqqqqqqqqqqqqqqqqqqqqqqqqqqqqqqqqqqqqqqqqqqqqqqqqqqqqqqqqqqqqqqqqqqqqqqqqqqqqqqqqqqqqqqqqqqqqqqqqqqqqqqqqqqqqqqqqqqqqqqqqqqqqqqqqqqqqqqqqqqqqqqqqqqqqqqqqqqqqqqqqqqqqqqqqqqqqqqqqqqqqqqqqqqqqqqqqqqqqqqqqqqqqqqqqqqqqqqqqqqqqqqqqqqqqqqqqqqqqqqqqqqqqqqqqqqqqqqqqqqqqqqqqqqqqqqqqqqqqqqqqqqqqqqqqqqqqqqqqqqqqqqqqqqqqqqqqqqqqqqqqqqqqqqqqqqqqqqqqqqqqjxxlqq<Variables>qqqqqqqqqqqqqqqqqqqqqqqqqqqqqqqqqqqqqqqqqqqqqqqqqqqqqqqqqqqqqqqqqqqqqqqqqqqqqqqqqqqqqqqqqqqqqqqqqqqqqqqqqqqqqqqqqqqqqqqqqqqqqqqqqqqqqqqqqqqqqqqqqqqqqqqqqqqqqqqqqqqqqqqqqqqqqqqqqqqqqqqqqqqqqqqqqqqqqqqqqqqqqqqqqqqqqqqqqqqqqqqqqqqqqqqqqqqqqqqqqqqqqqqqqqqqqqqqqqqqqqqqqqqqqqqqqqqqqqqqqqqqqqqqqqqqqqqqqqqqqqqqqqqqqqqqqqqqqqqqqqqqqqqqqqqqqqqqqqqqqqqqqqqqqqqqqqqqqqqqqqqqqqqqqqqqqqqqqqqqqqqqqkxxx (int) argc = 1xxxx `q(char **) argv = 0x00007ffeefbff530xxxx (int) funky_var_name_that_should_be_rendered = 22xxxxxxxxxxxxxxxxxxxxxxxxxxxxxxxxxxxxxxxxxxxxxxxxxxxxxxxxxxxxxxxxxxxxxxxxxxxxxxxxxxxxxxxxxxxxxxxxxxxxxxxmqqqqqqqqqqqqqqqqqqqqqqqqqqqqqqqqqqqqqqqqqqqqqqqqqqqqqqqqqqqqqqqqqqqqqqqqqqqqqqqqqqqqqqqqqqqqqqqqqqqqqqqqqqqqqqqqqqqqqqqqqqqqqqqqqqqqqqqqqqqqqqqqqqqqqqqqqqqqqqqqqqqqqqqqqqqqqqqqqqqqqqqqqqqqqqqqqqqqqqqqqqqqqqqqqqqqqqqqqqqqqqqqqqqqqqqqqqqqqqqqqqqqqqqqqqqqqqqqqqqqqqqqqqqqqqqqqqqqqqqqqqqqqqqqqqqqqqqqqqqqqqqqqqqqqqqqqqqqqqqqqqqqqqqqqqqqqqqqqqqqqqqqqqqqqqqqqqqqqqqqqqqqqqqqqqqqqqqqqqqqqqqqqqqqqqqqqqqqqqjmqqqqqqqqqqqqqqqqqqqqqqqqqqqqqqqqqqqqqqqqqqqqqqqqqqqqqqqqqqqqqqqqqqqqqqqqqqqqqqqqqqqqqqqqqqqqqqqqqqjProcess: 48158 stopped Thread: 0x5b176e Frame: 0 PC = 0x0000000100000fab [?1l>(lldb) settings set interpreter.prompt-on-quit false

Hide Details

Session logs for test failures/errors/unexpected successes will go into directory '/Users/buildslave/jenkins/workspace/lldb-cmake-sanitized/test/logs' Command invoked: /Users/buildslave/jenkins/workspace/lldb-cmake-sanitized/llvm-project/lldb/test/dotest.py --arch=x86_64 -s /Users/buildslave/jenkins/workspace/lldb-cmake-sanitized/lldb-build/lldb-test-traces -S nm -u CXXFLAGS -u CFLAGS --executable /Users/buildslave/jenkins/workspace/lldb-cmake-sanitized/lldb-build/./bin/lldb --dsymutil /Users/buildslave/jenkins/workspace/lldb-cmake-sanitized/lldb-build/./bin/dsymutil --filecheck /Users/buildslave/jenkins/workspace/lldb-cmake-sanitized/lldb-build/./bin/FileCheck -C /Users/buildslave/jenkins/workspace/lldb-cmake-sanitized/host-compiler/bin/clang --codesign-identity lldb_codesign --server /Users/buildslave/jenkins/workspace/lldb-cmake-sanitized/lldb-build/./bin/debugserver --arch x86_64 --build-dir /Users/buildslave/jenkins/workspace/lldb-cmake-sanitized/lldb-build/lldb-test-build.noindex -s=/Users/buildslave/jenkins/workspace/lldb-cmake-sanitized/test/logs -t --env TERM=vt100 --env LLVM_LIBS_DIR=/Users/buildslave/jenkins/workspace/lldb-cmake-sanitized/lldb-build/./lib --build-dir /Users/buildslave/jenkins/workspace/lldb-cmake-sanitized/lldb-build/tools/lldb/lldb-test-build.noindex --module-cache-dir /Users/buildslave/jenkins/workspace/lldb-cmake-sanitized/lldb-build/tools/lldb/lldb-test-build.noindex/module-cache-lldb /Users/buildslave/jenkins/workspace/lldb-cmake-sanitized/llvm-project/lldb/packages/Python/lldbsuite/test/commands/gui/basic -p TestGuiBasic.py Change dir to: /Users/buildslave/jenkins/workspace/lldb-cmake-sanitized/llvm-project/lldb/packages/Python/lldbsuite/test/commands/gui/basic runCmd: settings set symbols.enable-external-lookup false output:

Hide Details

runCmd: settings set plugin.process.gdb-remote.packet-timeout 60 output:

Hide Details

runCmd: settings set symbols.clang-modules-cache-path "/Users/buildslave/jenkins/workspace/lldb-cmake-sanitized/lldb-build/tools/lldb/lldb-test-build.noindex/module-cache-lldb" output:

Hide Details

runCmd: settings set use-color false output:

Hide Details

FAIL: LLDB (/Users/buildslave/jenkins/workspace/lldb-cmake-sanitized/host-compiler/bin/clang-10-x86_64) :: test_gui (TestGuiBasic.BasicGuiCommandTest) tearing down the child process....

Hide Details

CLEANUP ERROR: LLDB (/Users/buildslave/jenkins/workspace/lldb-cmake-sanitized/host-compiler/bin/clang-10-x86_64) :: test_gui (TestGuiBasic.BasicGuiCommandTest) Restore dir to: /Users/buildslave/jenkins/workspace/lldb-cmake-sanitized/lldb-build/tools/lldb/lit ====================================================================== ERROR: test_gui (TestGuiBasic.BasicGuiCommandTest) ---------------------------------------------------------------------- Traceback (most recent call last): File "/Users/buildslave/jenkins/workspace/lldb-cmake-sanitized/llvm-project/lldb/packages/Python/lldbsuite/test/commands/gui/basic/TestGuiBasic.py", line 60, in test_gui self.quit() File "/Users/buildslave/jenkins/workspace/lldb-cmake-sanitized/llvm-project/lldb/packages/Python/lldbsuite/test/lldbpexpect.py", line 61, in quit self.child.close(force=not gracefully) File "/Users/buildslave/jenkins/workspace/lldb-cmake-sanitized/llvm-project/lldb/third_party/Python/module/pexpect-4.6/pexpect/pty_spawn.py", line 327, in close self.ptyproc.close(force=force) File "/System/Library/Frameworks/Python.framework/Versions/2.7/lib/python2.7/contextlib.py", line 35, in __exit__ self.gen.throw(type, value, traceback) File "/Users/buildslave/jenkins/workspace/lldb-cmake-sanitized/llvm-project/lldb/third_party/Python/module/pexpect-4.6/pexpect/pty_spawn.py", line 25, in _wrap_ptyprocess_err raise ExceptionPexpect(*e.args) ExceptionPexpect: Could not terminate the child. Config=x86_64-/Users/buildslave/jenkins/workspace/lldb-cmake-sanitized/host-compiler/bin/clang-10 ---------------------------------------------------------------------- Ran 1 test in 12.431s

Hide Details

RESULT: FAILED (0 passes, 0 failures, 1 errors, 0 skipped, 0 expected failures, 0 unexpected successes)

Hide Details

******************** PASS: lldb-Unit :: Utility/./UtilityTests/StringExtractorTest.GetNameColonValueNoColon (1107 of 1725) PASS: LLDB :: SymbolFile/DWARF/debug_ranges_and_rnglists.test (1108 of 1725) PASS: lldb-Suite :: commands/expression/entry-bp/TestExprEntryBP.py (1109 of 1725) PASS: lldb-Suite :: lang/cpp/global_variables/TestCPPGlobalVariables.py (1110 of 1725) PASS: lldb-Unit :: Utility/./UtilityTests/RangeTest.EqualInvalid (1111 of 1725) PASS: lldb-Suite :: functionalities/postmortem/minidump-new/TestMiniDumpNew.py (1112 of 1725) UNSUPPORTED: LLDB :: Register/x86-64-gp-write.test (1113 of 1725) PASS: lldb-Unit :: Utility/./UtilityTests/StringExtractorTest.GetHexBytesAvail (1114 of 1725) PASS: LLDB :: BuildScript/toolchain-clang.test (1115 of 1725) PASS: lldb-Suite :: tools/lldb-server/TestGdbRemoteRegisterState.py (1116 of 1725) PASS: lldb-Suite :: lang/c/strings/TestCStrings.py (1117 of 1725) PASS: lldb-Unit :: Utility/./UtilityTests/AnsiTerminal.Unknown (1118 of 1725) PASS: lldb-Suite :: functionalities/thread/concurrent_events/TestConcurrentCrashWithBreak.py (1119 of 1725) PASS: LLDB :: SymbolFile/DWARF/dir-separator-posix.s (1120 of 1725) PASS: lldb-Unit :: Utility/./UtilityTests/StreamTeeTest.Write (1121 of 1725) PASS: lldb-Unit :: Utility/./UtilityTests/StringExtractorTest.GetHexU8_Underflow_NoEof (1122 of 1725) PASS: lldb-Unit :: Utility/./UtilityTests/UUIDTest.RelationalOperators (1123 of 1725) PASS: lldb-Suite :: functionalities/data-formatter/data-formatter-stl/libstdcpp/unique_ptr/TestDataFormatterStdUniquePtr.py (1124 of 1725) PASS: lldb-Suite :: lang/cpp/template/TestTemplateArgs.py (1125 of 1725) PASS: LLDB :: Minidump/breakpad-symbols.test (1126 of 1725) PASS: lldb-Unit :: Target/./TargetTests/MemoryRegionInfoTest.Formatv (1127 of 1725) PASS: lldb-Suite :: functionalities/data-formatter/hexcaps/TestDataFormatterHexCaps.py (1128 of 1725) PASS: lldb-Suite :: functionalities/data-formatter/data-formatter-objc/TestDataFormatterObjCNSContainer.py (1129 of 1725) PASS: lldb-Suite :: functionalities/load_unload/TestLoadUnload.py (1130 of 1725) PASS: lldb-Suite :: python_api/frame/inlines/TestInlinedFrame.py (1131 of 1725) PASS: lldb-Suite :: functionalities/thread/thread_exit/TestThreadExit.py (1132 of 1725) PASS: lldb-Suite :: commands/source/info/TestSourceInfo.py (1133 of 1725) PASS: lldb-Unit :: Utility/./UtilityTests/FileSpecTest.PrependPathComponent (1134 of 1725) PASS: lldb-Suite :: lang/cpp/exceptions/TestCPPExceptionBreakpoints.py (1135 of 1725) PASS: lldb-Unit :: Process/gdb-remote/./ProcessGdbRemoteTests/GDBRemoteClientBaseTest.InterruptNoResponse (1136 of 1725) PASS: LLDB :: SymbolFile/DWARF/debug-types-basic.test (1137 of 1725) PASS: lldb-Unit :: UnwindAssembly/x86/./UnwindAssemblyx86Tests/Testx86AssemblyInspectionEngine.TestPushECX (1138 of 1725) PASS: lldb-Suite :: commands/expression/radar_9673664/TestExprHelpExamples.py (1139 of 1725) PASS: LLDB :: Settings/TestFrameFormatColor.test (1140 of 1725) PASS: LLDB :: SymbolFile/NativePDB/global-classes.cpp (1141 of 1725) PASS: lldb-Unit :: UnwindAssembly/x86/./UnwindAssemblyx86Tests/Testx86AssemblyInspectionEngine.TestPopR13 (1142 of 1725) PASS: lldb-Suite :: functionalities/data-formatter/data-formatter-stl/libcxx/set/TestDataFormatterLibcxxSet.py (1143 of 1725) PASS: lldb-Suite :: commands/frame/diagnose/dereference-function-return/TestDiagnoseDereferenceFunctionReturn.py (1144 of 1725) PASS: lldb-Suite :: commands/expression/namespace_local_var_same_name_obj_c/TestNamespaceLocalVarSameNameObjC.py (1145 of 1725) PASS: lldb-Unit :: UnwindAssembly/x86/./UnwindAssemblyx86Tests/Testx86AssemblyInspectionEngine.TestSpillRegToStackViaMOVi386 (1146 of 1725) PASS: lldb-Unit :: Signals/./SignalsTests/UnixSignalsTest.GetFilteredSignals (1147 of 1725) PASS: lldb-Unit :: Utility/./UtilityTests/RangeTest.ContainsRangeStartingFromZero (1148 of 1725) PASS: lldb-Suite :: commands/watchpoints/hello_watchpoint/TestMyFirstWatchpoint.py (1149 of 1725) PASS: lldb-Suite :: functionalities/plugins/command_plugin/TestPluginCommands.py (1150 of 1725) PASS: lldb-Unit :: Utility/./UtilityTests/RangeTest.ContainsEndInclusive (1151 of 1725) PASS: lldb-Unit :: Utility/./UtilityTests/OptionsWithRawTest.EmptySuffix (1152 of 1725) PASS: LLDB :: Reproducer/Functionalities/TestDataFormatter.test (1153 of 1725) PASS: lldb-Suite :: functionalities/step_scripted/TestStepScripted.py (1154 of 1725) PASS: LLDB :: SymbolFile/DWARF/find-method-local-struct.cpp (1155 of 1725) PASS: lldb-Unit :: Utility/./UtilityTests/UriParserTest.TypicalPortPath (1156 of 1725) PASS: lldb-Suite :: commands/expression/top-level/TestTopLevelExprs.py (1157 of 1725) PASS: lldb-Unit :: Utility/./UtilityTests/StreamTeeTest.Constructor1Stream (1158 of 1725) PASS: lldb-Unit :: Utility/./UtilityTests/ArgsTest.TestUnknownEscape (1159 of 1725) PASS: lldb-Suite :: lang/c/local_variables/TestLocalVariables.py (1160 of 1725) PASS: lldb-Unit :: ScriptInterpreter/Python/./ScriptInterpreterPythonTests/PythonDataObjectsTest.TestPythonBytes (1161 of 1725) PASS: LLDB :: Modules/MachO/lc_build_version_notools.yaml (1162 of 1725) PASS: lldb-Unit :: Process/gdb-remote/./ProcessGdbRemoteTests/GDBRemoteClientBaseTest.SendPacketAndReceiveResponseWithOutputSupport (1163 of 1725) PASS: lldb-Unit :: Core/./LLDBCoreTests/MangledTest.ResultForValidName (1164 of 1725) PASS: lldb-Unit :: Utility/./UtilityTests/BroadcasterTest.EventTypeHasListeners (1165 of 1725) PASS: lldb-Suite :: functionalities/thread/backtrace_limit/TestBacktraceLimit.py (1166 of 1725) PASS: lldb-Unit :: Utility/./UtilityTests/StreamTeeTest.SetStreamAtIndexOverwrite (1167 of 1725) PASS: lldb-Unit :: Utility/./UtilityTests/OptionsWithRawTest.ArgsButNoDelimiter (1168 of 1725) PASS: lldb-Suite :: functionalities/darwin_log/source/debug/TestDarwinLogSourceDebug.py (1169 of 1725) PASS: lldb-Unit :: Utility/./UtilityTests/ProcessInfoTest.Constructor (1170 of 1725) PASS: LLDB :: SymbolFile/Breakpad/line-table-discontinuous-file-ids.test (1171 of 1725) PASS: LLDB :: Breakpoint/implicit_const_form_support.test (1172 of 1725) PASS: lldb-Suite :: macosx/add-dsym/TestAddDsymMidExecutionCommand.py (1173 of 1725) PASS: lldb-Unit :: debugserver/./debugserverTests/RNBSocket.LoopBackConnectIPv4 (1174 of 1725) PASS: lldb-Suite :: commands/frame/var-scope/TestFrameVariableScope.py (1175 of 1725) PASS: lldb-Suite :: functionalities/thread/concurrent_events/TestConcurrentSignalNWatchNBreak.py (1176 of 1725) PASS: lldb-Suite :: functionalities/source-map/TestTargetSourceMap.py (1177 of 1725) PASS: lldb-Unit :: Language/Highlighting/./HighlighterTests/HighlighterTest.Colons (1178 of 1725) PASS: lldb-Suite :: commands/command/script/import/rdar-12586188/TestRdar12586188.py (1179 of 1725) PASS: lldb-Unit :: Utility/./UtilityTests/StreamTest.PutChar (1180 of 1725) PASS: lldb-Unit :: Target/./TargetTests/ExecutionContextTest.GetByteOrder (1181 of 1725) PASS: lldb-Unit :: UnwindAssembly/x86/./UnwindAssemblyx86Tests/Testx86AssemblyInspectionEngine.TestPushR15 (1182 of 1725) PASS: lldb-Suite :: lang/objc/ivar-IMP/TestObjCiVarIMP.py (1183 of 1725) PASS: lldb-Suite :: lang/objc/objc++/TestObjCXX.py (1184 of 1725) PASS: lldb-Suite :: lang/c/conflicting-symbol/TestConflictingSymbol.py (1185 of 1725) PASS: lldb-Suite :: lang/objcxx/cxx-bridged-po/TestObjCXXBridgedPO.py (1186 of 1725) PASS: lldb-Unit :: Utility/./UtilityTests/OptionsWithRawTest.MultiWordSuffix (1187 of 1725) PASS: lldb-Suite :: functionalities/breakpoint/global_constructor/TestBreakpointInGlobalConstructor.py (1188 of 1725) PASS: lldb-Unit :: UnwindAssembly/x86/./UnwindAssemblyx86Tests/Testx86AssemblyInspectionEngine.TestPopRBPWithREX (1189 of 1725) PASS: lldb-Unit :: Utility/./UtilityTests/TimeoutTest.Construction (1190 of 1725) PASS: lldb-Suite :: lang/objc/foundation/TestRuntimeTypes.py (1191 of 1725) PASS: lldb-Suite :: commands/expression/radar_9531204/TestPrintfAfterUp.py (1192 of 1725) PASS: lldb-Suite :: functionalities/breakpoint/breakpoint_in_delayslot/TestAvoidBreakpointInDelaySlot.py (1193 of 1725) PASS: LLDB :: Minidump/Windows/Sigsegv/sigsegv.test (1194 of 1725) PASS: lldb-Unit :: Utility/./UtilityTests/LogChannelTest.List (1195 of 1725) PASS: lldb-Suite :: functionalities/data-formatter/data-formatter-stl/libcxx/queue/TestDataFormatterLibcxxQueue.py (1196 of 1725) PASS: lldb-Unit :: SymbolFile/DWARF/./SymbolFileDWARFTests/SymbolFileDWARFTests.TestAbbrevOrder1Start1 (1197 of 1725) PASS: lldb-Suite :: lang/objc/single-entry-dictionary/TestObjCSingleEntryDictionary.py (1198 of 1725) PASS: lldb-Suite :: commands/disassemble/basic/TestFrameDisassemble.py (1199 of 1725) PASS: lldb-Suite :: lang/c/enum_types/TestEnumTypes.py (1200 of 1725) PASS: lldb-Unit :: Utility/./UtilityTests/ArgsTest.TestQuotedUnknownEscape (1201 of 1725) PASS: lldb-Suite :: functionalities/data-formatter/data-formatter-synthtype/TestDataFormatterSynthType.py (1202 of 1725) PASS: lldb-Unit :: Utility/./UtilityTests/StreamTest.PutHex64ByteOrderLittle (1203 of 1725) PASS: lldb-Unit :: Utility/./UtilityTests/StatusTest.ErrorConversion (1204 of 1725) PASS: lldb-Unit :: Host/./HostTests/NativeProcessProtocolTest.ReadCStringFromMemory (1205 of 1725) PASS: lldb-Unit :: UnwindAssembly/x86/./UnwindAssemblyx86Tests/Testx86AssemblyInspectionEngine.TestPopEBX (1206 of 1725) PASS: lldb-Unit :: UnwindAssembly/x86/./UnwindAssemblyx86Tests/Testx86AssemblyInspectionEngine.TestPushRBPWithREX (1207 of 1725) UNSUPPORTED: LLDB :: SymbolFile/PDB/expressions.test (1208 of 1725) PASS: LLDB :: Modules/PECOFF/uuid.yaml (1209 of 1725) PASS: lldb-Suite :: commands/expression/import-std-module/stack/TestStack.py (1210 of 1725) PASS: lldb-Unit :: Utility/./UtilityTests/StringExtractorTest.GetHexU8_Exact_NoEof (1211 of 1725) PASS: lldb-Suite :: lang/objc/unicode-string/TestUnicodeString.py (1212 of 1725) PASS: lldb-Unit :: Utility/./UtilityTests/StringExtractorTest.GetHexBytesAvail_Partial (1213 of 1725) XFAIL: LLDB :: Register/x86-64-ymm-write.test (1214 of 1725) PASS: LLDB :: Modules/Breakpad/sections-trailing-func.test (1215 of 1725) PASS: lldb-Unit :: tools/lldb-server/tests/./LLDBServerTests/StandardStartupTest.TestStopReplyContainsThreadPcs (1216 of 1725) PASS: lldb-Suite :: functionalities/breakpoint/breakpoint_names/TestBreakpointNames.py (1217 of 1725) PASS: lldb-Unit :: UnwindAssembly/x86/./UnwindAssemblyx86Tests/Testx86AssemblyInspectionEngine.TestPushEDI (1218 of 1725) PASS: lldb-Suite :: lang/cpp/auto/TestCPPAuto.py (1219 of 1725) PASS: lldb-Unit :: Utility/./UtilityTests/StreamTeeTest.SetStreamAtIndexOutOfBounds (1220 of 1725) PASS: lldb-Unit :: UnwindAssembly/x86/./UnwindAssemblyx86Tests/Testx86AssemblyInspectionEngine.TestSubESP (1221 of 1725) PASS: lldb-Unit :: ObjectFile/Breakpad/./ObjectFileBreakpadTests/StackCFIRecord.parse (1222 of 1725) PASS: lldb-Unit :: Utility/./UtilityTests/StreamTest.PutBytesAsRawHex8ToMixedEndian (1223 of 1725) PASS: LLDB :: Breakpoint/debug_rnglist_offset_pair.test (1224 of 1725) PASS: lldb-Suite :: functionalities/tail_call_frames/ambiguous_tail_call_seq1/TestAmbiguousTailCallSeq1.py (1225 of 1725) PASS: lldb-Unit :: UnwindAssembly/x86/./UnwindAssemblyx86Tests/Testx86AssemblyInspectionEngine.TestDisassemblyMidFunctionEpilogues (1226 of 1725) PASS: lldb-Unit :: Expression/./ExpressionTests/DiagnosticManagerTest.HasFixits (1227 of 1725) PASS: lldb-Unit :: ScriptInterpreter/Python/./ScriptInterpreterPythonTests/PythonDataObjectsTest.TestPythonStringToStructuredString (1228 of 1725) PASS: lldb-Suite :: source-manager/TestSourceManager.py (1229 of 1725) PASS: lldb-Unit :: Symbol/./SymbolTests/PostfixExpression.ToDWARF (1230 of 1725) PASS: lldb-Suite :: lang/objc/objc-struct-argument/TestObjCStructArgument.py (1231 of 1725) PASS: lldb-Unit :: UnwindAssembly/x86/./UnwindAssemblyx86Tests/Testx86AssemblyInspectionEngine.TestPush0 (1232 of 1725) PASS: lldb-Suite :: commands/expression/persistent_ptr_update/TestPersistentPtrUpdate.py (1233 of 1725) PASS: lldb-Suite :: python_api/debugger/TestDebuggerAPI.py (1234 of 1725) PASS: lldb-Suite :: functionalities/thread/concurrent_events/TestConcurrentDelaySignalWatch.py (1235 of 1725) PASS: lldb-Suite :: commands/frame/diagnose/virtual-method-call/TestDiagnoseDereferenceVirtualMethodCall.py (1236 of 1725) PASS: lldb-Unit :: Utility/./UtilityTests/CompletionRequest.TestCompletionOwnership (1237 of 1725) PASS: lldb-Suite :: commands/expression/persist_objc_pointeetype/TestPersistObjCPointeeType.py (1238 of 1725) PASS: lldb-Unit :: Utility/./UtilityTests/BinaryStreamTest.PutSLEB128SixBytes (1239 of 1725) PASS: lldb-Unit :: Utility/./UtilityTests/ConstStringTest.CompareStringRef (1240 of 1725) PASS: lldb-Suite :: lang/objc/objc-class-method/TestObjCClassMethod.py (1241 of 1725) PASS: lldb-Suite :: lang/objc/modules/TestObjCModules.py (1242 of 1725) PASS: LLDB :: Register/x86-64-gp-read.test (1243 of 1725) PASS: lldb-Unit :: Utility/./UtilityTests/StringListTest.ForRange (1244 of 1725) PASS: lldb-Unit :: Utility/./UtilityTests/RangeTest.Slide (1245 of 1725) PASS: lldb-Unit :: Utility/./UtilityTests/UriParserTest.BadPort2 (1246 of 1725) PASS: lldb-Unit :: ScriptInterpreter/Python/./ScriptInterpreterPythonTests/PythonDataObjectsTest.TestTypeNameResolutionNoDot (1247 of 1725) PASS: lldb-Unit :: Utility/./UtilityTests/StreamTest.ShiftOperatorInts (1248 of 1725) PASS: LLDB :: SymbolFile/DWARF/debug-types-missing-signature.test (1249 of 1725) PASS: lldb-Suite :: functionalities/data-formatter/data-formatter-objc/TestDataFormatterObjCNSError.py (1250 of 1725) PASS: lldb-Unit :: Process/gdb-remote/./ProcessGdbRemoteTests/GDBRemoteCommunicationClientTest.ReadRegister (1251 of 1725) PASS: lldb-Unit :: Utility/./UtilityTests/StreamTest.PutHex16ByteOrderBig (1252 of 1725) PASS: lldb-Unit :: Host/./HostTests/HostInfoTest.GetHostname (1253 of 1725) PASS: lldb-Suite :: functionalities/memory/cache/TestMemoryCache.py (1254 of 1725) PASS: lldb-Suite :: commands/watchpoints/watchpoint_commands/TestWatchpointCommands.py (1255 of 1725) PASS: lldb-Suite :: types/TestDoubleTypes.py (1256 of 1725) PASS: lldb-Suite :: functionalities/inferior-crashing/recursive-inferior/TestRecursiveInferior.py (1257 of 1725) PASS: lldb-Suite :: commands/expression/call-function/TestCallStopAndContinue.py (1258 of 1725) PASS: lldb-Unit :: ScriptInterpreter/Python/./ScriptInterpreterPythonTests/PythonDataObjectsTest.TestPythonListToStructuredList (1259 of 1725) PASS: lldb-Unit :: Process/gdb-remote/./ProcessGdbRemoteTests/GDBRemoteCommunicationClientTest.SyncThreadState (1260 of 1725) PASS: lldb-Suite :: functionalities/thread/concurrent_events/TestConcurrentManySignals.py (1261 of 1725) PASS: lldb-Suite :: lang/c/array_types/TestArrayTypes.py (1262 of 1725) PASS: lldb-Unit :: Host/./HostTests/NativeProcessProtocolTest.SetBreakpointFailWrite (1263 of 1725) UNSUPPORTED: LLDB :: SymbolFile/PDB/variables-locations.test (1264 of 1725) PASS: LLDB :: Modules/Breakpad/uuid-matching-mac.test (1265 of 1725) PASS: lldb-Unit :: Utility/./UtilityTests/RangeTest.DoesIntersect (1266 of 1725) PASS: lldb-Unit :: Utility/./UtilityTests/GeneratorTest.Get (1267 of 1725) PASS: lldb-Suite :: commands/expression/timeout/TestCallWithTimeout.py (1268 of 1725) PASS: lldb-Unit :: Utility/./UtilityTests/ArgsTest.ReplaceArgumentAtIndexEqual (1269 of 1725) PASS: lldb-Suite :: functionalities/unwind/ehframe/TestEhFrameUnwind.py (1270 of 1725) PASS: lldb-Unit :: Utility/./UtilityTests/ArgsTest.TestSingleQuotedArgWithSpace (1271 of 1725) PASS: lldb-Unit :: Symbol/./SymbolTests/TestClangASTContext.TestRecordHasFields (1272 of 1725) PASS: lldb-Suite :: lang/cpp/char8_t/TestCxxChar8_t.py (1273 of 1725) PASS: lldb-Unit :: Utility/./UtilityTests/RegularExpression.Match (1274 of 1725) PASS: lldb-Unit :: Utility/./UtilityTests/StringListTest.InsertStringAtIndexMove (1275 of 1725) PASS: lldb-Unit :: Symbol/./SymbolTests/TestClangASTContext.TestIsClangType (1276 of 1725) PASS: lldb-Unit :: UnwindAssembly/x86/./UnwindAssemblyx86Tests/Testx86AssemblyInspectionEngine.TestPopESI (1277 of 1725) PASS: lldb-Suite :: functionalities/rerun/TestRerun.py (1278 of 1725) PASS: lldb-Unit :: Utility/./UtilityTests/VMRange.SetEndAddress (1279 of 1725) PASS: lldb-Suite :: functionalities/breakpoint/auto_continue/TestBreakpointAutoContinue.py (1280 of 1725) PASS: lldb-Unit :: Utility/./UtilityTests/ArgsTest.EscapeLLDBCommandArgument (1281 of 1725) PASS: lldb-Suite :: functionalities/thread/multi_break/TestMultipleBreakpoints.py (1282 of 1725) PASS: lldb-Unit :: Host/./HostTests/MainLoopTest.DetectsEOF (1283 of 1725) PASS: lldb-Unit :: Utility/./UtilityTests/StringListTest.GetMaxStringLengthMixed (1284 of 1725) PASS: lldb-Unit :: Process/minidump/./LLDBMinidumpTests/MinidumpParserTest.GetPidWindows (1285 of 1725) PASS: lldb-Suite :: commands/expression/persistent_types/TestNestedPersistentTypes.py (1286 of 1725) PASS: lldb-Suite :: functionalities/ubsan/basic/TestUbsanBasic.py (1287 of 1725) PASS: lldb-Suite :: lang/cpp/printf/TestPrintf.py (1288 of 1725) PASS: lldb-Suite :: types/TestDoubleTypesExpr.py (1289 of 1725) PASS: lldb-Unit :: Language/Highlighting/./HighlighterTests/HighlighterTest.ClangEmptyInput (1290 of 1725) PASS: lldb-Unit :: Utility/./UtilityTests/CompletionRequest.DuplicateFiltering (1291 of 1725) PASS: lldb-Suite :: functionalities/object-file/TestImageListMultiArchitecture.py (1292 of 1725) PASS: lldb-Unit :: Utility/./UtilityTests/SerializationRountripTest.SerializeDeserializePod (1293 of 1725) PASS: lldb-Suite :: benchmarks/libcxxmap/TestBenchmarkLibcxxMap.py (1294 of 1725) PASS: lldb-Suite :: macosx/universal/TestUniversal.py (1295 of 1725) PASS: lldb-Suite :: commands/expression/call-restarts/TestCallThatRestarts.py (1296 of 1725) PASS: LLDB :: Process/TestEnvironment.test (1297 of 1725) PASS: lldb-Suite :: commands/frame/diagnose/local-variable/TestLocalVariable.py (1298 of 1725) PASS: lldb-Suite :: lang/objc/objc-super/TestObjCSuper.py (1299 of 1725) PASS: lldb-Unit :: UnwindAssembly/x86/./UnwindAssemblyx86Tests/Testx86AssemblyInspectionEngine.TestPushExtended (1300 of 1725) PASS: lldb-Suite :: python_api/lldbutil/iter/TestRegistersIterator.py (1301 of 1725) PASS: lldb-Suite :: functionalities/data-formatter/data-formatter-stl/libstdcpp/vbool/TestDataFormatterStdVBool.py (1302 of 1725) PASS: lldb-Unit :: Utility/./UtilityTests/StringListTest.CopyListEmpty (1303 of 1725) PASS: lldb-Unit :: ScriptInterpreter/Python/./ScriptInterpreterPythonTests/PythonDataObjectsTest.TestBorrowedReferences (1304 of 1725) PASS: lldb-Unit :: Utility/./UtilityTests/ReproducerTest.SetCapture (1305 of 1725) PASS: lldb-Suite :: functionalities/data-formatter/data-formatter-objc/TestDataFormatterObjCNSData.py (1306 of 1725) PASS: lldb-Unit :: Utility/./UtilityTests/LogChannelTest.Enable (1307 of 1725) PASS: lldb-Suite :: functionalities/darwin_log/filter/exact_match/message/TestDarwinLogFilterMatchMessage.py (1308 of 1725) PASS: lldb-Suite :: commands/disassemble/basic/TestDisassembleBreakpoint.py (1309 of 1725) PASS: lldb-Unit :: Utility/./UtilityTests/Flags.GetBitSize (1310 of 1725) PASS: lldb-Unit :: Utility/./UtilityTests/StringLexerTest.PutBack (1311 of 1725) PASS: lldb-Suite :: functionalities/postmortem/netbsd-core/TestNetBSDCore.py (1312 of 1725) PASS: lldb-Suite :: lang/cpp/nsimport/TestCppNsImport.py (1313 of 1725) PASS: lldb-Suite :: python_api/rdar-12481949/Test-rdar-12481949.py (1314 of 1725) PASS: lldb-Unit :: Symbol/./SymbolTests/TestClangASTContext.TestGetBasicTypeFromName (1315 of 1725) PASS: lldb-Suite :: commands/expression/calculator_mode/TestCalculatorMode.py (1316 of 1725) PASS: lldb-Suite :: lang/objc/objc-ivar-protocols/TestIvarProtocols.py (1317 of 1725) PASS: lldb-Unit :: Expression/./ExpressionTests/DiagnosticManagerTest.GetStringNoDiags (1318 of 1725) PASS: lldb-Suite :: functionalities/data-formatter/language_category_updates/TestDataFormatterLanguageCategoryUpdates.py (1319 of 1725) PASS: lldb-Suite :: lang/c/unicode/TestUnicodeSymbols.py (1320 of 1725) PASS: lldb-Suite :: commands/watchpoints/multi_watchpoint_slots/TestWatchpointMultipleSlots.py (1321 of 1725) PASS: lldb-Suite :: python_api/lldbutil/frame/TestFrameUtils.py (1322 of 1725) PASS: lldb-Unit :: Core/./LLDBCoreTests/MangledTest.NameIndexes_FindFunctionSymbols (1323 of 1725) PASS: lldb-Suite :: functionalities/pre_run_dylibs/TestPreRunDylibs.py (1324 of 1725) PASS: lldb-Unit :: Utility/./UtilityTests/ArchSpecTest.TestParseMachCPUDashSubtypeTripleSimple (1325 of 1725) PASS: lldb-Suite :: functionalities/data-formatter/data-formatter-skip-summary/TestDataFormatterSkipSummary.py (1326 of 1725) PASS: lldb-Suite :: functionalities/target_var/TestTargetVar.py (1327 of 1725) PASS: LLDB :: SymbolFile/NativePDB/source-list.cpp (1328 of 1725) PASS: lldb-Suite :: functionalities/data-formatter/nsarraysynth/TestNSArraySynthetic.py (1329 of 1725) PASS: lldb-Unit :: ObjectFile/Breakpad/./ObjectFileBreakpadTests/InfoRecord.parse (1330 of 1725) PASS: lldb-Suite :: functionalities/inferior-changed/TestInferiorChanged.py (1331 of 1725) PASS: lldb-Suite :: functionalities/data-formatter/data-formatter-objc/TestDataFormatterObjCExpr.py (1332 of 1725) PASS: lldb-Unit :: ScriptInterpreter/Python/./ScriptInterpreterPythonTests/PythonDataObjectsTest.TestPythonIntegerToStructuredInteger (1333 of 1725) PASS: lldb-Suite :: commands/expression/po_verbosity/TestPoVerbosity.py (1334 of 1725) PASS: lldb-Unit :: Process/gdb-remote/./ProcessGdbRemoteTests/GDBRemoteClientBaseTest.SendContinueDelegateInterface (1335 of 1725) UNSUPPORTED: LLDB :: SymbolFile/PDB/compilands.test (1336 of 1725) PASS: lldb-Suite :: functionalities/breakpoint/objc/TestObjCBreakpoints.py (1337 of 1725) PASS: lldb-Unit :: Expression/./ExpressionTests/DiagnosticManagerTest.GetStringPreserveOrder (1338 of 1725) PASS: lldb-Unit :: Utility/./UtilityTests/StringListTest.ShiftMove (1339 of 1725) PASS: lldb-Unit :: Expression/./ExpressionTests/ClangHostTest.MacOSX (1340 of 1725) PASS: lldb-Unit :: Editline/./EditlineTests/EditlineTestFixture.EditlineReceivesSingleLineText (1341 of 1725) PASS: lldb-Suite :: functionalities/tail_call_frames/sbapi_support/TestTailCallFrameSBAPI.py (1342 of 1725) UNSUPPORTED: LLDB :: Register/x86-64-zmm-write.test (1343 of 1725) PASS: LLDB :: ExecControl/StopHook/stop-hook.test (1344 of 1725) PASS: lldb-Suite :: linux/builtin_trap/TestBuiltinTrap.py (1345 of 1725) PASS: lldb-Unit :: UnwindAssembly/x86/./UnwindAssemblyx86Tests/Testx86AssemblyInspectionEngine.Test32bitFramelessBigStackFrame (1346 of 1725) PASS: lldb-Unit :: Utility/./UtilityTests/UUIDTest.SetFromStringRef (1347 of 1725) PASS: lldb-Suite :: lang/objc/objc-struct-return/TestObjCStructReturn.py (1348 of 1725) PASS: lldb-Unit :: Host/./HostTests/SocketTest.DecodeHostAndPort (1349 of 1725) PASS: lldb-Suite :: functionalities/data-formatter/data-formatter-stl/libcxx/variant/TestDataFormatterLibcxxVariant.py (1350 of 1725) PASS: lldb-Unit :: Utility/./UtilityTests/VMRange.Reset (1351 of 1725) PASS: lldb-Unit :: ScriptInterpreter/Python/./ScriptInterpreterPythonTests/PythonDataObjectsTest.TestInstanceNameResolutionNoDot (1352 of 1725) PASS: lldb-Unit :: ScriptInterpreter/Python/./ScriptInterpreterPythonTests/PythonDataObjectsTest.TestPythonListValueEquality (1353 of 1725) PASS: lldb-Suite :: functionalities/gdb_remote_client/TestNestedRegDefinitions.py (1354 of 1725) PASS: lldb-Unit :: Utility/./UtilityTests/StringListTest.JoinEmpty (1355 of 1725) PASS: LLDB :: Python/crashlog.test (1356 of 1725) PASS: lldb-Suite :: functionalities/thread/concurrent_events/TestConcurrentDelayWatchBreak.py (1357 of 1725) PASS: lldb-Suite :: functionalities/abbreviation/TestCommonShortSpellings.py (1358 of 1725) PASS: LLDB :: Minidump/dump-all.test (1359 of 1725) PASS: lldb-Suite :: lang/cpp/dynamic-value/TestDynamicValue.py (1360 of 1725) PASS: lldb-Suite :: functionalities/ptr_refs/TestPtrRefs.py (1361 of 1725) PASS: lldb-Unit :: Utility/./UtilityTests/UriParserTest.BracketedHostnamePort (1362 of 1725) PASS: lldb-Unit :: Process/gdb-remote/./ProcessGdbRemoteTests/GDBRemoteCommunicationClientTest.GetMemoryRegionInfoInvalidResponse (1363 of 1725) PASS: lldb-Suite :: lang/cpp/function_refs/TestFunctionRefs.py (1364 of 1725) PASS: lldb-Suite :: functionalities/recursion/TestValueObjectRecursion.py (1365 of 1725) PASS: LLDB :: Driver/TestProcessAttach.test (1366 of 1725) XFAIL: LLDB :: SymbolFile/DWARF/find-type-in-function.cpp (1367 of 1725) PASS: lldb-Unit :: Host/./HostTests/SocketTest.TCPListen0ConnectAccept (1368 of 1725) PASS: lldb-Suite :: commands/expression/import-std-module/vector-of-vectors/TestVectorOfVectors.py (1369 of 1725) PASS: lldb-Unit :: Utility/./UtilityTests/StreamTest.PutBytesAsRawHex8ToLittleEndian (1370 of 1725) PASS: lldb-Unit :: Utility/./UtilityTests/StringListTest.GetSize (1371 of 1725) PASS: lldb-Suite :: functionalities/thread/concurrent_events/TestConcurrentDelayedCrashWithBreakpointWatchpoint.py (1372 of 1725) PASS: lldb-Suite :: lang/cpp/trivial_abi/TestTrivialABI.py (1373 of 1725) PASS: lldb-Suite :: commands/expression/namespace_local_var_same_name_cpp_and_c/TestNamespaceLocalVarSameNameCppAndC.py (1374 of 1725) PASS: lldb-Unit :: Utility/./UtilityTests/UriParserTest.SchemeHostSeparator4 (1375 of 1725) PASS: lldb-Unit :: SymbolFile/DWARF/./SymbolFileDWARFTests/SymbolFileDWARFTests.TestAbbrevOrder1Start5 (1376 of 1725) PASS: lldb-Unit :: Language/Highlighting/./HighlighterTests/HighlighterTest.DefaultHighlighterWithCursorOutOfBounds (1377 of 1725) PASS: lldb-Suite :: functionalities/thread/concurrent_events/TestConcurrentNWatchNBreak.py (1378 of 1725) PASS: lldb-Suite :: functionalities/data-formatter/data-formatter-proper-plurals/TestFormattersOneIsSingular.py (1379 of 1725) PASS: lldb-Unit :: Process/gdb-remote/./ProcessGdbRemoteTests/GDBRemoteCommunicationServerTest.SendErrorResponse_Status (1380 of 1725) PASS: lldb-Suite :: functionalities/thread/step_out/TestThreadStepOut.py (1381 of 1725) PASS: LLDB :: Modules/MachO/lc_version_min.yaml (1382 of 1725) PASS: LLDB :: SymbolFile/Breakpad/unwind-via-stack-cfi.test (1383 of 1725) PASS: LLDB :: SymbolFile/Breakpad/stack-cfi-parsing.test (1384 of 1725) PASS: lldb-Unit :: Utility/./UtilityTests/StringExtractorTest.GetHexBytes (1385 of 1725) PASS: lldb-Unit :: ScriptInterpreter/Python/./ScriptInterpreterPythonTests/PythonDataObjectsTest.TestPythonCallableCheck (1386 of 1725) PASS: lldb-Suite :: functionalities/data-formatter/frameformat_smallstruct/TestFrameFormatSmallStruct.py (1387 of 1725) PASS: lldb-Unit :: Host/./HostTests/MainLoopTest.UnmonitoredSignal (1388 of 1725) PASS: lldb-Unit :: Utility/./UtilityTests/FileSpecTest.GetNormalizedPath (1389 of 1725) PASS: lldb-Suite :: functionalities/darwin_log/filter/exact_match/activity/TestDarwinLogFilterMatchActivity.py (1390 of 1725) PASS: lldb-Suite :: functionalities/conditional_break/TestConditionalBreak.py (1391 of 1725) PASS: lldb-Unit :: Utility/./UtilityTests/ScalarTest.CastOperations (1392 of 1725) PASS: lldb-Suite :: functionalities/thread/concurrent_events/TestConcurrentSignalDelayBreak.py (1393 of 1725) PASS: LLDB :: Modules/ELF/section-overlap.yaml (1394 of 1725) PASS: lldb-Unit :: ScriptInterpreter/Python/./ScriptInterpreterPythonTests/PythonDataObjectsTest.TestPythonListManipulation (1395 of 1725) PASS: lldb-Unit :: Utility/./UtilityTests/OptionsWithRawTest.EmptySuffixSingleWhitespace (1396 of 1725) PASS: lldb-Unit :: Utility/./UtilityTests/SerializationRountripTest.SerializeDeserializePodPointers (1397 of 1725) PASS: lldb-Unit :: UnwindAssembly/x86/./UnwindAssemblyx86Tests/Testx86AssemblyInspectionEngine.TestLEAVE (1398 of 1725) PASS: lldb-Suite :: functionalities/target-new-solib-notifications/TestModuleLoadedNotifys.py (1399 of 1725) PASS: lldb-Unit :: Utility/./UtilityTests/BinaryStreamTest.PutSLEB128One (1400 of 1725) PASS: lldb-Suite :: commands/expression/import-std-module/deque-basic/TestBasicDeque.py (1401 of 1725) PASS: lldb-Unit :: Utility/./UtilityTests/StringListTest.GetMaxStringLengthIncreasingSize (1402 of 1725) PASS: lldb-Suite :: lang/objc/modules-cache/TestClangModulesCache.py (1403 of 1725) PASS: lldb-Suite :: python_api/section/TestSectionAPI.py (1404 of 1725) PASS: lldb-Unit :: SymbolFile/NativePDB/./SymbolFileNativePDBTests/PDBFPOProgramToDWARFExpressionTests.InvalidOpBinary (1405 of 1725) PASS: lldb-Unit :: Utility/./UtilityTests/BinaryStreamTest.PutULEB128TwoBytes (1406 of 1725) PASS: lldb-Suite :: functionalities/data-formatter/data-formatter-objc/TestDataFormatterObjCNSBundle.py (1407 of 1725) PASS: LLDB :: Reproducer/Functionalities/TestStepping.test (1408 of 1725) UNSUPPORTED: LLDB :: BuildScript/toolchain-clang-cl.test (1409 of 1725) PASS: lldb-Unit :: Symbol/./SymbolTests/PostfixExpression.ParseOneExpression (1410 of 1725) PASS: lldb-Suite :: lang/cpp/extern_c/TestExternCSymbols.py (1411 of 1725) PASS: lldb-Unit :: Host/./HostTests/SocketTest.UDPConnect (1412 of 1725) PASS: lldb-Unit :: UnwindAssembly/x86/./UnwindAssemblyx86Tests/Testx86AssemblyInspectionEngine.TestReturnDetect (1413 of 1725) PASS: lldb-Suite :: benchmarks/expression/TestRepeatedExprs.py (1414 of 1725) PASS: lldb-Suite :: functionalities/thread/concurrent_events/TestConcurrentSignalDelayWatch.py (1415 of 1725) PASS: lldb-Unit :: Process/gdb-remote/./ProcessGdbRemoteTests/GDBRemoteCommunicationClientTest.GetModulesInfo_UUID20 (1416 of 1725) PASS: lldb-Unit :: Host/./HostTests/TaskPoolTest.TaskMap (1417 of 1725) PASS: lldb-Suite :: lang/objc/variadic_methods/TestVariadicMethods.py (1418 of 1725) PASS: lldb-Unit :: ScriptInterpreter/Python/./ScriptInterpreterPythonTests/PythonExceptionStateTest.TestAutoRestoreChanged (1419 of 1725) PASS: lldb-Suite :: python_api/sbdata/TestSBData.py (1420 of 1725) PASS: lldb-Suite :: commands/watchpoints/watchpoint_set_command/TestWatchLocationWithWatchSet.py (1421 of 1725) PASS: lldb-Suite :: functionalities/thread/break_after_join/TestBreakAfterJoin.py (1422 of 1725) PASS: lldb-Unit :: Expression/./ExpressionTests/DiagnosticManagerTest.GetStringMultipleDiags (1423 of 1725) PASS: lldb-Suite :: functionalities/memory/find/TestMemoryFind.py (1424 of 1725) PASS: lldb-Suite :: functionalities/data-formatter/data-formatter-enum-format/TestDataFormatterEnumFormat.py (1425 of 1725) PASS: lldb-Unit :: Process/gdb-remote/./ProcessGdbRemoteTests/GDBRemoteCommunicationClientTest.WriteRegisterNoSuffix (1426 of 1725) PASS: lldb-Unit :: Host/./HostTests/NativeProcessProtocolTest.ReadMemoryWithoutTrap (1427 of 1725) PASS: LLDB :: Reproducer/TestGDBRemoteRepro.test (1428 of 1725) PASS: lldb-Suite :: functionalities/postmortem/minidump-new/TestMiniDumpUUID.py (1429 of 1725) PASS: lldb-Unit :: Utility/./UtilityTests/StringListTest.Join (1430 of 1725) PASS: lldb-Unit :: UnwindAssembly/x86/./UnwindAssemblyx86Tests/Testx86AssemblyInspectionEngine.TestStackRealign8BitDisp_i386 (1431 of 1725) PASS: lldb-Unit :: Utility/./UtilityTests/StructuredDataTest.StringDump (1432 of 1725) PASS: lldb-Suite :: commands/expression/call-overridden-method/TestCallOverriddenMethod.py (1433 of 1725) PASS: lldb-Unit :: Expression/./ExpressionTests/DiagnosticManagerTest.AddDiagnostic (1434 of 1725) PASS: lldb-Suite :: functionalities/signal/raise/TestRaise.py (1435 of 1725) PASS: lldb-Unit :: Utility/./UtilityTests/IndexToObjectTest.ObjectForIndex (1436 of 1725) PASS: lldb-Unit :: Process/minidump/./LLDBMinidumpTests/MinidumpParserTest.MinidumpDuplicateModuleMinAddress (1437 of 1725) PASS: lldb-Unit :: Utility/./UtilityTests/StringListTest.LongestCommonPrefixSingleElement (1438 of 1725) PASS: lldb-Suite :: tools/lldb-server/register-reading/TestGdbRemoteGPacket.py (1439 of 1725) PASS: lldb-Suite :: functionalities/data-formatter/ptr_ref_typedef/TestPtrRef2Typedef.py (1440 of 1725) PASS: lldb-Suite :: sample_test/TestSampleInlineTest.py (1441 of 1725) PASS: lldb-Unit :: Process/minidump/./LLDBMinidumpTests/RegisterContextMinidump.ConvertMinidumpContext_x86_32 (1442 of 1725) PASS: lldb-Unit :: Utility/./UtilityTests/StreamTeeTest.DefaultConstructor (1443 of 1725) PASS: lldb-Suite :: tools/lldb-server/TestGdbRemoteExpeditedRegisters.py (1444 of 1725) PASS: lldb-Suite :: commands/expression/fixits/TestFixIts.py (1445 of 1725) PASS: lldb-Suite :: functionalities/thread/concurrent_events/TestConcurrentDelayedCrashWithBreakpointSignal.py (1446 of 1725) UNSUPPORTED: LLDB :: Breakpoint/case-insensitive.test (1447 of 1725) PASS: lldb-Unit :: debugserver/./debugserverTests/RNBSocket.LoopBackListenIPv6 (1448 of 1725) PASS: lldb-Unit :: Target/./TargetTests/ExecutionContextTest.GetByteOrderTarget (1449 of 1725) PASS: lldb-Unit :: Language/Highlighting/./HighlighterTests/HighlighterTest.ClangCommas (1450 of 1725) PASS: lldb-Unit :: Process/minidump/./LLDBMinidumpTests/MinidumpParserTest.GetThreadContext_x86_64 (1451 of 1725) PASS: lldb-Suite :: functionalities/data-formatter/data-formatter-stl/libcxx/vector/TestDataFormatterLibcxxVector.py (1452 of 1725) PASS: lldb-Suite :: lang/cpp/class_static/TestStaticVariables.py (1453 of 1725) PASS: lldb-Suite :: tools/lldb-vscode/breakpoint/TestVSCode_setExceptionBreakpoints.py (1454 of 1725) PASS: lldb-Suite :: lang/cpp/diamond/TestDiamond.py (1455 of 1725) PASS: lldb-Suite :: lang/objc/objc-ivar-offsets/TestObjCIvarOffsets.py (1456 of 1725) PASS: lldb-Suite :: commands/register/register/register_command/TestRegisters.py (1457 of 1725) PASS: LLDB :: Modules/PECOFF/export-dllfunc.yaml (1458 of 1725) PASS: lldb-Unit :: Utility/./UtilityTests/StringListTest.JoinNonSpace (1459 of 1725) PASS: lldb-Unit :: Language/Highlighting/./HighlighterTests/HighlighterTest.ClangCursorOutOfBounds (1460 of 1725) PASS: lldb-Unit :: Utility/./UtilityTests/RangeTest.Equal (1461 of 1725) PASS: lldb-Suite :: lang/objcxx/hide-runtime-values/TestObjCXXHideRuntimeValues.py (1462 of 1725) PASS: lldb-Suite :: python_api/type/TestTypeList.py (1463 of 1725) PASS: lldb-Unit :: SymbolFile/DWARF/./SymbolFileDWARFTests/SymbolFileDWARFTests.TestAbbrevInvalidNULLTag (1464 of 1725) PASS: lldb-Suite :: commands/command/script_alias/TestCommandScriptAlias.py (1465 of 1725) PASS: lldb-Unit :: Utility/./UtilityTests/StreamTest.PutHex32ByteOrderBig (1466 of 1725) PASS: LLDB :: Driver/TestConvenienceVariables.test (1467 of 1725) PASS: lldb-Unit :: Utility/./UtilityTests/DataExtractorTest.GetMaxU64_unchecked (1468 of 1725) PASS: lldb-Suite :: commands/expression/call-function/TestCallBuiltinFunction.py (1469 of 1725) PASS: lldb-Unit :: Utility/./UtilityTests/ArgsTest.StringListConstructor (1470 of 1725) PASS: lldb-Unit :: Utility/./UtilityTests/OptionsWithRawTest.EmptyInput (1471 of 1725) PASS: lldb-Unit :: Utility/./UtilityTests/ArgsTest.TestTrailingBackslash (1472 of 1725) PASS: lldb-Suite :: python_api/file_handle/TestFileHandle.py (1473 of 1725) PASS: lldb-Unit :: Process/minidump/./LLDBMinidumpTests/MinidumpParserTest.GetMemoryRegionInfoFromMemory64List (1474 of 1725) FAIL: lldb-Suite :: functionalities/gdb_remote_client/TestGDBRemoteLoad.py (1475 of 1725) ******************** TEST 'lldb-Suite :: functionalities/gdb_remote_client/TestGDBRemoteLoad.py' FAILED ******************** lldb version 10.0.99 (http://labmaster3.local/git/llvm-project.git revision e78a7a0ecddc747129512fabf4836e22d1805f00) clang revision c624510f134ceee9bdb5308b6f4892890c61938f llvm revision c624510f134ceee9bdb5308b6f4892890c61938f LLDB library dir: /Users/buildslave/jenkins/workspace/lldb-cmake-sanitized/lldb-build/bin LLDB import library dir: /Users/buildslave/jenkins/workspace/lldb-cmake-sanitized/lldb-build/bin libstdcxx tests will not be run because: Don't know how to build with libstdcxx on macosx Skipping following debug info categories: ['dwo']

Hide Details

Session logs for test failures/errors/unexpected successes will go into directory '/Users/buildslave/jenkins/workspace/lldb-cmake-sanitized/test/logs' Command invoked: /Users/buildslave/jenkins/workspace/lldb-cmake-sanitized/llvm-project/lldb/test/dotest.py --arch=x86_64 -s /Users/buildslave/jenkins/workspace/lldb-cmake-sanitized/lldb-build/lldb-test-traces -S nm -u CXXFLAGS -u CFLAGS --executable /Users/buildslave/jenkins/workspace/lldb-cmake-sanitized/lldb-build/./bin/lldb --dsymutil /Users/buildslave/jenkins/workspace/lldb-cmake-sanitized/lldb-build/./bin/dsymutil --filecheck /Users/buildslave/jenkins/workspace/lldb-cmake-sanitized/lldb-build/./bin/FileCheck -C /Users/buildslave/jenkins/workspace/lldb-cmake-sanitized/host-compiler/bin/clang --codesign-identity lldb_codesign --server /Users/buildslave/jenkins/workspace/lldb-cmake-sanitized/lldb-build/./bin/debugserver --arch x86_64 --build-dir /Users/buildslave/jenkins/workspace/lldb-cmake-sanitized/lldb-build/lldb-test-build.noindex -s=/Users/buildslave/jenkins/workspace/lldb-cmake-sanitized/test/logs -t --env TERM=vt100 --env LLVM_LIBS_DIR=/Users/buildslave/jenkins/workspace/lldb-cmake-sanitized/lldb-build/./lib --build-dir /Users/buildslave/jenkins/workspace/lldb-cmake-sanitized/lldb-build/tools/lldb/lldb-test-build.noindex --module-cache-dir /Users/buildslave/jenkins/workspace/lldb-cmake-sanitized/lldb-build/tools/lldb/lldb-test-build.noindex/module-cache-lldb /Users/buildslave/jenkins/workspace/lldb-cmake-sanitized/llvm-project/lldb/packages/Python/lldbsuite/test/functionalities/gdb_remote_client -p TestGDBRemoteLoad.py Change dir to: /Users/buildslave/jenkins/workspace/lldb-cmake-sanitized/llvm-project/lldb/packages/Python/lldbsuite/test/functionalities/gdb_remote_client runCmd: settings set symbols.enable-external-lookup false output:

Hide Details

runCmd: settings set plugin.process.gdb-remote.packet-timeout 60 output:

Hide Details

runCmd: settings set symbols.clang-modules-cache-path "/Users/buildslave/jenkins/workspace/lldb-cmake-sanitized/lldb-build/tools/lldb/lldb-test-build.noindex/module-cache-lldb" output:

Hide Details

runCmd: settings set use-color false output:

Hide Details

FAIL: LLDB (/Users/buildslave/jenkins/workspace/lldb-cmake-sanitized/host-compiler/bin/clang-10-x86_64) :: test_flash_load (TestGDBRemoteLoad.TestGDBRemoteLoad) <bound method SBProcess.Kill of <lldb.SBProcess; proxy of <Swig Object of type 'lldb::SBProcess *' at 0x10f3f3ba0> >>: success

Hide Details

runCmd: settings set symbols.enable-external-lookup false output:

Hide Details

runCmd: settings set plugin.process.gdb-remote.packet-timeout 60 output:

Hide Details

runCmd: settings set symbols.clang-modules-cache-path "/Users/buildslave/jenkins/workspace/lldb-cmake-sanitized/lldb-build/tools/lldb/lldb-test-build.noindex/module-cache-lldb" output:

Hide Details

runCmd: settings set use-color false output:

Hide Details

FAIL: LLDB (/Users/buildslave/jenkins/workspace/lldb-cmake-sanitized/host-compiler/bin/clang-10-x86_64) :: test_module_load_address (TestGDBRemoteLoad.TestGDBRemoteLoad) <bound method SBProcess.Kill of <lldb.SBProcess; proxy of <Swig Object of type 'lldb::SBProcess *' at 0x10f3f3b40> >>: success

Hide Details

runCmd: settings set symbols.enable-external-lookup false output:

Hide Details

runCmd: settings set plugin.process.gdb-remote.packet-timeout 60 output:

Hide Details

runCmd: settings set symbols.clang-modules-cache-path "/Users/buildslave/jenkins/workspace/lldb-cmake-sanitized/lldb-build/tools/lldb/lldb-test-build.noindex/module-cache-lldb" output:

Hide Details

runCmd: settings set use-color false output:

Hide Details

FAIL: LLDB (/Users/buildslave/jenkins/workspace/lldb-cmake-sanitized/host-compiler/bin/clang-10-x86_64) :: test_ram_load (TestGDBRemoteLoad.TestGDBRemoteLoad) <bound method SBProcess.Kill of <lldb.SBProcess; proxy of <Swig Object of type 'lldb::SBProcess *' at 0x10f3f3ba0> >>: success

Hide Details

Restore dir to: /Users/buildslave/jenkins/workspace/lldb-cmake-sanitized/lldb-build/tools/lldb/lit ====================================================================== FAIL: test_flash_load (TestGDBRemoteLoad.TestGDBRemoteLoad) Test loading an object file to a target's flash memory ---------------------------------------------------------------------- Traceback (most recent call last): File "/Users/buildslave/jenkins/workspace/lldb-cmake-sanitized/llvm-project/lldb/packages/Python/lldbsuite/test/functionalities/gdb_remote_client/TestGDBRemoteLoad.py", line 73, in test_flash_load process = self.connect(target) File "/Users/buildslave/jenkins/workspace/lldb-cmake-sanitized/llvm-project/lldb/packages/Python/lldbsuite/test/functionalities/gdb_remote_client/gdbclientutils.py", line 479, in connect self.assertTrue(error.Success(), error.description) AssertionError: False is not True : failed to get reply to handshake packet Config=x86_64-/Users/buildslave/jenkins/workspace/lldb-cmake-sanitized/host-compiler/bin/clang-10 ====================================================================== FAIL: test_module_load_address (TestGDBRemoteLoad.TestGDBRemoteLoad) Test that setting the load address of a module uses virtual addresses ---------------------------------------------------------------------- Traceback (most recent call last): File "/Users/buildslave/jenkins/workspace/lldb-cmake-sanitized/llvm-project/lldb/packages/Python/lldbsuite/test/functionalities/gdb_remote_client/TestGDBRemoteLoad.py", line 20, in test_module_load_address process = self.connect(target) File "/Users/buildslave/jenkins/workspace/lldb-cmake-sanitized/llvm-project/lldb/packages/Python/lldbsuite/test/functionalities/gdb_remote_client/gdbclientutils.py", line 479, in connect self.assertTrue(error.Success(), error.description) AssertionError: False is not True : failed to get reply to handshake packet Config=x86_64-/Users/buildslave/jenkins/workspace/lldb-cmake-sanitized/host-compiler/bin/clang-10 ====================================================================== FAIL: test_ram_load (TestGDBRemoteLoad.TestGDBRemoteLoad) Test loading an object file to a target's ram ---------------------------------------------------------------------- Traceback (most recent call last): File "/Users/buildslave/jenkins/workspace/lldb-cmake-sanitized/llvm-project/lldb/packages/Python/lldbsuite/test/functionalities/gdb_remote_client/TestGDBRemoteLoad.py", line 31, in test_ram_load process = self.connect(target) File "/Users/buildslave/jenkins/workspace/lldb-cmake-sanitized/llvm-project/lldb/packages/Python/lldbsuite/test/functionalities/gdb_remote_client/gdbclientutils.py", line 479, in connect self.assertTrue(error.Success(), error.description) AssertionError: False is not True : failed to get reply to handshake packet Config=x86_64-/Users/buildslave/jenkins/workspace/lldb-cmake-sanitized/host-compiler/bin/clang-10 ---------------------------------------------------------------------- Ran 3 tests in 188.396s

Hide Details

RESULT: FAILED (0 passes, 3 failures, 0 errors, 0 skipped, 0 expected failures, 0 unexpected successes)

Hide Details

******************** PASS: lldb-Unit :: SymbolFile/DWARF/./SymbolFileDWARFTests/SymbolFileDWARFTests.TestAbilitiesForDWARF (1476 of 1725) PASS: lldb-Unit :: Host/./HostTests/FileSystemTest.GetPermissions (1477 of 1725) PASS: lldb-Unit :: Utility/./UtilityTests/StringExtractorTest.GetHexBytes_OddPair (1478 of 1725) PASS: lldb-Unit :: Process/gdb-remote/./ProcessGdbRemoteTests/GDBRemoteClientBaseTest.SendContinueAndAsyncPacket (1479 of 1725) PASS: lldb-Suite :: functionalities/paths/TestPaths.py (1480 of 1725) PASS: lldb-Suite :: functionalities/set-data/TestSetData.py (1481 of 1725) PASS: lldb-Unit :: Utility/./UtilityTests/RangeTest.ContainsAddrInvalid (1482 of 1725) PASS: lldb-Unit :: Utility/./UtilityTests/ProcessInstanceInfo.DumpTable (1483 of 1725) PASS: lldb-Unit :: Symbol/./SymbolTests/SymbolsTest.TerminateLocateExecutableSymbolFileForUnknownExecutableAndUnknownSymbolFile (1484 of 1725) PASS: LLDB :: Settings/TestSettingsSet.test (1485 of 1725) PASS: lldb-Unit :: UnwindAssembly/x86/./UnwindAssemblyx86Tests/Testx86AssemblyInspectionEngine.TestPopR12 (1486 of 1725) PASS: lldb-Unit :: Utility/./UtilityTests/RangeTest.DoesAdjoinOrIntersect (1487 of 1725) PASS: LLDB :: Reproducer/Functionalities/TestImageList.test (1488 of 1725) PASS: lldb-Suite :: commands/expression/completion/TestExprCompletion.py (1489 of 1725) PASS: lldb-Unit :: SymbolFile/DWARF/./SymbolFileDWARFTests/SymbolFileDWARFTests.TestAbbrevOutOfOrder (1490 of 1725) PASS: lldb-Unit :: Utility/./UtilityTests/StreamTest.ShiftOperatorStrings (1491 of 1725) PASS: lldb-Unit :: ScriptInterpreter/Python/./ScriptInterpreterPythonTests/PythonDataObjectsTest.TestResetting (1492 of 1725) PASS: lldb-Unit :: Utility/./UtilityTests/RangeTest.Clear (1493 of 1725) PASS: lldb-Suite :: python_api/signals/TestSignalsAPI.py (1494 of 1725) PASS: lldb-Unit :: Utility/./UtilityTests/RangeTest.Union (1495 of 1725) PASS: lldb-Suite :: functionalities/breakpoint/hardware_breakpoints/hardware_breakpoint_on_multiple_threads/TestHWBreakMultiThread.py (1496 of 1725) PASS: lldb-Suite :: macosx/thread-names/TestInterruptThreadNames.py (1497 of 1725) PASS: lldb-Suite :: functionalities/data-formatter/data-formatter-stl/libcxx/forward_list/TestDataFormatterLibcxxForwardList.py (1498 of 1725) PASS: lldb-Suite :: tools/lldb-server/inferior-crash/TestGdbRemoteSegFault.py (1499 of 1725) PASS: lldb-Unit :: Host/./HostTests/FileActionTest.Open (1500 of 1725) PASS: LLDB :: Modules/ELF/PT_LOAD-overlap-PT_INTERP.yaml (1501 of 1725) PASS: lldb-Unit :: Utility/./UtilityTests/RangeTest.ContainsRange (1502 of 1725) PASS: lldb-Unit :: Utility/./UtilityTests/DeserializerTest.HasData (1503 of 1725) PASS: lldb-Unit :: Interpreter/./InterpreterTests/CompletionTest.DirCompletionAbsolute (1504 of 1725) PASS: LLDB :: Settings/TestEchoCommands.test (1505 of 1725) PASS: lldb-Unit :: UnwindAssembly/x86/./UnwindAssemblyx86Tests/Testx86AssemblyInspectionEngine.TestPushRBX (1506 of 1725) PASS: lldb-Suite :: tools/lldb-vscode/attach/TestVSCode_attach.py (1507 of 1725) PASS: lldb-Suite :: lang/objc/objc-dyn-sbtype/TestObjCDynamicSBType.py (1508 of 1725) PASS: lldb-Unit :: UnwindAssembly/x86/./UnwindAssemblyx86Tests/Testx86AssemblyInspectionEngine.TestPopRBX (1509 of 1725) PASS: lldb-Suite :: commands/expression/import-std-module/weak_ptr-dbg-info-content/TestDbgInfoContentWeakPtr.py (1510 of 1725) PASS: lldb-Suite :: functionalities/thread/backtrace_all/TestBacktraceAll.py (1511 of 1725) PASS: lldb-Suite :: commands/expression/options/TestExprOptions.py (1512 of 1725) PASS: lldb-Unit :: Utility/./UtilityTests/JSONTest.Dictionary (1513 of 1725) PASS: lldb-Unit :: Host/./HostTests/FileSystemTest.EnumerateDirectory (1514 of 1725) PASS: lldb-Suite :: lang/cpp/offsetof/TestOffsetofCpp.py (1515 of 1725) PASS: LLDB :: Modules/ELF/section-permissions.yaml (1516 of 1725) PASS: lldb-Unit :: Utility/./UtilityTests/Flags.AnySet (1517 of 1725) PASS: lldb-Unit :: debugserver/./debugserverTests/RNBSocket.LoopBackConnectIPv6 (1518 of 1725) PASS: lldb-Unit :: Utility/./UtilityTests/LogChannelEnabledTest.LogThread (1519 of 1725) PASS: lldb-Unit :: Utility/./UtilityTests/StringListTest.SetSize (1520 of 1725) PASS: lldb-Suite :: lang/objc/bitfield_ivars/TestBitfieldIvars.py (1521 of 1725) PASS: lldb-Suite :: functionalities/stats_api/TestStatisticsAPI.py (1522 of 1725) PASS: lldb-Unit :: Signals/./SignalsTests/UnixSignalsTest.Iteration (1523 of 1725) PASS: lldb-Unit :: Utility/./UtilityTests/FileSpecTest.AppendPathComponent (1524 of 1725) PASS: lldb-Unit :: Utility/./UtilityTests/StreamTeeTest.Assignment (1525 of 1725) PASS: lldb-Unit :: Utility/./UtilityTests/OptionsWithRawTest.SingleWhitespaceInput (1526 of 1725) PASS: lldb-Suite :: functionalities/dynamic_value_child_count/TestDynamicValueChildCount.py (1527 of 1725) PASS: lldb-Unit :: Utility/./UtilityTests/FileSpecTest.EqualSeparator (1528 of 1725) PASS: lldb-Unit :: Utility/./UtilityTests/BroadcasterTest.BroadcastEvent (1529 of 1725) PASS: LLDB :: Unwind/trap_frame_sym_ctx.test (1530 of 1725) PASS: lldb-Suite :: lang/objc/forward-decl/TestForwardDecl.py (1531 of 1725) PASS: lldb-Unit :: Symbol/./SymbolTests/SymbolsTest.LocateExecutableSymbolFileForUnknownExecutableAndMissingSymbolFile (1532 of 1725) PASS: LLDB :: Modules/ELF/build-id-case.yaml (1533 of 1725) PASS: lldb-Unit :: Utility/./UtilityTests/RangeTest.ContainsAddr (1534 of 1725) PASS: lldb-Unit :: Utility/./UtilityTests/StringExtractorTest.DecodeHexU8_InvalidHex2 (1535 of 1725) PASS: lldb-Suite :: functionalities/data-formatter/data-formatter-stl/libcxx/multiset/TestDataFormatterLibcxxMultiSet.py (1536 of 1725) PASS: lldb-Unit :: Utility/./UtilityTests/VMRange.Clear (1537 of 1725) PASS: lldb-Suite :: tools/lldb-vscode/launch/TestVSCode_launch.py (1538 of 1725) PASS: lldb-Suite :: functionalities/thread/concurrent_events/TestConcurrentBreakpointOneDelayBreakpointThreads.py (1539 of 1725) PASS: lldb-Unit :: Utility/./UtilityTests/StreamTest.PutULEB128 (1540 of 1725) PASS: lldb-Suite :: lang/cpp/unicode-literals/TestUnicodeLiterals.py (1541 of 1725) PASS: LLDB :: SymbolFile/Breakpad/symtab-macho.test (1542 of 1725) PASS: lldb-Unit :: Utility/./UtilityTests/LogChannelTest.EnableOptions (1543 of 1725) PASS: lldb-Suite :: lang/cpp/class_types/TestClassTypesDisassembly.py (1544 of 1725) PASS: lldb-Unit :: Process/minidump/./LLDBMinidumpTests/MinidumpParserTest.GetMiscInfoWindows (1545 of 1725) PASS: lldb-Suite :: macosx/safe-to-func-call/TestSafeFuncCalls.py (1546 of 1725) PASS: LLDB :: SymbolFile/DWARF/debug_loc.s (1547 of 1725) PASS: lldb-Suite :: commands/expression/inline-namespace/TestInlineNamespace.py (1548 of 1725) PASS: lldb-Suite :: functionalities/postmortem/mach-core/TestMachCore.py (1549 of 1725) PASS: LLDB :: SymbolFile/DWARF/split-dwarf-multiple-cu.ll (1550 of 1725) PASS: lldb-Unit :: SymbolFile/NativePDB/./SymbolFileNativePDBTests/PDBFPOProgramToDWARFExpressionTests.UnresolvedDependentCyclicRegisterAssignmentReference (1551 of 1725) PASS: LLDB :: SymbolFile/DWARF/find-qualified-variable.cpp (1552 of 1725) PASS: lldb-Suite :: lang/c/register_variables/TestRegisterVariables.py (1553 of 1725) PASS: lldb-Unit :: Utility/./UtilityTests/BinaryStreamTest.PutSLEB128Zero (1554 of 1725) PASS: lldb-Unit :: Utility/./UtilityTests/RangeTest.NotEqualInvalid (1555 of 1725) PASS: LLDB :: Modules/ELF/section-types.yaml (1556 of 1725) PASS: lldb-Suite :: commands/process/launch-with-shellexpand/TestLaunchWithShellExpand.py (1557 of 1725) PASS: lldb-Suite :: commands/register/register/intel_xtended_registers/TestMPXRegisters.py (1558 of 1725) PASS: lldb-Unit :: Process/minidump/./LLDBMinidumpTests/MinidumpParserTest.MinidumpModuleOrder (1559 of 1725) PASS: lldb-Suite :: commands/frame/diagnose/dereference-this/TestDiagnoseDereferenceThis.py (1560 of 1725) PASS: lldb-Suite :: functionalities/archives/TestBSDArchives.py (1561 of 1725) PASS: lldb-Unit :: Utility/./UtilityTests/RangeTest.ClearWithStarAddress (1562 of 1725) PASS: lldb-Unit :: Utility/./UtilityTests/BinaryStreamTest.PutULEB128FiveBytes (1563 of 1725) PASS: lldb-Unit :: Utility/./UtilityTests/StringExtractorTest.GetHexBytes_Partial (1564 of 1725) PASS: lldb-Unit :: Process/minidump/./LLDBMinidumpTests/MinidumpParserTest.GetThreadContext_x86_32_wow64 (1565 of 1725) PASS: lldb-Unit :: ScriptInterpreter/Python/./ScriptInterpreterPythonTests/PythonDataObjectsTest.TestExtractingUInt64ThroughStructuredData (1566 of 1725) PASS: lldb-Suite :: functionalities/signal/handle-abrt/TestHandleAbort.py (1567 of 1725) PASS: lldb-Unit :: Utility/./UtilityTests/StringListTest.SplitIntoLinesSingleTrailingCR (1568 of 1725) PASS: lldb-Unit :: Host/./HostTests/FileSystemTest.Resolve (1569 of 1725) PASS: lldb-Suite :: functionalities/data-formatter/data-formatter-stl/libcxx/tuple/TestDataFormatterLibcxxTuple.py (1570 of 1725) PASS: lldb-Unit :: Process/minidump/./LLDBMinidumpTests/MinidumpParserTest.GetThreadsAndGetThreadContext (1571 of 1725) PASS: lldb-Suite :: functionalities/unwind/sigtramp/TestSigtrampUnwind.py (1572 of 1725) PASS: lldb-Suite :: functionalities/data-formatter/data-formatter-script/TestDataFormatterScript.py (1573 of 1725) PASS: lldb-Unit :: Utility/./UtilityTests/StringListTest.JoinThree (1574 of 1725) PASS: LLDB :: SymbolFile/NativePDB/ast-methods.cpp (1575 of 1725) PASS: lldb-Unit :: UnwindAssembly/x86/./UnwindAssemblyx86Tests/Testx86AssemblyInspectionEngine.TestSimple64bitFrameFunction (1576 of 1725) PASS: LLDB :: SymbolFile/DWARF/debug_ranges-missing-section.s (1577 of 1725) PASS: lldb-Suite :: commands/add-dsym/uuid/TestAddDsymCommand.py (1578 of 1725) PASS: lldb-Suite :: lang/cpp/type_lookup/TestCppTypeLookup.py (1579 of 1725) PASS: lldb-Unit :: Utility/./UtilityTests/StreamTest.PutHex8 (1580 of 1725) PASS: lldb-Unit :: ObjectFile/ELF/./ObjectFileELFTests/ObjectFileELFTest.GetModuleSpecifications_EarlySectionHeaders (1581 of 1725) PASS: lldb-Suite :: commands/expression/weak_symbols/TestWeakSymbols.py (1582 of 1725) PASS: lldb-Unit :: Process/minidump/./LLDBMinidumpTests/MinidumpParserTest.GetArchitecture (1583 of 1725) PASS: lldb-Unit :: Utility/./UtilityTests/FileSpecTest.EqualDotsPosixRoot (1584 of 1725) PASS: lldb-Suite :: commands/watchpoints/multiple_hits/TestMultipleHits.py (1585 of 1725) PASS: lldb-Unit :: Utility/./UtilityTests/StreamTest.PutStringAsRawHex8 (1586 of 1725) PASS: lldb-Unit :: Process/gdb-remote/./ProcessGdbRemoteTests/GDBRemoteCommunicationTest.ReadPacket_checksum (1587 of 1725) XFAIL: LLDB :: Register/x86-mm-xmm-write.test (1588 of 1725) PASS: lldb-Suite :: functionalities/breakpoint/step_over_breakpoint/TestStepOverBreakpoint.py (1589 of 1725) PASS: lldb-Unit :: ScriptInterpreter/Python/./ScriptInterpreterPythonTests/PythonDataObjectsTest.TestPythonTupleInitializerList2 (1590 of 1725) PASS: lldb-Suite :: commands/expression/import-std-module/forward_list-dbg-info-content/TestDbgInfoContentForwardList.py (1591 of 1725) PASS: lldb-Suite :: functionalities/thread/concurrent_events/TestConcurrentSignalWatch.py (1592 of 1725) PASS: lldb-Unit :: Utility/./UtilityTests/UriParserTest.MinimalPath (1593 of 1725) PASS: lldb-Unit :: Expression/./ExpressionTests/DiagnosticManagerTest.AppendMessageSubsequentDiags (1594 of 1725) PASS: LLDB :: Settings/TestModuleCacheSanity.test (1595 of 1725) PASS: lldb-Unit :: Utility/./UtilityTests/BinaryStreamTest.PutSLEB128ThreeBytes (1596 of 1725) PASS: lldb-Suite :: tools/lldb-server/signal-filtering/TestGdbRemote_QPassSignals.py (1597 of 1725) PASS: lldb-Suite :: functionalities/breakpoint/cpp/TestCPPBreakpointLocations.py (1598 of 1725) PASS: lldb-Suite :: functionalities/data-formatter/var-in-aggregate-misuse/TestVarInAggregateMisuse.py (1599 of 1725) PASS: lldb-Unit :: Utility/./UtilityTests/StringExtractorTest.GetHexU8_Exact (1600 of 1725) PASS: lldb-Suite :: commands/statistics/basic/TestStats.py (1601 of 1725) PASS: lldb-Suite :: functionalities/data-formatter/data-formatter-objc/nsindexpath/TestDataFormatterNSIndexPath.py (1602 of 1725) PASS: lldb-Suite :: functionalities/data-formatter/data-formatter-objc/TestDataFormatterObjCNSDate.py (1603 of 1725) PASS: lldb-Suite :: lang/cpp/dynamic-value-same-basename/TestDynamicValueSameBase.py (1604 of 1725) PASS: lldb-Suite :: commands/frame/diagnose/complicated-expression/TestComplicatedExpression.py (1605 of 1725) PASS: lldb-Suite :: functionalities/data-formatter/data-formatter-objc/TestDataFormatterObjCCF.py (1606 of 1725) PASS: lldb-Unit :: Language/Highlighting/./HighlighterTests/HighlighterTest.ClangUnterminatedString (1607 of 1725) PASS: lldb-Unit :: Process/gdb-remote/./ProcessGdbRemoteTests/GDBRemoteCommunicationClientTest.GetModulesInfoInvalidResponse (1608 of 1725) PASS: lldb-Suite :: lang/cpp/lambdas/TestLambdas.py (1609 of 1725) PASS: lldb-Unit :: Language/Highlighting/./HighlighterTests/HighlighterTest.ClangStringLiterals (1610 of 1725) PASS: lldb-Unit :: Symbol/./SymbolTests/DWARFCallFrameInfoTest.Basic_dwarf4 (1611 of 1725) PASS: lldb-Suite :: lang/cpp/modules-import/TestCXXModulesImport.py (1612 of 1725) PASS: lldb-Suite :: commands/expression/cast_int_to_anonymous_enum/TestCastIntToAnonymousEnum.py (1613 of 1725) PASS: lldb-Suite :: commands/frame/language/TestGuessLanguage.py (1614 of 1725) PASS: lldb-Unit :: Utility/./UtilityTests/StringListTest.InsertStringAtIndexStdString (1615 of 1725) PASS: lldb-Suite :: functionalities/data-formatter/data-formatter-cpp/TestDataFormatterCpp.py (1616 of 1725) PASS: lldb-Unit :: Symbol/./SymbolTests/DWARFCallFrameInfoTest.Basic_eh (1617 of 1725) PASS: lldb-Unit :: UnwindAssembly/x86/./UnwindAssemblyx86Tests/Testx86AssemblyInspectionEngine.TestStackRealign32BitDisp_x86_64 (1618 of 1725) PASS: lldb-Suite :: tools/lldb-server/TestGdbRemoteExitCode.py (1619 of 1725) PASS: lldb-Unit :: Utility/./UtilityTests/Predicate.WaitForValueNotEqualTo (1620 of 1725) PASS: lldb-Suite :: api/multiple-targets/TestMultipleTargets.py (1621 of 1725) PASS: lldb-Unit :: Host/./HostTests/FileSystemTest.Readable (1622 of 1725) PASS: lldb-Suite :: python_api/name_lookup/TestNameLookup.py (1623 of 1725) PASS: LLDB :: Reproducer/TestReuseDirectory.test (1624 of 1725) PASS: lldb-Suite :: functionalities/thread/concurrent_events/TestConcurrentManyWatchpoints.py (1625 of 1725) PASS: lldb-Suite :: functionalities/data-formatter/type_summary_list_script/TestTypeSummaryListScript.py (1626 of 1725) PASS: lldb-Suite :: functionalities/postmortem/minidump/TestMiniDump.py (1627 of 1725) PASS: lldb-Suite :: functionalities/gdb_remote_client/TestWriteMemory.py (1628 of 1725) PASS: lldb-Unit :: Utility/./UtilityTests/FileSpecTest.CopyByAppendingPathComponent (1629 of 1725) PASS: lldb-Suite :: commands/expression/import-std-module/shared_ptr-dbg-info-content/TestSharedPtrDbgInfoContent.py (1630 of 1725) PASS: lldb-Suite :: commands/expression/import-std-module/list-dbg-info-content/TestDbgInfoContentList.py (1631 of 1725) PASS: lldb-Unit :: Language/CPlusPlus/./LanguageCPlusPlusTests/CPlusPlusLanguage.ExtractContextAndIdentifier (1632 of 1725) PASS: lldb-Unit :: Utility/./UtilityTests/StringExtractorTest.GetHexBytesAvail_FullString (1633 of 1725) PASS: lldb-Unit :: Utility/./UtilityTests/RangeTest.SizeTypes (1634 of 1725) UNSUPPORTED: LLDB :: SymbolFile/PDB/vbases.test (1635 of 1725) PASS: lldb-Suite :: commands/expression/import-std-module/vector-dbg-info-content/TestDbgInfoContentVector.py (1636 of 1725) PASS: lldb-Suite :: lang/cpp/class-template-parameter-pack/TestClassTemplateParameterPack.py (1637 of 1725) PASS: lldb-Unit :: Utility/./UtilityTests/RangeTest.LessThan (1638 of 1725) PASS: lldb-Suite :: lang/objc/exceptions/TestObjCExceptions.py (1639 of 1725) PASS: lldb-Unit :: Process/minidump/./LLDBMinidumpTests/MinidumpParserTest.GetMemory (1640 of 1725) PASS: lldb-Unit :: Utility/./UtilityTests/BinaryStreamTest.PutULEB128SixBytes (1641 of 1725) PASS: lldb-Suite :: sample_test/TestSampleTest.py (1642 of 1725) PASS: lldb-Unit :: Language/Highlighting/./HighlighterTests/HighlighterTest.ClangScalarLiterals (1643 of 1725) PASS: LLDB :: SymbolFile/DWARF/debug-types-address-ranges.s (1644 of 1725) PASS: lldb-Suite :: functionalities/breakpoint/breakpoint_language/TestBreakpointLanguage.py (1645 of 1725) PASS: LLDB :: SymbolFile/DWARF/dir-separator-no-comp-dir.s (1646 of 1725) PASS: lldb-Unit :: Utility/./UtilityTests/StringExtractorTest.DecodeHexU8_InvalidHex (1647 of 1725) PASS: lldb-Unit :: Utility/./UtilityTests/LogTest.Register (1648 of 1725) PASS: lldb-Suite :: functionalities/data-formatter/user-format-vs-summary/TestUserFormatVsSummary.py (1649 of 1725) PASS: lldb-Unit :: UnwindAssembly/x86/./UnwindAssemblyx86Tests/Testx86AssemblyInspectionEngine.TestPopRBP (1650 of 1725) PASS: LLDB :: Reproducer/TestDriverOptions.test (1651 of 1725) PASS: lldb-Suite :: functionalities/breakpoint/debugbreak/TestDebugBreak.py (1652 of 1725) PASS: lldb-Suite :: commands/expression/call-function/TestCallStdStringFunction.py (1653 of 1725) PASS: lldb-Suite :: lang/c/tls_globals/TestTlsGlobals.py (1654 of 1725) PASS: lldb-Suite :: lang/mixed/TestMixedLanguages.py (1655 of 1725) PASS: lldb-Suite :: commands/expression/pr35310/TestExprsBug35310.py (1656 of 1725) PASS: LLDB :: Expr/TestIRMemoryMap.test (1657 of 1725) PASS: lldb-Unit :: Utility/./UtilityTests/StreamTest.PutPtr (1658 of 1725) PASS: LLDB :: Reproducer/TestFileRepro.test (1659 of 1725) PASS: lldb-Suite :: functionalities/data-formatter/data-formatter-globals/TestDataFormatterGlobals.py (1660 of 1725) PASS: lldb-Unit :: Process/gdb-remote/./ProcessGdbRemoteTests/GDBRemoteCommunicationServerTest.SendErrorResponse_ErrorNumber (1661 of 1725) PASS: lldb-Unit :: ObjectFile/Breakpad/./ObjectFileBreakpadTests/Record.classify (1662 of 1725) UNSUPPORTED: LLDB :: SymbolFile/PDB/enums-layout.test (1663 of 1725) PASS: lldb-Unit :: Utility/./UtilityTests/TimerTest.CategoryTimes2 (1664 of 1725) PASS: lldb-Unit :: Interpreter/./InterpreterTests/CompletionTest.FileCompletionAbsolute (1665 of 1725) PASS: LLDB :: Modules/ELF/PT_LOAD-overlap-section.yaml (1666 of 1725) PASS: lldb-Suite :: functionalities/exec/TestExec.py (1667 of 1725) PASS: lldb-Unit :: Utility/./UtilityTests/UriParserTest.SchemeHostSeparator3 (1668 of 1725) PASS: lldb-Unit :: Utility/./UtilityTests/UriParserTest.MinimalPortPath (1669 of 1725) PASS: lldb-Unit :: Utility/./UtilityTests/DataExtractorTest.PeekData (1670 of 1725) PASS: lldb-Suite :: commands/help/TestHelp.py (1671 of 1725) PASS: lldb-Suite :: commands/expression/radar_8638051/Test8638051.py (1672 of 1725) PASS: lldb-Unit :: Utility/./UtilityTests/StreamTest.PutRawBytesToMixedEndian (1673 of 1725) PASS: lldb-Suite :: python_api/process/TestProcessAPI.py (1674 of 1725) PASS: lldb-Suite :: functionalities/backticks/TestBackticksWithoutATarget.py (1675 of 1725) PASS: lldb-Unit :: Host/./HostTests/MainLoopTest.ReadObject (1676 of 1725) PASS: lldb-Unit :: Host/./HostTests/NativeProcessProtocolTest.SetBreakpointFailVerify (1677 of 1725) PASS: lldb-Unit :: Utility/./UtilityTests/StringListTest.GetMaxStringLengthDecreasingSize (1678 of 1725) PASS: lldb-Unit :: Expression/./ExpressionTests/DiagnosticManagerTest.AppendMessageNoDiag (1679 of 1725) PASS: lldb-Suite :: functionalities/inferior-crashing/TestInferiorCrashingStep.py (1680 of 1725) PASS: lldb-Unit :: Symbol/./SymbolTests/LineEntryTest.GetSameLineContiguousAddressRangeOneInline (1681 of 1725) PASS: lldb-Suite :: commands/expression/persistent_types/TestPersistentTypes.py (1682 of 1725) PASS: lldb-Suite :: commands/expression/char/TestExprsChar.py (1683 of 1725) PASS: lldb-Suite :: functionalities/tsan/multiple/TestTsanMultiple.py (1684 of 1725) PASS: lldb-Suite :: functionalities/breakpoint/source_regexp/TestSourceRegexBreakpoints.py (1685 of 1725) PASS: lldb-Unit :: Utility/./UtilityTests/ArgsTest.ReplaceArgumentAtIndexLonger (1686 of 1725) PASS: lldb-Suite :: functionalities/non-overlapping-index-variable-i/TestIndexVariable.py (1687 of 1725) PASS: lldb-Unit :: Utility/./UtilityTests/StreamTeeTest.Flush (1688 of 1725) PASS: lldb-Unit :: Target/./TargetTests/PathMappingListTest.RelativeTests (1689 of 1725) PASS: lldb-Suite :: functionalities/breakpoint/breakpoint_by_line_and_column/TestBreakpointByLineAndColumn.py (1690 of 1725) PASS: lldb-Suite :: commands/expression/dollar-in-variable/TestDollarInVariable.py (1691 of 1725) UNSUPPORTED: LLDB :: SymbolFile/DWARF/debug-types-expressions.test (1692 of 1725) PASS: lldb-Suite :: lang/objc/foundation/TestObjCMethodsNSError.py (1693 of 1725) PASS: lldb-Unit :: Host/./HostTests/NativeProcessProtocolTest.ReadCStringFromMemory_MaxSize (1694 of 1725) PASS: lldb-Unit :: Utility/./UtilityTests/StringExtractorTest.GetHexU8_InvalidHex (1695 of 1725) PASS: lldb-Unit :: Utility/./UtilityTests/ArgsTest.TestQuotedTrailingBackslash (1696 of 1725) PASS: LLDB :: SymbolFile/NativePDB/function-types-calling-conv.cpp (1697 of 1725) PASS: lldb-Suite :: python_api/watchpoint/watchlocation/TestTargetWatchAddress.py (1698 of 1725) PASS: lldb-Suite :: commands/expression/argument_passing_restrictions/TestArgumentPassingRestrictions.py (1699 of 1725) PASS: lldb-Unit :: Utility/./UtilityTests/StatusTest.Formatv (1700 of 1725) PASS: LLDB :: SymbolFile/DWARF/find-variable-file.cpp (1701 of 1725) PASS: lldb-Unit :: Utility/./UtilityTests/StreamTest.PutHex16ByteOrderLittle (1702 of 1725) PASS: lldb-Unit :: Host/./HostTests/FileSystemTest.Exists (1703 of 1725) PASS: lldb-Suite :: functionalities/darwin_log/filter/exact_match/activity-chain/TestDarwinLogFilterMatchActivityChain.py (1704 of 1725) PASS: lldb-Unit :: Utility/./UtilityTests/StringListTest.ForRangeEmpty (1705 of 1725) PASS: LLDB :: SymbolFile/NativePDB/function-types-classes.cpp (1706 of 1725) PASS: lldb-Unit :: Symbol/./SymbolTests/PostfixExpression.ParseFPOProgram (1707 of 1725) PASS: lldb-Suite :: commands/log/basic/TestLogging.py (1708 of 1725) PASS: lldb-Suite :: lang/cpp/breakpoint-commands/TestCPPBreakpointCommands.py (1709 of 1725) PASS: lldb-Unit :: Utility/./UtilityTests/StreamTest.ChangingByteOrder (1710 of 1725) PASS: lldb-Suite :: functionalities/breakpoint/address_breakpoints/TestBadAddressBreakpoints.py (1711 of 1725) PASS: LLDB :: Breakpoint/jitbp_elf.test (1712 of 1725) PASS: lldb-Suite :: driver/batch_mode/TestBatchMode.py (1713 of 1725) PASS: lldb-Suite :: python_api/value/TestValueAPI.py (1714 of 1725) PASS: lldb-Suite :: commands/watchpoints/watchpoint_disable/TestWatchpointDisable.py (1715 of 1725) PASS: lldb-Suite :: python_api/function_symbol/TestSymbolAPI.py (1716 of 1725) PASS: lldb-Suite :: functionalities/tail_call_frames/disambiguate_paths_to_common_sink/TestDisambiguatePathsToCommonSink.py (1717 of 1725) PASS: lldb-Suite :: python_api/exprpath_synthetic/TestExprPathSynthetic.py (1718 of 1725) PASS: lldb-Suite :: commands/expression/call-throws/TestCallThatThrows.py (1719 of 1725) PASS: lldb-Suite :: lang/objc/objc-new-syntax/TestObjCNewSyntaxDictionary.py (1720 of 1725) PASS: lldb-Suite :: lang/objc/objc-new-syntax/TestObjCNewSyntaxLiteral.py (1721 of 1725) PASS: lldb-Suite :: lang/objc/hidden-ivars/TestHiddenIvars.py (1722 of 1725) PASS: lldb-Suite :: api/multithreaded/TestMultithreaded.py (1723 of 1725) PASS: lldb-Suite :: types/TestIntegerTypesExpr.py (1724 of 1725) TIMEOUT: lldb-Suite :: lang/objc/foundation/TestFoundationDisassembly.py (1725 of 1725) ******************** TEST 'lldb-Suite :: lang/objc/foundation/TestFoundationDisassembly.py' FAILED ******************** Reached timeout of 1200 seconds ******************** Testing Time: 2162.70s ******************** Failing Tests (8): lldb-Suite :: functionalities/gdb_remote_client/TestGDBRemoteClient.py lldb-Suite :: tools/lldb-server/commandline/TestStubReverseConnect.py lldb-Suite :: tools/lldb-server/TestLldbGdbServer.py lldb-Suite :: iohandler/completion/TestIOHandlerCompletion.py lldb-Suite :: commands/expression/multiline-completion/TestMultilineCompletion.py lldb-Suite :: functionalities/gdb_remote_client/TestThreadSelectionBug.py lldb-Suite :: commands/gui/basic/TestGuiBasic.py lldb-Suite :: functionalities/gdb_remote_client/TestGDBRemoteLoad.py

Hide Details

******************** Timed Out Tests (1): lldb-Suite :: lang/objc/foundation/TestFoundationDisassembly.py

Hide Details

Hide Details

Slowest Tests: -------------------------------------------------------------------------- 121.42s: lldb-Suite :: lang/objc/foundation/TestObjCMethodsString.py 121.78s: lldb-Suite :: api/multithreaded/TestMultithreaded.py 122.10s: lldb-Suite :: api/check_public_api_headers/TestPublicAPIHeaders.py 122.80s: lldb-Suite :: functionalities/recursion/TestValueObjectRecursion.py 126.74s: lldb-Suite :: functionalities/inferior-crashing/TestInferiorCrashingStep.py 129.72s: lldb-Suite :: python_api/target/TestTargetAPI.py 139.47s: lldb-Suite :: lang/objc/objc-new-syntax/TestObjCNewSyntaxArray.py 144.88s: lldb-Suite :: lang/c/anonymous/TestAnonymous.py 157.63s: lldb-Suite :: commands/target/basic/TestTargetCommand.py 163.13s: lldb-Suite :: lang/objc/exceptions/TestObjCExceptions.py 189.47s: lldb-Suite :: functionalities/load_unload/TestLoadUnload.py 193.37s: lldb-Suite :: functionalities/gdb_remote_client/TestGDBRemoteLoad.py 210.91s: lldb-Suite :: lang/objc/foundation/TestObjCMethods.py 217.02s: lldb-Suite :: functionalities/return-value/TestReturnValue.py 224.13s: lldb-Suite :: lang/cpp/namespace/TestNamespaceLookup.py 236.63s: lldb-Suite :: lang/cpp/enum_types/TestCPP11EnumTypes.py 237.97s: lldb-Suite :: tools/lldb-server/TestLldbGdbServer.py 261.59s: lldb-Suite :: types/TestIntegerTypesExpr.py 461.12s: lldb-Suite :: types/TestIntegerTypes.py 1200.71s: lldb-Suite :: lang/objc/foundation/TestFoundationDisassembly.py

Hide Details

Tests Times: -------------------------------------------------------------------------- [ Range ] :: [ Percentage ] :: [ Count ] -------------------------------------------------------------------------- [ 0s, 100s) :: [*************************************** ] :: [1697/1725] [ 100s, 200s) :: [ ] :: [ 18/1725] [ 200s, 300s) :: [ ] :: [ 8/1725] [ 300s, 400s) :: [ ] :: [ 0/1725] [ 400s, 500s) :: [ ] :: [ 1/1725] [ 500s, 600s) :: [ ] :: [ 0/1725] [ 600s, 700s) :: [ ] :: [ 0/1725] [ 700s, 800s) :: [ ] :: [ 0/1725] [ 800s, 900s) :: [ ] :: [ 0/1725] [ 900s,1000s) :: [ ] :: [ 0/1725] [1000s,1100s) :: [ ] :: [ 0/1725] [1100s,1200s) :: [ ] :: [ 0/1725] [1200s,1300s) :: [ ] :: [ 1/1725] Expected Passes : 1666 Expected Failures : 6 Unsupported Tests : 44 Unexpected Failures: 8 Individual Timeouts: 1 FAILED: tools/lldb/lit/CMakeFiles/check-lldb-lit cd /Users/buildslave/jenkins/workspace/lldb-cmake-sanitized/lldb-build/tools/lldb/lit && /usr/bin/python /Users/buildslave/jenkins/workspace/lldb-cmake-sanitized/lldb-build/./bin/llvm-lit -v --time-tests --shuffle --xunit-xml-output=/Users/buildslave/jenkins/workspace/lldb-cmake-sanitized/test/results.xml -v --timeout 1200 /Users/buildslave/jenkins/workspace/lldb-cmake-sanitized/lldb-build/tools/lldb/lit ninja: build stopped: subcommand failed. Command failed Command: ['/usr/bin/env', 'TERM=vt100', '/usr/local/bin/ninja', '-v', 'check-lldb'] [Pipeline] } [Pipeline] // timeout [Pipeline] } [Pipeline] // stage [Pipeline] stage [Pipeline] { (Declarative: Post Actions) [Pipeline] scanForIssues No credentials specified [Clang (LLVM based)] Sleeping for 5 seconds due to JENKINS-32191... [Clang (LLVM based)] Parsing console log (workspace: '/Users/buildslave/jenkins/workspace/lldb-cmake-sanitized') [Pipeline] junit Recording test results [Pipeline] } [Pipeline] // stage [Pipeline] } [Pipeline] // withEnv [Pipeline] } [Pipeline] // node [Pipeline] End of Pipeline [BFA] Scanning build for known causes... [BFA] Found failure cause(s): [BFA] Regression test failed from category Test [BFA] Ninja target failed from category Compile [BFA] Done. 1s ERROR: script returned exit code 1 Finished: FAILURE