FailedConsole Output

Skipping 8,014 KB.. Full Log
fff, 0x00007fff65e8536a libsystem_kernel.dylib`__ulock_wait + 10, queue = 'com.apple.main-thread'
* thread #2: tid = 0xa26044, 0x0000000100000d92 a.out`do_bad_thing_with_location(index=7, char_ptr="", new_val='c') at main.cpp:36:1, stop reason = watchpoint 1
  thread #3: tid = 0xa26045, 0x0000000100000d92 a.out`do_bad_thing_with_location(index=7, char_ptr="", new_val='c') at main.cpp:36:1, stop reason = watchpoint 1
  thread #4: tid = 0xa26046, 0x0000000100000d92 a.out`do_bad_thing_with_location(index=7, char_ptr="", new_val='c') at main.cpp:36:1, stop reason = watchpoint 1

Hide Details

Hide Details

runCmd: thread select 2 output:

Hide Details

runCmd: thread select 3 output:

Hide Details

runCmd: thread select 4 output:

Hide Details

runCmd: thread backtrace output: * thread #4, stop reason = watchpoint 1 * frame #0: 0x0000000100000d92 a.out`do_bad_thing_with_location(index=7, char_ptr="", new_val='c') at main.cpp:36:1 frame #1: 0x0000000100000e4e a.out`access_pool(flag=true) at main.cpp:53:9 frame #2: 0x0000000100000f35 a.out`thread_func(thread_index=2) at main.cpp:80:19 frame #3: 0x00000001000027c4 a.out`decltype(__f=0x0000000100400258, __args=0x0000000100400260)(unsigned int)>(fp)(std::__1::forward<long>(fp0))) std::__1::__invoke<void (*)(unsigned int), long>(void (*&&)(unsigned int), long&&) at type_traits:3539:1 frame #4: 0x000000010000270e a.out`void std::__1::__thread_execute<std::__1::unique_ptr<std::__1::__thread_struct, std::__1::default_delete<std::__1::__thread_struct> >, void (*)(unsigned int), long, 2ul>(__t=size=3, (null)=__tuple_indices<2> @ 0x000070000da04eb8)(unsigned int), long>&, std::__1::__tuple_indices<2ul>) at thread:273:5 frame #5: 0x0000000100001f16 a.out`void* std::__1::__thread_proxy<std::__1::tuple<std::__1::unique_ptr<std::__1::__thread_struct, std::__1::default_delete<std::__1::__thread_struct> >, void (*)(unsigned int), long> >(__vp=0x0000000100400250) at thread:283:5 frame #6: 0x00007fff65f3c33d libsystem_pthread.dylib`_pthread_body + 126 frame #7: 0x00007fff65f3f2a7 libsystem_pthread.dylib`_pthread_start + 70 frame #8: 0x00007fff65f3b425 libsystem_pthread.dylib`thread_start + 13

Hide Details

Hide Details

runCmd: expr unsigned val = g_char_ptr[7]; val output: (unsigned int) $2 = 99

Hide Details

Hide Details

looking at: (unsigned int) $2 = 99

Hide Details

Expecting end string: = 99 Matched

Hide Details

runCmd: watchpoint list -v output: Number of supported hardware watchpoints: 4 Current watchpoints: Watchpoint 1: addr = 0x100400087 size = 1 state = enabled type = w old value: 0x0000000000000063 new value: 0x0000000000000063 hw_index = 0 hit_count = 3 ignore_count = 0

Hide Details

Hide Details

Expecting sub string: hit_count = 3 Matched

Hide Details

runCmd: thread backtrace all output: thread #1, queue = 'com.apple.main-thread' frame #0: 0x00007fff65e8536a libsystem_kernel.dylib`__ulock_wait + 10 frame #1: 0x00007fff65f4070b libsystem_pthread.dylib`_pthread_join + 356 frame #2: 0x00007fff6346a978 libc++.1.dylib`std::__1::thread::join() + 24 frame #3: 0x000000010000127f a.out`main(argc=1, argv=0x00007ffeefbff528) at main.cpp:110:16 frame #4: 0x00007fff65d4a085 libdyld.dylib`start + 1 frame #5: 0x00007fff65d4a085 libdyld.dylib`start + 1 thread #2, stop reason = watchpoint 1 frame #0: 0x0000000100000d92 a.out`do_bad_thing_with_location(index=7, char_ptr="", new_val='c') at main.cpp:36:1 frame #1: 0x0000000100000e4e a.out`access_pool(flag=true) at main.cpp:53:9 frame #2: 0x0000000100000f35 a.out`thread_func(thread_index=0) at main.cpp:80:19 frame #3: 0x00000001000027c4 a.out`decltype(__f=0x00000001004001a8, __args=0x00000001004001b0)(unsigned int)>(fp)(std::__1::forward<long>(fp0))) std::__1::__invoke<void (*)(unsigned int), long>(void (*&&)(unsigned int), long&&) at type_traits:3539:1 frame #4: 0x000000010000270e a.out`void std::__1::__thread_execute<std::__1::unique_ptr<std::__1::__thread_struct, std::__1::default_delete<std::__1::__thread_struct> >, void (*)(unsigned int), long, 2ul>(__t=size=3, (null)=__tuple_indices<2> @ 0x000070000d8feeb8)(unsigned int), long>&, std::__1::__tuple_indices<2ul>) at thread:273:5 frame #5: 0x0000000100001f16 a.out`void* std::__1::__thread_proxy<std::__1::tuple<std::__1::unique_ptr<std::__1::__thread_struct, std::__1::default_delete<std::__1::__thread_struct> >, void (*)(unsigned int), long> >(__vp=0x00000001004001a0) at thread:283:5 frame #6: 0x00007fff65f3c33d libsystem_pthread.dylib`_pthread_body + 126 frame #7: 0x00007fff65f3f2a7 libsystem_pthread.dylib`_pthread_start + 70 frame #8: 0x00007fff65f3b425 libsystem_pthread.dylib`thread_start + 13 thread #3, stop reason = watchpoint 1 frame #0: 0x0000000100000d92 a.out`do_bad_thing_with_location(index=7, char_ptr="", new_val='c') at main.cpp:36:1 frame #1: 0x0000000100000e4e a.out`access_pool(flag=true) at main.cpp:53:9 frame #2: 0x0000000100000f35 a.out`thread_func(thread_index=1) at main.cpp:80:19 frame #3: 0x00000001000027c4 a.out`decltype(__f=0x00000001004001f8, __args=0x0000000100400200)(unsigned int)>(fp)(std::__1::forward<long>(fp0))) std::__1::__invoke<void (*)(unsigned int), long>(void (*&&)(unsigned int), long&&) at type_traits:3539:1 frame #4: 0x000000010000270e a.out`void std::__1::__thread_execute<std::__1::unique_ptr<std::__1::__thread_struct, std::__1::default_delete<std::__1::__thread_struct> >, void (*)(unsigned int), long, 2ul>(__t=size=3, (null)=__tuple_indices<2> @ 0x000070000d981eb8)(unsigned int), long>&, std::__1::__tuple_indices<2ul>) at thread:273:5 frame #5: 0x0000000100001f16 a.out`void* std::__1::__thread_proxy<std::__1::tuple<std::__1::unique_ptr<std::__1::__thread_struct, std::__1::default_delete<std::__1::__thread_struct> >, void (*)(unsigned int), long> >(__vp=0x00000001004001f0) at thread:283:5 frame #6: 0x00007fff65f3c33d libsystem_pthread.dylib`_pthread_body + 126 frame #7: 0x00007fff65f3f2a7 libsystem_pthread.dylib`_pthread_start + 70 frame #8: 0x00007fff65f3b425 libsystem_pthread.dylib`thread_start + 13 * thread #4, stop reason = watchpoint 1 * frame #0: 0x0000000100000d92 a.out`do_bad_thing_with_location(index=7, char_ptr="", new_val='c') at main.cpp:36:1 frame #1: 0x0000000100000e4e a.out`access_pool(flag=true) at main.cpp:53:9 frame #2: 0x0000000100000f35 a.out`thread_func(thread_index=2) at main.cpp:80:19 frame #3: 0x00000001000027c4 a.out`decltype(__f=0x0000000100400258, __args=0x0000000100400260)(unsigned int)>(fp)(std::__1::forward<long>(fp0))) std::__1::__invoke<void (*)(unsigned int), long>(void (*&&)(unsigned int), long&&) at type_traits:3539:1 frame #4: 0x000000010000270e a.out`void std::__1::__thread_execute<std::__1::unique_ptr<std::__1::__thread_struct, std::__1::default_delete<std::__1::__thread_struct> >, void (*)(unsigned int), long, 2ul>(__t=size=3, (null)=__tuple_indices<2> @ 0x000070000da04eb8)(unsigned int), long>&, std::__1::__tuple_indices<2ul>) at thread:273:5 frame #5: 0x0000000100001f16 a.out`void* std::__1::__thread_proxy<std::__1::tuple<std::__1::unique_ptr<std::__1::__thread_struct, std::__1::default_delete<std::__1::__thread_struct> >, void (*)(unsigned int), long> >(__vp=0x0000000100400250) at thread:283:5 frame #6: 0x00007fff65f3c33d libsystem_pthread.dylib`_pthread_body + 126 frame #7: 0x00007fff65f3f2a7 libsystem_pthread.dylib`_pthread_start + 70 frame #8: 0x00007fff65f3b425 libsystem_pthread.dylib`thread_start + 13

Hide Details

Hide Details

<bound method SBProcess.Kill of <lldb.SBProcess; proxy of <Swig Object of type 'lldb::SBProcess *' at 0x10a47a060> >>: success

Hide Details

PASS: LLDB (/Users/buildslave/jenkins/workspace/lldb-cmake-sanitized/lldb-build/bin/clang-10-x86_64) :: test_watchlocation_using_watchpoint_set_dwarf (TestWatchLocationWithWatchSet.WatchLocationUsingWatchpointSetTestCase) UNSUPPORTED: LLDB (/Users/buildslave/jenkins/workspace/lldb-cmake-sanitized/lldb-build/bin/clang-10-x86_64) :: test_watchlocation_using_watchpoint_set_dwo (TestWatchLocationWithWatchSet.WatchLocationUsingWatchpointSetTestCase) (test case does not fall in any category of interest for this run) runCmd: settings set symbols.enable-external-lookup false output:

Hide Details

runCmd: settings set plugin.process.gdb-remote.packet-timeout 60 output:

Hide Details

runCmd: settings set symbols.clang-modules-cache-path "/Users/buildslave/jenkins/workspace/lldb-cmake-sanitized/lldb-build/lldb-test-build.noindex/module-cache-lldb/lldb-api" output:

Hide Details

runCmd: settings set use-color false output:

Hide Details

runCmd: file /Users/buildslave/jenkins/workspace/lldb-cmake-sanitized/lldb-build/lldb-test-build.noindex/commands/watchpoints/watchpoint_set_command/TestWatchLocationWithWatchSet.test_watchlocation_using_watchpoint_set_gmodules/a.out output: Current executable set to '/Users/buildslave/jenkins/workspace/lldb-cmake-sanitized/lldb-build/lldb-test-build.noindex/commands/watchpoints/watchpoint_set_command/TestWatchLocationWithWatchSet.test_watchlocation_using_watchpoint_set_gmodules/a.out' (x86_64).

Hide Details

Hide Details

runCmd: breakpoint set -l 105 output: Breakpoint 1: where = a.out`main + 391 at main.cpp:105:5, address = 0x0000000100001207

Hide Details

Hide Details

Expecting pattern: ^Breakpoint (?P<bpno>[0-9]+): (?P<num_locations>[0-9]+) locations\.$ Not matched

Hide Details

Expecting pattern: ^Breakpoint (?P<bpno>[0-9]+): (?P<num_locations>no) locations \(pending\)\. Not matched

Hide Details

Expecting pattern: ^Breakpoint (?P<bpno>[0-9]+): where = (?P<module>.*)`(?P<symbol>[+\-]{0,1}[^+]+)( \+ (?P<offset>[0-9]+)){0,1}( \[inlined\] (?P<inline_symbol>.*)){0,1} at (?P<file>[^:]+):(?P<line_no>[0-9]+)(?P<column>(:[0-9]+)?), address = (?P<address>0x[0-9a-fA-F]+)$ Matched

Hide Details

runCmd: run output: Process 65417 stopped * thread #1, queue = 'com.apple.main-thread', stop reason = breakpoint 1.1 frame #0: 0x0000000100001207 a.out`main(argc=1, argv=0x00007ffeefbff520) at main.cpp:105:5 102 int c; 103 } MyAggregateDataType; 104 -> 105 printf ("Before turning all three threads loose...\n"); // Set break point at this line. ^ 106 barrier_wait(); 107 108 // Join all of our threads

Hide Details

Process 65417 launched: '/Users/buildslave/jenkins/workspace/lldb-cmake-sanitized/lldb-build/lldb-test-build.noindex/commands/watchpoints/watchpoint_set_command/TestWatchLocationWithWatchSet.test_watchlocation_using_watchpoint_set_gmodules/a.out' (x86_64)

Hide Details

Hide Details

runCmd: thread list output: Process 65417 stopped * thread #1: tid = 0xa26761, 0x0000000100001207 a.out`main(argc=1, argv=0x00007ffeefbff520) at main.cpp:105:5, queue = 'com.apple.main-thread', stop reason = breakpoint 1.1 thread #2: tid = 0xa267b7, 0x00007fff65e861b2 libsystem_kernel.dylib`__psynch_cvwait + 10 thread #3: tid = 0xa267b8, 0x00007fff65e861b2 libsystem_kernel.dylib`__psynch_cvwait + 10 thread #4: tid = 0xa267b9, 0x00007fff65e861b2 libsystem_kernel.dylib`__psynch_cvwait + 10

Hide Details

Hide Details

Expecting sub string: stopped Matched

Hide Details

Expecting sub string: stop reason = breakpoint Matched

Hide Details

runCmd: watchpoint set expression -w write -s 1 -- g_char_ptr + 7 output: Watchpoint created: Watchpoint 1: addr = 0x100200367 size = 1 state = enabled type = w new value: 0x0000001002000000

Hide Details

Hide Details

Expecting sub string: Watchpoint created Matched

Hide Details

Expecting sub string: size = 1 Matched

Hide Details

Expecting sub string: type = w Matched

Hide Details

runCmd: expr unsigned val = g_char_ptr[7]; val output: (unsigned int) $1 = 0

Hide Details

Hide Details

looking at: (unsigned int) $1 = 0

Hide Details

Expecting end string: = 0 Matched

Hide Details

runCmd: watchpoint list -v output: Number of supported hardware watchpoints: 4 Current watchpoints: Watchpoint 1: addr = 0x100200367 size = 1 state = enabled type = w new value: 0x0000001002000000 hw_index = -1 hit_count = 0 ignore_count = 0

Hide Details

Hide Details

Expecting sub string: hit_count = 0 Matched

Hide Details

runCmd: process continue output: Process 65417 resuming Process 65417 stopped * thread #2, stop reason = watchpoint 1 frame #0: 0x0000000100000d92 a.out`do_bad_thing_with_location(index=7, char_ptr="", new_val='c') at main.cpp:36:1 33 unsigned what = new_val; 34 printf("new value written to array(%p) and index(%u) = %u\n", char_ptr, index, what); 35 char_ptr[index] = new_val; -> 36 } ^ 37 38 uint32_t 39 access_pool (bool flag = false) thread #3, stop reason = watchpoint 1 frame #0: 0x0000000100000d92 a.out`do_bad_thing_with_location(index=7, char_ptr="", new_val='c') at main.cpp:36:1 33 unsigned what = new_val; 34 printf("new value written to array(%p) and index(%u) = %u\n", char_ptr, index, what); 35 char_ptr[index] = new_val; -> 36 } ^ 37 38 uint32_t 39 access_pool (bool flag = false) thread #4, stop reason = watchpoint 1 frame #0: 0x0000000100000d92 a.out`do_bad_thing_with_location(index=7, char_ptr="", new_val='c') at main.cpp:36:1 33 unsigned what = new_val; 34 printf("new value written to array(%p) and index(%u) = %u\n", char_ptr, index, what); 35 char_ptr[index] = new_val; -> 36 } ^ 37 38 uint32_t 39 access_pool (bool flag = false)

Hide Details

Hide Details

Hide Details

runCmd: thread list output: Process 65417 stopped thread #1: tid = 0xa26761, 0x00007fff65e8536a libsystem_kernel.dylib`__ulock_wait + 10, queue = 'com.apple.main-thread' * thread #2: tid = 0xa267b7, 0x0000000100000d92 a.out`do_bad_thing_with_location(index=7, char_ptr="", new_val='c') at main.cpp:36:1, stop reason = watchpoint 1 thread #3: tid = 0xa267b8, 0x0000000100000d92 a.out`do_bad_thing_with_location(index=7, char_ptr="", new_val='c') at main.cpp:36:1, stop reason = watchpoint 1 thread #4: tid = 0xa267b9, 0x0000000100000d92 a.out`do_bad_thing_with_location(index=7, char_ptr="", new_val='c') at main.cpp:36:1, stop reason = watchpoint 1

Hide Details

Hide Details

Expecting sub string: stopped Matched

Hide Details

Expecting sub string: stop reason = watchpoint Matched

Hide Details

Expecting sub string: do_bad_thing_with_location Matched

Hide Details

runCmd: thread list output: Process 65417 stopped thread #1: tid = 0xa26761, 0x00007fff65e8536a libsystem_kernel.dylib`__ulock_wait + 10, queue = 'com.apple.main-thread' * thread #2: tid = 0xa267b7, 0x0000000100000d92 a.out`do_bad_thing_with_location(index=7, char_ptr="", new_val='c') at main.cpp:36:1, stop reason = watchpoint 1 thread #3: tid = 0xa267b8, 0x0000000100000d92 a.out`do_bad_thing_with_location(index=7, char_ptr="", new_val='c') at main.cpp:36:1, stop reason = watchpoint 1 thread #4: tid = 0xa267b9, 0x0000000100000d92 a.out`do_bad_thing_with_location(index=7, char_ptr="", new_val='c') at main.cpp:36:1, stop reason = watchpoint 1

Hide Details

Hide Details

runCmd: thread select 2 output:

Hide Details

runCmd: thread select 3 output:

Hide Details

runCmd: thread select 4 output:

Hide Details

runCmd: thread backtrace output: * thread #4, stop reason = watchpoint 1 * frame #0: 0x0000000100000d92 a.out`do_bad_thing_with_location(index=7, char_ptr="", new_val='c') at main.cpp:36:1 frame #1: 0x0000000100000e4e a.out`access_pool(flag=true) at main.cpp:53:9 frame #2: 0x0000000100000f35 a.out`thread_func(thread_index=2) at main.cpp:80:19 frame #3: 0x00000001000027c4 a.out`decltype(__f=0x00000001002024e8, __args=0x00000001002024f0)(unsigned int)>(fp)(std::__1::forward<long>(fp0))) std::__1::__invoke<void (*)(unsigned int), long>(void (*&&)(unsigned int), long&&) at type_traits:3539:1 frame #4: 0x000000010000270e a.out`void std::__1::__thread_execute<std::__1::unique_ptr<std::__1::__thread_struct, std::__1::default_delete<std::__1::__thread_struct> >, void (*)(unsigned int), long, 2ul>(__t=size=3, (null)=__tuple_indices<2> @ 0x0000700006972eb8)(unsigned int), long>&, std::__1::__tuple_indices<2ul>) at thread:273:5 frame #5: 0x0000000100001f16 a.out`void* std::__1::__thread_proxy<std::__1::tuple<std::__1::unique_ptr<std::__1::__thread_struct, std::__1::default_delete<std::__1::__thread_struct> >, void (*)(unsigned int), long> >(__vp=0x00000001002024e0) at thread:283:5 frame #6: 0x00007fff65f3c33d libsystem_pthread.dylib`_pthread_body + 126 frame #7: 0x00007fff65f3f2a7 libsystem_pthread.dylib`_pthread_start + 70 frame #8: 0x00007fff65f3b425 libsystem_pthread.dylib`thread_start + 13

Hide Details

Hide Details

runCmd: expr unsigned val = g_char_ptr[7]; val output: (unsigned int) $2 = 99

Hide Details

Hide Details

looking at: (unsigned int) $2 = 99

Hide Details

Expecting end string: = 99 Matched

Hide Details

runCmd: watchpoint list -v output: Number of supported hardware watchpoints: 4 Current watchpoints: Watchpoint 1: addr = 0x100200367 size = 1 state = enabled type = w old value: 0x0000001002000063 new value: 0x0000001002000063 hw_index = 0 hit_count = 3 ignore_count = 0

Hide Details

Hide Details

Expecting sub string: hit_count = 3 Matched

Hide Details

runCmd: thread backtrace all output: thread #1, queue = 'com.apple.main-thread' frame #0: 0x00007fff65e8536a libsystem_kernel.dylib`__ulock_wait + 10 frame #1: 0x00007fff65f4070b libsystem_pthread.dylib`_pthread_join + 356 frame #2: 0x00007fff6346a978 libc++.1.dylib`std::__1::thread::join() + 24 frame #3: 0x000000010000127f a.out`main(argc=1, argv=0x00007ffeefbff520) at main.cpp:110:16 frame #4: 0x00007fff65d4a085 libdyld.dylib`start + 1 thread #2, stop reason = watchpoint 1 frame #0: 0x0000000100000d92 a.out`do_bad_thing_with_location(index=7, char_ptr="", new_val='c') at main.cpp:36:1 frame #1: 0x0000000100000e4e a.out`access_pool(flag=true) at main.cpp:53:9 frame #2: 0x0000000100000f35 a.out`thread_func(thread_index=0) at main.cpp:80:19 frame #3: 0x00000001000027c4 a.out`decltype(__f=0x0000000100200698, __args=0x00000001002006a0)(unsigned int)>(fp)(std::__1::forward<long>(fp0))) std::__1::__invoke<void (*)(unsigned int), long>(void (*&&)(unsigned int), long&&) at type_traits:3539:1 frame #4: 0x000000010000270e a.out`void std::__1::__thread_execute<std::__1::unique_ptr<std::__1::__thread_struct, std::__1::default_delete<std::__1::__thread_struct> >, void (*)(unsigned int), long, 2ul>(__t=size=3, (null)=__tuple_indices<2> @ 0x000070000686ceb8)(unsigned int), long>&, std::__1::__tuple_indices<2ul>) at thread:273:5 frame #5: 0x0000000100001f16 a.out`void* std::__1::__thread_proxy<std::__1::tuple<std::__1::unique_ptr<std::__1::__thread_struct, std::__1::default_delete<std::__1::__thread_struct> >, void (*)(unsigned int), long> >(__vp=0x0000000100200690) at thread:283:5 frame #6: 0x00007fff65f3c33d libsystem_pthread.dylib`_pthread_body + 126 frame #7: 0x00007fff65f3f2a7 libsystem_pthread.dylib`_pthread_start + 70 frame #8: 0x00007fff65f3b425 libsystem_pthread.dylib`thread_start + 13 thread #3, stop reason = watchpoint 1 frame #0: 0x0000000100000d92 a.out`do_bad_thing_with_location(index=7, char_ptr="", new_val='c') at main.cpp:36:1 frame #1: 0x0000000100000e4e a.out`access_pool(flag=true) at main.cpp:53:9 frame #2: 0x0000000100000f35 a.out`thread_func(thread_index=1) at main.cpp:80:19 frame #3: 0x00000001000027c4 a.out`decltype(__f=0x00000001002023c8, __args=0x00000001002023d0)(unsigned int)>(fp)(std::__1::forward<long>(fp0))) std::__1::__invoke<void (*)(unsigned int), long>(void (*&&)(unsigned int), long&&) at type_traits:3539:1 frame #4: 0x000000010000270e a.out`void std::__1::__thread_execute<std::__1::unique_ptr<std::__1::__thread_struct, std::__1::default_delete<std::__1::__thread_struct> >, void (*)(unsigned int), long, 2ul>(__t=size=3, (null)=__tuple_indices<2> @ 0x00007000068efeb8)(unsigned int), long>&, std::__1::__tuple_indices<2ul>) at thread:273:5 frame #5: 0x0000000100001f16 a.out`void* std::__1::__thread_proxy<std::__1::tuple<std::__1::unique_ptr<std::__1::__thread_struct, std::__1::default_delete<std::__1::__thread_struct> >, void (*)(unsigned int), long> >(__vp=0x00000001002023c0) at thread:283:5 frame #6: 0x00007fff65f3c33d libsystem_pthread.dylib`_pthread_body + 126 frame #7: 0x00007fff65f3f2a7 libsystem_pthread.dylib`_pthread_start + 70 frame #8: 0x00007fff65f3b425 libsystem_pthread.dylib`thread_start + 13 * thread #4, stop reason = watchpoint 1 * frame #0: 0x0000000100000d92 a.out`do_bad_thing_with_location(index=7, char_ptr="", new_val='c') at main.cpp:36:1 frame #1: 0x0000000100000e4e a.out`access_pool(flag=true) at main.cpp:53:9 frame #2: 0x0000000100000f35 a.out`thread_func(thread_index=2) at main.cpp:80:19 frame #3: 0x00000001000027c4 a.out`decltype(__f=0x00000001002024e8, __args=0x00000001002024f0)(unsigned int)>(fp)(std::__1::forward<long>(fp0))) std::__1::__invoke<void (*)(unsigned int), long>(void (*&&)(unsigned int), long&&) at type_traits:3539:1 frame #4: 0x000000010000270e a.out`void std::__1::__thread_execute<std::__1::unique_ptr<std::__1::__thread_struct, std::__1::default_delete<std::__1::__thread_struct> >, void (*)(unsigned int), long, 2ul>(__t=size=3, (null)=__tuple_indices<2> @ 0x0000700006972eb8)(unsigned int), long>&, std::__1::__tuple_indices<2ul>) at thread:273:5 frame #5: 0x0000000100001f16 a.out`void* std::__1::__thread_proxy<std::__1::tuple<std::__1::unique_ptr<std::__1::__thread_struct, std::__1::default_delete<std::__1::__thread_struct> >, void (*)(unsigned int), long> >(__vp=0x00000001002024e0) at thread:283:5 frame #6: 0x00007fff65f3c33d libsystem_pthread.dylib`_pthread_body + 126 frame #7: 0x00007fff65f3f2a7 libsystem_pthread.dylib`_pthread_start + 70 frame #8: 0x00007fff65f3b425 libsystem_pthread.dylib`thread_start + 13

Hide Details

Hide Details

<bound method SBProcess.Kill of <lldb.SBProcess; proxy of <Swig Object of type 'lldb::SBProcess *' at 0x12110c2d0> >>: success

Hide Details

PASS: LLDB (/Users/buildslave/jenkins/workspace/lldb-cmake-sanitized/lldb-build/bin/clang-10-x86_64) :: test_watchlocation_using_watchpoint_set_gmodules (TestWatchLocationWithWatchSet.WatchLocationUsingWatchpointSetTestCase) Restore dir to: /Users/buildslave/jenkins/workspace/lldb-cmake-sanitized/lldb-build/tools/lldb/test ====================================================================== FAIL: test_watchlocation_using_watchpoint_set_dsym (TestWatchLocationWithWatchSet.WatchLocationUsingWatchpointSetTestCase) Test watching a location with 'watchpoint set expression -w write -s size' option. ---------------------------------------------------------------------- Traceback (most recent call last): File "/Users/buildslave/jenkins/workspace/lldb-cmake-sanitized/llvm-project/lldb/packages/Python/lldbsuite/test/lldbtest.py", line 1732, in test_method return attrvalue(self) File "/Users/buildslave/jenkins/workspace/lldb-cmake-sanitized/llvm-project/lldb/packages/Python/lldbsuite/test/decorators.py", line 111, in wrapper func(*args, **kwargs) File "/Users/buildslave/jenkins/workspace/lldb-cmake-sanitized/llvm-project/lldb/packages/Python/lldbsuite/test/decorators.py", line 111, in wrapper func(*args, **kwargs) File "/Users/buildslave/jenkins/workspace/lldb-cmake-sanitized/llvm-project/lldb/packages/Python/lldbsuite/test/commands/watchpoints/watchpoint_set_command/TestWatchLocationWithWatchSet.py", line 69, in test_watchlocation_using_watchpoint_set 'type = w']) File "/Users/buildslave/jenkins/workspace/lldb-cmake-sanitized/llvm-project/lldb/packages/Python/lldbsuite/test/lldbtest.py", line 2302, in expect inHistory=inHistory) File "/Users/buildslave/jenkins/workspace/lldb-cmake-sanitized/llvm-project/lldb/packages/Python/lldbsuite/test/lldbtest.py", line 2061, in runCmd msg if (msg) else CMD_MSG(cmd)) AssertionError: False is not True : Watchpoint created successfully Error output: error: expression evaluation of address to watch failed expression evaluated: g_char_ptr + 7

Hide Details

Config=x86_64-/Users/buildslave/jenkins/workspace/lldb-cmake-sanitized/lldb-build/bin/clang-10 ---------------------------------------------------------------------- Ran 4 tests in 116.649s

Hide Details

RESULT: FAILED (2 passes, 1 failures, 0 errors, 1 skipped, 0 expected failures, 0 unexpected successes)

Hide Details

******************** PASS: lldb-api :: functionalities/thread/concurrent_events/TestConcurrentBreakpointOneDelayBreakpointThreads.py (603 of 1807) UNSUPPORTED: lldb-shell :: Register/x86-64-xmm16-write.test (604 of 1807) PASS: lldb-api :: lang/cpp/dynamic-value/TestDynamicValue.py (605 of 1807) PASS: lldb-unit :: Process/minidump/./LLDBMinidumpTests/MinidumpParserTest.GetArchitecture (606 of 1807) PASS: lldb-api :: python_api/lldbutil/TestSwigVersion.py (607 of 1807) PASS: lldb-api :: functionalities/postmortem/elf-core/gcore/TestGCore.py (608 of 1807) PASS: lldb-api :: commands/frame/diagnose/local-variable/TestLocalVariable.py (609 of 1807) PASS: lldb-shell :: SymbolFile/DWARF/parallel-indexing-stress.s (610 of 1807) PASS: lldb-unit :: Utility/./UtilityTests/UUIDTest.Validity (611 of 1807) PASS: lldb-api :: lang/objc/print-obj/TestPrintObj.py (612 of 1807) PASS: lldb-api :: functionalities/data-formatter/type_summary_list_script/TestTypeSummaryListScript.py (613 of 1807) PASS: lldb-unit :: SymbolFile/DWARF/./SymbolFileDWARFTests/SymbolFileDWARFTests.TestAbbrevValidAttrNullForm (614 of 1807) PASS: lldb-api :: lang/objc/objc-new-syntax/TestObjCNewSyntaxLiteral.py (615 of 1807) PASS: lldb-api :: lang/cpp/gmodules-templates/TestGModules.py (616 of 1807) PASS: lldb-shell :: ObjectFile/ELF/base-address.yaml (617 of 1807) PASS: lldb-unit :: Utility/./UtilityTests/LogChannelTest.List (618 of 1807) PASS: lldb-api :: functionalities/step_scripted/TestStepScripted.py (619 of 1807) PASS: lldb-unit :: Utility/./UtilityTests/StringListTest.JoinMultiCharSeparator (620 of 1807) PASS: lldb-api :: lang/cpp/operator-overload/TestOperatorOverload.py (621 of 1807) PASS: lldb-api :: functionalities/data-formatter/synthcapping/TestSyntheticCapping.py (622 of 1807) PASS: lldb-api :: commands/platform/basic/TestPlatformPython.py (623 of 1807) PASS: lldb-shell :: Breakpoint/split-dwarf5-debug-stroffsets.test (624 of 1807) UNSUPPORTED: lldb-api :: commands/expression/call-restarts/TestCallThatRestarts.py (625 of 1807) PASS: lldb-api :: python_api/rdar-12481949/Test-rdar-12481949.py (626 of 1807) PASS: lldb-unit :: SymbolFile/DWARF/./SymbolFileDWARFTests/SymbolFileDWARFTests.TestAbbrevNullAttrValidForm (627 of 1807) PASS: lldb-unit :: Utility/./UtilityTests/ArgsTest.TestArgv (628 of 1807) PASS: lldb-unit :: Host/./HostTests/SocketTest.DomainGetConnectURI (629 of 1807) UNSUPPORTED: lldb-api :: functionalities/asan/TestReportData.py (630 of 1807) PASS: lldb-api :: lang/c/tls_globals/TestTlsGlobals.py (631 of 1807) PASS: lldb-api :: tools/lldb-vscode/breakpoint/TestVSCode_setExceptionBreakpoints.py (632 of 1807) PASS: lldb-unit :: Utility/./UtilityTests/StatusTest.Formatv (633 of 1807) PASS: lldb-api :: functionalities/param_entry_vals/basic_entry_values_x86_64/TestBasicEntryValuesX86_64.py (634 of 1807) PASS: lldb-api :: commands/platform/process/TestProcessList.py (635 of 1807) PASS: lldb-api :: functionalities/data-formatter/data-formatter-objc/nsstring/TestDataFormatterNSString.py (636 of 1807) PASS: lldb-unit :: Utility/./UtilityTests/StringListTest.AppendList (637 of 1807) PASS: lldb-api :: macosx/find-dsym/bundle-with-dot-in-filename/TestBundleWithDotInFilename.py (638 of 1807) PASS: lldb-unit :: Language/Highlighting/./HighlighterTests/HighlighterTest.ClangCursorPos (639 of 1807) PASS: lldb-unit :: Utility/./UtilityTests/NameMatchesTest.Ignore (640 of 1807) PASS: lldb-unit :: Utility/./UtilityTests/RangeTest.EqualInvalid (641 of 1807) PASS: lldb-shell :: Heap/heap-cstr.test (642 of 1807) PASS: lldb-shell :: Driver/TestCore.test (643 of 1807) PASS: lldb-api :: macosx/DBGSourcePathRemapping/TestDSYMSourcePathRemapping.py (644 of 1807) PASS: lldb-unit :: Utility/./UtilityTests/RecordReplayTest.InstrumentedFoo (645 of 1807) PASS: lldb-api :: commands/expression/po_verbosity/TestPoVerbosity.py (646 of 1807) PASS: lldb-api :: functionalities/gdb_remote_client/TestNoWatchpointSupportInfo.py (647 of 1807) PASS: lldb-api :: functionalities/breakpoint/require_hw_breakpoints/TestRequireHWBreakpoints.py (648 of 1807) PASS: lldb-api :: lang/cpp/signed_types/TestSignedTypes.py (649 of 1807) PASS: lldb-api :: python_api/default-constructor/TestDefaultConstructorForAPIObjects.py (650 of 1807) PASS: lldb-api :: commands/process/attach/attach_denied/TestAttachDenied.py (651 of 1807) PASS: lldb-unit :: Expression/./ExpressionTests/CppModuleConfigurationTest.Xcode (652 of 1807) PASS: lldb-unit :: Language/CPlusPlus/./LanguageCPlusPlusTests/CPlusPlusLanguage.FindAlternateFunctionManglings (653 of 1807) PASS: lldb-unit :: Utility/./UtilityTests/UriParserTest.SchemeHostSeparator2 (654 of 1807) PASS: lldb-api :: lang/cpp/call-function/TestCallCPPFunction.py (655 of 1807) PASS: lldb-api :: lang/objc/objc-ivar-protocols/TestIvarProtocols.py (656 of 1807) PASS: lldb-unit :: Language/Highlighting/./HighlighterTests/HighlighterTest.ClangCursorPosAfterOtherToken (657 of 1807) PASS: lldb-api :: functionalities/tail_call_frames/inlining_and_tail_calls/TestInliningAndTailCalls.py (658 of 1807) PASS: lldb-api :: functionalities/gdb_remote_client/TestThreadSelectionBug.py (659 of 1807) PASS: lldb-unit :: Utility/./UtilityTests/DeserializerTest.HasData (660 of 1807) PASS: lldb-shell :: SymbolFile/NativePDB/function-types-calling-conv.cpp (661 of 1807) PASS: lldb-unit :: Process/gdb-remote/./ProcessGdbRemoteTests/GDBRemoteCommunicationClientTest.SendStartTracePacket (662 of 1807) PASS: lldb-api :: tools/lldb-server/TestGdbRemoteHostInfo.py (663 of 1807) UNSUPPORTED: lldb-shell :: SymbolFile/PDB/enums-layout.test (664 of 1807) PASS: lldb-unit :: Utility/./UtilityTests/StreamTest.ChangingByteOrder (665 of 1807) PASS: lldb-api :: functionalities/breakpoint/breakpoint_ignore_count/TestBreakpointIgnoreCount.py (666 of 1807) PASS: lldb-unit :: Language/Highlighting/./HighlighterTests/HighlighterTest.ClangCursorPosInOtherToken (667 of 1807) PASS: lldb-api :: commands/frame/select/TestFrameSelect.py (668 of 1807) PASS: lldb-unit :: Utility/./UtilityTests/StringListTest.AppendStringCString (669 of 1807) PASS: lldb-shell :: Breakpoint/debug_rnglist_offset_pair.test (670 of 1807) PASS: lldb-api :: functionalities/data-formatter/dump_dynamic/TestDumpDynamic.py (671 of 1807) PASS: lldb-api :: lang/cpp/virtual/TestVirtual.py (672 of 1807) PASS: lldb-unit :: UnwindAssembly/x86/./UnwindAssemblyx86Tests/Testx86AssemblyInspectionEngine.TestReturnDetect (673 of 1807) PASS: lldb-api :: functionalities/breakpoint/breakpoint_ids/TestBreakpointIDs.py (674 of 1807) PASS: lldb-unit :: Utility/./UtilityTests/ConstStringTest.CompareStringRef (675 of 1807) UNSUPPORTED: lldb-shell :: SymbolFile/PDB/vbases.test (676 of 1807) PASS: lldb-unit :: SymbolFile/NativePDB/./SymbolFileNativePDBTests/PDBFPOProgramToDWARFExpressionTests.SingleAssignmentRegisterRef (677 of 1807) UNSUPPORTED: lldb-api :: commands/gui/basic/TestGuiBasic.py (678 of 1807) PASS: lldb-api :: macosx/thread-names/TestInterruptThreadNames.py (679 of 1807) UNSUPPORTED: lldb-shell :: SymbolFile/PDB/function-nested-block.test (680 of 1807) PASS: lldb-api :: functionalities/thread/thread_exit/TestThreadExit.py (681 of 1807) PASS: lldb-unit :: Utility/./UtilityTests/RangeTest.Slide (682 of 1807) PASS: lldb-shell :: SymbolFile/DWARF/find-method.cpp (683 of 1807) PASS: lldb-shell :: ObjectFile/PECOFF/basic-info-arm64.yaml (684 of 1807) PASS: lldb-api :: commands/expression/call-function/TestCallStdStringFunction.py (685 of 1807) PASS: lldb-unit :: Utility/./UtilityTests/StringListTest.SplitIntoLinesEmpty (686 of 1807) PASS: lldb-api :: python_api/target/TestTargetAPI.py (687 of 1807) PASS: lldb-unit :: Utility/./UtilityTests/RangeDataVector.FindEntryThatContains (688 of 1807) PASS: lldb-api :: python_api/sbstructureddata/TestStructuredDataAPI.py (689 of 1807) PASS: lldb-unit :: SymbolFile/DWARF/./SymbolFileDWARFTests/SymbolFileDWARFTests.TestAbbrevInvalidNULLTag (690 of 1807) PASS: lldb-unit :: Utility/./UtilityTests/VMRange.SetEndAddress (691 of 1807) UNSUPPORTED: lldb-shell :: Expr/TestIRMemoryMapWindows.test (692 of 1807) PASS: lldb-unit :: Utility/./UtilityTests/ListenerTest.GetEventImmediate (693 of 1807) PASS: lldb-unit :: Utility/./UtilityTests/OptionsWithRawTest.ArgsButNoDelimiter (694 of 1807) PASS: lldb-unit :: Expression/./ExpressionTests/CppModuleConfigurationTest.MissingUsrInclude (695 of 1807) PASS: lldb-api :: functionalities/breakpoint/breakpoint_names/TestBreakpointNames.py (696 of 1807) PASS: lldb-api :: commands/platform/basic/TestPlatformCommand.py (697 of 1807) PASS: lldb-api :: functionalities/tail_call_frames/unambiguous_sequence/TestUnambiguousTailCalls.py (698 of 1807) PASS: lldb-api :: commands/expression/fixits/TestFixIts.py (699 of 1807) PASS: lldb-shell :: SymbolFile/DWARF/debug-types-signature-loop.s (700 of 1807) PASS: lldb-unit :: UnwindAssembly/x86/./UnwindAssemblyx86Tests/Testx86AssemblyInspectionEngine.TestPushEBX (701 of 1807) PASS: lldb-unit :: Expression/./ExpressionTests/CppModuleConfigurationTest.IgnoreLibStdCpp (702 of 1807) PASS: lldb-api :: tools/lldb-server/TestGdbRemote_vCont.py (703 of 1807) PASS: lldb-unit :: Symbol/./SymbolTests/SymbolsTest.TerminateLocateExecutableSymbolFileForUnknownExecutableAndUnknownSymbolFile (704 of 1807) PASS: lldb-unit :: SymbolFile/NativePDB/./SymbolFileNativePDBTests/PDBFPOProgramToDWARFExpressionTests.DependencyChain (705 of 1807) PASS: lldb-api :: functionalities/unwind/sigtramp/TestSigtrampUnwind.py (706 of 1807) PASS: lldb-api :: lang/objc/objc-builtin-types/TestObjCBuiltinTypes.py (707 of 1807) PASS: lldb-shell :: ObjectFile/ELF/PT_LOAD-overlap-section.yaml (708 of 1807) PASS: lldb-unit :: Utility/./UtilityTests/RangeTest.ClearWithStarAddress (709 of 1807) PASS: lldb-unit :: UnwindAssembly/x86/./UnwindAssemblyx86Tests/Testx86AssemblyInspectionEngine.Test32BitOnlyInstruction (710 of 1807) PASS: lldb-unit :: debugserver/./debugserverTests/RNBSocket.AnyListen (711 of 1807) PASS: lldb-api :: commands/expression/import-std-module/stack/TestStack.py (712 of 1807) PASS: lldb-shell :: Driver/LocalLLDBInit.test (713 of 1807) PASS: lldb-unit :: Host/./HostTests/NativeProcessProtocolTest.SetBreakpointFailVerify (714 of 1807) PASS: lldb-shell :: Reproducer/TestSynchronous.test (715 of 1807) PASS: lldb-api :: lang/cpp/namespace_definitions/TestNamespaceDefinitions.py (716 of 1807) PASS: lldb-unit :: Utility/./UtilityTests/OptionsWithRawTest.UnterminatedQuote (717 of 1807) PASS: lldb-api :: tools/lldb-vscode/breakpoint/TestVSCode_setBreakpoints.py (718 of 1807) PASS: lldb-unit :: Utility/./UtilityTests/StatusTest.ErrorConversion (719 of 1807) PASS: lldb-unit :: Symbol/./SymbolTests/PostfixExpression.ToDWARF (720 of 1807) PASS: lldb-api :: lang/objc/modules-inline-functions/TestModulesInlineFunctions.py (721 of 1807) PASS: lldb-unit :: Utility/./UtilityTests/StreamTest.ShiftOperatorChars (722 of 1807) PASS: lldb-unit :: Utility/./UtilityTests/EnvironmentTest.EnvpConversion (723 of 1807) PASS: lldb-unit :: UnwindAssembly/x86/./UnwindAssemblyx86Tests/Testx86AssemblyInspectionEngine.TestPopR15 (724 of 1807) PASS: lldb-api :: functionalities/data-formatter/data-formatter-stl/libcxx/iterator/TestDataFormatterLibccIterator.py (725 of 1807) PASS: lldb-unit :: Utility/./UtilityTests/GeneratorTest.Get (726 of 1807) PASS: lldb-shell :: SymbolFile/Breakpad/unwind-via-raSearch.test (727 of 1807) PASS: lldb-shell :: SymbolFile/DWARF/find-basic-variable.cpp (728 of 1807) PASS: lldb-unit :: Process/minidump/./LLDBMinidumpTests/MinidumpParserTest.GetPidWindows (729 of 1807) PASS: lldb-unit :: UnwindAssembly/x86/./UnwindAssemblyx86Tests/Testx86AssemblyInspectionEngine.TestPopEBP (730 of 1807) PASS: lldb-unit :: Target/./TargetTests/ModuleCacheTest.GetAndPut (731 of 1807) PASS: lldb-unit :: Utility/./UtilityTests/StringListTest.SplitIntoLines (732 of 1807) PASS: lldb-unit :: Core/./LLDBCoreTests/RichManglingContextTest.Basic (733 of 1807) PASS: lldb-unit :: Language/Highlighting/./HighlighterTests/HighlighterTest.DefaultHighlighterWithCursor (734 of 1807) PASS: lldb-api :: functionalities/thread/concurrent_events/TestConcurrentManyCrash.py (735 of 1807) PASS: lldb-unit :: Utility/./UtilityTests/VMRange.Reset (736 of 1807) PASS: lldb-api :: types/TestFloatTypesExpr.py (737 of 1807) PASS: lldb-api :: functionalities/data-formatter/data-formatter-stl/libcxx/string/TestDataFormatterLibcxxString.py (738 of 1807) PASS: lldb-unit :: UnwindAssembly/x86/./UnwindAssemblyx86Tests/Testx86AssemblyInspectionEngine.TestPopR14 (739 of 1807) PASS: lldb-unit :: Host/./HostTests/TaskPoolTest.RunTasks (740 of 1807) PASS: lldb-unit :: Process/minidump/./LLDBMinidumpTests/MinidumpParserTest.GetMiscInfo_no_stream (741 of 1807) PASS: lldb-unit :: Signals/./SignalsTests/UnixSignalsTest.GetInfo (742 of 1807) PASS: lldb-api :: lang/objc/objc-super/TestObjCSuper.py (743 of 1807) PASS: lldb-api :: commands/frame/diagnose/dereference-function-return/TestDiagnoseDereferenceFunctionReturn.py (744 of 1807) PASS: lldb-api :: tools/lldb-vscode/attach/TestVSCode_attach.py (745 of 1807) PASS: lldb-unit :: Utility/./UtilityTests/StringExtractorTest.GetHexBytesAvail_FullString (746 of 1807) PASS: lldb-unit :: Utility/./UtilityTests/Flags.AllClear (747 of 1807) PASS: lldb-api :: lang/objc/objc-optimized/TestObjcOptimized.py (748 of 1807) PASS: lldb-api :: functionalities/breakpoint/breakpoint_set_restart/TestBreakpointSetRestart.py (749 of 1807) PASS: lldb-unit :: Host/./HostTests/SocketTest.UDPGetConnectURI (750 of 1807) PASS: lldb-unit :: UnwindAssembly/x86/./UnwindAssemblyx86Tests/Testx86AssemblyInspectionEngine.TestPopR12 (751 of 1807) PASS: lldb-api :: functionalities/data-formatter/ostypeformatting/TestFormattersOsType.py (752 of 1807) PASS: lldb-unit :: Target/./TargetTests/ExecutionContextTest.GetByteOrderTarget (753 of 1807) UNSUPPORTED: lldb-shell :: SymbolFile/target-symbols-add-unwind.test (754 of 1807) UNSUPPORTED: lldb-api :: functionalities/data-formatter/data-formatter-stl/libstdcpp/vbool/TestDataFormatterStdVBool.py (755 of 1807) PASS: lldb-api :: commands/expression/argument_passing_restrictions/TestArgumentPassingRestrictions.py (756 of 1807) PASS: lldb-api :: commands/expression/diagnostics/TestExprDiagnostics.py (757 of 1807) UNSUPPORTED: lldb-api :: functionalities/darwin_log/filter/exact_match/message/TestDarwinLogFilterMatchMessage.py (758 of 1807) PASS: lldb-api :: lang/cpp/offsetof/TestOffsetofCpp.py (759 of 1807) PASS: lldb-api :: commands/expression/test/TestExprs2.py (760 of 1807) PASS: lldb-api :: functionalities/breakpoint/inlined_breakpoints/TestInlinedBreakpoints.py (761 of 1807) PASS: lldb-unit :: Language/Highlighting/./HighlighterTests/HighlighterTest.ClangEmptyInput (762 of 1807) UNSUPPORTED: lldb-api :: functionalities/darwin_log/filter/regex/activity/TestDarwinLogFilterRegexActivity.py (763 of 1807) UNSUPPORTED: lldb-api :: commands/watchpoints/variable_out_of_scope/TestWatchedVarHitWhenInScope.py (764 of 1807) PASS: lldb-api :: lang/objc/objc-checker/TestObjCCheckers.py (765 of 1807) PASS: lldb-shell :: Unwind/eh-frame-dwarf-unwind.test (766 of 1807) PASS: lldb-api :: commands/expression/save_jit_objects/TestSaveJITObjects.py (767 of 1807) PASS: lldb-api :: functionalities/data-formatter/data-formatter-stl/libcxx/atomic/TestLibCxxAtomic.py (768 of 1807) PASS: lldb-unit :: Expression/./ExpressionTests/DiagnosticManagerTest.GetStringPreserveOrder (769 of 1807) PASS: lldb-unit :: Utility/./UtilityTests/StringExtractorTest.GetU32BigEndian (770 of 1807) PASS: lldb-unit :: Utility/./UtilityTests/BinaryStreamTest.PutULEB128EightBytes (771 of 1807) TIMEOUT: lldb-api :: types/TestIntegerTypesExpr.py (772 of 1807) ******************** TEST 'lldb-api :: types/TestIntegerTypesExpr.py' FAILED ******************** Reached timeout of 1200 seconds ******************** PASS: lldb-unit :: Host/./HostTests/FileSystemTest.OpenErrno (773 of 1807) PASS: lldb-unit :: Process/gdb-remote/./ProcessGdbRemoteTests/GDBRemoteCommunicationClientTest.SaveRestoreRegistersNoSuffix (774 of 1807) PASS: lldb-api :: lang/objc/modules-incomplete/TestIncompleteModules.py (775 of 1807) PASS: lldb-unit :: Host/./HostTests/MainLoopTest.DetectsEOF (776 of 1807) PASS: lldb-shell :: SymbolFile/NativePDB/function-types-classes.cpp (777 of 1807) PASS: lldb-unit :: Utility/./UtilityTests/IndexToObjectTest.ObjectForIndex (778 of 1807) PASS: lldb-api :: lang/objc/self/TestObjCSelf.py (779 of 1807) PASS: lldb-api :: python_api/disassemble-raw-data/TestDisassembleRawData.py (780 of 1807) PASS: lldb-api :: commands/expression/weak_symbols/TestWeakSymbols.py (781 of 1807) PASS: lldb-unit :: ObjectFile/ELF/./ObjectFileELFTests/ObjectFileELFTest.GetModuleSpecifications_EarlySectionHeaders (782 of 1807) PASS: lldb-unit :: ScriptInterpreter/Python/./ScriptInterpreterPythonTests/PythonDataObjectsTest.TestGlobalNameResolutionNoDot (783 of 1807) PASS: lldb-unit :: Process/gdb-remote/./ProcessGdbRemoteTests/GDBRemoteCommunicationClientTest.GetModulesInfo_UUID20 (784 of 1807) PASS: lldb-unit :: SymbolFile/NativePDB/./SymbolFileNativePDBTests/PDBFPOProgramToDWARFExpressionTests.InvalidAssignmentSingle (785 of 1807) PASS: lldb-shell :: Commands/command-backtrace.test (786 of 1807) UNSUPPORTED: lldb-api :: linux/sepdebugsymlink/TestTargetSymbolsSepDebugSymlink.py (787 of 1807) PASS: lldb-shell :: Breakpoint/split-dwarf-5-addrbase.test (788 of 1807) PASS: lldb-api :: commands/expression/function_template_specialization_temp_args/TestFunctionTemplateSpecializationTempArgs.py (789 of 1807) PASS: lldb-shell :: SymbolFile/NativePDB/disassembly.cpp (790 of 1807) PASS: lldb-api :: functionalities/object-file/TestImageListMultiArchitecture.py (791 of 1807) PASS: lldb-unit :: ObjectFile/ELF/./ObjectFileELFTests/ObjectFileELFTest.GetSymtab_NoSymEntryPointArmThumbAddressClass (792 of 1807) PASS: lldb-unit :: Host/./HostTests/FileSystemTest.GetByteSize (793 of 1807) PASS: lldb-unit :: Target/./TargetTests/ExecutionContextTest.GetByteOrder (794 of 1807) PASS: lldb-api :: functionalities/process_group/TestChangeProcessGroup.py (795 of 1807) PASS: lldb-api :: functionalities/data-formatter/data-formatter-stl/libcxx/multiset/TestDataFormatterLibcxxMultiSet.py (796 of 1807) PASS: lldb-unit :: UnwindAssembly/x86/./UnwindAssemblyx86Tests/Testx86AssemblyInspectionEngine.TestPushESI (797 of 1807) PASS: lldb-unit :: Utility/./UtilityTests/RangeTest.SlideZero (798 of 1807) PASS: lldb-shell :: ObjectFile/PECOFF/uuid.yaml (799 of 1807) PASS: lldb-unit :: Utility/./UtilityTests/OptionsWithRawTest.EmptySuffixSingleWhitespace (800 of 1807) PASS: lldb-api :: commands/expression/static-initializers/TestStaticInitializers.py (801 of 1807) PASS: lldb-api :: python_api/watchpoint/watchlocation/TestSetWatchlocation.py (802 of 1807) PASS: lldb-unit :: UnwindAssembly/x86/./UnwindAssemblyx86Tests/Testx86AssemblyInspectionEngine.TestStackRealign8BitDisp_i386 (803 of 1807) PASS: lldb-shell :: ObjectFile/Breakpad/sections.test (804 of 1807) PASS: lldb-unit :: SymbolFile/DWARF/./SymbolFileDWARFTests/DWARFASTParserClangTests.EnsureAllDIEsInDeclContextHaveBeenParsedParsesOnlyMatchingEntries (805 of 1807) PASS: lldb-api :: python_api/watchpoint/TestWatchpointIter.py (806 of 1807) PASS: lldb-shell :: ObjectFile/ELF/minidebuginfo-find-symbols.yaml (807 of 1807) UNSUPPORTED: lldb-shell :: SymbolFile/DWARF/debug-types-expressions.test (808 of 1807) PASS: lldb-unit :: Target/./TargetTests/PathMappingListTest.RelativeTests (809 of 1807) PASS: lldb-unit :: Process/minidump/./LLDBMinidumpTests/RegisterContextMinidump.ConvertMinidumpContext_x86_32 (810 of 1807) PASS: lldb-unit :: Utility/./UtilityTests/ArchSpecTest.OperatorBool (811 of 1807) PASS: lldb-unit :: Utility/./UtilityTests/ReproducerTest.SetCapture (812 of 1807) PASS: lldb-unit :: Host/./HostTests/ConnectionFileDescriptorTest.TCPGetURIv4 (813 of 1807) PASS: lldb-api :: python_api/value/change_values/TestChangeValueAPI.py (814 of 1807) PASS: lldb-unit :: Utility/./UtilityTests/UriParserTest.BracketedHostnamePort (815 of 1807) PASS: lldb-shell :: SymbolFile/Breakpad/unwind-via-stack-cfi.test (816 of 1807) PASS: lldb-unit :: Utility/./UtilityTests/StreamTest.PutHex16ByteOrderLittle (817 of 1807) PASS: lldb-unit :: Utility/./UtilityTests/StreamTest.PutCharNull (818 of 1807) PASS: lldb-api :: lang/mixed/TestMixedLanguages.py (819 of 1807) PASS: lldb-unit :: Utility/./UtilityTests/ArgsTest.TestQuotedTrailingBackslash (820 of 1807) PASS: lldb-api :: functionalities/return-value/TestReturnValue.py (821 of 1807) PASS: lldb-unit :: Utility/./UtilityTests/UriParserTest.TypicalPortPath (822 of 1807) PASS: lldb-unit :: Process/minidump/./LLDBMinidumpTests/MinidumpParserTest.GetMemoryRegionInfoLinuxMaps (823 of 1807) PASS: lldb-unit :: Process/gdb-remote/./ProcessGdbRemoteTests/GDBRemoteCommunicationClientTest.SendGetMetaDataPacket (824 of 1807) PASS: lldb-unit :: Utility/./UtilityTests/OptionsWithRawTest.SingleWhitespaceInput (825 of 1807) PASS: lldb-unit :: Utility/./UtilityTests/StreamTest.PutBytesAsRawHex8ToBigEndian (826 of 1807) UNSUPPORTED: lldb-shell :: Register/x86-64-gp-write.test (827 of 1807) PASS: lldb-unit :: Language/Highlighting/./HighlighterTests/HighlighterTest.ClangCursorPosEndOfLine (828 of 1807) PASS: lldb-shell :: SymbolFile/DWARF/dwarf5-partial-index.cpp (829 of 1807) PASS: lldb-unit :: debugserver/./debugserverTests/RNBSocket.LoopBackConnectIPv4 (830 of 1807) PASS: lldb-api :: functionalities/memory/find/TestMemoryFind.py (831 of 1807) PASS: lldb-api :: lang/cpp/std-function-step-into-callable/TestStdFunctionStepIntoCallable.py (832 of 1807) PASS: lldb-shell :: Expr/TestTypeOfDeclTypeExpr.test (833 of 1807) PASS: lldb-api :: functionalities/postmortem/netbsd-core/TestNetBSDCore.py (834 of 1807) PASS: lldb-unit :: ObjectFile/Breakpad/./ObjectFileBreakpadTests/StackWinRecord.parse (835 of 1807) PASS: lldb-api :: commands/expression/call-function/TestCallUserDefinedFunction.py (836 of 1807) PASS: lldb-shell :: Reproducer/TestWorkingDir.test (837 of 1807) PASS: lldb-shell :: SymbolFile/DWARF/array-sizes.s (838 of 1807) PASS: lldb-api :: lang/objc/objc-struct-return/TestObjCStructReturn.py (839 of 1807) PASS: lldb-api :: functionalities/gdb_remote_client/TestNestedRegDefinitions.py (840 of 1807) PASS: lldb-api :: tools/lldb-vscode/step/TestVSCode_step.py (841 of 1807) PASS: lldb-shell :: SymbolFile/Breakpad/symtab-macho.test (842 of 1807) PASS: lldb-unit :: Utility/./UtilityTests/RecordReplayTest.InstrumentedFooSameThis (843 of 1807) PASS: lldb-api :: functionalities/thread/concurrent_events/TestConcurrentWatchBreak.py (844 of 1807) PASS: lldb-unit :: Utility/./UtilityTests/CompletionRequest.DuplicateFilteringWithComments (845 of 1807) PASS: lldb-shell :: Minidump/dump-all.test (846 of 1807) PASS: lldb-api :: commands/disassemble/basic/TestDisassembleBreakpoint.py (847 of 1807) PASS: lldb-unit :: Process/minidump/./LLDBMinidumpTests/MinidumpParserTest.GetPid (848 of 1807) PASS: lldb-unit :: Utility/./UtilityTests/StringExtractorTest.GetHexBytes_Underflow (849 of 1807) PASS: lldb-unit :: Utility/./UtilityTests/StreamTest.PutMaxHex64ByteOrderLittle (850 of 1807) PASS: lldb-unit :: Utility/./UtilityTests/AnsiTerminal.Twice (851 of 1807) PASS: lldb-api :: lang/c/const_variables/TestConstVariables.py (852 of 1807) PASS: lldb-api :: python_api/frame/get-variables/TestGetVariables.py (853 of 1807) PASS: lldb-api :: tools/lldb-server/inferior-crash/TestGdbRemoteAbort.py (854 of 1807) PASS: lldb-unit :: Utility/./UtilityTests/StringListTest.ForRange (855 of 1807) PASS: lldb-api :: commands/expression/expr-in-syscall/TestExpressionInSyscall.py (856 of 1807) PASS: lldb-api :: functionalities/data-formatter/data-formatter-stl/libcxx/queue/TestDataFormatterLibcxxQueue.py (857 of 1807) PASS: lldb-unit :: Utility/./UtilityTests/StringLexerTest.Peek (858 of 1807) PASS: lldb-api :: commands/expression/ir-interpreter/TestIRInterpreter.py (859 of 1807) PASS: lldb-unit :: Host/./HostTests/NativeProcessProtocolTest.SetBreakpointFailRead (860 of 1807) PASS: lldb-api :: python_api/process/TestProcessAPI.py (861 of 1807) PASS: lldb-api :: commands/expression/import-std-module/vector-basic/TestBasicVector.py (862 of 1807) PASS: lldb-unit :: Utility/./UtilityTests/StringExtractorTest.GetHexBytesAvail_OddPair2 (863 of 1807) PASS: lldb-unit :: ScriptInterpreter/Python/./ScriptInterpreterPythonTests/PythonDataObjectsTest.TestPythonListManipulation (864 of 1807) PASS: lldb-unit :: Utility/./UtilityTests/StreamTeeTest.DefaultConstructor (865 of 1807) PASS: lldb-api :: functionalities/data-formatter/data-formatter-objc/TestDataFormatterObjCExpr.py (866 of 1807) PASS: lldb-unit :: ScriptInterpreter/Python/./ScriptInterpreterPythonTests/PythonDataObjectsTest.TestPythonTupleToStructuredList (867 of 1807) PASS: lldb-unit :: Utility/./UtilityTests/ArgsTest.ReplaceArgumentAtIndexFarOutOfRange (868 of 1807) PASS: lldb-api :: commands/frame/var/TestFrameVar.py (869 of 1807) PASS: lldb-unit :: Language/Highlighting/./HighlighterTests/HighlighterTest.Keywords (870 of 1807) PASS: lldb-unit :: Host/./HostTests/SocketTest.TCPListen0ConnectAccept (871 of 1807) UNSUPPORTED: lldb-shell :: Register/x86-64-zmm-write.test (872 of 1807) PASS: lldb-shell :: SymbolFile/Breakpad/line-table.test (873 of 1807) PASS: lldb-api :: commands/expression/import-std-module/weak_ptr/TestWeakPtr.py (874 of 1807) PASS: lldb-shell :: ObjectFile/ELF/build-id-case.yaml (875 of 1807) PASS: lldb-api :: functionalities/data-formatter/varscript_formatting/TestDataFormatterVarScriptFormatting.py (876 of 1807) PASS: lldb-api :: lang/objc/single-entry-dictionary/TestObjCSingleEntryDictionary.py (877 of 1807) PASS: lldb-shell :: ObjectFile/ELF/PT_LOAD-overlap.yaml (878 of 1807) PASS: lldb-shell :: ObjectFile/Breakpad/uuid-matching-mac.test (879 of 1807) PASS: lldb-api :: functionalities/thread/concurrent_events/TestConcurrentSignalDelayBreak.py (880 of 1807) PASS: lldb-api :: lang/cpp/enum_types/TestCPP11EnumTypes.py (881 of 1807) PASS: lldb-api :: lang/objc/objc-static-method/TestObjCStaticMethod.py (882 of 1807) PASS: lldb-shell :: Driver/TestConvenienceVariables.test (883 of 1807) PASS: lldb-unit :: Utility/./UtilityTests/NameMatchesTest.Contains (884 of 1807) PASS: lldb-unit :: Host/./HostTests/FileSystemTest.MakeAbsolute (885 of 1807) PASS: lldb-unit :: Symbol/./SymbolTests/TestClangASTContext.TemplateArguments (886 of 1807) PASS: lldb-unit :: Target/./TargetTests/PathMappingListTest.AbsoluteTests (887 of 1807) PASS: lldb-api :: functionalities/thread/exit_during_step/TestExitDuringStep.py (888 of 1807) PASS: lldb-unit :: Breakpoint/./LLDBBreakpointTests/BreakpointIDTest.StringIsBreakpointName (889 of 1807) PASS: lldb-unit :: ScriptInterpreter/Python/./ScriptInterpreterPythonTests/PythonDataObjectsTest.TestResetting (890 of 1807) PASS: lldb-api :: lang/objc/objc-new-syntax/TestObjCNewSyntaxDictionary.py (891 of 1807) PASS: lldb-unit :: Utility/./UtilityTests/CompletionRequest.DuplicateFiltering (892 of 1807) PASS: lldb-unit :: Utility/./UtilityTests/ArchSpecTest.TestParseMachCPUDashSubtypeTripleExtra (893 of 1807) PASS: lldb-unit :: Utility/./UtilityTests/StringListTest.AppendStringMove (894 of 1807) PASS: lldb-api :: functionalities/wrong_commands/TestWrongCommands.py (895 of 1807) PASS: lldb-api :: lang/cpp/breakpoint_in_member_func_w_non_primitive_params/TestBreakpointInMemberFuncWNonPrimitiveParams.py (896 of 1807) PASS: lldb-unit :: Utility/./UtilityTests/RangeTest.LessThan (897 of 1807) PASS: lldb-unit :: Process/minidump/./LLDBMinidumpTests/MinidumpParserTest.InvalidMinidump (898 of 1807) PASS: lldb-unit :: Language/Highlighting/./HighlighterTests/HighlighterTest.ClangPreserveNewLine (899 of 1807) UNSUPPORTED: lldb-api :: python_api/disassemble-raw-data/TestDisassemble_VST1_64.py (900 of 1807) PASS: lldb-unit :: Expression/./ExpressionTests/DiagnosticManagerTest.FixedExpression (901 of 1807) PASS: lldb-api :: functionalities/gdb_remote_client/TestWriteMemory.py (902 of 1807) PASS: lldb-unit :: ObjectFile/ELF/./ObjectFileELFTests/ObjectFileELFTest.GetSymtab_NoSymEntryPointArmAddressClass (903 of 1807) PASS: lldb-unit :: Utility/./UtilityTests/StringExtractorTest.GetHexU8_Extra_NoEof (904 of 1807) PASS: lldb-unit :: Signals/./SignalsTests/UnixSignalsTest.VersionChange (905 of 1807) PASS: lldb-unit :: Utility/./UtilityTests/ScalarTest.Promotion (906 of 1807) PASS: lldb-unit :: Utility/./UtilityTests/StreamTest.PutPtr (907 of 1807) UNSUPPORTED: lldb-api :: benchmarks/libcxxmap/TestBenchmarkLibcxxMap.py (908 of 1807) PASS: lldb-unit :: Utility/./UtilityTests/RangeDataVector.FindEntryThatContains_Overlap (909 of 1807) PASS: lldb-unit :: Language/Highlighting/./HighlighterTests/HighlighterTest.Colons (910 of 1807) UNSUPPORTED: lldb-shell :: SymbolFile/PDB/compilands.test (911 of 1807) PASS: lldb-api :: lang/cpp/nested-class-other-compilation-unit/TestNestedClassWithParentInAnotherCU.py (912 of 1807) PASS: lldb-api :: python_api/lldbutil/iter/TestRegistersIterator.py (913 of 1807) PASS: lldb-api :: lang/objc/objc-class-method/TestObjCClassMethod.py (914 of 1807) PASS: lldb-api :: lang/c/find_struct_type/TestFindStructTypes.py (915 of 1807) PASS: lldb-api :: commands/command/script/TestCommandScript.py (916 of 1807) PASS: lldb-unit :: Utility/./UtilityTests/StreamTest.PutMaxHex64ByteOrderBig (917 of 1807) PASS: lldb-unit :: Utility/./UtilityTests/ArgsTest.TestQuotedUnknownEscape (918 of 1807) PASS: lldb-unit :: debugserver/./debugserverTests/RNBSocket.LoopBackListenIPv6 (919 of 1807) PASS: lldb-unit :: Utility/./UtilityTests/FileSpecTest.AppendPathComponent (920 of 1807) PASS: lldb-shell :: Settings/TestEchoCommands.test (921 of 1807) PASS: lldb-api :: functionalities/data-formatter/data-formatter-objc/TestDataFormatterObjCNSDate.py (922 of 1807) PASS: lldb-unit :: ScriptInterpreter/Python/./ScriptInterpreterPythonTests/PythonDataObjectsTest.TestPythonFile (923 of 1807) PASS: lldb-api :: functionalities/data-formatter/data-formatter-enum-format/TestDataFormatterEnumFormat.py (924 of 1807) PASS: lldb-api :: functionalities/data-formatter/data-formatter-objc/TestDataFormatterObjCNSBundle.py (925 of 1807) PASS: lldb-unit :: Utility/./UtilityTests/ScalarTest.CastOperations (926 of 1807) PASS: lldb-api :: macosx/load-kext/TestLoadKext.py (927 of 1807) PASS: lldb-api :: lang/cpp/unique-types/TestUniqueTypes.py (928 of 1807) PASS: lldb-unit :: Host/./HostTests/FileActionTest.Open (929 of 1807) PASS: lldb-api :: functionalities/data-formatter/ptr_ref_typedef/TestPtrRef2Typedef.py (930 of 1807) UNSUPPORTED: lldb-api :: functionalities/darwin_log/filter/regex/subsystem/TestDarwinLogFilterRegexSubsystem.py (931 of 1807) PASS: lldb-shell :: Minidump/fb-dump.test (932 of 1807) PASS: lldb-api :: lang/cpp/wchar_t/TestCxxWCharT.py (933 of 1807) PASS: lldb-shell :: Breakpoint/debug_rnglist_rlestartend.test (934 of 1807) UNSUPPORTED: lldb-api :: commands/register/register/intel_xtended_registers/mpx_offset_intersection/TestMPXOffsetIntersection.py (935 of 1807) PASS: lldb-unit :: Utility/./UtilityTests/StringExtractorTest.DecodeHexU8_InvalidHex (936 of 1807) PASS: lldb-unit :: Symbol/./SymbolTests/Type.CompilerContextPattern (937 of 1807) PASS: lldb-unit :: ObjectFile/Breakpad/./ObjectFileBreakpadTests/Record.classify (938 of 1807) PASS: lldb-unit :: Language/Highlighting/./HighlighterTests/HighlighterTest.ClangUnterminatedString (939 of 1807) PASS: lldb-unit :: Editline/./EditlineTests/EditlineTestFixture.EditlineReceivesMultiLineText (940 of 1807) PASS: lldb-api :: functionalities/thread/concurrent_events/TestConcurrentSignalWatch.py (941 of 1807) PASS: lldb-unit :: Utility/./UtilityTests/DataExtractorTest.GetMaxU64 (942 of 1807) PASS: lldb-unit :: Language/Highlighting/./HighlighterTests/HighlighterTest.ClangSquareBrackets (943 of 1807) PASS: lldb-unit :: Utility/./UtilityTests/StringListTest.AppendListCStringArrayEmpty (944 of 1807) PASS: lldb-api :: lang/objc/modules-cache/TestClangModulesCache.py (945 of 1807) UNSUPPORTED: lldb-api :: arm/breakpoint-it/TestBreakpointIt.py (946 of 1807) PASS: lldb-api :: functionalities/data-formatter/data-formatter-named-summaries/TestDataFormatterNamedSummaries.py (947 of 1807) PASS: lldb-unit :: Utility/./UtilityTests/StreamTest.ShiftOperatorPtr (948 of 1807) PASS: lldb-api :: commands/expression/import-std-module/queue/TestQueue.py (949 of 1807) PASS: lldb-api :: commands/command/history/TestCommandHistory.py (950 of 1807) PASS: lldb-api :: macosx/safe-to-func-call/TestSafeFuncCalls.py (951 of 1807) PASS: lldb-unit :: Utility/./UtilityTests/FileSpecTest.IsRelative (952 of 1807) PASS: lldb-unit :: UnwindAssembly/x86/./UnwindAssemblyx86Tests/Testx86AssemblyInspectionEngine.TestPopEDI (953 of 1807) PASS: lldb-unit :: Utility/./UtilityTests/StringListTest.Join (954 of 1807) PASS: lldb-unit :: UnwindAssembly/x86/./UnwindAssemblyx86Tests/Testx86AssemblyInspectionEngine.Test64bitFramelessSmallStackFrame (955 of 1807) PASS: lldb-shell :: SymbolFile/NativePDB/source-list.cpp (956 of 1807) UNSUPPORTED: lldb-api :: lang/cpp/function-template-parameter-pack/TestFunctionTemplateParameterPack.py (957 of 1807) PASS: lldb-api :: functionalities/data-formatter/data-formatter-stl/libcxx/variant/TestDataFormatterLibcxxVariant.py (958 of 1807) UNSUPPORTED: lldb-api :: functionalities/tty/TestTerminal.py (959 of 1807) PASS: lldb-api :: commands/expression/import-std-module/vector-dbg-info-content/TestDbgInfoContentVector.py (960 of 1807) PASS: lldb-unit :: ScriptInterpreter/Python/./ScriptInterpreterPythonTests/PythonDataObjectsTest.TestPythonTupleInitializerList2 (961 of 1807) PASS: lldb-unit :: Host/./HostTests/MainLoopTest.Signal (962 of 1807) PASS: lldb-unit :: Core/./LLDBCoreTests/StreamCallbackTest.Callback (963 of 1807) PASS: lldb-api :: lang/c/shared_lib_stripped_symbols/TestSharedLibStrippedSymbols.py (964 of 1807) PASS: lldb-unit :: UnwindAssembly/x86/./UnwindAssemblyx86Tests/Testx86AssemblyInspectionEngine.TestSimple32bitFrameFunction (965 of 1807) PASS: lldb-api :: python_api/function_symbol/TestSymbolAPI.py (966 of 1807) PASS: lldb-unit :: Process/gdb-remote/./ProcessGdbRemoteTests/GDBRemoteCommunicationServerTest.SendErrorResponse_ErrorList (967 of 1807) PASS: lldb-api :: functionalities/type_lookup/TestTypeLookup.py (968 of 1807) PASS: lldb-api :: tools/lldb-server/TestGdbRemoteExpeditedRegisters.py (969 of 1807) PASS: lldb-unit :: Symbol/./SymbolTests/PostfixExpression.ParseOneExpression (970 of 1807) PASS: lldb-unit :: Expression/./ExpressionTests/CppModuleConfigurationTest.LibCppV2 (971 of 1807) PASS: lldb-api :: functionalities/data-formatter/setvaluefromcstring/TestSetValueFromCString.py (972 of 1807) PASS: lldb-shell :: SymbolFile/Breakpad/line-table-mixed-path-styles.test (973 of 1807) PASS: lldb-unit :: Utility/./UtilityTests/RangeTest.ContainsRangeStartingFromZero (974 of 1807) PASS: lldb-api :: functionalities/thread/concurrent_events/TestConcurrentTwoWatchpointsOneDelayBreakpoint.py (975 of 1807) PASS: lldb-unit :: Utility/./UtilityTests/TimerTest.CategoryTimes (976 of 1807) PASS: lldb-unit :: Core/./LLDBCoreTests/RichManglingContextTest.IPDRealloc (977 of 1807) PASS: lldb-unit :: SymbolFile/DWARF/./SymbolFileDWARFTests/SymbolFileDWARFTests.TestAbbrevOrder1Start5 (978 of 1807) PASS: lldb-unit :: Utility/./UtilityTests/StreamTest.PutBytesAsRawHex8ToMixedEndian (979 of 1807) PASS: lldb-shell :: SymbolFile/NativePDB/global-classes.cpp (980 of 1807) PASS: lldb-shell :: ObjectFile/PECOFF/dep-modules.yaml (981 of 1807) PASS: lldb-shell :: Reproducer/TestDiscard.test (982 of 1807) PASS: lldb-unit :: Utility/./UtilityTests/UriParserTest.Empty (983 of 1807) UNSUPPORTED: lldb-api :: functionalities/darwin_log/format/TestDarwinLogMessageFormat.py (984 of 1807) PASS: lldb-unit :: Utility/./UtilityTests/AnsiTerminal.WhiteSpace (985 of 1807) PASS: lldb-unit :: Process/gdb-remote/./ProcessGdbRemoteTests/GDBRemoteClientBaseTest.SendContinueDelegateInterface (986 of 1807) PASS: lldb-unit :: Utility/./UtilityTests/LogChannelTest.Disable (987 of 1807) PASS: lldb-unit :: UnwindAssembly/x86/./UnwindAssemblyx86Tests/Testx86AssemblyInspectionEngine.Test32bitFramelessBigStackFrame (988 of 1807) PASS: lldb-api :: functionalities/postmortem/mach-core/TestMachCore.py (989 of 1807) PASS: lldb-unit :: Process/gdb-remote/./ProcessGdbRemoteTests/GDBRemoteCommunicationClientTest.GetModulesInfo (990 of 1807) PASS: lldb-api :: lang/objc/foundation/TestObjectDescriptionAPI.py (991 of 1807) PASS: lldb-unit :: Utility/./UtilityTests/Flags.GetBitSize (992 of 1807) PASS: lldb-unit :: Utility/./UtilityTests/BinaryStreamTest.PutSLEB128EightBytes (993 of 1807) PASS: lldb-api :: tools/lldb-server/TestAppleSimulatorOSType.py (994 of 1807) PASS: lldb-api :: lang/cpp/template-function/TestTemplateFunctions.py (995 of 1807) PASS: lldb-api :: tools/lldb-server/register-reading/TestGdbRemoteGPacket.py (996 of 1807) PASS: lldb-api :: functionalities/data-formatter/data-formatter-stl/libcxx/initializerlist/TestInitializerList.py (997 of 1807) PASS: lldb-api :: functionalities/data-formatter/data-formatter-objc/nsindexpath/TestDataFormatterNSIndexPath.py (998 of 1807) PASS: lldb-api :: commands/expression/unicode-in-variable/TestUnicodeInVariable.py (999 of 1807) PASS: lldb-unit :: Utility/./UtilityTests/UriParserTest.MinimalPath (1000 of 1807) PASS: lldb-unit :: Expression/./ExpressionTests/DWARFExpression.DW_OP_convert (1001 of 1807) PASS: lldb-unit :: Process/minidump/./LLDBMinidumpTests/MinidumpParserTest.GetMiscInfoWindows (1002 of 1807) PASS: lldb-api :: api/check_public_api_headers/TestPublicAPIHeaders.py (1003 of 1807) PASS: lldb-api :: functionalities/breakpoint/move_nearest/TestMoveNearest.py (1004 of 1807) PASS: lldb-unit :: Expression/./ExpressionTests/DiagnosticManagerTest.GetStringNoDiags (1005 of 1807) PASS: lldb-api :: commands/expression/persist_objc_pointeetype/TestPersistObjCPointeeType.py (1006 of 1807) UNSUPPORTED: lldb-shell :: Register/x86-ymm-read.test (1007 of 1807) PASS: lldb-unit :: Utility/./UtilityTests/StringListTest.JoinEmpty (1008 of 1807) PASS: lldb-unit :: Utility/./UtilityTests/StringListTest.CopyListSingle (1009 of 1807) PASS: lldb-unit :: Process/minidump/./LLDBMinidumpTests/RegisterContextMinidump.ConvertMinidumpContext_x86_64 (1010 of 1807) PASS: lldb-unit :: Utility/./UtilityTests/BroadcasterTest.BroadcastEvent (1011 of 1807) UNSUPPORTED: lldb-shell :: SymbolFile/PDB/class-layout.test (1012 of 1807) PASS: lldb-unit :: Utility/./UtilityTests/StringExtractorTest.GetHexBytesAvail_Underflow (1013 of 1807) PASS: lldb-unit :: Utility/./UtilityTests/RegularExpression.Empty (1014 of 1807) PASS: lldb-unit :: ScriptInterpreter/Python/./ScriptInterpreterPythonTests/PythonDataObjectsTest.TestTypeNameResolutionNoDot (1015 of 1807) PASS: lldb-api :: functionalities/thread/concurrent_events/TestConcurrentNWatchNBreak.py (1016 of 1807) PASS: lldb-unit :: Utility/./UtilityTests/TimerTest.CategoryTimes2 (1017 of 1807) PASS: lldb-unit :: Symbol/./SymbolTests/PostfixExpression.ParseFPOProgram (1018 of 1807) PASS: lldb-api :: python_api/interpreter/TestCommandInterpreterAPI.py (1019 of 1807) PASS: lldb-api :: lang/objc/modules-update/TestClangModulesUpdate.py (1020 of 1807) PASS: lldb-shell :: Unwind/trap_frame_sym_ctx.test (1021 of 1807) UNSUPPORTED: lldb-shell :: Register/x86-ymm-write.test (1022 of 1807) PASS: lldb-api :: functionalities/plugins/python_os_plugin/TestPythonOSPlugin.py (1023 of 1807) PASS: lldb-shell :: ObjectFile/ELF/many-sections.s (1024 of 1807) PASS: lldb-unit :: UnwindAssembly/x86/./UnwindAssemblyx86Tests/Testx86AssemblyInspectionEngine.TestPushR12 (1025 of 1807) PASS: lldb-api :: functionalities/target-new-solib-notifications/TestModuleLoadedNotifys.py (1026 of 1807) PASS: lldb-unit :: Interpreter/./InterpreterTests/OptionArgParserTest.toBoolean (1027 of 1807) PASS: lldb-unit :: Utility/./UtilityTests/StreamTeeTest.Constructor1Stream (1028 of 1807) XFAIL: lldb-shell :: Unwind/prefer-debug-over-eh-frame.test (1029 of 1807) PASS: lldb-api :: types/TestDoubleTypes.py (1030 of 1807) PASS: lldb-unit :: Utility/./UtilityTests/ArchSpecTest.TestSetTriple (1031 of 1807) PASS: lldb-unit :: Symbol/./SymbolTests/DWARFCallFrameInfoTest.Basic_dwarf4 (1032 of 1807) PASS: lldb-unit :: Symbol/./SymbolTests/TestClangASTContext.TestRemoveFastQualifiers (1033 of 1807) PASS: lldb-unit :: ObjectFile/PECOFF/./ObjectFilePECOFFTests/PECallFrameInfoTest.Chained_eh (1034 of 1807) PASS: lldb-unit :: Signals/./SignalsTests/UnixSignalsTest.Iteration (1035 of 1807) PASS: lldb-api :: lang/cpp/llvm-style/TestLLVMStyle.py (1036 of 1807) PASS: lldb-api :: commands/expression/import-std-module/deque-basic/TestBasicDeque.py (1037 of 1807) PASS: lldb-unit :: Utility/./UtilityTests/OptionsWithRawTest.QuotedSuffix (1038 of 1807) PASS: lldb-unit :: Utility/./UtilityTests/FileSpecTest.RemoveLastPathComponent (1039 of 1807) PASS: lldb-api :: commands/watchpoints/watchpoint_commands/command/TestWatchpointCommandLLDB.py (1040 of 1807) UNSUPPORTED: lldb-shell :: SymbolFile/NativePDB/stack_unwinding01.cpp (1041 of 1807) PASS: lldb-unit :: Utility/./UtilityTests/RangeTest.DoesAdjoinOrIntersect (1042 of 1807) PASS: lldb-api :: commands/expression/import-std-module/weak_ptr-dbg-info-content/TestDbgInfoContentWeakPtr.py (1043 of 1807) PASS: lldb-unit :: SymbolFile/NativePDB/./SymbolFileNativePDBTests/PDBFPOProgramToDWARFExpressionTests.UnresolvedRegisterReference (1044 of 1807) PASS: lldb-unit :: Utility/./UtilityTests/RecordReplayTest.InstrumentedBar (1045 of 1807) PASS: lldb-unit :: Utility/./UtilityTests/StringExtractorTest.GetHexU8_InvalidHex_NoEof (1046 of 1807) PASS: lldb-api :: python_api/module_section/TestModuleAndSection.py (1047 of 1807) PASS: lldb-shell :: SymbolFile/Breakpad/unwind-via-stack-win.test (1048 of 1807) PASS: lldb-api :: functionalities/data-formatter/data-formatter-stl/libcxx/optional/TestDataFormatterLibcxxOptional.py (1049 of 1807) PASS: lldb-unit :: Utility/./UtilityTests/UUIDTest.StringConverion (1050 of 1807) PASS: lldb-api :: functionalities/stats_api/TestStatisticsAPI.py (1051 of 1807) PASS: lldb-api :: commands/statistics/basic/TestStats.py (1052 of 1807) PASS: lldb-api :: commands/expression/radar_8638051/Test8638051.py (1053 of 1807) PASS: lldb-api :: python_api/class_members/TestSBTypeClassMembers.py (1054 of 1807) PASS: lldb-api :: lang/cpp/inlines/TestInlines.py (1055 of 1807) PASS: lldb-shell :: SymbolFile/DWARF/debug-types-address-ranges.s (1056 of 1807) PASS: lldb-unit :: Language/Highlighting/./HighlighterTests/HighlighterTest.ClangTrailingBackslashMissingNewLine (1057 of 1807) PASS: lldb-unit :: Utility/./UtilityTests/BinaryStreamTest.PutSLEB128FiveBytes (1058 of 1807) UNSUPPORTED: lldb-api :: functionalities/tsan/thread_leak/TestTsanThreadLeak.py (1059 of 1807) PASS: lldb-unit :: Utility/./UtilityTests/StreamTeeTest.AppendStream (1060 of 1807) PASS: lldb-api :: commands/expression/persistent_ptr_update/TestPersistentPtrUpdate.py (1061 of 1807) UNSUPPORTED: lldb-api :: functionalities/data-formatter/data-formatter-stl/libstdcpp/list/TestDataFormatterStdList.py (1062 of 1807) PASS: lldb-unit :: UnwindAssembly/x86/./UnwindAssemblyx86Tests/Testx86AssemblyInspectionEngine.TestPushR15 (1063 of 1807) PASS: lldb-unit :: Utility/./UtilityTests/BinaryStreamTest.PutSLEB128ThreeBytes (1064 of 1807) PASS: lldb-unit :: SymbolFile/DWARF/./SymbolFileDWARFTests/SymbolFileDWARFTests.TestAbbrevOutOfOrder (1065 of 1807) PASS: lldb-api :: lang/objc/exceptions/TestObjCExceptions.py (1066 of 1807) UNSUPPORTED: lldb-shell :: BuildScript/toolchain-clang-cl.test (1067 of 1807) PASS: lldb-api :: functionalities/tail_call_frames/ambiguous_tail_call_seq2/TestAmbiguousTailCallSeq2.py (1068 of 1807) PASS: lldb-api :: functionalities/data-formatter/data-formatter-stl/libcxx/vector/TestDataFormatterLibcxxVector.py (1069 of 1807) PASS: lldb-unit :: Utility/./UtilityTests/OptionsWithRawTest.LeadingSpaceArgs (1070 of 1807) PASS: lldb-unit :: Utility/./UtilityTests/UserIDResolver.GetGroupName (1071 of 1807) PASS: lldb-api :: commands/expression/import-std-module/list-basic/TestBasicList.py (1072 of 1807) PASS: lldb-api :: lang/cpp/char8_t/TestCxxChar8_t.py (1073 of 1807) PASS: lldb-unit :: Utility/./UtilityTests/ProcessInfoTest.Constructor (1074 of 1807) PASS: lldb-api :: python_api/lldbutil/process/TestPrintStackTraces.py (1075 of 1807) PASS: lldb-unit :: Utility/./UtilityTests/StreamTest.PutHex32ByteOrderLittle (1076 of 1807) PASS: lldb-api :: functionalities/data-formatter/data-formatter-objc/TestDataFormatterObjCNSContainer.py (1077 of 1807) PASS: lldb-unit :: UnwindAssembly/x86/./UnwindAssemblyx86Tests/Testx86AssemblyInspectionEngine.TestPushExtended (1078 of 1807) PASS: lldb-unit :: Utility/./UtilityTests/VMRange.ContainsAddr (1079 of 1807) UNSUPPORTED: lldb-api :: functionalities/ubsan/basic/TestUbsanBasic.py (1080 of 1807) PASS: lldb-unit :: Utility/./UtilityTests/StringLexerTest.HasAtLeast (1081 of 1807) PASS: lldb-unit :: SymbolFile/NativePDB/./SymbolFileNativePDBTests/PDBFPOProgramToDWARFExpressionTests.UnresolvedCyclicRegisterAssignmentReference (1082 of 1807) PASS: lldb-unit :: Utility/./UtilityTests/StringListTest.LongestCommonPrefixNoPrefix (1083 of 1807) PASS: lldb-unit :: Utility/./UtilityTests/GeneratorTest.GetOrCreate (1084 of 1807) PASS: lldb-api :: functionalities/modern-type-lookup/libcxx/TestLibCxxModernTypeLookup.py (1085 of 1807) PASS: lldb-api :: functionalities/inferior-crashing/recursive-inferior/TestRecursiveInferior.py (1086 of 1807) PASS: lldb-api :: lang/objc/foundation/TestObjCMethodsString.py (1087 of 1807) PASS: lldb-api :: functionalities/abbreviation/TestCommonShortSpellings.py (1088 of 1807) PASS: lldb-shell :: Breakpoint/debug_rnglistx_rlex.test (1089 of 1807) PASS: lldb-api :: lang/cpp/overloaded-functions/TestOverloadedFunctions.py (1090 of 1807) PASS: lldb-api :: lang/cpp/auto/TestCPPAuto.py (1091 of 1807) UNSUPPORTED: lldb-api :: functionalities/darwin_log/filter/exact_match/category/TestDarwinLogFilterMatchCategory.py (1092 of 1807) PASS: lldb-api :: lang/cpp/chained-calls/TestCppChainedCalls.py (1093 of 1807) PASS: lldb-unit :: Utility/./UtilityTests/StreamTest.ShiftOperatorUInts (1094 of 1807) PASS: lldb-shell :: ObjectFile/ELF/netbsd-exec-8.99.30-amd64.yaml (1095 of 1807) PASS: lldb-unit :: ScriptInterpreter/Python/./ScriptInterpreterPythonTests/PythonDataObjectsTest.TestPythonStringToStructuredString (1096 of 1807) PASS: lldb-shell :: BuildScript/compiler-full-path.test (1097 of 1807) PASS: lldb-unit :: tools/lldb-server/tests/./LLDBServerTests/TestBase.LaunchModePreservesEnvironment (1098 of 1807) UNSUPPORTED: lldb-api :: benchmarks/stepping/TestSteppingSpeed.py (1099 of 1807) PASS: lldb-api :: functionalities/thread/concurrent_events/TestConcurrentCrashWithBreak.py (1100 of 1807) PASS: lldb-unit :: Utility/./UtilityTests/RangeTest.ContainsEndInclusive (1101 of 1807) PASS: lldb-api :: functionalities/data-formatter/language_category_updates/TestDataFormatterLanguageCategoryUpdates.py (1102 of 1807) PASS: lldb-api :: api/multithreaded/TestMultithreaded.py (1103 of 1807) PASS: lldb-unit :: Utility/./UtilityTests/StringExtractorTest.GetU64LittleEndian (1104 of 1807) PASS: lldb-api :: functionalities/data-formatter/vector-types/TestVectorTypesFormatting.py (1105 of 1807) UNSUPPORTED: lldb-shell :: SymbolFile/PDB/type-quals.test (1106 of 1807) PASS: lldb-unit :: Utility/./UtilityTests/ScalarTest.APIntConstructor (1107 of 1807) PASS: lldb-unit :: Utility/./UtilityTests/LogChannelEnabledTest.LogVerboseThread (1108 of 1807) UNSUPPORTED: lldb-api :: tools/lldb-server/TestGdbRemoteAuxvSupport.py (1109 of 1807) PASS: lldb-api :: functionalities/modern-type-lookup/basic/TestBasicModernTypeLookup.py (1110 of 1807) PASS: lldb-api :: functionalities/thread/concurrent_events/TestConcurrentTwoWatchpointThreads.py (1111 of 1807) PASS: lldb-unit :: Utility/./UtilityTests/VMRange.Comparison (1112 of 1807) PASS: lldb-shell :: Breakpoint/jitbp_elf.test (1113 of 1807) FAIL: lldb-api :: terminal/TestEditline.py (1114 of 1807) ******************** TEST 'lldb-api :: terminal/TestEditline.py' FAILED ******************** lldb version 10.0.99 (http://labmaster3.local/git/llvm-project.git revision 2916489c54a303971bc546f287b71532d49ddd33) clang revision ebf9bf2cbc8fa68d536e481e370c4ba40ce61a8a llvm revision ebf9bf2cbc8fa68d536e481e370c4ba40ce61a8a (lldb) settings set symbols.enable-external-lookup false (lldb) settings set plugin.process.gdb-remote.packet-timeout 60 (lldb) settings set symbols.clang-modules-cache-path "/Users/buildslave/jenkins/workspace/lldb-cmake-sanitized/lldb-build/lldb-test-build.noindex/module-cache-lldb/lldb-api" (lldb) settings set use-color false (lldb) el rintphp el rintprinthel printelp print Evaluate an expression on the current thread. Displays any returned value with LLDB's default formatting. Expects 'raw' input (see 'help raw-input'.)

Hide Details

Syntax: print <expr>

Hide Details

Command Options Usage: print <expr>

Hide Details

Hide Details

'print' is an abbreviation for 'expression --' (lldb) el tepshp el tepstephel stepelp step Source level single step, stepping into calls. Defaults to current thread unless specified.

Hide Details

Syntax: step <cmd-options> [<thread-id>]

Hide Details

Command Options Usage: step [-c <count>] [-e <linenum>] [-m <run-mode>] [-a <boolean>] [-t <function-name>] [-A <boolean>] [-r <regular-expression>] [<thread-id>]

Hide Details

-A <boolean> ( --step-out-avoids-no-debug <boolean> ) A boolean value, if true stepping out of functions will continue to step out till it hits a function with debug information.

Hide Details

-a <boolean> ( --step-in-avoids-no-debug <boolean> ) A boolean value that sets whether stepping into functions will step over functions with no debug information.

Hide Details

-c <count> ( --count <count> ) How many times to perform the stepping operation - currently only supported for step-inst and next-inst.

Hide Details

-e <linenum> ( --end-linenumber <linenum> ) The line at which to stop stepping - defaults to the next line and only supported for step-in and step-over. You can also pass the string 'block' to step to the end of the current block. This is particularly use in conjunction with --step-target to step through a complex calling sequence.

Hide Details

-m <run-mode> ( --run-mode <run-mode> ) Determine how to run other threads while stepping the current thread. Values: this-thread | all-threads | while-stepping

Hide Details

-r <regular-expression> ( --step-over-regexp <regular-expression> ) A regular expression that definesfunction names to not to stop at when stepping in.

Hide Details

-t <function-name> ( --step-in-target <function-name> ) The name of the directly called function step in should stop at when stepping into.

Hide Details

This command takes options and free-form arguments. If your arguments resemble option specifiers (i.e., they start with a - or --), you must use ' -- ' between the end of the command options and the beginning of the arguments.

Hide Details

'step' is an abbreviation for 'thread step-in' (lldb) el xitehp el xitexithel exitelp exit Quit the LLDB debugger.

Hide Details

Syntax: exit

Hide Details

'exit' is an abbreviation for 'quit' (lldb) settings set interpreter.prompt-on-quit false LLDB library dir: /Users/buildslave/jenkins/workspace/lldb-cmake-sanitized/lldb-build/bin LLDB import library dir: /Users/buildslave/jenkins/workspace/lldb-cmake-sanitized/lldb-build/bin libstdcxx tests will not be run because: Don't know how to build with libstdcxx on macosx Skipping following debug info categories: ['dwo']

Hide Details

Session logs for test failures/errors/unexpected successes will go into directory '/Users/buildslave/jenkins/workspace/lldb-cmake-sanitized/test/logs' Command invoked: /Users/buildslave/jenkins/workspace/lldb-cmake-sanitized/llvm-project/lldb/test/API/dotest.py --arch=x86_64 -s /Users/buildslave/jenkins/workspace/lldb-cmake-sanitized/lldb-build/lldb-test-traces -S nm -u CXXFLAGS -u CFLAGS --executable /Users/buildslave/jenkins/workspace/lldb-cmake-sanitized/lldb-build/./bin/lldb --compiler /Users/buildslave/jenkins/workspace/lldb-cmake-sanitized/lldb-build/./bin/clang --dsymutil /Users/buildslave/jenkins/workspace/lldb-cmake-sanitized/lldb-build/./bin/dsymutil --filecheck /Users/buildslave/jenkins/workspace/lldb-cmake-sanitized/lldb-build/./bin/FileCheck --codesign-identity lldb_codesign --server /Users/buildslave/jenkins/workspace/lldb-cmake-sanitized/lldb-build/./bin/debugserver --arch x86_64 --build-dir /Users/buildslave/jenkins/workspace/lldb-cmake-sanitized/lldb-build/lldb-test-build.noindex -s=/Users/buildslave/jenkins/workspace/lldb-cmake-sanitized/test/logs -t --env TERM=vt100 --env LLVM_LIBS_DIR=/Users/buildslave/jenkins/workspace/lldb-cmake-sanitized/lldb-build/./lib --build-dir /Users/buildslave/jenkins/workspace/lldb-cmake-sanitized/lldb-build/lldb-test-build.noindex --lldb-module-cache-dir /Users/buildslave/jenkins/workspace/lldb-cmake-sanitized/lldb-build/lldb-test-build.noindex/module-cache-lldb/lldb-api --clang-module-cache-dir /Users/buildslave/jenkins/workspace/lldb-cmake-sanitized/lldb-build/lldb-test-build.noindex/module-cache-clang/lldb-api /Users/buildslave/jenkins/workspace/lldb-cmake-sanitized/llvm-project/lldb/packages/Python/lldbsuite/test/terminal -p TestEditline.py Change dir to: /Users/buildslave/jenkins/workspace/lldb-cmake-sanitized/llvm-project/lldb/packages/Python/lldbsuite/test/terminal runCmd: settings set symbols.enable-external-lookup false output:

Hide Details

runCmd: settings set plugin.process.gdb-remote.packet-timeout 60 output:

Hide Details

runCmd: settings set symbols.clang-modules-cache-path "/Users/buildslave/jenkins/workspace/lldb-cmake-sanitized/lldb-build/lldb-test-build.noindex/module-cache-lldb/lldb-api" output:

Hide Details

runCmd: settings set use-color false output:

Hide Details

FAIL: LLDB (/Users/buildslave/jenkins/workspace/lldb-cmake-sanitized/lldb-build/bin/clang-10-x86_64) :: test_left_right_arrow (TestEditline.EditlineTest) tearing down the child process....

Hide Details

CLEANUP ERROR: LLDB (/Users/buildslave/jenkins/workspace/lldb-cmake-sanitized/lldb-build/bin/clang-10-x86_64) :: test_left_right_arrow (TestEditline.EditlineTest) Restore dir to: /Users/buildslave/jenkins/workspace/lldb-cmake-sanitized/lldb-build/tools/lldb/test ====================================================================== ERROR: test_left_right_arrow (TestEditline.EditlineTest) Test that ctrl+left/right arrow navigates words correctly. ---------------------------------------------------------------------- Traceback (most recent call last): File "/Users/buildslave/jenkins/workspace/lldb-cmake-sanitized/llvm-project/lldb/third_party/Python/module/pexpect-4.6/pexpect/pty_spawn.py", line 23, in _wrap_ptyprocess_err yield File "/Users/buildslave/jenkins/workspace/lldb-cmake-sanitized/llvm-project/lldb/third_party/Python/module/pexpect-4.6/pexpect/pty_spawn.py", line 327, in close self.ptyproc.close(force=force) File "/Users/buildslave/jenkins/workspace/lldb-cmake-sanitized/llvm-project/lldb/third_party/Python/module/ptyprocess-0.6.0/ptyprocess/ptyprocess.py", line 400, in close raise PtyProcessError('Could not terminate the child.') ptyprocess.util.PtyProcessError: Could not terminate the child.

Hide Details

During handling of the above exception, another exception occurred:

Hide Details

Traceback (most recent call last): File "/Users/buildslave/jenkins/workspace/lldb-cmake-sanitized/llvm-project/lldb/packages/Python/lldbsuite/test/terminal/TestEditline.py", line 49, in test_left_right_arrow self.quit() File "/Users/buildslave/jenkins/workspace/lldb-cmake-sanitized/llvm-project/lldb/packages/Python/lldbsuite/test/lldbpexpect.py", line 61, in quit self.child.close(force=not gracefully) File "/Users/buildslave/jenkins/workspace/lldb-cmake-sanitized/llvm-project/lldb/third_party/Python/module/pexpect-4.6/pexpect/pty_spawn.py", line 327, in close self.ptyproc.close(force=force) File "/usr/local/Cellar/python/3.7.0/Frameworks/Python.framework/Versions/3.7/lib/python3.7/contextlib.py", line 130, in __exit__ self.gen.throw(type, value, traceback) File "/Users/buildslave/jenkins/workspace/lldb-cmake-sanitized/llvm-project/lldb/third_party/Python/module/pexpect-4.6/pexpect/pty_spawn.py", line 25, in _wrap_ptyprocess_err raise ExceptionPexpect(*e.args) pexpect.exceptions.ExceptionPexpect: Could not terminate the child. Config=x86_64-/Users/buildslave/jenkins/workspace/lldb-cmake-sanitized/lldb-build/bin/clang-10 ---------------------------------------------------------------------- Ran 1 test in 3.666s

Hide Details

RESULT: FAILED (0 passes, 0 failures, 1 errors, 0 skipped, 0 expected failures, 0 unexpected successes)

Hide Details

******************** PASS: lldb-api :: functionalities/breakpoint/cpp/TestCPPBreakpointLocations.py (1115 of 1807) PASS: lldb-api :: lang/cpp/rvalue-references/TestRvalueReferences.py (1116 of 1807) PASS: lldb-api :: functionalities/breakpoint/address_breakpoints/TestBadAddressBreakpoints.py (1117 of 1807) PASS: lldb-api :: functionalities/mtc/simple/TestMTCSimple.py (1118 of 1807) PASS: lldb-api :: python_api/watchpoint/TestSetWatchpoint.py (1119 of 1807) PASS: lldb-api :: source-manager/TestSourceManager.py (1120 of 1807) PASS: lldb-api :: python_api/symbol-context/TestSymbolContext.py (1121 of 1807) PASS: lldb-unit :: Interpreter/./InterpreterTests/OptionArgParserTest.toScriptLanguage (1122 of 1807) PASS: lldb-unit :: Utility/./UtilityTests/ScalarTest.GetValue (1123 of 1807) PASS: lldb-api :: functionalities/thread/step_until/TestStepUntil.py (1124 of 1807) PASS: lldb-unit :: Utility/./UtilityTests/StringExtractorTest.GetNameColonValueNoColon (1125 of 1807) PASS: lldb-api :: python_api/debugger/TestDebuggerAPI.py (1126 of 1807) PASS: lldb-unit :: Utility/./UtilityTests/BinaryStreamTest.PutSLEB128One (1127 of 1807) PASS: lldb-api :: functionalities/data-formatter/data-formatter-cpp/TestDataFormatterCpp.py (1128 of 1807) PASS: lldb-api :: functionalities/memory-region/TestMemoryRegion.py (1129 of 1807) PASS: lldb-unit :: Utility/./UtilityTests/ScalarTest.GetBytes (1130 of 1807) PASS: lldb-shell :: Reproducer/Functionalities/TestStepping.test (1131 of 1807) PASS: lldb-unit :: Utility/./UtilityTests/RangeTest.LessThanInvalid (1132 of 1807) PASS: lldb-api :: commands/expression/scoped_enums/TestScopedEnumType.py (1133 of 1807) PASS: lldb-shell :: Minidump/memory-region-from-module.yaml (1134 of 1807) PASS: lldb-unit :: Utility/./UtilityTests/UriParserTest.MinimalPortPath (1135 of 1807) PASS: lldb-api :: commands/expression/vector_of_enums/TestVectorOfEnums.py (1136 of 1807) PASS: lldb-api :: commands/expression/import-std-module/list-dbg-info-content/TestDbgInfoContentList.py (1137 of 1807) PASS: lldb-shell :: Quit/TestQuitExitCodeNonInt.test (1138 of 1807) PASS: lldb-unit :: Utility/./UtilityTests/StringListTest.Clear (1139 of 1807) PASS: lldb-unit :: Utility/./UtilityTests/StreamTest.PutHex16ByteOrderBig (1140 of 1807) PASS: lldb-shell :: SymbolFile/DWARF/find-inline-method.s (1141 of 1807) PASS: lldb-unit :: Utility/./UtilityTests/UriParserTest.BracketedHostname (1142 of 1807) PASS: lldb-api :: functionalities/thread/concurrent_events/TestConcurrentTwoBreakpointsOneWatchpoint.py (1143 of 1807) PASS: lldb-unit :: Utility/./UtilityTests/LogChannelTest.Enable (1144 of 1807) XFAIL: lldb-shell :: Register/x86-mm-xmm-write.test (1145 of 1807) UNSUPPORTED: lldb-shell :: Register/x86-zmm-read.test (1146 of 1807) PASS: lldb-shell :: Breakpoint/single-file-split-dwarf.test (1147 of 1807) PASS: lldb-unit :: Utility/./UtilityTests/NameMatchesTest.EndsWith (1148 of 1807) PASS: lldb-api :: functionalities/thread/concurrent_events/TestConcurrentWatchpointWithDelayWatchpointThreads.py (1149 of 1807) PASS: lldb-unit :: Utility/./UtilityTests/NameMatchesTest.RegularExpression (1150 of 1807) PASS: lldb-api :: lang/c/unicode/TestUnicodeSymbols.py (1151 of 1807) PASS: lldb-api :: lang/cpp/global_operators/TestCppGlobalOperators.py (1152 of 1807) PASS: lldb-api :: lang/c/vla/TestVLA.py (1153 of 1807) PASS: lldb-api :: functionalities/tail_call_frames/sbapi_support/TestTailCallFrameSBAPI.py (1154 of 1807) PASS: lldb-unit :: SymbolFile/NativePDB/./SymbolFileNativePDBTests/PDBFPOProgramToDWARFExpressionTests.UnsupportedRASearch (1155 of 1807) PASS: lldb-unit :: Utility/./UtilityTests/StringListTest.GetMaxStringLengthEqualSize (1156 of 1807) PASS: lldb-api :: lang/cpp/template/TestTemplateArgs.py (1157 of 1807) PASS: lldb-shell :: ObjectFile/ELF/aarch64-relocations.yaml (1158 of 1807) PASS: lldb-unit :: Host/./HostTests/NativeProcessProtocolTest.SetBreakpointFailWrite (1159 of 1807) PASS: lldb-api :: functionalities/breakpoint/comp_dir_symlink/TestCompDirSymLink.py (1160 of 1807) PASS: lldb-unit :: UnwindAssembly/x86/./UnwindAssemblyx86Tests/Testx86AssemblyInspectionEngine.TestPushR13 (1161 of 1807) PASS: lldb-unit :: Utility/./UtilityTests/StringListTest.SplitIntoLinesSingleTrailingCR (1162 of 1807) PASS: lldb-api :: lang/cpp/operators/TestCppOperators.py (1163 of 1807) PASS: lldb-unit :: Process/gdb-remote/./ProcessGdbRemoteTests/GDBRemoteCommunicationTest.ReadPacket_checksum (1164 of 1807) PASS: lldb-unit :: Utility/./UtilityTests/StringExtractorTest.GetNameColonValueContainsColon (1165 of 1807) PASS: lldb-shell :: SymbolFile/DWARF/apple-index-is-used.cpp (1166 of 1807) UNSUPPORTED: lldb-api :: tools/lldb-server/platform-process-connect/TestPlatformProcessConnect.py (1167 of 1807) PASS: lldb-api :: commands/expression/import-std-module/shared_ptr/TestSharedPtr.py (1168 of 1807) UNSUPPORTED: lldb-api :: functionalities/asan/TestMemoryHistory.py (1169 of 1807) PASS: lldb-unit :: UnwindAssembly/x86/./UnwindAssemblyx86Tests/Testx86AssemblyInspectionEngine.TestPopRBPWithREX (1170 of 1807) PASS: lldb-unit :: Symbol/./SymbolTests/Type.GetTypeScopeAndBasename (1171 of 1807) PASS: lldb-unit :: Utility/./UtilityTests/StringListTest.AppendListCStringArray (1172 of 1807) PASS: lldb-api :: lang/cpp/namespace/TestNamespace.py (1173 of 1807) PASS: lldb-api :: lang/cpp/dynamic-value/TestCppValueCast.py (1174 of 1807) PASS: lldb-api :: commands/watchpoints/watchpoint_on_vectors/TestValueOfVectorVariable.py (1175 of 1807) PASS: lldb-api :: functionalities/data-formatter/format-propagation/TestFormatPropagation.py (1176 of 1807) PASS: lldb-shell :: Reproducer/TestDump.test (1177 of 1807) PASS: lldb-unit :: Utility/./UtilityTests/VMRange.CollectionContains (1178 of 1807) PASS: lldb-api :: lang/cpp/symbols/TestSymbols.py (1179 of 1807) PASS: lldb-api :: functionalities/thread/concurrent_events/TestConcurrentTwoBreakpointThreads.py (1180 of 1807) PASS: lldb-api :: python_api/value/linked_list/TestValueAPILinkedList.py (1181 of 1807) PASS: lldb-unit :: Symbol/./SymbolTests/TestClangASTContext.TestBuiltinTypeForEncodingAndBitSize (1182 of 1807) PASS: lldb-unit :: Process/minidump/./LLDBMinidumpTests/MinidumpParserTest.GetThreadsAndGetThreadContext (1183 of 1807) PASS: lldb-shell :: Reproducer/TestDriverOptions.test (1184 of 1807) PASS: lldb-unit :: Utility/./UtilityTests/StreamTest.PutCStringWithStringRef (1185 of 1807) UNSUPPORTED: lldb-api :: functionalities/tsan/cpp_global_location/TestTsanCPPGlobalLocation.py (1186 of 1807) PASS: lldb-unit :: Process/gdb-remote/./ProcessGdbRemoteTests/GDBRemoteCommunicationClientTest.SendSignalsToIgnore (1187 of 1807) PASS: lldb-unit :: ScriptInterpreter/Python/./ScriptInterpreterPythonTests/PythonDataObjectsTest.TestPythonDictionaryValueEquality (1188 of 1807) UNSUPPORTED: lldb-shell :: Register/arm-fp-read.test (1189 of 1807) PASS: lldb-unit :: Utility/./UtilityTests/OptionsWithRawTest.ArgsButNoLeadingDash (1190 of 1807) UNSUPPORTED: lldb-api :: functionalities/darwin_log/filter/regex/category/TestDarwinLogFilterRegexCategory.py (1191 of 1807) PASS: lldb-unit :: Utility/./UtilityTests/BinaryStreamTest.PutULEB128One (1192 of 1807) PASS: lldb-unit :: Utility/./UtilityTests/StringListTest.InsertStringAtIndexOutOfBounds (1193 of 1807) PASS: lldb-api :: tools/lldb-vscode/launch/TestVSCode_launch.py (1194 of 1807) PASS: lldb-unit :: Utility/./UtilityTests/StringExtractorTest.GetHexBytesAvail_OddPair (1195 of 1807) UNSUPPORTED: lldb-api :: functionalities/darwin_log/filter/exact_match/activity-chain/TestDarwinLogFilterMatchActivityChain.py (1196 of 1807) PASS: lldb-shell :: Process/TestEnvironment.test (1197 of 1807) PASS: lldb-unit :: Utility/./UtilityTests/ConstStringTest.NullAndEmptyStates (1198 of 1807) PASS: lldb-api :: driver/batch_mode/TestBatchMode.py (1199 of 1807) PASS: lldb-unit :: Utility/./UtilityTests/StringListTest.GetMaxStringLengthDecreasingSize (1200 of 1807) PASS: lldb-unit :: Utility/./UtilityTests/RangeTest.ContainsEndInclusiveInvalid (1201 of 1807) PASS: lldb-api :: macosx/order/TestOrderFile.py (1202 of 1807) PASS: lldb-unit :: Process/gdb-remote/./ProcessGdbRemoteTests/GDBRemoteCommunicationServerTest.SendErrorResponse_StringError (1203 of 1807) PASS: lldb-shell :: ObjectFile/PECOFF/sections-names.yaml (1204 of 1807) PASS: lldb-api :: commands/frame/diagnose/dereference-this/TestDiagnoseDereferenceThis.py (1205 of 1807) PASS: lldb-api :: functionalities/thread/concurrent_events/TestConcurrentManyWatchpoints.py (1206 of 1807) PASS: lldb-shell :: ObjectFile/ELF/duplicate-section.yaml (1207 of 1807) PASS: lldb-unit :: Utility/./UtilityTests/ListenerTest.GetEventWait (1208 of 1807) PASS: lldb-shell :: SymbolFile/Breakpad/stack-cfi-parsing.test (1209 of 1807) PASS: lldb-unit :: Utility/./UtilityTests/LogTest.Unregister (1210 of 1807) UNSUPPORTED: lldb-api :: benchmarks/continue/TestBenchmarkContinue.py (1211 of 1807) PASS: lldb-unit :: Host/./HostTests/FileSystemTest.GetPermissions (1212 of 1807) UNSUPPORTED: lldb-api :: commands/expression/macros/TestMacros.py (1213 of 1807) PASS: lldb-unit :: Utility/./UtilityTests/RegularExpression.Valid (1214 of 1807) PASS: lldb-unit :: Utility/./UtilityTests/StringListTest.CopyList (1215 of 1807) PASS: lldb-api :: functionalities/data-formatter/typedef_array/TestTypedefArray.py (1216 of 1807) PASS: lldb-unit :: Process/gdb-remote/./ProcessGdbRemoteTests/GDBRemoteClientBaseTest.SendContinueDelegateStructuredDataReceipt (1217 of 1807) PASS: lldb-api :: functionalities/breakpoint/breakpoint_by_line_and_column/TestBreakpointByLineAndColumn.py (1218 of 1807) PASS: lldb-unit :: Expression/./ExpressionTests/ClangHostTest.MacOSX (1219 of 1807) PASS: lldb-unit :: ObjectFile/Breakpad/./ObjectFileBreakpadTests/ModuleRecord.parse (1220 of 1807) PASS: lldb-api :: lang/cpp/namespace/TestNamespaceLookup.py (1221 of 1807) PASS: lldb-api :: lang/c/stepping/TestStepAndBreakpoints.py (1222 of 1807) PASS: lldb-api :: functionalities/data-formatter/user-format-vs-summary/TestUserFormatVsSummary.py (1223 of 1807) PASS: lldb-unit :: ObjectFile/Breakpad/./ObjectFileBreakpadTests/FileRecord.parse (1224 of 1807) PASS: lldb-unit :: Utility/./UtilityTests/StringListTest.RemoveBlankLines (1225 of 1807) PASS: lldb-unit :: Utility/./UtilityTests/BroadcasterTest.EventTypeHasListeners (1226 of 1807) PASS: lldb-unit :: Utility/./UtilityTests/StringListTest.InsertStringAtIndexEnd (1227 of 1807) PASS: lldb-api :: macosx/indirect_symbol/TestIndirectSymbols.py (1228 of 1807) PASS: lldb-api :: functionalities/data-formatter/data-formatter-disabling/TestDataFormatterDisabling.py (1229 of 1807) PASS: lldb-api :: functionalities/signal/raise/TestRaise.py (1230 of 1807) PASS: lldb-api :: commands/expression/completion-in-lambda-and-unnnamed-class/TestCompletionInLambdaAndUnnamedClass.py (1231 of 1807) PASS: lldb-unit :: Utility/./UtilityTests/DataExtractorTest.GetMaxS64 (1232 of 1807) PASS: lldb-api :: functionalities/thread/concurrent_events/TestConcurrentBreakpointsDelayedBreakpointOneWatchpoint.py (1233 of 1807) PASS: lldb-api :: lang/objc/objc-ivar-stripped/TestObjCIvarStripped.py (1234 of 1807) PASS: lldb-api :: functionalities/show_location/TestShowLocationDwarf5.py (1235 of 1807) PASS: lldb-unit :: Host/./HostTests/SocketTest.DecodeHostAndPort (1236 of 1807) PASS: lldb-api :: functionalities/breakpoint/breakpoint_command/TestBreakpointCommand.py (1237 of 1807) PASS: lldb-unit :: Utility/./UtilityTests/NameMatchesTest.Equals (1238 of 1807) PASS: lldb-unit :: Utility/./UtilityTests/ArgsTest.ReplaceArgumentAtIndexLonger (1239 of 1807) PASS: lldb-unit :: Utility/./UtilityTests/RangeTest.Union (1240 of 1807) PASS: lldb-unit :: Utility/./UtilityTests/StringLexerTest.Next (1241 of 1807) PASS: lldb-api :: functionalities/multidebugger_commands/TestMultipleDebuggersCommands.py (1242 of 1807) PASS: lldb-unit :: Language/Highlighting/./HighlighterTests/HighlighterTest.ClangIdentifiers (1243 of 1807) PASS: lldb-api :: api/log/TestAPILog.py (1244 of 1807) PASS: lldb-unit :: Utility/./UtilityTests/UriParserTest.BadPort (1245 of 1807) PASS: lldb-api :: commands/settings/TestSettings.py (1246 of 1807) PASS: lldb-api :: functionalities/breakpoint/debugbreak/TestDebugBreak.py (1247 of 1807) UNSUPPORTED: lldb-api :: functionalities/darwin_log/filter/regex/message/TestDarwinLogFilterRegexMessage.py (1248 of 1807) PASS: lldb-shell :: SymbolFile/DWARF/deterministic-build.cpp (1249 of 1807) PASS: lldb-unit :: ScriptInterpreter/Python/./ScriptInterpreterPythonTests/PythonDataObjectsTest.TestPythonByteArray (1250 of 1807) PASS: lldb-unit :: Utility/./UtilityTests/ScalarTest.ExtractBitfield (1251 of 1807) PASS: lldb-shell :: SymbolFile/DWARF/find-basic-function.cpp (1252 of 1807) PASS: lldb-unit :: SymbolFile/NativePDB/./SymbolFileNativePDBTests/PDBFPOProgramToDWARFExpressionTests.UnresolvedDependentCyclicRegisterAssignmentReference (1253 of 1807) PASS: lldb-api :: functionalities/load_unload/TestLoadUnload.py (1254 of 1807) PASS: lldb-unit :: Language/Highlighting/./HighlighterTests/HighlighterTest.HighlighterSelectionType (1255 of 1807) PASS: lldb-api :: commands/watchpoints/watchpoint_commands/condition/TestWatchpointConditionCmd.py (1256 of 1807) PASS: lldb-api :: functionalities/gdb_remote_client/TestRecognizeBreakpoint.py (1257 of 1807) PASS: lldb-unit :: Utility/./UtilityTests/AnsiTerminal.Basic (1258 of 1807) UNSUPPORTED: lldb-shell :: Register/x86-gp-read.test (1259 of 1807) PASS: lldb-unit :: Utility/./UtilityTests/StringExtractorTest.GetHexU8_Exact (1260 of 1807) PASS: lldb-unit :: Utility/./UtilityTests/ConstStringTest.MangledCounterpart (1261 of 1807) PASS: lldb-unit :: Symbol/./SymbolTests/TestClangASTContext.TestUnifyAccessSpecifiers (1262 of 1807) PASS: lldb-unit :: ScriptInterpreter/Python/./ScriptInterpreterPythonTests/PythonDataObjectsTest.TestExceptions (1263 of 1807) PASS: lldb-api :: functionalities/thread/backtrace_all/TestBacktraceAll.py (1264 of 1807) PASS: lldb-unit :: ObjectFile/Breakpad/./ObjectFileBreakpadTests/FuncRecord.parse (1265 of 1807) PASS: lldb-api :: commands/command/invalid-args/TestInvalidArgsCommand.py (1266 of 1807) PASS: lldb-unit :: Utility/./UtilityTests/UriParserTest.SchemeHostSeparator4 (1267 of 1807) PASS: lldb-unit :: Host/./HostTests/MainLoopTest.TerminatesImmediately (1268 of 1807) PASS: lldb-api :: lang/objc/modules/TestObjCModules.py (1269 of 1807) PASS: lldb-shell :: Reproducer/TestReuseDirectory.test (1270 of 1807) PASS: lldb-unit :: Interpreter/./InterpreterTests/OptionArgParserTest.toChar (1271 of 1807) PASS: lldb-api :: lang/c/modules/TestCModules.py (1272 of 1807) PASS: lldb-api :: commands/expression/call-function/TestCallBuiltinFunction.py (1273 of 1807) PASS: lldb-unit :: ScriptInterpreter/Python/./ScriptInterpreterPythonTests/PythonDataObjectsTest.TestPythonBoolean (1274 of 1807) PASS: lldb-unit :: Utility/./UtilityTests/AnsiTerminal.Incomplete (1275 of 1807) PASS: lldb-shell :: SymbolFile/Breakpad/line-table-missing-file.test (1276 of 1807) PASS: lldb-shell :: SymbolFile/NativePDB/break-by-line.cpp (1277 of 1807) PASS: lldb-unit :: Utility/./UtilityTests/StringListTest.InsertStringAtIndexStdString (1278 of 1807) PASS: lldb-api :: functionalities/data-formatter/data-formatter-proper-plurals/TestFormattersOneIsSingular.py (1279 of 1807) PASS: lldb-api :: commands/watchpoints/watchpoint_commands/command/TestWatchpointCommandPython.py (1280 of 1807) PASS: lldb-unit :: Utility/./UtilityTests/StreamTest.PutHex32ByteOrderBig (1281 of 1807) PASS: lldb-unit :: Process/gdb-remote/./ProcessGdbRemoteTests/GDBRemoteCommunicationClientTest.SendStopTracePacket (1282 of 1807) PASS: lldb-api :: commands/expression/ir-interpreter-phi-nodes/TestIRInterpreterPHINodes.py (1283 of 1807) PASS: lldb-api :: macosx/find-app-in-bundle/TestFindAppInBundle.py (1284 of 1807) PASS: lldb-unit :: Utility/./UtilityTests/StreamTeeTest.Constructor2Streams (1285 of 1807) PASS: lldb-api :: functionalities/breakpoint/scripted_bkpt/TestScriptedResolver.py (1286 of 1807) PASS: lldb-api :: lang/objc/objc-static-method-stripped/TestObjCStaticMethodStripped.py (1287 of 1807) PASS: lldb-shell :: ObjectFile/PECOFF/export-dllfunc.yaml (1288 of 1807) PASS: lldb-api :: lang/objc/unicode-string/TestUnicodeString.py (1289 of 1807) PASS: lldb-api :: functionalities/inferior-assert/TestInferiorAssert.py (1290 of 1807) PASS: lldb-api :: lang/c/enum_types/TestEnumTypes.py (1291 of 1807) PASS: lldb-unit :: Utility/./UtilityTests/FileSpecTest.CopyByAppendingPathComponent (1292 of 1807) PASS: lldb-api :: lang/objc/global_ptrs/TestGlobalObjects.py (1293 of 1807) PASS: lldb-shell :: SymbolFile/DWARF/find-qualified-variable.cpp (1294 of 1807) PASS: lldb-shell :: Commands/command-regex-delete.test (1295 of 1807) PASS: lldb-unit :: Process/minidump/./LLDBMinidumpTests/MinidumpParserTest.GetThreadContext_x86_32_wow64 (1296 of 1807) PASS: lldb-api :: python_api/file_handle/TestFileHandle.py (1297 of 1807) PASS: lldb-unit :: Host/./HostTests/FileSystemTest.Resolve (1298 of 1807) PASS: lldb-api :: python_api/lldbutil/frame/TestFrameUtils.py (1299 of 1807) PASS: lldb-api :: python_api/sblaunchinfo/TestSBLaunchInfo.py (1300 of 1807) PASS: lldb-api :: functionalities/tail_call_frames/thread_step_out_or_return/TestSteppingOutWithArtificialFrames.py (1301 of 1807) PASS: lldb-unit :: Utility/./UtilityTests/RangeTest.ContainsAddr (1302 of 1807) PASS: lldb-unit :: Expression/./ExpressionTests/CppModuleConfigurationTest.AmbiguousLibCpp (1303 of 1807) PASS: lldb-api :: python_api/exprpath_synthetic/TestExprPathSynthetic.py (1304 of 1807) PASS: lldb-unit :: Utility/./UtilityTests/BinaryStreamTest.PutSLEB128OneByte (1305 of 1807) PASS: lldb-api :: functionalities/tail_call_frames/thread_step_out_message/TestArtificialFrameStepOutMessage.py (1306 of 1807) PASS: lldb-unit :: Process/minidump/./LLDBMinidumpTests/MinidumpParserTest.MinidumpModuleOrder (1307 of 1807) PASS: lldb-shell :: Driver/TestRepl.test (1308 of 1807) PASS: lldb-unit :: Utility/./UtilityTests/UriParserTest.Minimal (1309 of 1807) PASS: lldb-api :: python_api/objc_type/TestObjCType.py (1310 of 1807) PASS: lldb-unit :: Expression/./ExpressionTests/CppModuleConfigurationTest.Sysroot (1311 of 1807) PASS: lldb-api :: commands/target/create-deps/TestTargetCreateDeps.py (1312 of 1807) PASS: lldb-api :: api/command-return-object/TestSBCommandReturnObject.py (1313 of 1807) PASS: lldb-api :: functionalities/paths/TestPaths.py (1314 of 1807) PASS: lldb-unit :: SymbolFile/NativePDB/./SymbolFileNativePDBTests/PDBFPOProgramToDWARFExpressionTests.MissingTargetRegister (1315 of 1807) PASS: lldb-unit :: Utility/./UtilityTests/DataExtractorTest.GetCStr (1316 of 1807) PASS: lldb-api :: commands/watchpoints/multiple_hits/TestMultipleHits.py (1317 of 1807) PASS: lldb-api :: functionalities/thread/concurrent_events/TestConcurrentWatchBreakDelay.py (1318 of 1807) PASS: lldb-unit :: Target/./TargetTests/ExecutionContextTest.GetByteOrderProcess (1319 of 1807) PASS: lldb-unit :: Host/./HostTests/HostInfoTest.GetAugmentedArchSpec (1320 of 1807) PASS: lldb-shell :: ObjectFile/MachO/symtab.yaml (1321 of 1807) PASS: lldb-api :: functionalities/signal/handle-abrt/TestHandleAbort.py (1322 of 1807) PASS: lldb-unit :: Language/Highlighting/./HighlighterTests/HighlighterTest.ClangCursorPosBeforeOtherToken (1323 of 1807) PASS: lldb-api :: commands/apropos/with-process/TestAproposWithProcess.py (1324 of 1807) PASS: lldb-api :: functionalities/jitloader_gdb/TestJITLoaderGDB.py (1325 of 1807) PASS: lldb-api :: python_api/interpreter/TestRunCommandInterpreterAPI.py (1326 of 1807) PASS: lldb-unit :: ScriptInterpreter/Python/./ScriptInterpreterPythonTests/PythonDataObjectsTest.TestPythonString (1327 of 1807) PASS: lldb-api :: lang/cpp/global_variables/TestCPPGlobalVariables.py (1328 of 1807) PASS: lldb-unit :: Utility/./UtilityTests/BinaryStreamTest.PutULEB128OneByte (1329 of 1807) PASS: lldb-api :: functionalities/breakpoint/breakpoint_command/TestBreakpointCommandsFromPython.py (1330 of 1807) PASS: lldb-shell :: ObjectFile/ELF/section-addresses.yaml (1331 of 1807) PASS: lldb-unit :: Utility/./UtilityTests/StringListTest.ShiftCString (1332 of 1807) PASS: lldb-unit :: Utility/./UtilityTests/StatusTest.ErrorConstructor (1333 of 1807) PASS: lldb-unit :: Utility/./UtilityTests/BinaryStreamTest.PutSLEB128SevenBytes (1334 of 1807) PASS: lldb-api :: lang/objc/conflicting-definition/TestConflictingDefinition.py (1335 of 1807) PASS: lldb-api :: lang/objc/orderedset/TestOrderedSet.py (1336 of 1807) PASS: lldb-unit :: Utility/./UtilityTests/StringListTest.GetMaxStringLengthMixed (1337 of 1807) PASS: lldb-unit :: Process/minidump/./LLDBMinidumpTests/MinidumpParserTest.FindMemoryRangeWithFullMemoryMinidump (1338 of 1807) PASS: lldb-unit :: Utility/./UtilityTests/ProcessInstanceInfo.DumpTable (1339 of 1807) PASS: lldb-shell :: SymbolFile/DWARF/debug-types-basic.test (1340 of 1807) PASS: lldb-api :: macosx/function-starts/TestFunctionStarts.py (1341 of 1807) PASS: lldb-unit :: Target/./TargetTests/ModuleCacheTest.GetAndPutUuidExists (1342 of 1807) PASS: lldb-shell :: SymbolFile/NativePDB/ast-functions.cpp (1343 of 1807) PASS: lldb-api :: functionalities/postmortem/elf-core/TestLinuxCore.py (1344 of 1807) PASS: lldb-api :: types/TestRecursiveTypes.py (1345 of 1807) PASS: lldb-unit :: Utility/./UtilityTests/RegularExpression.Match (1346 of 1807) PASS: lldb-unit :: Interpreter/./InterpreterTests/CompletionTest.FileCompletionAbsolute (1347 of 1807) PASS: lldb-unit :: Utility/./UtilityTests/ArgsTest.TestMultipleArgs (1348 of 1807) UNSUPPORTED: lldb-api :: functionalities/data-formatter/data-formatter-stl/libstdcpp/map/TestDataFormatterStdMap.py (1349 of 1807) PASS: lldb-api :: lang/objc/real-definition/TestRealDefinition.py (1350 of 1807) PASS: lldb-api :: python_api/section/TestSectionAPI.py (1351 of 1807) PASS: lldb-shell :: Commands/command-regex-unalias.test (1352 of 1807) PASS: lldb-unit :: Utility/./UtilityTests/StringExtractorTest.GetNameColonValueNoSemicolon (1353 of 1807) PASS: lldb-api :: commands/expression/calculator_mode/TestCalculatorMode.py (1354 of 1807) PASS: lldb-unit :: Utility/./UtilityTests/StreamTest.PutHex8 (1355 of 1807) PASS: lldb-api :: functionalities/postmortem/minidump/TestMiniDump.py (1356 of 1807) PASS: lldb-api :: lang/cpp/dynamic-value-same-basename/TestDynamicValueSameBase.py (1357 of 1807) PASS: lldb-unit :: Utility/./UtilityTests/StringExtractorTest.GetHexU8_Underflow2 (1358 of 1807) PASS: lldb-shell :: Commands/CommandScriptImmediateOutput/CommandScriptImmediateOutputConsole.test (1359 of 1807) PASS: lldb-api :: lang/cpp/diamond/TestDiamond.py (1360 of 1807) PASS: lldb-unit :: ObjectFile/Breakpad/./ObjectFileBreakpadTests/StackCFIRecord.parse (1361 of 1807) PASS: lldb-unit :: Utility/./UtilityTests/UriParserTest.MinimalPort (1362 of 1807) PASS: lldb-unit :: Utility/./UtilityTests/StringExtractorTest.GetHexBytesAvail_Partial (1363 of 1807) PASS: lldb-shell :: Commands/command-source.test (1364 of 1807) PASS: lldb-api :: commands/expression/namespace_local_var_same_name_obj_c/TestNamespaceLocalVarSameNameObjC.py (1365 of 1807) PASS: lldb-unit :: Utility/./UtilityTests/LogTest.Register (1366 of 1807) PASS: lldb-unit :: Utility/./UtilityTests/StringExtractorTest.GetHexU8_Extra (1367 of 1807) PASS: lldb-api :: commands/expression/no-deadlock/TestExprDoesntBlock.py (1368 of 1807) PASS: lldb-api :: commands/quit/TestQuit.py (1369 of 1807) PASS: lldb-shell :: BuildScript/script-args.test (1370 of 1807) PASS: lldb-shell :: SymbolFile/DWARF/anon_class_w_and_wo_export_symbols.ll (1371 of 1807) PASS: lldb-api :: python_api/sbdata/TestSBData.py (1372 of 1807) PASS: lldb-api :: functionalities/data-formatter/frameformat_smallstruct/TestFrameFormatSmallStruct.py (1373 of 1807) UNSUPPORTED: lldb-shell :: SymbolFile/PDB/expressions.test (1374 of 1807) UNSUPPORTED: lldb-shell :: SymbolFile/PDB/variables.test (1375 of 1807) PASS: lldb-shell :: SymbolFile/DWARF/debug-types-dwo-cross-reference.cpp (1376 of 1807) PASS: lldb-unit :: Utility/./UtilityTests/FileSpecTest.GuessPathStyle (1377 of 1807) PASS: lldb-unit :: Utility/./UtilityTests/StringListTest.Assignment (1378 of 1807) PASS: lldb-api :: macosx/nslog/TestDarwinNSLogOutput.py (1379 of 1807) PASS: lldb-unit :: Utility/./UtilityTests/AnsiTerminal.AtEnd (1380 of 1807) PASS: lldb-shell :: ObjectFile/ELF/compressed-sections.yaml (1381 of 1807) PASS: lldb-unit :: UnwindAssembly/x86/./UnwindAssemblyx86Tests/Testx86AssemblyInspectionEngine.Testi386IgnoredRegisters (1382 of 1807) PASS: lldb-shell :: ObjectFile/PECOFF/basic-info.yaml (1383 of 1807) PASS: lldb-api :: lang/cpp/lambdas/TestLambdas.py (1384 of 1807) PASS: lldb-shell :: SymbolFile/DWARF/compilercontext.ll (1385 of 1807) PASS: lldb-unit :: Process/gdb-remote/./ProcessGdbRemoteTests/GDBRemoteCommunicationClientTest.ReadRegister (1386 of 1807) PASS: lldb-api :: tools/lldb-server/TestGdbRemoteProcessInfo.py (1387 of 1807) PASS: lldb-unit :: Host/./HostTests/SocketAddressTest.Set (1388 of 1807) PASS: lldb-api :: lang/cpp/exceptions/TestCPPExceptionBreakpoints.py (1389 of 1807) PASS: lldb-api :: functionalities/thread/concurrent_events/TestConcurrentCrashWithSignal.py (1390 of 1807) PASS: lldb-unit :: Process/gdb-remote/./ProcessGdbRemoteTests/GDBRemoteClientBaseTest.SendContinueAndLateInterrupt (1391 of 1807) PASS: lldb-unit :: Utility/./UtilityTests/ArgsTest.TestTrailingBackslash (1392 of 1807) PASS: lldb-unit :: Expression/./ExpressionTests/DiagnosticManagerTest.AppendMessageNoDiag (1393 of 1807) PASS: lldb-api :: functionalities/step-avoids-no-debug/TestStepNoDebug.py (1394 of 1807) PASS: lldb-api :: functionalities/thread/concurrent_events/TestConcurrentTwoWatchpointsOneBreakpoint.py (1395 of 1807) UNSUPPORTED: lldb-api :: functionalities/data-formatter/data-formatter-stl/libstdcpp/vector/TestDataFormatterStdVector.py (1396 of 1807) PASS: lldb-unit :: Language/Highlighting/./HighlighterTests/HighlighterTest.ClangStringLiterals (1397 of 1807) PASS: lldb-api :: commands/expression/persistent_variables/TestPersistentVariables.py (1398 of 1807) PASS: lldb-api :: functionalities/data-formatter/compactvectors/TestCompactVectors.py (1399 of 1807) PASS: lldb-api :: lang/objc/foundation/TestObjCMethods2.py (1400 of 1807) PASS: lldb-unit :: Utility/./UtilityTests/StringExtractorTest.GetHexU8_InvalidHex (1401 of 1807) UNSUPPORTED: lldb-api :: commands/expression/completion-crash-incomplete-record/TestCompletionCrashIncompleteRecord.py (1402 of 1807) PASS: lldb-unit :: Utility/./UtilityTests/CompletionRequest.ShiftArguments (1403 of 1807) PASS: lldb-api :: functionalities/data-formatter/data-formatter-skip-summary/TestDataFormatterSkipSummary.py (1404 of 1807) PASS: lldb-unit :: Utility/./UtilityTests/TimeoutTest.Format (1405 of 1807) PASS: lldb-unit :: Process/minidump/./LLDBMinidumpTests/MinidumpParserTest.GetThreadContext_x86_32 (1406 of 1807) PASS: lldb-shell :: Reproducer/TestGDBRemoteRepro.test (1407 of 1807) UNSUPPORTED: lldb-shell :: ObjectFile/ELF/minidebuginfo-set-and-hit-breakpoint.test (1408 of 1807) PASS: lldb-shell :: Settings/TestSettingsSet.test (1409 of 1807) PASS: lldb-api :: functionalities/load_using_paths/TestLoadUsingPaths.py (1410 of 1807) PASS: lldb-api :: functionalities/tail_call_frames/disambiguate_call_site/TestDisambiguateCallSite.py (1411 of 1807) PASS: lldb-unit :: Utility/./UtilityTests/DataExtractorTest.GetCStrAtNullOffset (1412 of 1807) PASS: lldb-unit :: Utility/./UtilityTests/ScalarTest.RightShiftOperator (1413 of 1807) UNSUPPORTED: lldb-shell :: Unwind/unwind-plan-dwarf-dump.test (1414 of 1807) PASS: lldb-api :: functionalities/memory/cache/TestMemoryCache.py (1415 of 1807) PASS: lldb-api :: lang/cpp/function_refs/TestFunctionRefs.py (1416 of 1807) PASS: lldb-unit :: Utility/./UtilityTests/Flags.Reset (1417 of 1807) PASS: lldb-unit :: Utility/./UtilityTests/SerializationRountripTest.SerializeDeserializeObjectPointer (1418 of 1807) PASS: lldb-shell :: SymbolFile/DWARF/split-dwarf-multiple-cu.ll (1419 of 1807) PASS: lldb-api :: commands/expression/import-std-module/basic/TestImportStdModule.py (1420 of 1807) PASS: lldb-api :: commands/watchpoints/watchpoint_size/TestWatchpointSizes.py (1421 of 1807) PASS: lldb-api :: functionalities/value_md5_crash/TestValueMD5Crash.py (1422 of 1807) PASS: lldb-api :: api/multiple-targets/TestMultipleTargets.py (1423 of 1807) PASS: lldb-api :: functionalities/data-formatter/data-formatter-stl/libcxx/multimap/TestDataFormatterLibccMultiMap.py (1424 of 1807) PASS: lldb-shell :: SymbolFile/DWARF/clang-ast-from-dwarf-unamed-and-anon-structs.cpp (1425 of 1807) PASS: lldb-shell :: SymbolFile/DWARF/dir-separator-windows.s (1426 of 1807) PASS: lldb-unit :: Process/minidump/./LLDBMinidumpTests/MinidumpParserTest.GetLinuxProcStatus_no_stream (1427 of 1807) PASS: lldb-api :: functionalities/thread/concurrent_events/TestConcurrentSignalWatchBreak.py (1428 of 1807) PASS: lldb-api :: lang/c/strings/TestCStrings.py (1429 of 1807) PASS: lldb-unit :: Utility/./UtilityTests/ArgsTest.ReplaceArgumentAtIndexShort (1430 of 1807) PASS: lldb-api :: lang/cpp/char1632_t/TestChar1632T.py (1431 of 1807) PASS: lldb-api :: commands/expression/entry-bp/TestExprEntryBP.py (1432 of 1807) PASS: lldb-unit :: UnwindAssembly/x86/./UnwindAssemblyx86Tests/Testx86AssemblyInspectionEngine.TestPopRBP (1433 of 1807) UNSUPPORTED: lldb-api :: functionalities/thread/concurrent_events/TestConcurrentManySignals.py (1434 of 1807) PASS: lldb-unit :: UnwindAssembly/x86/./UnwindAssemblyx86Tests/Testx86AssemblyInspectionEngine.TestSpillRegToStackViaMOVx86_64 (1435 of 1807) PASS: lldb-api :: lang/cpp/limit-debug-info/TestWithLimitDebugInfo.py (1436 of 1807) PASS: lldb-unit :: Process/gdb-remote/./ProcessGdbRemoteTests/GDBRemoteCommunicationClientTest.GetModulesInfoInvalidResponse (1437 of 1807) PASS: lldb-api :: functionalities/gdb_remote_client/TestTargetXMLArch.py (1438 of 1807) PASS: lldb-unit :: Utility/./UtilityTests/StringListTest.ShiftMove (1439 of 1807) UNSUPPORTED: lldb-api :: commands/watchpoints/hello_watchlocation/TestWatchLocation.py (1440 of 1807) PASS: lldb-api :: functionalities/data-formatter/data-formatter-synthtype/TestDataFormatterSynthType.py (1441 of 1807) PASS: lldb-api :: tools/lldb-server/TestGdbRemoteRegisterState.py (1442 of 1807) PASS: lldb-api :: tools/lldb-server/TestGdbRemoteThreadsInStopReply.py (1443 of 1807) PASS: lldb-unit :: Process/minidump/./LLDBMinidumpTests/MinidumpParserTest.GetThreadContext_x86_64 (1444 of 1807) PASS: lldb-shell :: Reproducer/Functionalities/TestDataFormatter.test (1445 of 1807) PASS: lldb-shell :: SymbolFile/NativePDB/s_constant.cpp (1446 of 1807) UNSUPPORTED: lldb-shell :: SymbolFile/PDB/func-symbols.test (1447 of 1807) PASS: lldb-shell :: Breakpoint/case-sensitive.test (1448 of 1807) PASS: lldb-unit :: Expression/./ExpressionTests/DiagnosticManagerTest.GetStringMultiline (1449 of 1807) PASS: lldb-unit :: Target/./TargetTests/PathMappingListTest.RemapRoot (1450 of 1807) PASS: lldb-unit :: Utility/./UtilityTests/StringLexerTest.PutBack (1451 of 1807) PASS: lldb-api :: functionalities/data-formatter/data-formatter-stl/libcxx/set/TestDataFormatterLibcxxSet.py (1452 of 1807) PASS: lldb-api :: commands/frame/diagnose/complicated-expression/TestComplicatedExpression.py (1453 of 1807) PASS: lldb-shell :: SymbolFile/DWARF/debug-types-line-tables.s (1454 of 1807) PASS: lldb-shell :: Reproducer/TestFileRepro.test (1455 of 1807) PASS: lldb-api :: functionalities/gdb_remote_client/TestRestartBug.py (1456 of 1807) PASS: lldb-api :: commands/command/script_alias/TestCommandScriptAlias.py (1457 of 1807) PASS: lldb-unit :: UnwindAssembly/x86/./UnwindAssemblyx86Tests/Testx86AssemblyInspectionEngine.TestPopEBX (1458 of 1807) PASS: lldb-unit :: Utility/./UtilityTests/LogChannelEnabledTest.log_options (1459 of 1807) PASS: lldb-unit :: Utility/./UtilityTests/StringExtractorTest.GetHexU8_Underflow2_NoEof (1460 of 1807) PASS: lldb-api :: python_api/watchpoint/watchlocation/TestTargetWatchAddress.py (1461 of 1807) PASS: lldb-unit :: Utility/./UtilityTests/RangeTest.SizeTypes (1462 of 1807) PASS: lldb-shell :: Quit/TestQuitExitCodeTooManyArgs.test (1463 of 1807) PASS: lldb-unit :: Utility/./UtilityTests/BinaryStreamTest.PutSLEB128Zero (1464 of 1807) PASS: lldb-shell :: ObjectFile/Breakpad/sections-trailing-func.test (1465 of 1807) PASS: lldb-unit :: Symbol/./SymbolTests/DWARFCallFrameInfoTest.Basic_eh (1466 of 1807) PASS: lldb-api :: python_api/symbol-context/two-files/TestSymbolContextTwoFiles.py (1467 of 1807) PASS: lldb-api :: python_api/function_symbol/TestDisasmAPI.py (1468 of 1807) PASS: lldb-unit :: UnwindAssembly/x86/./UnwindAssemblyx86Tests/Testx86AssemblyInspectionEngine.TestPopESI (1469 of 1807) UNSUPPORTED: lldb-api :: functionalities/longjmp/TestLongjmp.py (1470 of 1807) PASS: lldb-unit :: tools/lldb-server/tests/./LLDBServerTests/TestBase.DebugserverEnv (1471 of 1807) UNSUPPORTED: lldb-shell :: SymbolFile/PDB/ast-restore.test (1472 of 1807) PASS: lldb-unit :: Utility/./UtilityTests/DataExtractorTest.PeekData (1473 of 1807) PASS: lldb-shell :: ObjectFile/ELF/netbsd-core-amd64.test (1474 of 1807) PASS: lldb-api :: lang/cpp/stl/TestSTL.py (1475 of 1807) PASS: lldb-api :: commands/process/attach/TestProcessAttach.py (1476 of 1807) PASS: lldb-api :: functionalities/breakpoint/source_regexp/TestSourceRegexBreakpoints.py (1477 of 1807) PASS: lldb-api :: functionalities/breakpoint/breakpoint_hit_count/TestBreakpointHitCount.py (1478 of 1807) PASS: lldb-unit :: Process/minidump/./LLDBMinidumpTests/MinidumpParserTest.GetExceptionStream (1479 of 1807) PASS: lldb-shell :: SymbolFile/NativePDB/bitfields.cpp (1480 of 1807) UNSUPPORTED: lldb-shell :: Breakpoint/case-insensitive.test (1481 of 1807) PASS: lldb-api :: functionalities/inferior-crashing/TestInferiorCrashingStep.py (1482 of 1807) UNSUPPORTED: lldb-api :: functionalities/darwin_log/filter/exact_match/subsystem/TestDarwinLogFilterMatchSubsystem.py (1483 of 1807) PASS: lldb-api :: functionalities/dead-strip/TestDeadStrip.py (1484 of 1807) PASS: lldb-api :: commands/expression/rdar42038760/TestScalarURem.py (1485 of 1807) PASS: lldb-api :: lang/objc/foundation/TestSymbolTable.py (1486 of 1807) PASS: lldb-unit :: Utility/./UtilityTests/ArgsTest.GetQuotedCommandString (1487 of 1807) PASS: lldb-unit :: Utility/./UtilityTests/Predicate.WaitForValueEqualTo (1488 of 1807) PASS: lldb-api :: commands/gui/invalid-args/TestInvalidArgsGui.py (1489 of 1807) PASS: lldb-api :: macosx/universal/TestUniversal.py (1490 of 1807) PASS: lldb-unit :: Utility/./UtilityTests/SerializationRountripTest.SerializeDeserializePod (1491 of 1807) PASS: lldb-unit :: Utility/./UtilityTests/ScalarTest.Scalar_512 (1492 of 1807) PASS: lldb-unit :: Utility/./UtilityTests/StringExtractorTest.GetHexBytes_OddPair2 (1493 of 1807) PASS: lldb-shell :: Minidump/Windows/Sigsegv/sigsegv.test (1494 of 1807) PASS: lldb-api :: functionalities/var_path/TestVarPath.py (1495 of 1807) PASS: lldb-api :: commands/expression/namespace_local_var_same_name_cpp_and_c/TestNamespaceLocalVarSameNameCppAndC.py (1496 of 1807) PASS: lldb-unit :: Utility/./UtilityTests/UriParserTest.BadPort2 (1497 of 1807) PASS: lldb-unit :: Utility/./UtilityTests/StringExtractorTest.GetHexBytes_OddPair (1498 of 1807) PASS: lldb-api :: tools/lldb-server/commandline/TestStubSetSID.py (1499 of 1807) PASS: lldb-api :: lang/c/shared_lib/TestSharedLib.py (1500 of 1807) PASS: lldb-unit :: Process/gdb-remote/./ProcessGdbRemoteTests/GDBRemoteCommunicationServerTest.SendErrorResponse_UnimplementedError (1501 of 1807) PASS: lldb-unit :: Utility/./UtilityTests/ProcessInstanceInfoMatch.Name (1502 of 1807) PASS: lldb-unit :: Utility/./UtilityTests/RangeTest.DoesIntersect (1503 of 1807) PASS: lldb-unit :: Core/./LLDBCoreTests/MangledTest.NameIndexes_FindFunctionSymbols (1504 of 1807) UNSUPPORTED: lldb-api :: functionalities/tsan/basic/TestTsanBasic.py (1505 of 1807) PASS: lldb-unit :: Target/./TargetTests/ModuleCacheTest.GetAndPutStrangeHostname (1506 of 1807) PASS: lldb-api :: lang/objc/foundation/TestConstStrings.py (1507 of 1807) PASS: lldb-api :: lang/objc/modules-auto-import/TestModulesAutoImport.py (1508 of 1807) PASS: lldb-shell :: Settings/TestFrameFormatColor.test (1509 of 1807) PASS: lldb-unit :: Utility/./UtilityTests/VMRange.Clear (1510 of 1807) PASS: lldb-api :: functionalities/thread/concurrent_events/TestConcurrentDelaySignalWatch.py (1511 of 1807) PASS: lldb-unit :: Utility/./UtilityTests/ConstStringTest.format_provider (1512 of 1807) PASS: lldb-unit :: Host/./HostTests/NativeProcessProtocolTest.ReadMemoryWithoutTrap (1513 of 1807) PASS: lldb-unit :: Utility/./UtilityTests/StreamTeeTest.Flush (1514 of 1807) PASS: lldb-shell :: Reproducer/Functionalities/TestExpressionEvaluation.test (1515 of 1807) UNSUPPORTED: lldb-api :: lang/objc/rdar-12408181/TestRdar12408181.py (1516 of 1807) PASS: lldb-api :: python_api/process/read-mem-cstring/TestReadMemCString.py (1517 of 1807) PASS: lldb-api :: lang/cpp/frame-var-anon-unions/TestFrameVariableAnonymousUnions.py (1518 of 1807) PASS: lldb-unit :: Utility/./UtilityTests/DataExtractorTest.GetBitfield (1519 of 1807) PASS: lldb-shell :: SymbolFile/DWARF/find-variable-dwo.cpp (1520 of 1807) PASS: lldb-api :: lang/cpp/virtual-overload/TestVirtualOverload.py (1521 of 1807) PASS: lldb-unit :: Utility/./UtilityTests/Flags.AnySet (1522 of 1807) PASS: lldb-shell :: ObjectFile/ELF/PT_LOAD-overlap-PT_TLS.yaml (1523 of 1807) UNSUPPORTED: lldb-api :: functionalities/unwind/standard/TestStandardUnwind.py (1524 of 1807) PASS: lldb-unit :: Host/./HostTests/FileSystemTest.FileAndDirectoryComponents (1525 of 1807) PASS: lldb-unit :: Language/Highlighting/./HighlighterTests/HighlighterTest.ClangTrailingBackslashBeforeNewline (1526 of 1807) PASS: lldb-api :: commands/expression/import-std-module/unique_ptr-dbg-info-content/TestUniquePtrDbgInfoContent.py (1527 of 1807) PASS: lldb-unit :: Utility/./UtilityTests/AnsiTerminal.Unknown (1528 of 1807) UNSUPPORTED: lldb-shell :: Process/Windows/exception_access_violation.cpp (1529 of 1807) PASS: lldb-unit :: Utility/./UtilityTests/StringLexerTest.NextIf (1530 of 1807) PASS: lldb-unit :: Target/./TargetTests/MemoryRegionInfoTest.Formatv (1531 of 1807) PASS: lldb-api :: functionalities/data-formatter/summary-string-onfail/Test-rdar-9974002.py (1532 of 1807) PASS: lldb-unit :: Process/gdb-remote/./ProcessGdbRemoteTests/GDBRemoteCommunicationClientTest.GetMemoryRegionInfo (1533 of 1807) PASS: lldb-shell :: Quit/TestQuitExitCode30.test (1534 of 1807) PASS: lldb-api :: commands/watchpoints/watchpoint_commands/TestWatchpointCommands.py (1535 of 1807) PASS: lldb-unit :: UnwindAssembly/x86/./UnwindAssemblyx86Tests/Testx86AssemblyInspectionEngine.TestPushEBP (1536 of 1807) PASS: lldb-unit :: Expression/./ExpressionTests/CppModuleConfigurationTest.LinuxLocalLibCpp (1537 of 1807) PASS: lldb-api :: functionalities/data-formatter/stringprinter/TestStringPrinter.py (1538 of 1807) PASS: lldb-unit :: ScriptInterpreter/Python/./ScriptInterpreterPythonTests/PythonDataObjectsTest.TestDictionaryResolutionWithDot (1539 of 1807) PASS: lldb-api :: commands/watchpoints/multiple_threads/TestWatchpointMultipleThreads.py (1540 of 1807) PASS: lldb-unit :: Utility/./UtilityTests/StreamTest.PutChar (1541 of 1807) PASS: lldb-unit :: ScriptInterpreter/Python/./ScriptInterpreterPythonTests/PythonDataObjectsTest.TestObjectAttributes (1542 of 1807) UNSUPPORTED: lldb-api :: commands/register/register/intel_xtended_registers/mpx_bound_violation/TestBoundViolation.py (1543 of 1807) PASS: lldb-unit :: Host/./HostTests/File.GetStreamFromDescriptor (1544 of 1807) PASS: lldb-unit :: Utility/./UtilityTests/AnsiTerminal.KnownPrefix (1545 of 1807) PASS: lldb-unit :: Utility/./UtilityTests/DataExtractorTest.GetMaxU64_unchecked (1546 of 1807) PASS: lldb-api :: functionalities/thread/concurrent_events/TestConcurrentBreakpointDelayBreakpointOneSignal.py (1547 of 1807) PASS: lldb-api :: lang/objcxx/class-name-clash/TestNameClash.py (1548 of 1807) PASS: lldb-api :: functionalities/tail_call_frames/disambiguate_tail_call_seq/TestDisambiguateTailCallSeq.py (1549 of 1807) PASS: lldb-unit :: Expression/./ExpressionTests/DiagnosticManagerTest.AddDiagnostic (1550 of 1807) UNSUPPORTED: lldb-api :: benchmarks/expression/TestExpressionCmd.py (1551 of 1807) PASS: lldb-unit :: debugserver/./debugserverTests/RNBSocket.LoopBackListenIPv4 (1552 of 1807) PASS: lldb-unit :: SymbolFile/DWARF/./SymbolFileDWARFTests/SymbolFileDWARFTests.TestAbbrevMissingTerminator (1553 of 1807) UNSUPPORTED: lldb-api :: functionalities/data-formatter/data-formatter-stl/libstdcpp/smart_ptr/TestDataFormatterStdSmartPtr.py (1554 of 1807) PASS: lldb-api :: lang/c/blocks/TestBlocks.py (1555 of 1807) PASS: lldb-unit :: Utility/./UtilityTests/StreamTeeTest.SetStreamAtIndexOutOfBounds (1556 of 1807) PASS: lldb-api :: lang/objc/ivar-IMP/TestObjCiVarIMP.py (1557 of 1807) PASS: lldb-api :: commands/frame/diagnose/dereference-argument/TestDiagnoseDereferenceArgument.py (1558 of 1807) PASS: lldb-api :: python_api/frame/TestFrames.py (1559 of 1807) PASS: lldb-unit :: Process/gdb-remote/./ProcessGdbRemoteTests/GDBRemoteClientBaseTest.SendPacketAndReceiveResponseWithOutputSupport (1560 of 1807) PASS: lldb-api :: functionalities/breakpoint/step_over_breakpoint/TestStepOverBreakpoint.py (1561 of 1807) PASS: lldb-api :: functionalities/data-formatter/data-formatter-synth/TestDataFormatterSynth.py (1562 of 1807) PASS: lldb-shell :: ObjectFile/ELF/section-types-edgecases.yaml (1563 of 1807) PASS: lldb-api :: python_api/lldbutil/iter/TestLLDBIterator.py (1564 of 1807) PASS: lldb-unit :: Core/./LLDBCoreTests/MangledTest.EmptyForInvalidName (1565 of 1807) UNSUPPORTED: lldb-api :: tools/lldb-server/libraries-svr4/TestGdbRemoteLibrariesSvr4Support.py (1566 of 1807) PASS: lldb-shell :: ObjectFile/PECOFF/basic-info-arm.yaml (1567 of 1807) PASS: lldb-api :: functionalities/inferior-crashing/TestInferiorCrashing.py (1568 of 1807) PASS: lldb-api :: lang/cpp/type_lookup/TestCppTypeLookup.py (1569 of 1807) PASS: lldb-shell :: SymbolFile/NativePDB/globals-fundamental.cpp (1570 of 1807) PASS: lldb-api :: macosx/duplicate-archive-members/TestDuplicateMembers.py (1571 of 1807) PASS: lldb-api :: lang/cpp/stl/TestStdCXXDisassembly.py (1572 of 1807) UNSUPPORTED: lldb-shell :: ObjectFile/ELF/minidebuginfo-no-lzma.yaml (1573 of 1807) PASS: lldb-api :: commands/expression/radar_9531204/TestPrintfAfterUp.py (1574 of 1807) PASS: lldb-unit :: Symbol/./SymbolTests/SymbolsTest.LocateExecutableSymbolFileForUnknownExecutableAndMissingSymbolFile (1575 of 1807) UNSUPPORTED: lldb-api :: macosx/macabi/TestMacABImacOSFramework.py (1576 of 1807) PASS: lldb-api :: commands/apropos/basic/TestApropos.py (1577 of 1807) PASS: lldb-unit :: Host/./HostTests/ProcessLaunchInfoTest.Constructor (1578 of 1807) PASS: lldb-unit :: Utility/./UtilityTests/CompletionRequest.TryCompleteCurrentArgGood (1579 of 1807) PASS: lldb-api :: functionalities/inferior-changed/TestInferiorChanged.py (1580 of 1807) PASS: lldb-api :: functionalities/non-overlapping-index-variable-i/TestIndexVariable.py (1581 of 1807) PASS: lldb-unit :: Utility/./UtilityTests/StringListTest.AppendStringStdString (1582 of 1807) PASS: lldb-unit :: Language/Highlighting/./HighlighterTests/HighlighterTest.ClangPPDirectives (1583 of 1807) PASS: lldb-unit :: Utility/./UtilityTests/DataExtractorTest.GetCStrUnterminated (1584 of 1807) PASS: lldb-unit :: Utility/./UtilityTests/StreamTest.PutCString (1585 of 1807) PASS: lldb-unit :: Utility/./UtilityTests/Flags.Test (1586 of 1807) PASS: lldb-api :: commands/expression/options/TestExprOptions.py (1587 of 1807) PASS: lldb-unit :: Utility/./UtilityTests/ScalarTest.Division (1588 of 1807) PASS: lldb-unit :: Utility/./UtilityTests/StringListTest.GetMaxStringLengthIncreasingSize (1589 of 1807) PASS: lldb-api :: functionalities/testid/TestTestId.py (1590 of 1807) PASS: lldb-api :: lang/objc/objc-foundation-dictionary-empty/TestNSDictionary0.py (1591 of 1807) PASS: lldb-api :: functionalities/data-formatter/data-formatter-python-synth/TestDataFormatterPythonSynth.py (1592 of 1807) PASS: lldb-unit :: Utility/./UtilityTests/ArgsTest.ReplaceArgumentAtIndexOutOfRange (1593 of 1807) PASS: lldb-shell :: ObjectFile/ELF/PT_LOAD-empty.yaml (1594 of 1807) PASS: lldb-unit :: Utility/./UtilityTests/SerializationRountripTest.SerializeDeserializePodReferences (1595 of 1807) PASS: lldb-api :: commands/frame/diagnose/inheritance/TestDiagnoseInheritance.py (1596 of 1807) PASS: lldb-unit :: Language/Highlighting/./HighlighterTests/HighlighterTest.ClangTrailingBackslashWithWhitespace (1597 of 1807) PASS: lldb-api :: commands/register/register/register_command/TestRegisters.py (1598 of 1807) PASS: lldb-api :: commands/watchpoints/watchpoint_events/TestWatchpointEvents.py (1599 of 1807) PASS: lldb-api :: sample_test/TestSampleTest.py (1600 of 1807) PASS: lldb-unit :: UnwindAssembly/x86/./UnwindAssemblyx86Tests/Testx86AssemblyInspectionEngine.TestPushEDI (1601 of 1807) PASS: lldb-api :: lang/cpp/extern_c/TestExternCSymbols.py (1602 of 1807) PASS: lldb-unit :: Utility/./UtilityTests/DataExtractorTest.GetCStrEmpty (1603 of 1807) UNSUPPORTED: lldb-shell :: Register/aarch64-fp-read.test (1604 of 1807) PASS: lldb-unit :: Utility/./UtilityTests/ArgsTest.TestInsertArg (1605 of 1807) PASS: lldb-unit :: Utility/./UtilityTests/RegularExpression.Invalid (1606 of 1807) PASS: lldb-api :: commands/expression/import-std-module/deque-dbg-info-content/TestDbgInfoContentDeque.py (1607 of 1807) PASS: lldb-unit :: Expression/./ExpressionTests/CppModuleConfigurationTest.UnknownLibCppFile (1608 of 1807) PASS: lldb-api :: lang/cpp/modules-import/TestCXXModulesImport.py (1609 of 1807) PASS: lldb-unit :: Symbol/./SymbolTests/TestClangASTContext.TestGetBasicTypeFromEnum (1610 of 1807) PASS: lldb-api :: functionalities/breakpoint/objc/TestObjCBreakpoints.py (1611 of 1807) PASS: lldb-api :: lang/c/register_variables/TestRegisterVariables.py (1612 of 1807) UNSUPPORTED: lldb-shell :: Register/x86-zmm-write.test (1613 of 1807) PASS: lldb-api :: functionalities/breakpoint/breakpoint_options/TestBreakpointOptions.py (1614 of 1807) PASS: lldb-api :: functionalities/data-formatter/var-in-aggregate-misuse/TestVarInAggregateMisuse.py (1615 of 1807) UNSUPPORTED: lldb-api :: benchmarks/startup/TestStartupDelays.py (1616 of 1807) PASS: lldb-unit :: Expression/./ExpressionTests/DiagnosticManagerTest.AppendMessageSubsequentDiags (1617 of 1807) PASS: lldb-unit :: Process/gdb-remote/./ProcessGdbRemoteTests/GDBRemoteClientBaseTest.InterruptNoResponse (1618 of 1807) PASS: lldb-unit :: Host/./HostTests/NativeProcessProtocolTest.SetBreakpoint (1619 of 1807) UNSUPPORTED: lldb-api :: linux/thread/create_during_instruction_step/TestCreateDuringInstructionStep.py (1620 of 1807) UNSUPPORTED: lldb-api :: api/multiple-debuggers/TestMultipleDebuggers.py (1621 of 1807) PASS: lldb-api :: macosx/lc-note/kern-ver-str/TestKernVerStrLCNOTE.py (1622 of 1807) PASS: lldb-unit :: Process/gdb-remote/./ProcessGdbRemoteTests/GDBRemoteCommunicationServerTest.SendErrorResponse_ErrorNumber (1623 of 1807) PASS: lldb-shell :: SymbolFile/DWARF/find-method-local-struct.cpp (1624 of 1807) PASS: lldb-api :: commands/target/dump-symtab-demangle/TestDumpSymtabDemangle.py (1625 of 1807) PASS: lldb-api :: tools/lldb-vscode/variables/TestVSCode_variables.py (1626 of 1807) PASS: lldb-api :: commands/expression/import-std-module/no-std-module/TestMissingStdModule.py (1627 of 1807) PASS: lldb-api :: commands/command/delete/TestCommandDelete.py (1628 of 1807) PASS: lldb-unit :: Utility/./UtilityTests/TimeoutTest.Construction (1629 of 1807) PASS: lldb-api :: lang/cpp/accelerator-table/TestCPPAccelerator.py (1630 of 1807) PASS: lldb-unit :: Language/Highlighting/./HighlighterTests/HighlighterTest.ClangScalarLiterals (1631 of 1807) PASS: lldb-unit :: Utility/./UtilityTests/LogChannelEnabledTest.LLDB_LOG_ERROR (1632 of 1807) PASS: lldb-api :: lang/objc/ptr_refs/TestPtrRefsObjC.py (1633 of 1807) PASS: lldb-shell :: Settings/TestFrameFormatNoColor.test (1634 of 1807) PASS: lldb-unit :: Utility/./UtilityTests/RangeTest.Clear (1635 of 1807) UNSUPPORTED: lldb-api :: functionalities/darwin_log/source/info/TestDarwinLogSourceInfo.py (1636 of 1807) PASS: lldb-unit :: Utility/./UtilityTests/TimerTest.CategoryTimesNested (1637 of 1807) PASS: lldb-unit :: Utility/./UtilityTests/BinaryStreamTest.PutSLEB128FourBytes (1638 of 1807) PASS: lldb-unit :: Host/./HostTests/MainLoopTest.ReadObject (1639 of 1807) PASS: lldb-shell :: ObjectFile/MachO/lc_build_version_notools.yaml (1640 of 1807) PASS: lldb-shell :: ObjectFile/ELF/PT_LOAD-overlap-PT_INTERP.yaml (1641 of 1807) PASS: lldb-api :: lang/c/inlines/TestRedefinitionsInInlines.py (1642 of 1807) PASS: lldb-unit :: Utility/./UtilityTests/ProcessInstanceInfo.DumpTable_invalidUID (1643 of 1807) PASS: lldb-api :: functionalities/gdb_remote_client/TestNoGPacketSupported.py (1644 of 1807) PASS: lldb-api :: lang/objc/objc++/TestObjCXX.py (1645 of 1807) PASS: lldb-api :: functionalities/thread/concurrent_events/TestConcurrentSignalDelayWatch.py (1646 of 1807) PASS: lldb-api :: lang/objc/radar-9691614/TestObjCMethodReturningBOOL.py (1647 of 1807) PASS: lldb-unit :: ObjectFile/Breakpad/./ObjectFileBreakpadTests/PublicRecord.parse (1648 of 1807) PASS: lldb-unit :: Utility/./UtilityTests/ArgsTest.AppendArguments (1649 of 1807) PASS: lldb-unit :: Utility/./UtilityTests/ConstStringTest.UpdateMangledCounterpart (1650 of 1807) PASS: lldb-api :: functionalities/data-formatter/data-formatter-stl/libcxx/forward_list/TestDataFormatterLibcxxForwardList.py (1651 of 1807) PASS: lldb-api :: functionalities/pre_run_dylibs/TestPreRunDylibs.py (1652 of 1807) PASS: lldb-api :: functionalities/breakpoint/breakpoint_conditions/TestBreakpointConditions.py (1653 of 1807) PASS: lldb-shell :: ObjectFile/ELF/PT_LOAD.yaml (1654 of 1807) PASS: lldb-unit :: ScriptInterpreter/Python/./ScriptInterpreterPythonTests/PythonDataObjectsTest.TestPythonIntegerToStructuredInteger (1655 of 1807) PASS: lldb-unit :: ScriptInterpreter/Python/./ScriptInterpreterPythonTests/PythonDataObjectsTest.TestPythonInteger (1656 of 1807) PASS: lldb-unit :: Utility/./UtilityTests/RangeTest.Equal (1657 of 1807) PASS: lldb-api :: functionalities/archives/TestBSDArchives.py (1658 of 1807) UNSUPPORTED: lldb-api :: functionalities/breakpoint/hardware_breakpoints/hardware_breakpoint_on_multiple_threads/TestHWBreakMultiThread.py (1659 of 1807) PASS: lldb-api :: functionalities/float-display/TestFloatDisplay.py (1660 of 1807) UNSUPPORTED: lldb-shell :: SymbolFile/PDB/typedefs.test (1661 of 1807) PASS: lldb-unit :: Host/./HostTests/FileSystemTest.EnumerateDirectory (1662 of 1807) PASS: lldb-api :: functionalities/set-data/TestSetData.py (1663 of 1807) PASS: lldb-unit :: Utility/./UtilityTests/StringListTest.InsertStringAtIndexMove (1664 of 1807) PASS: lldb-shell :: Minidump/disassemble-no-module.yaml (1665 of 1807) PASS: lldb-shell :: SymbolFile/DWARF/debug-line-basic.s (1666 of 1807) PASS: lldb-unit :: Utility/./UtilityTests/TildeExpressionResolver.ResolveFullPath (1667 of 1807) PASS: lldb-api :: functionalities/data-formatter/synthupdate/TestSyntheticFilterRecompute.py (1668 of 1807) PASS: lldb-api :: commands/target/stop-hooks/TestStopHooks.py (1669 of 1807) UNSUPPORTED: lldb-api :: functionalities/signal/handle-segv/TestHandleSegv.py (1670 of 1807) PASS: lldb-api :: lang/objc/hidden-ivars/TestHiddenIvars.py (1671 of 1807) PASS: lldb-api :: functionalities/thread/num_threads/TestNumThreads.py (1672 of 1807) PASS: lldb-api :: functionalities/data-formatter/data-formatter-stl/libcxx/tuple/TestDataFormatterLibcxxTuple.py (1673 of 1807) PASS: lldb-api :: commands/settings/quoting/TestQuoting.py (1674 of 1807) PASS: lldb-shell :: Quit/TestQuitExitCode-30.test (1675 of 1807) PASS: lldb-api :: lang/objcxx/hide-runtime-values/TestObjCXXHideRuntimeValues.py (1676 of 1807) PASS: lldb-unit :: Utility/./UtilityTests/RangeTest.Constructor (1677 of 1807) PASS: lldb-api :: functionalities/tail_call_frames/ambiguous_tail_call_seq1/TestAmbiguousTailCallSeq1.py (1678 of 1807) PASS: lldb-unit :: ScriptInterpreter/Python/./ScriptInterpreterPythonTests/PythonDataObjectsTest.TestPythonTupleValues (1679 of 1807) PASS: lldb-shell :: Breakpoint/debug_rnglist_basic.test (1680 of 1807) PASS: lldb-unit :: Language/Highlighting/./HighlighterTests/HighlighterTest.ClangBraces (1681 of 1807) PASS: lldb-unit :: Utility/./UtilityTests/StringExtractorTest.InitMisc (1682 of 1807) PASS: lldb-unit :: Utility/./UtilityTests/ArgsTest.DoubleQuotedItem (1683 of 1807) PASS: lldb-unit :: Host/./HostTests/HostInfoTest.GetHostname (1684 of 1807) UNSUPPORTED: lldb-shell :: Register/aarch64-gp-read.test (1685 of 1807) PASS: lldb-api :: commands/expression/import-std-module/unique_ptr/TestUniquePtr.py (1686 of 1807) PASS: lldb-api :: functionalities/breakpoint/breakpoint_locations/TestBreakpointLocations.py (1687 of 1807) PASS: lldb-unit :: UnwindAssembly/x86/./UnwindAssemblyx86Tests/Testx86AssemblyInspectionEngine.TestPushEAX (1688 of 1807) PASS: lldb-unit :: Utility/./UtilityTests/EnvironmentTest.EnvpConstruction (1689 of 1807) PASS: lldb-shell :: Host/TestCustomShell.test (1690 of 1807) PASS: lldb-unit :: Utility/./UtilityTests/RegisterValueTest.GetSet8 (1691 of 1807) PASS: lldb-api :: functionalities/thread/crash_during_step/TestCrashDuringStep.py (1692 of 1807) PASS: lldb-api :: functionalities/data-formatter/data-formatter-ptr-to-array/TestPtrToArrayFormatting.py (1693 of 1807) PASS: lldb-unit :: Process/gdb-remote/./ProcessGdbRemoteTests/GDBRemoteClientBaseTest.SendContinueAndInterrupt2PacketBug (1694 of 1807) PASS: lldb-unit :: Language/Highlighting/./HighlighterTests/HighlighterTest.ClangOperators (1695 of 1807) PASS: lldb-unit :: Expression/./ExpressionTests/DWARFExpression.DW_OP_pick (1696 of 1807) PASS: lldb-shell :: SymbolFile/DWARF/find-basic-namespace.cpp (1697 of 1807) PASS: lldb-api :: commands/log/invalid-args/TestInvalidArgsLog.py (1698 of 1807) PASS: lldb-shell :: SymbolFile/DWARF/debug_aranges-empty-section.s (1699 of 1807) PASS: lldb-unit :: Utility/./UtilityTests/StreamTest.PutBytesAsRawHex8ToLittleEndian (1700 of 1807) PASS: lldb-unit :: Utility/./UtilityTests/StringExtractorTest.DecodeHexU8_InvalidHex2 (1701 of 1807) PASS: lldb-api :: lang/objc/blocks/TestObjCIvarsInBlocks.py (1702 of 1807) PASS: lldb-unit :: Utility/./UtilityTests/OptionsWithRawTest.EmptyArgsOnlySuffix (1703 of 1807) PASS: lldb-api :: lang/objc/objc-new-syntax/TestObjCNewSyntaxArray.py (1704 of 1807) PASS: lldb-api :: lang/c/local_variables/TestLocalVariables.py (1705 of 1807) PASS: lldb-unit :: Utility/./UtilityTests/StreamTest.PutHex64ByteOrderBig (1706 of 1807) PASS: lldb-unit :: Utility/./UtilityTests/ScalarTest.Equality (1707 of 1807) PASS: lldb-api :: functionalities/data-formatter/type_summary_list_arg/TestTypeSummaryListArg.py (1708 of 1807) XFAIL: lldb-shell :: Register/x86-64-write.test (1709 of 1807) PASS: lldb-api :: functionalities/signal/TestSendSignal.py (1710 of 1807) PASS: lldb-shell :: Reproducer/TestRelativePath.test (1711 of 1807) XFAIL: lldb-shell :: SymbolFile/DWARF/find-type-in-function.cpp (1712 of 1807) PASS: lldb-unit :: Interpreter/./InterpreterTests/CompletionTest.DirCompletionAbsolute (1713 of 1807) PASS: lldb-unit :: Utility/./UtilityTests/StringExtractorTest.GetHexBytesAvail (1714 of 1807) PASS: lldb-unit :: Utility/./UtilityTests/StreamTest.PutRawBytesToBigEndian (1715 of 1807) PASS: lldb-unit :: Utility/./UtilityTests/ArgsTest.GetArgumentArrayRef (1716 of 1807) PASS: lldb-unit :: Utility/./UtilityTests/BinaryStreamTest.PutULEB128TwoBytes (1717 of 1807) PASS: lldb-unit :: Utility/./UtilityTests/Flags.AllSet (1718 of 1807) PASS: lldb-api :: terminal/TestSTTYBeforeAndAfter.py (1719 of 1807) PASS: lldb-unit :: Utility/./UtilityTests/CompletionRequest.Constructor (1720 of 1807) PASS: lldb-shell :: ObjectFile/ELF/section-types.yaml (1721 of 1807) PASS: lldb-api :: functionalities/thread/concurrent_events/TestConcurrentManyBreakpoints.py (1722 of 1807) PASS: lldb-api :: functionalities/data-formatter/data-formatter-stl/libcxx/list/TestDataFormatterLibcxxList.py (1723 of 1807) PASS: lldb-api :: functionalities/data-formatter/data-formatter-stl/libcxx/map/TestDataFormatterLibccMap.py (1724 of 1807) PASS: lldb-api :: commands/expression/import-std-module/forward_list-basic/TestBasicForwardList.py (1725 of 1807) PASS: lldb-shell :: Commands/command-script-import.test (1726 of 1807) PASS: lldb-api :: commands/expression/import-std-module/forward_list-dbg-info-content/TestDbgInfoContentForwardList.py (1727 of 1807) PASS: lldb-unit :: UnwindAssembly/x86/./UnwindAssemblyx86Tests/Testx86AssemblyInspectionEngine.TestPushRBX (1728 of 1807) PASS: lldb-api :: types/TestIntegerTypes.py (1729 of 1807) PASS: lldb-unit :: Language/Highlighting/./HighlighterTests/HighlighterTest.ClangComments (1730 of 1807) PASS: lldb-unit :: ScriptInterpreter/Python/./ScriptInterpreterPythonTests/PythonDataObjectsTest.TestPythonListValueEquality (1731 of 1807) PASS: lldb-shell :: SymbolFile/DWARF/debug_loc.s (1732 of 1807) PASS: lldb-unit :: ScriptInterpreter/Python/./ScriptInterpreterPythonTests/PythonDataObjectsTest.TestGlobalNameResolutionWithDot (1733 of 1807) PASS: lldb-unit :: Utility/./UtilityTests/CompletionRequest.TestCompletionOwnership (1734 of 1807) PASS: lldb-unit :: UnwindAssembly/x86/./UnwindAssemblyx86Tests/Testx86AssemblyInspectionEngine.TestMovRSPtoRBP (1735 of 1807) PASS: lldb-unit :: ScriptInterpreter/Python/./ScriptInterpreterPythonTests/PythonDataObjectsTest.TestModuleNameResolutionNoDot (1736 of 1807) PASS: lldb-unit :: UnwindAssembly/x86/./UnwindAssemblyx86Tests/Testx86AssemblyInspectionEngine.TestPopR13 (1737 of 1807) PASS: lldb-shell :: SymbolFile/DWARF/debug-types-missing-signature.test (1738 of 1807) PASS: lldb-api :: functionalities/data-formatter/data-formatter-script/TestDataFormatterScript.py (1739 of 1807) PASS: lldb-shell :: Breakpoint/debug_addrx.test (1740 of 1807) PASS: lldb-unit :: Language/Highlighting/./HighlighterTests/HighlighterTest.DefaultHighlighterWithCursorOutOfBounds (1741 of 1807) UNSUPPORTED: lldb-api :: commands/watchpoints/multi_watchpoint_slots/TestWatchpointMultipleSlots.py (1742 of 1807) PASS: lldb-unit :: ScriptInterpreter/Python/./ScriptInterpreterPythonTests/PythonDataObjectsTest.TestScript (1743 of 1807) PASS: lldb-unit :: Utility/./UtilityTests/ConstStringTest.CompareConstString (1744 of 1807) UNSUPPORTED: lldb-shell :: SymbolFile/PDB/variables-locations.test (1745 of 1807) PASS: lldb-api :: lang/cpp/nsimport/TestCppNsImport.py (1746 of 1807) PASS: lldb-api :: lang/objc/objc-stepping/TestObjCStepping.py (1747 of 1807) PASS: lldb-api :: commands/process/attach-resume/TestAttachResume.py (1748 of 1807) PASS: lldb-shell :: SymbolFile/DWARF/debug_ranges_and_rnglists.test (1749 of 1807) PASS: lldb-unit :: Process/minidump/./LLDBMinidumpTests/MinidumpParserTest.GetArchitectureWindows (1750 of 1807) PASS: lldb-api :: python_api/signals/TestSignalsAPI.py (1751 of 1807) UNSUPPORTED: lldb-api :: tools/lldb-server/TestGdbRemoteModuleInfo.py (1752 of 1807) PASS: lldb-unit :: Utility/./UtilityTests/DataExtractorTest.GetCStrAtEnd (1753 of 1807) PASS: lldb-unit :: Signals/./SignalsTests/UnixSignalsTest.GetFilteredSignals (1754 of 1807) PASS: lldb-api :: commands/expression/persistent_types/TestPersistentTypes.py (1755 of 1807) PASS: lldb-api :: functionalities/conditional_break/TestConditionalBreak.py (1756 of 1807) UNSUPPORTED: lldb-shell :: Register/x86-64-xmm16-read.test (1757 of 1807) PASS: lldb-shell :: Commands/CommandScriptImmediateOutput/CommandScriptImmediateOutputFile.test (1758 of 1807) PASS: lldb-unit :: Utility/./UtilityTests/LogTest.LLDB_LOG_nullptr (1759 of 1807) PASS: lldb-api :: python_api/sbvalue_persist/TestSBValuePersist.py (1760 of 1807) PASS: lldb-unit :: Utility/./UtilityTests/StreamTeeTest.SetStreamAtIndexOverwrite (1761 of 1807) PASS: lldb-api :: lang/objc/objc-property/TestObjCProperty.py (1762 of 1807) PASS: lldb-unit :: Utility/./UtilityTests/BinaryStreamTest.PutULEB128MaxValue (1763 of 1807) PASS: lldb-api :: functionalities/dynamic_value_child_count/TestDynamicValueChildCount.py (1764 of 1807) PASS: lldb-api :: api/listeners/TestListener.py (1765 of 1807) PASS: lldb-api :: python_api/value/empty_class/TestValueAPIEmptyClass.py (1766 of 1807) UNSUPPORTED: lldb-api :: functionalities/thread/state/TestThreadStates.py (1767 of 1807) PASS: lldb-unit :: Utility/./UtilityTests/StringExtractorTest.GetHexBytes_Partial (1768 of 1807) PASS: lldb-api :: commands/expression/import_builtin_fileid/TestImportBuiltinFileID.py (1769 of 1807) PASS: lldb-unit :: Utility/./UtilityTests/StreamTest.PutRawBytesToLittleEndian (1770 of 1807) PASS: lldb-api :: functionalities/postmortem/wow64_minidump/TestWow64MiniDump.py (1771 of 1807) PASS: lldb-unit :: Utility/./UtilityTests/StringExtractorTest.DecodeHexU8_Extra (1772 of 1807) PASS: lldb-unit :: Process/minidump/./LLDBMinidumpTests/MinidumpParserTest.GetMemoryRegionInfoFromMemory64List (1773 of 1807) PASS: lldb-shell :: ObjectFile/PECOFF/invalid-export-table.yaml (1774 of 1807) PASS: lldb-unit :: Host/./HostTests/SocketTest.DomainListenConnectAccept (1775 of 1807) PASS: lldb-api :: python_api/sbtype_typeclass/TestSBTypeTypeClass.py (1776 of 1807) PASS: lldb-shell :: SymbolFile/Breakpad/line-table-discontinuous-file-ids.test (1777 of 1807) PASS: lldb-unit :: Utility/./UtilityTests/UriParserTest.BracketedHostnameWithColon (1778 of 1807) PASS: lldb-unit :: Utility/./UtilityTests/StringListTest.LongestCommonPrefixEmpty (1779 of 1807) PASS: lldb-api :: functionalities/data-formatter/boolreference/TestFormattersBoolRefPtr.py (1780 of 1807) UNSUPPORTED: lldb-api :: functionalities/darwin_log/filter/regex/activity-chain/TestDarwinLogFilterRegexActivityChain.py (1781 of 1807) PASS: lldb-unit :: Utility/./UtilityTests/OptionsWithRawTest.SingleWordSuffix (1782 of 1807) PASS: lldb-unit :: Symbol/./SymbolTests/LineEntryTest.GetSameLineContiguousAddressRangeNoInlines (1783 of 1807) PASS: lldb-api :: lang/objc/objc-ivar-offsets/TestObjCIvarOffsets.py (1784 of 1807) PASS: lldb-unit :: Utility/./UtilityTests/StreamTeeTest.CopyConstructor (1785 of 1807) PASS: lldb-api :: commands/expression/xvalue/TestXValuePrinting.py (1786 of 1807) PASS: lldb-unit :: Process/gdb-remote/./ProcessGdbRemoteTests/GDBRemoteClientBaseTest.SendContinueAndWait (1787 of 1807) PASS: lldb-unit :: Process/gdb-remote/./ProcessGdbRemoteTests/GDBRemoteClientBaseTest.SendContinueAndInterrupt (1788 of 1807) PASS: lldb-api :: functionalities/type_completion/TestTypeCompletion.py (1789 of 1807) PASS: lldb-unit :: Expression/./ExpressionTests/CppModuleConfigurationTest.AmbiguousCLib (1790 of 1807) PASS: lldb-unit :: Utility/./UtilityTests/VASprintfTest.EncodingError (1791 of 1807) PASS: lldb-unit :: UnwindAssembly/x86/./UnwindAssemblyx86Tests/Testx86AssemblyInspectionEngine.TestAddESP (1792 of 1807) PASS: lldb-api :: functionalities/data-formatter/data-formatter-objc/TestDataFormatterObjCKVO.py (1793 of 1807) PASS: lldb-api :: functionalities/modern-type-lookup/basic-objc/TestBasicObjcModernTypeLookup.py (1794 of 1807) PASS: lldb-api :: commands/disassemble/basic/TestFrameDisassemble.py (1795 of 1807) PASS: lldb-api :: functionalities/data-formatter/hexcaps/TestDataFormatterHexCaps.py (1796 of 1807) PASS: lldb-api :: functionalities/data-formatter/data-formatter-objc/TestDataFormatterObjCNSError.py (1797 of 1807) PASS: lldb-api :: functionalities/thread/concurrent_events/TestConcurrentSignalNWatchNBreak.py (1798 of 1807) PASS: lldb-api :: commands/frame/diagnose/array/TestArray.py (1799 of 1807) PASS: lldb-api :: functionalities/thread/exit_during_break/TestExitDuringBreak.py (1800 of 1807) PASS: lldb-api :: lang/c/array_types/TestArrayTypes.py (1801 of 1807) PASS: lldb-api :: functionalities/memory/read/TestMemoryRead.py (1802 of 1807) PASS: lldb-api :: functionalities/data-formatter/data-formatter-stl/libcxx/unordered/TestDataFormatterUnordered.py (1803 of 1807) PASS: lldb-api :: commands/expression/char/TestExprsChar.py (1804 of 1807) PASS: lldb-api :: lang/objc/variadic_methods/TestVariadicMethods.py (1805 of 1807) PASS: lldb-api :: tools/lldb-server/TestLldbGdbServer.py (1806 of 1807) PASS: lldb-api :: lang/objc/foundation/TestFoundationDisassembly.py (1807 of 1807)

Hide Details

Testing Time: 4228.23s ******************** Failing Tests (3): lldb-api :: tools/lldb-server/TestGdbRemoteKill.py lldb-api :: commands/watchpoints/watchpoint_set_command/TestWatchLocationWithWatchSet.py lldb-api :: terminal/TestEditline.py

Hide Details

******************** Timed Out Tests (1): lldb-api :: types/TestIntegerTypesExpr.py

Hide Details

Hide Details

Slowest Tests: -------------------------------------------------------------------------- 303.90s: lldb-api :: lang/objc/exceptions/TestObjCExceptions.py 330.88s: lldb-api :: functionalities/inferior-crashing/TestInferiorCrashingStep.py 349.94s: lldb-api :: lang/c/anonymous/TestAnonymous.py 352.63s: lldb-api :: tools/lldb-server/TestGdbRemoteThreadsInStopReply.py 382.95s: lldb-api :: lang/objc/real-definition/TestRealDefinition.py 386.98s: lldb-api :: lang/objc/objc-new-syntax/TestObjCNewSyntaxLiteral.py 413.51s: lldb-api :: python_api/target/TestTargetAPI.py 444.51s: lldb-api :: commands/target/basic/TestTargetCommand.py 468.51s: lldb-api :: lang/cpp/namespace/TestNamespace.py 478.92s: lldb-api :: functionalities/return-value/TestReturnValue.py 492.54s: lldb-api :: lang/objc/foundation/TestFoundationDisassembly.py 536.00s: lldb-api :: api/multithreaded/TestMultithreaded.py 577.49s: lldb-api :: lang/objc/foundation/TestObjCMethods.py 590.66s: lldb-api :: functionalities/load_unload/TestLoadUnload.py 593.60s: lldb-api :: lang/objc/hidden-ivars/TestHiddenIvars.py 651.22s: lldb-api :: tools/lldb-server/TestLldbGdbServer.py 761.68s: lldb-api :: lang/cpp/enum_types/TestCPP11EnumTypes.py 842.81s: lldb-api :: lang/cpp/namespace/TestNamespaceLookup.py 1008.71s: lldb-api :: types/TestIntegerTypes.py 1201.92s: lldb-api :: types/TestIntegerTypesExpr.py

Hide Details

Tests Times: -------------------------------------------------------------------------- [ Range ] :: [ Percentage ] :: [ Count ] -------------------------------------------------------------------------- [ 0s, 100s) :: [*********************************** ] :: [1605/1807] [ 100s, 200s) :: [*** ] :: [ 152/1807] [ 200s, 300s) :: [ ] :: [ 27/1807] [ 300s, 400s) :: [ ] :: [ 7/1807] [ 400s, 500s) :: [ ] :: [ 4/1807] [ 500s, 600s) :: [ ] :: [ 4/1807] [ 600s, 700s) :: [ ] :: [ 3/1807] [ 700s, 800s) :: [ ] :: [ 1/1807] [ 800s, 900s) :: [ ] :: [ 1/1807] [ 900s,1000s) :: [ ] :: [ 1/1807] [1000s,1100s) :: [ ] :: [ 1/1807] [1100s,1200s) :: [ ] :: [ 0/1807] [1200s,1300s) :: [ ] :: [ 1/1807] Expected Passes : 1650 Expected Failures : 6 Unsupported Tests : 147 Unexpected Failures: 3 Individual Timeouts: 1 FAILED: tools/lldb/test/CMakeFiles/check-lldb-lit cd /Users/buildslave/jenkins/workspace/lldb-cmake-sanitized/lldb-build/tools/lldb/test && /usr/local/bin/python /Users/buildslave/jenkins/workspace/lldb-cmake-sanitized/lldb-build/./bin/llvm-lit -v --time-tests --shuffle --xunit-xml-output=/Users/buildslave/jenkins/workspace/lldb-cmake-sanitized/test/results.xml -v --timeout 1200 /Users/buildslave/jenkins/workspace/lldb-cmake-sanitized/lldb-build/tools/lldb/test ninja: build stopped: subcommand failed. Command failed: Command '['/usr/bin/env', 'TERM=vt100', '/usr/local/bin/ninja', '-v', 'check-lldb']' returned non-zero exit status 1. Command: ['/usr/bin/env', 'TERM=vt100', '/usr/local/bin/ninja', '-v', 'check-lldb'] [Pipeline] } [Pipeline] // timeout [Pipeline] } [Pipeline] // stage [Pipeline] stage [Pipeline] { (Declarative: Post Actions) [Pipeline] scanForIssues No credentials specified [Clang (LLVM based)] Sleeping for 5 seconds due to JENKINS-32191... [Clang (LLVM based)] Parsing console log (workspace: '/Users/buildslave/jenkins/workspace/lldb-cmake-sanitized') [Pipeline] junit Recording test results [Pipeline] } [Pipeline] // stage [Pipeline] } [Pipeline] // withEnv [Pipeline] } [Pipeline] // node [Pipeline] End of Pipeline [BFA] Scanning build for known causes... [BFA] Found failure cause(s): [BFA] Ninja target failed from category Compile [BFA] Regression test failed from category Test [BFA] Done. 2s ERROR: script returned exit code 1 Finished: FAILURE