FailedConsole Output

Skipping 8,210 KB.. Full Log
mbols.enable-external-lookup false
output: 

Hide Details

runCmd: settings set plugin.process.gdb-remote.packet-timeout 60 output:

Hide Details

runCmd: settings set symbols.clang-modules-cache-path "/Users/buildslave/jenkins/workspace/lldb-cmake-sanitized/lldb-build/lldb-test-build.noindex/module-cache-lldb/lldb-api" output:

Hide Details

runCmd: settings set use-color false output:

Hide Details

runCmd: file /Users/buildslave/jenkins/workspace/lldb-cmake-sanitized/lldb-build/lldb-test-build.noindex/functionalities/data-formatter/data-formatter-stl/libcxx/multimap/TestDataFormatterLibccMultiMap.test_with_run_command_dwarf/a.out output: Current executable set to '/Users/buildslave/jenkins/workspace/lldb-cmake-sanitized/lldb-build/lldb-test-build.noindex/functionalities/data-formatter/data-formatter-stl/libcxx/multimap/TestDataFormatterLibccMultiMap.test_with_run_command_dwarf/a.out' (x86_64).

Hide Details

Hide Details

runCmd: breakpoint set -p "Set break point at this line." output: Breakpoint 1: 14 locations.

Hide Details

Hide Details

Expecting pattern: ^Breakpoint (?P<bpno>[0-9]+): (?P<num_locations>[0-9]+) locations\.$ Matched

Hide Details

runCmd: run output: Process 97836 stopped * thread #1, queue = 'com.apple.main-thread', stop reason = breakpoint 1.1 frame #0: 0x00000001000013e5 a.out`main at main.cpp:25:16 22 { 23 intint_map ii; 24 -> 25 ii.emplace(0,0); // Set break point at this line. ^ 26 ii.emplace(1,1); 27 thefoo_rw(1); // Set break point at this line. 28 ii.emplace(2,0);

Hide Details

Process 97836 launched: '/Users/buildslave/jenkins/workspace/lldb-cmake-sanitized/lldb-build/lldb-test-build.noindex/functionalities/data-formatter/data-formatter-stl/libcxx/multimap/TestDataFormatterLibccMultiMap.test_with_run_command_dwarf/a.out' (x86_64)

Hide Details

Hide Details

runCmd: thread list output: Process 97836 stopped * thread #1: tid = 0x8620afb, 0x00000001000013e5 a.out`main at main.cpp:25:16, queue = 'com.apple.main-thread', stop reason = breakpoint 1.1

Hide Details

Hide Details

Expecting sub string: stopped Matched

Hide Details

Expecting sub string: stop reason = breakpoint Matched

Hide Details

Adding tearDown hook: def cleanup(): self.runCmd('type format clear', check=False) self.runCmd('type summary clear', check=False) self.runCmd('type filter clear', check=False) self.runCmd('type synth clear', check=False) self.runCmd( "settings set target.max-children-count 256", check=False)

Hide Details

Hide Details

runCmd: frame variable ii output: (std::__1::multimap<int, int, std::__1::less<int>, std::__1::allocator<std::__1::pair<const int, int> > >) ii = size=0 {}

Hide Details

Hide Details

Expecting sub string: std::__1::multimap Matched

Hide Details

Expecting sub string: size=0 Matched

Hide Details

Expecting sub string: {} Matched

Hide Details

runCmd: frame variable ii output: (std::__1::multimap<int, int, std::__1::less<int>, std::__1::allocator<std::__1::pair<const int, int> > >) ii = size=2 { [0] = (first = 0, second = 0) [1] = (first = 1, second = 1) }

Hide Details

Hide Details

Expecting sub string: std::__1::multimap Matched

Hide Details

Expecting sub string: size=2 Matched

Hide Details

Expecting sub string: [0] = Matched

Hide Details

Expecting sub string: first = 0 Matched

Hide Details

Expecting sub string: second = 0 Matched

Hide Details

Expecting sub string: [1] = Matched

Hide Details

Expecting sub string: first = 1 Matched

Hide Details

Expecting sub string: second = 1 Matched

Hide Details

runCmd: frame variable ii output: (std::__1::multimap<int, int, std::__1::less<int>, std::__1::allocator<std::__1::pair<const int, int> > >) ii = size=4 { [0] = (first = 0, second = 0) [1] = (first = 1, second = 1) [2] = (first = 2, second = 0) [3] = (first = 3, second = 1) }

Hide Details

Hide Details

Expecting sub string: std::__1::multimap Matched

Hide Details

Expecting sub string: size=4 Matched

Hide Details

Expecting sub string: [2] = Matched

Hide Details

Expecting sub string: first = 2 Matched

Hide Details

Expecting sub string: second = 0 Matched

Hide Details

Expecting sub string: [3] = Matched

Hide Details

Expecting sub string: first = 3 Matched

Hide Details

Expecting sub string: second = 1 Matched

Hide Details

runCmd: frame variable ii output: (std::__1::multimap<int, int, std::__1::less<int>, std::__1::allocator<std::__1::pair<const int, int> > >) ii = size=8 { [0] = (first = 0, second = 0) [1] = (first = 1, second = 1) [2] = (first = 2, second = 0) [3] = (first = 3, second = 1) [4] = (first = 4, second = 0) [5] = (first = 5, second = 1) [6] = (first = 6, second = 0) [7] = (first = 7, second = 1) }

Hide Details

Hide Details

Expecting sub string: std::__1::multimap Matched

Hide Details

Expecting sub string: size=8 Matched

Hide Details

Expecting sub string: [5] = Matched

Hide Details

Expecting sub string: first = 5 Matched

Hide Details

Expecting sub string: second = 0 Matched

Hide Details

Expecting sub string: [7] = Matched

Hide Details

Expecting sub string: first = 7 Matched

Hide Details

Expecting sub string: second = 1 Matched

Hide Details

runCmd: p ii output: (std::__1::multimap<int, int, std::__1::less<int>, std::__1::allocator<std::__1::pair<const int, int> > >) $0 = size=8 { [0] = (first = 0, second = 0) [1] = (first = 1, second = 1) [2] = (first = 2, second = 0) [3] = (first = 3, second = 1) [4] = (first = 4, second = 0) [5] = (first = 5, second = 1) [6] = (first = 6, second = 0) [7] = (first = 7, second = 1) }

Hide Details

Hide Details

Expecting sub string: std::__1::multimap Matched

Hide Details

Expecting sub string: size=8 Matched

Hide Details

Expecting sub string: [5] = Matched

Hide Details

Expecting sub string: first = 5 Matched

Hide Details

Expecting sub string: second = 0 Matched

Hide Details

Expecting sub string: [7] = Matched

Hide Details

Expecting sub string: first = 7 Matched

Hide Details

Expecting sub string: second = 1 Matched

Hide Details

runCmd: frame variable ii[0] output: (std::__1::pair<const int, int>) [0] = (first = 0, second = 0)

Hide Details

Hide Details

Expecting sub string: first = 0 Matched

Hide Details

Expecting sub string: second = 0 Matched

Hide Details

runCmd: frame variable ii[3] output: (std::__1::pair<const int, int>) [3] = (first = 3, second = 1)

Hide Details

Hide Details

Expecting sub string: first = Matched

Hide Details

Expecting sub string: second = Matched

Hide Details

runCmd: frame variable ii output: (std::__1::multimap<int, int, std::__1::less<int>, std::__1::allocator<std::__1::pair<const int, int> > >) ii = size=0 {}

Hide Details

Hide Details

Expecting sub string: std::__1::multimap Matched

Hide Details

Expecting sub string: size=0 Matched

Hide Details

Expecting sub string: {} Matched

Hide Details

runCmd: frame variable si output: (std::__1::multimap<std::__1::basic_string<char, std::__1::char_traits<char>, std::__1::allocator<char> >, int, std::__1::less<std::__1::basic_string<char, std::__1::char_traits<char>, std::__1::allocator<char> > >, std::__1::allocator<std::__1::pair<const std::__1::basic_string<char, std::__1::char_traits<char>, std::__1::allocator<char> >, int> > >) si = size=0 {}

Hide Details

Hide Details

Expecting sub string: std::__1::multimap Matched

Hide Details

Expecting sub string: size=0 Matched

Hide Details

Expecting sub string: {} Matched

Hide Details

runCmd: frame variable si output: (std::__1::multimap<std::__1::basic_string<char, std::__1::char_traits<char>, std::__1::allocator<char> >, int, std::__1::less<std::__1::basic_string<char, std::__1::char_traits<char>, std::__1::allocator<char> > >, std::__1::allocator<std::__1::pair<const std::__1::basic_string<char, std::__1::char_traits<char>, std::__1::allocator<char> >, int> > >) si = size=1 { [0] = (first = "zero", second = 0) }

Hide Details

Hide Details

Expecting sub string: std::__1::multimap Matched

Hide Details

Expecting sub string: size=1 Matched

Hide Details

Expecting sub string: [0] = Matched

Hide Details

Expecting sub string: first = "zero" Matched

Hide Details

Expecting sub string: second = 0 Matched

Hide Details

runCmd: frame variable si output: (std::__1::multimap<std::__1::basic_string<char, std::__1::char_traits<char>, std::__1::allocator<char> >, int, std::__1::less<std::__1::basic_string<char, std::__1::char_traits<char>, std::__1::allocator<char> > >, std::__1::allocator<std::__1::pair<const std::__1::basic_string<char, std::__1::char_traits<char>, std::__1::allocator<char> >, int> > >) si = size=4 { [0] = (first = "one", second = 1) [1] = (first = "three", second = 3) [2] = (first = "two", second = 2) [3] = (first = "zero", second = 0) }

Hide Details

Hide Details

Expecting sub string: std::__1::multimap Matched

Hide Details

Expecting sub string: size=4 Matched

Hide Details

Expecting sub string: [0] = Matched

Hide Details

Expecting sub string: first = "zero" Matched

Hide Details

Expecting sub string: second = 0 Matched

Hide Details

Expecting sub string: [1] = Matched

Hide Details

Expecting sub string: first = "one" Matched

Hide Details

Expecting sub string: second = 1 Matched

Hide Details

Expecting sub string: [2] = Matched

Hide Details

Expecting sub string: first = "two" Matched

Hide Details

Expecting sub string: second = 2 Matched

Hide Details

Expecting sub string: [3] = Matched

Hide Details

Expecting sub string: first = "three" Matched

Hide Details

Expecting sub string: second = 3 Matched

Hide Details

runCmd: p si output: (std::__1::multimap<std::__1::basic_string<char, std::__1::char_traits<char>, std::__1::allocator<char> >, int, std::__1::less<std::__1::basic_string<char, std::__1::char_traits<char>, std::__1::allocator<char> > >, std::__1::allocator<std::__1::pair<const std::__1::basic_string<char, std::__1::char_traits<char>, std::__1::allocator<char> >, int> > >) $1 = size=4 { [0] = (first = "one", second = 1) [1] = (first = "three", second = 3) [2] = (first = "two", second = 2) [3] = (first = "zero", second = 0) }

Hide Details

Hide Details

Expecting sub string: std::__1::multimap Matched

Hide Details

Expecting sub string: size=4 Matched

Hide Details

Expecting sub string: [0] = Matched

Hide Details

Expecting sub string: first = "zero" Matched

Hide Details

Expecting sub string: second = 0 Matched

Hide Details

Expecting sub string: [1] = Matched

Hide Details

Expecting sub string: first = "one" Matched

Hide Details

Expecting sub string: second = 1 Matched

Hide Details

Expecting sub string: [2] = Matched

Hide Details

Expecting sub string: first = "two" Matched

Hide Details

Expecting sub string: second = 2 Matched

Hide Details

Expecting sub string: [3] = Matched

Hide Details

Expecting sub string: first = "three" Matched

Hide Details

Expecting sub string: second = 3 Matched

Hide Details

runCmd: frame variable si[0] output: (std::__1::pair<const std::__1::basic_string<char, std::__1::char_traits<char>, std::__1::allocator<char> >, int>) [0] = (first = "one", second = 1)

Hide Details

Hide Details

Expecting sub string: first = Matched

Hide Details

Expecting sub string: one Matched

Hide Details

Expecting sub string: second = 1 Matched

Hide Details

runCmd: frame variable si output: (std::__1::multimap<std::__1::basic_string<char, std::__1::char_traits<char>, std::__1::allocator<char> >, int, std::__1::less<std::__1::basic_string<char, std::__1::char_traits<char>, std::__1::allocator<char> > >, std::__1::allocator<std::__1::pair<const std::__1::basic_string<char, std::__1::char_traits<char>, std::__1::allocator<char> >, int> > >) si = size=0 {}

Hide Details

Hide Details

Expecting sub string: std::__1::multimap Matched

Hide Details

Expecting sub string: size=0 Matched

Hide Details

Expecting sub string: {} Matched

Hide Details

runCmd: frame variable is output: (std::__1::multimap<int, std::__1::basic_string<char, std::__1::char_traits<char>, std::__1::allocator<char> >, std::__1::less<int>, std::__1::allocator<std::__1::pair<const int, std::__1::basic_string<char, std::__1::char_traits<char>, std::__1::allocator<char> > > > >) is = size=0 {}

Hide Details

Hide Details

Expecting sub string: std::__1::multimap Matched

Hide Details

Expecting sub string: size=0 Matched

Hide Details

Expecting sub string: {} Matched

Hide Details

runCmd: frame variable is output: (std::__1::multimap<int, std::__1::basic_string<char, std::__1::char_traits<char>, std::__1::allocator<char> >, std::__1::less<int>, std::__1::allocator<std::__1::pair<const int, std::__1::basic_string<char, std::__1::char_traits<char>, std::__1::allocator<char> > > > >) is = size=4 { [0] = (first = 1, second = "is") [1] = (first = 2, second = "smart") [2] = (first = 3, second = "!!!") [3] = (first = 85, second = "goofy") }

Hide Details

Hide Details

Expecting sub string: std::__1::multimap Matched

Hide Details

Expecting sub string: size=4 Matched

Hide Details

Expecting sub string: [0] = Matched

Hide Details

Expecting sub string: second = "goofy" Matched

Hide Details

Expecting sub string: first = 85 Matched

Hide Details

Expecting sub string: [1] = Matched

Hide Details

Expecting sub string: second = "is" Matched

Hide Details

Expecting sub string: first = 1 Matched

Hide Details

Expecting sub string: [2] = Matched

Hide Details

Expecting sub string: second = "smart" Matched

Hide Details

Expecting sub string: first = 2 Matched

Hide Details

Expecting sub string: [3] = Matched

Hide Details

Expecting sub string: second = "!!!" Matched

Hide Details

Expecting sub string: first = 3 Matched

Hide Details

runCmd: p is output: (std::__1::multimap<int, std::__1::basic_string<char, std::__1::char_traits<char>, std::__1::allocator<char> >, std::__1::less<int>, std::__1::allocator<std::__1::pair<const int, std::__1::basic_string<char, std::__1::char_traits<char>, std::__1::allocator<char> > > > >) $2 = size=4 { [0] = (first = 1, second = "is") [1] = (first = 2, second = "smart") [2] = (first = 3, second = "!!!") [3] = (first = 85, second = "goofy") }

Hide Details

Hide Details

Expecting sub string: std::__1::multimap Matched

Hide Details

Expecting sub string: size=4 Matched

Hide Details

Expecting sub string: [0] = Matched

Hide Details

Expecting sub string: second = "goofy" Matched

Hide Details

Expecting sub string: first = 85 Matched

Hide Details

Expecting sub string: [1] = Matched

Hide Details

Expecting sub string: second = "is" Matched

Hide Details

Expecting sub string: first = 1 Matched

Hide Details

Expecting sub string: [2] = Matched

Hide Details

Expecting sub string: second = "smart" Matched

Hide Details

Expecting sub string: first = 2 Matched

Hide Details

Expecting sub string: [3] = Matched

Hide Details

Expecting sub string: second = "!!!" Matched

Hide Details

Expecting sub string: first = 3 Matched

Hide Details

runCmd: frame variable is[0] output: (std::__1::pair<const int, std::__1::basic_string<char, std::__1::char_traits<char>, std::__1::allocator<char> > >) [0] = (first = 1, second = "is")

Hide Details

Hide Details

Expecting sub string: first = Matched

Hide Details

Expecting sub string: second = Matched

Hide Details

runCmd: frame variable is output: (std::__1::multimap<int, std::__1::basic_string<char, std::__1::char_traits<char>, std::__1::allocator<char> >, std::__1::less<int>, std::__1::allocator<std::__1::pair<const int, std::__1::basic_string<char, std::__1::char_traits<char>, std::__1::allocator<char> > > > >) is = size=0 {}

Hide Details

Hide Details

Expecting sub string: std::__1::multimap Matched

Hide Details

Expecting sub string: size=0 Matched

Hide Details

Expecting sub string: {} Matched

Hide Details

runCmd: frame variable ss output: (std::__1::multimap<std::__1::basic_string<char, std::__1::char_traits<char>, std::__1::allocator<char> >, std::__1::basic_string<char, std::__1::char_traits<char>, std::__1::allocator<char> >, std::__1::less<std::__1::basic_string<char, std::__1::char_traits<char>, std::__1::allocator<char> > >, std::__1::allocator<std::__1::pair<const std::__1::basic_string<char, std::__1::char_traits<char>, std::__1::allocator<char> >, std::__1::basic_string<char, std::__1::char_traits<char>, std::__1::allocator<char> > > > >) ss = size=0 {}

Hide Details

Hide Details

Expecting sub string: std::__1::multimap Matched

Hide Details

Expecting sub string: size=0 Matched

Hide Details

Expecting sub string: {} Matched

Hide Details

runCmd: frame variable ss output: (std::__1::multimap<std::__1::basic_string<char, std::__1::char_traits<char>, std::__1::allocator<char> >, std::__1::basic_string<char, std::__1::char_traits<char>, std::__1::allocator<char> >, std::__1::less<std::__1::basic_string<char, std::__1::char_traits<char>, std::__1::allocator<char> > >, std::__1::allocator<std::__1::pair<const std::__1::basic_string<char, std::__1::char_traits<char>, std::__1::allocator<char> >, std::__1::basic_string<char, std::__1::char_traits<char>, std::__1::allocator<char> > > > >) ss = size=3 { [0] = (first = "casa", second = "house") [1] = (first = "ciao", second = "hello") [2] = (first = "gatto", second = "cat") }

Hide Details

Hide Details

Expecting sub string: std::__1::multimap Matched

Hide Details

Expecting sub string: size=3 Matched

Hide Details

Expecting sub string: [0] = Matched

Hide Details

Expecting sub string: second = "hello" Matched

Hide Details

Expecting sub string: first = "ciao" Matched

Hide Details

Expecting sub string: [1] = Matched

Hide Details

Expecting sub string: second = "house" Matched

Hide Details

Expecting sub string: first = "casa" Matched

Hide Details

Expecting sub string: [2] = Matched

Hide Details

Expecting sub string: second = "cat" Matched

Hide Details

Expecting sub string: first = "gatto" Matched

Hide Details

runCmd: p ss output: (std::__1::multimap<std::__1::basic_string<char, std::__1::char_traits<char>, std::__1::allocator<char> >, std::__1::basic_string<char, std::__1::char_traits<char>, std::__1::allocator<char> >, std::__1::less<std::__1::basic_string<char, std::__1::char_traits<char>, std::__1::allocator<char> > >, std::__1::allocator<std::__1::pair<const std::__1::basic_string<char, std::__1::char_traits<char>, std::__1::allocator<char> >, std::__1::basic_string<char, std::__1::char_traits<char>, std::__1::allocator<char> > > > >) $3 = size=3 { [0] = (first = "casa", second = "house") [1] = (first = "ciao", second = "hello") [2] = (first = "gatto", second = "cat") }

Hide Details

Hide Details

Expecting sub string: std::__1::multimap Matched

Hide Details

Expecting sub string: size=3 Matched

Hide Details

Expecting sub string: [0] = Matched

Hide Details

Expecting sub string: second = "hello" Matched

Hide Details

Expecting sub string: first = "ciao" Matched

Hide Details

Expecting sub string: [1] = Matched

Hide Details

Expecting sub string: second = "house" Matched

Hide Details

Expecting sub string: first = "casa" Matched

Hide Details

Expecting sub string: [2] = Matched

Hide Details

Expecting sub string: second = "cat" Matched

Hide Details

Expecting sub string: first = "gatto" Matched

Hide Details

runCmd: frame variable ss[2] output: (std::__1::pair<const std::__1::basic_string<char, std::__1::char_traits<char>, std::__1::allocator<char> >, std::__1::basic_string<char, std::__1::char_traits<char>, std::__1::allocator<char> > >) [2] = (first = "gatto", second = "cat")

Hide Details

Hide Details

Expecting sub string: gatto Matched

Hide Details

Expecting sub string: cat Matched

Hide Details

runCmd: frame variable ss output: (std::__1::multimap<std::__1::basic_string<char, std::__1::char_traits<char>, std::__1::allocator<char> >, std::__1::basic_string<char, std::__1::char_traits<char>, std::__1::allocator<char> >, std::__1::less<std::__1::basic_string<char, std::__1::char_traits<char>, std::__1::allocator<char> > >, std::__1::allocator<std::__1::pair<const std::__1::basic_string<char, std::__1::char_traits<char>, std::__1::allocator<char> >, std::__1::basic_string<char, std::__1::char_traits<char>, std::__1::allocator<char> > > > >) ss = size=0 {}

Hide Details

Hide Details

Expecting sub string: std::__1::multimap Matched

Hide Details

Expecting sub string: size=0 Matched

Hide Details

Expecting sub string: {} Matched

Hide Details

<bound method SBProcess.Kill of <lldb.SBProcess; proxy of <Swig Object of type 'lldb::SBProcess *' at 0x109e4bb10> >>: success

Hide Details

Executing tearDown hook: def cleanup(): self.runCmd('type format clear', check=False) self.runCmd('type summary clear', check=False) self.runCmd('type filter clear', check=False) self.runCmd('type synth clear', check=False) self.runCmd( "settings set target.max-children-count 256", check=False)

Hide Details

Hide Details

runCmd: type format clear check of return status not required output:

Hide Details

runCmd: type summary clear check of return status not required output:

Hide Details

runCmd: type filter clear check of return status not required output:

Hide Details

runCmd: type synth clear check of return status not required output:

Hide Details

runCmd: settings set target.max-children-count 256 check of return status not required output:

Hide Details

PASS: LLDB (/Users/buildslave/jenkins/workspace/lldb-cmake-sanitized/lldb-build/bin/clang-10-x86_64) :: test_with_run_command_dwarf (TestDataFormatterLibccMultiMap.LibcxxMultiMapDataFormatterTestCase) UNSUPPORTED: LLDB (/Users/buildslave/jenkins/workspace/lldb-cmake-sanitized/lldb-build/bin/clang-10-x86_64) :: test_with_run_command_dwo (TestDataFormatterLibccMultiMap.LibcxxMultiMapDataFormatterTestCase) (test case does not fall in any category of interest for this run) runCmd: settings set symbols.enable-external-lookup false output:

Hide Details

runCmd: settings set plugin.process.gdb-remote.packet-timeout 60 output:

Hide Details

runCmd: settings set symbols.clang-modules-cache-path "/Users/buildslave/jenkins/workspace/lldb-cmake-sanitized/lldb-build/lldb-test-build.noindex/module-cache-lldb/lldb-api" output:

Hide Details

runCmd: settings set use-color false output:

Hide Details

runCmd: file /Users/buildslave/jenkins/workspace/lldb-cmake-sanitized/lldb-build/lldb-test-build.noindex/functionalities/data-formatter/data-formatter-stl/libcxx/multimap/TestDataFormatterLibccMultiMap.test_with_run_command_gmodules/a.out output: Current executable set to '/Users/buildslave/jenkins/workspace/lldb-cmake-sanitized/lldb-build/lldb-test-build.noindex/functionalities/data-formatter/data-formatter-stl/libcxx/multimap/TestDataFormatterLibccMultiMap.test_with_run_command_gmodules/a.out' (x86_64).

Hide Details

Hide Details

runCmd: breakpoint set -p "Set break point at this line." output: Breakpoint 1: 14 locations.

Hide Details

Hide Details

Expecting pattern: ^Breakpoint (?P<bpno>[0-9]+): (?P<num_locations>[0-9]+) locations\.$ Matched

Hide Details

runCmd: run output: Process 99135 stopped * thread #1, queue = 'com.apple.main-thread', stop reason = breakpoint 1.1 frame #0: 0x00000001000013e5 a.out`main at main.cpp:25:16 22 { 23 intint_map ii; 24 -> 25 ii.emplace(0,0); // Set break point at this line. ^ 26 ii.emplace(1,1); 27 thefoo_rw(1); // Set break point at this line. 28 ii.emplace(2,0);

Hide Details

Process 99135 launched: '/Users/buildslave/jenkins/workspace/lldb-cmake-sanitized/lldb-build/lldb-test-build.noindex/functionalities/data-formatter/data-formatter-stl/libcxx/multimap/TestDataFormatterLibccMultiMap.test_with_run_command_gmodules/a.out' (x86_64)

Hide Details

Hide Details

runCmd: thread list output: Process 99135 stopped * thread #1: tid = 0x86213a1, 0x00000001000013e5 a.out`main at main.cpp:25:16, queue = 'com.apple.main-thread', stop reason = breakpoint 1.1

Hide Details

Hide Details

Expecting sub string: stopped Matched

Hide Details

Expecting sub string: stop reason = breakpoint Matched

Hide Details

Adding tearDown hook: def cleanup(): self.runCmd('type format clear', check=False) self.runCmd('type summary clear', check=False) self.runCmd('type filter clear', check=False) self.runCmd('type synth clear', check=False) self.runCmd( "settings set target.max-children-count 256", check=False)

Hide Details

Hide Details

runCmd: frame variable ii output: (std::__1::multimap<int, int, std::__1::less<int>, std::__1::allocator<std::__1::pair<const int, int> > >) ii = size=0 {}

Hide Details

Hide Details

Expecting sub string: std::__1::multimap Matched

Hide Details

Expecting sub string: size=0 Matched

Hide Details

Expecting sub string: {} Matched

Hide Details

runCmd: frame variable ii output: (std::__1::multimap<int, int, std::__1::less<int>, std::__1::allocator<std::__1::pair<const int, int> > >) ii = size=2 { [0] = (first = 0, second = 0) [1] = (first = 1, second = 1) }

Hide Details

Hide Details

Expecting sub string: std::__1::multimap Matched

Hide Details

Expecting sub string: size=2 Matched

Hide Details

Expecting sub string: [0] = Matched

Hide Details

Expecting sub string: first = 0 Matched

Hide Details

Expecting sub string: second = 0 Matched

Hide Details

Expecting sub string: [1] = Matched

Hide Details

Expecting sub string: first = 1 Matched

Hide Details

Expecting sub string: second = 1 Matched

Hide Details

runCmd: frame variable ii output: (std::__1::multimap<int, int, std::__1::less<int>, std::__1::allocator<std::__1::pair<const int, int> > >) ii = size=4 { [0] = (first = 0, second = 0) [1] = (first = 1, second = 1) [2] = (first = 2, second = 0) [3] = (first = 3, second = 1) }

Hide Details

Hide Details

Expecting sub string: std::__1::multimap Matched

Hide Details

Expecting sub string: size=4 Matched

Hide Details

Expecting sub string: [2] = Matched

Hide Details

Expecting sub string: first = 2 Matched

Hide Details

Expecting sub string: second = 0 Matched

Hide Details

Expecting sub string: [3] = Matched

Hide Details

Expecting sub string: first = 3 Matched

Hide Details

Expecting sub string: second = 1 Matched

Hide Details

runCmd: frame variable ii output: (std::__1::multimap<int, int, std::__1::less<int>, std::__1::allocator<std::__1::pair<const int, int> > >) ii = size=8 { [0] = (first = 0, second = 0) [1] = (first = 1, second = 1) [2] = (first = 2, second = 0) [3] = (first = 3, second = 1) [4] = (first = 4, second = 0) [5] = (first = 5, second = 1) [6] = (first = 6, second = 0) [7] = (first = 7, second = 1) }

Hide Details

Hide Details

Expecting sub string: std::__1::multimap Matched

Hide Details

Expecting sub string: size=8 Matched

Hide Details

Expecting sub string: [5] = Matched

Hide Details

Expecting sub string: first = 5 Matched

Hide Details

Expecting sub string: second = 0 Matched

Hide Details

Expecting sub string: [7] = Matched

Hide Details

Expecting sub string: first = 7 Matched

Hide Details

Expecting sub string: second = 1 Matched

Hide Details

runCmd: p ii output: (std::__1::multimap<int, int, std::__1::less<int>, std::__1::allocator<std::__1::pair<const int, int> > >) $0 = size=8 { [0] = (first = 0, second = 0) [1] = (first = 1, second = 1) [2] = (first = 2, second = 0) [3] = (first = 3, second = 1) [4] = (first = 4, second = 0) [5] = (first = 5, second = 1) [6] = (first = 6, second = 0) [7] = (first = 7, second = 1) }

Hide Details

Hide Details

Expecting sub string: std::__1::multimap Matched

Hide Details

Expecting sub string: size=8 Matched

Hide Details

Expecting sub string: [5] = Matched

Hide Details

Expecting sub string: first = 5 Matched

Hide Details

Expecting sub string: second = 0 Matched

Hide Details

Expecting sub string: [7] = Matched

Hide Details

Expecting sub string: first = 7 Matched

Hide Details

Expecting sub string: second = 1 Matched

Hide Details

runCmd: frame variable ii[0] output: (std::__1::pair<const int, int>) [0] = (first = 0, second = 0)

Hide Details

Hide Details

Expecting sub string: first = 0 Matched

Hide Details

Expecting sub string: second = 0 Matched

Hide Details

runCmd: frame variable ii[3] output: (std::__1::pair<const int, int>) [3] = (first = 3, second = 1)

Hide Details

Hide Details

Expecting sub string: first = Matched

Hide Details

Expecting sub string: second = Matched

Hide Details

runCmd: frame variable ii output: (std::__1::multimap<int, int, std::__1::less<int>, std::__1::allocator<std::__1::pair<const int, int> > >) ii = size=0 {}

Hide Details

Hide Details

Expecting sub string: std::__1::multimap Matched

Hide Details

Expecting sub string: size=0 Matched

Hide Details

Expecting sub string: {} Matched

Hide Details

runCmd: frame variable si output: (std::__1::multimap<std::__1::basic_string<char, std::__1::char_traits<char>, std::__1::allocator<char> >, int, std::__1::less<std::__1::basic_string<char, std::__1::char_traits<char>, std::__1::allocator<char> > >, std::__1::allocator<std::__1::pair<const std::__1::basic_string<char, std::__1::char_traits<char>, std::__1::allocator<char> >, int> > >) si = size=0 {}

Hide Details

Hide Details

Expecting sub string: std::__1::multimap Matched

Hide Details

Expecting sub string: size=0 Matched

Hide Details

Expecting sub string: {} Matched

Hide Details

runCmd: frame variable si output: (std::__1::multimap<std::__1::basic_string<char, std::__1::char_traits<char>, std::__1::allocator<char> >, int, std::__1::less<std::__1::basic_string<char, std::__1::char_traits<char>, std::__1::allocator<char> > >, std::__1::allocator<std::__1::pair<const std::__1::basic_string<char, std::__1::char_traits<char>, std::__1::allocator<char> >, int> > >) si = size=1 { [0] = (first = "zero", second = 0) }

Hide Details

Hide Details

Expecting sub string: std::__1::multimap Matched

Hide Details

Expecting sub string: size=1 Matched

Hide Details

Expecting sub string: [0] = Matched

Hide Details

Expecting sub string: first = "zero" Matched

Hide Details

Expecting sub string: second = 0 Matched

Hide Details

runCmd: frame variable si output: (std::__1::multimap<std::__1::basic_string<char, std::__1::char_traits<char>, std::__1::allocator<char> >, int, std::__1::less<std::__1::basic_string<char, std::__1::char_traits<char>, std::__1::allocator<char> > >, std::__1::allocator<std::__1::pair<const std::__1::basic_string<char, std::__1::char_traits<char>, std::__1::allocator<char> >, int> > >) si = size=4 { [0] = (first = "one", second = 1) [1] = (first = "three", second = 3) [2] = (first = "two", second = 2) [3] = (first = "zero", second = 0) }

Hide Details

Hide Details

Expecting sub string: std::__1::multimap Matched

Hide Details

Expecting sub string: size=4 Matched

Hide Details

Expecting sub string: [0] = Matched

Hide Details

Expecting sub string: first = "zero" Matched

Hide Details

Expecting sub string: second = 0 Matched

Hide Details

Expecting sub string: [1] = Matched

Hide Details

Expecting sub string: first = "one" Matched

Hide Details

Expecting sub string: second = 1 Matched

Hide Details

Expecting sub string: [2] = Matched

Hide Details

Expecting sub string: first = "two" Matched

Hide Details

Expecting sub string: second = 2 Matched

Hide Details

Expecting sub string: [3] = Matched

Hide Details

Expecting sub string: first = "three" Matched

Hide Details

Expecting sub string: second = 3 Matched

Hide Details

runCmd: p si output: (std::__1::multimap<std::__1::basic_string<char, std::__1::char_traits<char>, std::__1::allocator<char> >, int, std::__1::less<std::__1::basic_string<char, std::__1::char_traits<char>, std::__1::allocator<char> > >, std::__1::allocator<std::__1::pair<const std::__1::basic_string<char, std::__1::char_traits<char>, std::__1::allocator<char> >, int> > >) $1 = size=0 {}

Hide Details

Hide Details

Expecting sub string: std::__1::multimap Matched

Hide Details

Expecting sub string: size=4 Not matched

Hide Details

FAIL: LLDB (/Users/buildslave/jenkins/workspace/lldb-cmake-sanitized/lldb-build/bin/clang-10-x86_64) :: test_with_run_command_gmodules (TestDataFormatterLibccMultiMap.LibcxxMultiMapDataFormatterTestCase) <bound method SBProcess.Kill of <lldb.SBProcess; proxy of <Swig Object of type 'lldb::SBProcess *' at 0x109e4b600> >>: success

Hide Details

Executing tearDown hook: def cleanup(): self.runCmd('type format clear', check=False) self.runCmd('type summary clear', check=False) self.runCmd('type filter clear', check=False) self.runCmd('type synth clear', check=False) self.runCmd( "settings set target.max-children-count 256", check=False)

Hide Details

Hide Details

runCmd: type format clear check of return status not required output:

Hide Details

runCmd: type summary clear check of return status not required output:

Hide Details

runCmd: type filter clear check of return status not required output:

Hide Details

runCmd: type synth clear check of return status not required output:

Hide Details

runCmd: settings set target.max-children-count 256 check of return status not required output:

Hide Details

Restore dir to: /Users/buildslave/jenkins/workspace/lldb-cmake-sanitized/lldb-build/tools/lldb/test ====================================================================== FAIL: test_with_run_command_gmodules (TestDataFormatterLibccMultiMap.LibcxxMultiMapDataFormatterTestCase) Test that that file and class static variables display correctly. ---------------------------------------------------------------------- Traceback (most recent call last): File "/Users/buildslave/jenkins/workspace/lldb-cmake-sanitized/llvm-project/lldb/packages/Python/lldbsuite/test/lldbtest.py", line 1732, in test_method return attrvalue(self) File "/Users/buildslave/jenkins/workspace/lldb-cmake-sanitized/llvm-project/lldb/packages/Python/lldbsuite/test/functionalities/data-formatter/data-formatter-stl/libcxx/multimap/TestDataFormatterLibccMultiMap.py", line 170, in test_with_run_command 'second = 3']) File "/Users/buildslave/jenkins/workspace/lldb-cmake-sanitized/llvm-project/lldb/packages/Python/lldbsuite/test/lldbtest.py", line 2367, in expect msg if msg else EXP_MSG(str, output, exe)) AssertionError: False is not True : 'p si' returns expected result, got '(std::__1::multimap<std::__1::basic_string<char, std::__1::char_traits<char>, std::__1::allocator<char> >, int, std::__1::less<std::__1::basic_string<char, std::__1::char_traits<char>, std::__1::allocator<char> > >, std::__1::allocator<std::__1::pair<const std::__1::basic_string<char, std::__1::char_traits<char>, std::__1::allocator<char> >, int> > >) $1 = size=0 {}' Config=x86_64-/Users/buildslave/jenkins/workspace/lldb-cmake-sanitized/lldb-build/bin/clang-10 ---------------------------------------------------------------------- Ran 4 tests in 128.213s

Hide Details

RESULT: FAILED (2 passes, 1 failures, 0 errors, 1 skipped, 0 expected failures, 0 unexpected successes)

Hide Details

******************** PASS: lldb-shell :: SymbolFile/DWARF/dir-separator-no-comp-dir-relative-name.s (866 of 1888) PASS: lldb-unit :: Utility/./UtilityTests/StreamTest.PutRawBytesToLittleEndian (867 of 1888) PASS: lldb-unit :: Language/CPlusPlus/./LanguageCPlusPlusTests/CPlusPlusLanguage.ExtractContextAndIdentifier (868 of 1888) UNSUPPORTED: lldb-api :: lang/cpp/printf/TestPrintf.py (869 of 1888) UNSUPPORTED: lldb-shell :: Register/x86-ymm-write.test (870 of 1888) PASS: lldb-shell :: Settings/TestSettingsSet.test (871 of 1888) PASS: lldb-unit :: Interpreter/./InterpreterTests/OptionArgParserTest.toBoolean (872 of 1888) PASS: lldb-unit :: Expression/./ExpressionTests/DiagnosticManagerTest.PutStringSeverities (873 of 1888) PASS: lldb-unit :: Utility/./UtilityTests/OptionsWithRawTest.EmptySuffix (874 of 1888) PASS: lldb-api :: functionalities/abbreviation/TestAbbreviations.py (875 of 1888) PASS: lldb-unit :: Language/Highlighting/./HighlighterTests/HighlighterTest.Colons (876 of 1888) PASS: lldb-shell :: Reproducer/TestReuseDirectory.test (877 of 1888) PASS: lldb-unit :: debugserver/./debugserverTests/JSON.Parse (878 of 1888) PASS: lldb-unit :: Utility/./UtilityTests/StringListTest.CopyList (879 of 1888) PASS: lldb-api :: functionalities/testid/TestTestId.py (880 of 1888) PASS: lldb-api :: commands/expression/two-files/TestObjCTypeQueryFromOtherCompileUnit.py (881 of 1888) PASS: lldb-api :: functionalities/tail_call_frames/ambiguous_tail_call_seq2/TestAmbiguousTailCallSeq2.py (882 of 1888) PASS: lldb-unit :: Symbol/./SymbolTests/TestClangASTContext.TestBuiltinTypeForEncodingAndBitSize (883 of 1888) PASS: lldb-api :: functionalities/data-formatter/synthcapping/TestSyntheticCapping.py (884 of 1888) PASS: lldb-api :: functionalities/value_md5_crash/TestValueMD5Crash.py (885 of 1888) PASS: lldb-unit :: Symbol/./SymbolTests/TestClangASTContext.TestGetTypeClassTypeOf (886 of 1888) PASS: lldb-unit :: Utility/./UtilityTests/StringLexerTest.HasAtLeast (887 of 1888) PASS: lldb-api :: lang/objc/rdar-10967107/TestRdar10967107.py (888 of 1888) PASS: lldb-unit :: Utility/./UtilityTests/StringExtractorTest.GetHexBytesAvail_Underflow (889 of 1888) PASS: lldb-unit :: Process/gdb-remote/./ProcessGdbRemoteTests/GDBRemoteClientBaseTest.SendContinueAndInterrupt2PacketBug (890 of 1888) PASS: lldb-unit :: Utility/./UtilityTests/ArgsTest.AppendArguments (891 of 1888) XFAIL: lldb-shell :: Register/x86-64-ymm-write.test (892 of 1888) PASS: lldb-unit :: Utility/./UtilityTests/StreamTest.PutHex64ByteOrderLittle (893 of 1888) PASS: lldb-unit :: Process/minidump/./LLDBMinidumpTests/RegisterContextMinidump.ConvertMinidumpContext_x86_32 (894 of 1888) PASS: lldb-shell :: SymbolFile/DWARF/find-variable-file.cpp (895 of 1888) PASS: lldb-shell :: Minidump/dump-all.test (896 of 1888) PASS: lldb-api :: lang/c/conflicting-symbol/TestConflictingSymbol.py (897 of 1888) PASS: lldb-api :: python_api/objc_type/TestObjCType.py (898 of 1888) PASS: lldb-api :: functionalities/data-formatter/hexcaps/TestDataFormatterHexCaps.py (899 of 1888) PASS: lldb-unit :: Target/./TargetTests/ExecutionContextTest.GetByteOrder (900 of 1888) PASS: lldb-api :: functionalities/data-formatter/typedef_array/TestTypedefArray.py (901 of 1888) UNSUPPORTED: lldb-api :: benchmarks/turnaround/TestCompileRunToBreakpointTurnaround.py (902 of 1888) PASS: lldb-api :: sample_test/TestSampleTest.py (903 of 1888) PASS: lldb-unit :: Utility/./UtilityTests/OptionsWithRawTest.UnterminatedQuote (904 of 1888) PASS: lldb-api :: commands/expression/import-std-module/basic/TestImportStdModule.py (905 of 1888) PASS: lldb-unit :: Expression/./ExpressionTests/CppModuleConfigurationTest.IgnoreLibStdCpp (906 of 1888) PASS: lldb-unit :: Interpreter/./InterpreterTests/CompletionTest.DirCompletionUsername (907 of 1888) PASS: lldb-api :: lang/cpp/char8_t/TestCxxChar8_t.py (908 of 1888) PASS: lldb-api :: lang/cpp/dynamic-value/TestCppValueCast.py (909 of 1888) PASS: lldb-unit :: ScriptInterpreter/Python/./ScriptInterpreterPythonTests/PythonDataObjectsTest.TestPythonDictionaryManipulation (910 of 1888) PASS: lldb-api :: functionalities/data-formatter/parray/TestPrintArray.py (911 of 1888) PASS: lldb-api :: commands/expression/import-std-module/no-std-module/TestMissingStdModule.py (912 of 1888) PASS: lldb-api :: commands/reproducer/invalid-args/TestInvalidArgsReproducer.py (913 of 1888) PASS: lldb-unit :: Utility/./UtilityTests/StreamTest.AddressPrefix (914 of 1888) PASS: lldb-api :: functionalities/breakpoint/address_breakpoints/TestAddressBreakpoints.py (915 of 1888) PASS: lldb-unit :: Host/./HostTests/FileSystemTest.MakeAbsolute (916 of 1888) PASS: lldb-unit :: tools/lldb-server/tests/./LLDBServerTests/StandardStartupTest.TestStopReplyContainsThreadPcs (917 of 1888) PASS: lldb-unit :: Host/./HostTests/SocketAddressTest.Set (918 of 1888) PASS: lldb-api :: functionalities/data-formatter/dump_dynamic/TestDumpDynamic.py (919 of 1888) PASS: lldb-unit :: Core/./LLDBCoreTests/MangledTest.ResultForBlockInvocation (920 of 1888) PASS: lldb-api :: functionalities/postmortem/elf-core/thread_crash/TestLinuxCoreThreads.py (921 of 1888) PASS: lldb-api :: commands/quit/TestQuit.py (922 of 1888) PASS: lldb-api :: functionalities/data-formatter/refpointer-recursion/TestDataFormatterRefPtrRecursion.py (923 of 1888) PASS: lldb-api :: commands/watchpoints/watchpoint_size/TestWatchpointSizes.py (924 of 1888) PASS: lldb-unit :: Host/./HostTests/NativeProcessProtocolTest.SetBreakpointFailWrite (925 of 1888) PASS: lldb-api :: lang/objcxx/objcxx-ivar-vector/TestIvarVector.py (926 of 1888) UNSUPPORTED: lldb-api :: lang/objc/rdar-12408181/TestRdar12408181.py (927 of 1888) UNSUPPORTED: lldb-api :: functionalities/ubsan/basic/TestUbsanBasic.py (928 of 1888) PASS: lldb-unit :: Utility/./UtilityTests/RecordReplayTest.InstrumentedBarRef (929 of 1888) PASS: lldb-api :: commands/process/attach/attach_denied/TestAttachDenied.py (930 of 1888) UNSUPPORTED: lldb-shell :: SymbolFile/NativePDB/typedefs.cpp (931 of 1888) PASS: lldb-api :: commands/frame/diagnose/dereference-this/TestDiagnoseDereferenceThis.py (932 of 1888) PASS: lldb-unit :: Symbol/./SymbolTests/LineEntryTest.GetSameLineContiguousAddressRangeNoInlines (933 of 1888) PASS: lldb-api :: functionalities/data-formatter/poarray/TestPrintObjectArray.py (934 of 1888) UNSUPPORTED: lldb-api :: android/platform/TestDefaultCacheLineSize.py (935 of 1888) UNSUPPORTED: lldb-shell :: ScriptInterpreter/Lua/watchpoint_callback.test (936 of 1888) PASS: lldb-api :: commands/help/TestHelp.py (937 of 1888) UNSUPPORTED: lldb-api :: functionalities/data-formatter/data-formatter-stl/libstdcpp/unique_ptr/TestDataFormatterStdUniquePtr.py (938 of 1888) PASS: lldb-unit :: Utility/./UtilityTests/StreamTest.PutHex16ByteOrderLittle (939 of 1888) PASS: lldb-unit :: Utility/./UtilityTests/StringExtractorTest.GetHexBytesAvail_Partial (940 of 1888) PASS: lldb-unit :: Utility/./UtilityTests/StringListTest.JoinMultiCharSeparator (941 of 1888) PASS: lldb-api :: functionalities/breakpoint/source_regexp/TestSourceRegexBreakpoints.py (942 of 1888) PASS: lldb-unit :: Utility/./UtilityTests/StringListTest.PopBack (943 of 1888) PASS: lldb-unit :: Process/minidump/./LLDBMinidumpTests/MinidumpParserTest.GetLinuxProcStatus (944 of 1888) PASS: lldb-unit :: Host/./HostTests/MainLoopTest.Signal (945 of 1888) PASS: lldb-unit :: Utility/./UtilityTests/SerializationRountripTest.SerializeDeserializeObjectReference (946 of 1888) PASS: lldb-unit :: Utility/./UtilityTests/StringListTest.ShiftMove (947 of 1888) UNSUPPORTED: lldb-api :: commands/register/register/intel_xtended_registers/mpx_bound_violation/TestBoundViolation.py (948 of 1888) PASS: lldb-api :: python_api/watchpoint/watchlocation/TestTargetWatchAddress.py (949 of 1888) PASS: lldb-unit :: Utility/./UtilityTests/StreamTest.QuotedCString (950 of 1888) PASS: lldb-api :: functionalities/data-formatter/data-formatter-objc/nsindexpath/TestDataFormatterNSIndexPath.py (951 of 1888) PASS: lldb-api :: lang/cpp/chained-calls/TestCppChainedCalls.py (952 of 1888) PASS: lldb-unit :: UnwindAssembly/x86/./UnwindAssemblyx86Tests/Testx86AssemblyInspectionEngine.TestPopESI (953 of 1888) PASS: lldb-api :: python_api/lldbutil/process/TestPrintStackTraces.py (954 of 1888) PASS: lldb-unit :: Utility/./UtilityTests/BinaryStreamTest.PutSLEB128MaxValue (955 of 1888) PASS: lldb-unit :: UnwindAssembly/x86/./UnwindAssemblyx86Tests/Testx86AssemblyInspectionEngine.TestPopEBX (956 of 1888) PASS: lldb-api :: commands/expression/import-std-module/forward_list-basic/TestBasicForwardList.py (957 of 1888) PASS: lldb-unit :: Utility/./UtilityTests/BinaryStreamTest.PutULEB128FourBytes (958 of 1888) PASS: lldb-unit :: Utility/./UtilityTests/StringExtractorTest.InitEmpty (959 of 1888) PASS: lldb-api :: commands/expression/pr35310/TestExprsBug35310.py (960 of 1888) PASS: lldb-unit :: Utility/./UtilityTests/ScalarTest.CastOperations (961 of 1888) PASS: lldb-api :: functionalities/data-formatter/pyobjsynthprovider/TestPyObjSynthProvider.py (962 of 1888) PASS: lldb-shell :: ObjectFile/ELF/netbsd-exec-8.99.30-amd64.yaml (963 of 1888) PASS: lldb-unit :: Utility/./UtilityTests/GeneratorTest.GetOrCreate (964 of 1888) PASS: lldb-api :: functionalities/jitloader_gdb/TestJITLoaderGDB.py (965 of 1888) PASS: lldb-unit :: Utility/./UtilityTests/BinaryStreamTest.PutULEB128NineBytes (966 of 1888) PASS: lldb-api :: functionalities/data-formatter/data-formatter-ptr-to-array/TestPtrToArrayFormatting.py (967 of 1888) PASS: lldb-shell :: SymbolFile/Breakpad/unwind-via-stack-cfi.test (968 of 1888) PASS: lldb-api :: functionalities/load_unload/TestLoadUnload.py (969 of 1888) PASS: lldb-api :: lang/objc/foundation/TestRuntimeTypes.py (970 of 1888) PASS: lldb-api :: functionalities/data-formatter/data-formatter-smart-array/TestDataFormatterSmartArray.py (971 of 1888) PASS: lldb-unit :: Utility/./UtilityTests/FileSpecTest.IsRelative (972 of 1888) PASS: lldb-unit :: Process/gdb-remote/./ProcessGdbRemoteTests/GDBRemoteClientBaseTest.SendContinueAndWait (973 of 1888) PASS: lldb-api :: commands/watchpoints/step_over_watchpoint/TestStepOverWatchpoint.py (974 of 1888) UNSUPPORTED: lldb-api :: functionalities/asan/TestMemoryHistory.py (975 of 1888) PASS: lldb-shell :: Reproducer/Functionalities/TestDataFormatter.test (976 of 1888) PASS: lldb-unit :: Utility/./UtilityTests/StreamTest.PutRawBytesToMixedEndian (977 of 1888) PASS: lldb-api :: lang/objc/foundation/TestObjCMethodsString.py (978 of 1888) PASS: lldb-unit :: UnwindAssembly/x86/./UnwindAssemblyx86Tests/Testx86AssemblyInspectionEngine.Test32bitFramelessSmallStackFrame (979 of 1888) PASS: lldb-unit :: ObjectFile/Breakpad/./ObjectFileBreakpadTests/StackWinRecord.parse (980 of 1888) PASS: lldb-shell :: Settings/TestEchoCommands.test (981 of 1888) PASS: lldb-shell :: ObjectFile/MachO/subsections.yaml (982 of 1888) PASS: lldb-api :: functionalities/gdb_remote_client/TestPlatformClient.py (983 of 1888) PASS: lldb-unit :: Utility/./UtilityTests/BinaryStreamTest.PutSLEB128FourBytes (984 of 1888) PASS: lldb-shell :: Reproducer/TestRelativePath.test (985 of 1888) PASS: lldb-unit :: Utility/./UtilityTests/ArgsTest.GetQuotedCommandString (986 of 1888) PASS: lldb-api :: python_api/formatters/TestFormattersSBAPI.py (987 of 1888) PASS: lldb-shell :: SymbolFile/DWARF/debug_loc-aslr.s (988 of 1888) PASS: lldb-api :: functionalities/data-formatter/data-formatter-advanced/TestDataFormatterAdv.py (989 of 1888) PASS: lldb-api :: functionalities/thread/concurrent_events/TestConcurrentBreakpointDelayBreakpointOneSignal.py (990 of 1888) PASS: lldb-shell :: Breakpoint/split-dwarf-5-addrbase.test (991 of 1888) PASS: lldb-unit :: Utility/./UtilityTests/ScalarTest.Comparison (992 of 1888) PASS: lldb-unit :: Utility/./UtilityTests/Predicate.WaitForValueNotEqualTo (993 of 1888) PASS: lldb-unit :: Host/./HostTests/FileSystemTest.Readable (994 of 1888) PASS: lldb-unit :: Utility/./UtilityTests/TimerTest.CategoryTimesNested (995 of 1888) PASS: lldb-api :: lang/c/strings/TestCStrings.py (996 of 1888) PASS: lldb-unit :: tools/lldb-server/tests/./LLDBServerTests/TestBase.DebugserverEnv (997 of 1888) PASS: lldb-shell :: Settings/TestModuleCacheSanity.test (998 of 1888) PASS: lldb-unit :: Utility/./UtilityTests/StringExtractorTest.GetHexU8_Exact_NoEof (999 of 1888) PASS: lldb-shell :: Commands/command-script-import.test (1000 of 1888) PASS: lldb-api :: functionalities/non-overlapping-index-variable-i/TestIndexVariable.py (1001 of 1888) PASS: lldb-api :: commands/expression/persistent_ptr_update/TestPersistentPtrUpdate.py (1002 of 1888) PASS: lldb-unit :: Utility/./UtilityTests/TildeExpressionResolver.ResolveFullPath (1003 of 1888) UNSUPPORTED: lldb-api :: python_api/disassemble-raw-data/TestDisassemble_VST1_64.py (1004 of 1888) PASS: lldb-shell :: SymbolFile/Breakpad/unwind-via-stack-win.test (1005 of 1888) PASS: lldb-unit :: Process/gdb-remote/./ProcessGdbRemoteTests/GDBRemoteCommunicationTest.ReadPacket_checksum (1006 of 1888) UNSUPPORTED: lldb-api :: functionalities/data-formatter/data-formatter-stl/libstdcpp/string/TestDataFormatterStdString.py (1007 of 1888) PASS: lldb-shell :: ObjectFile/Breakpad/sections-trailing-func.test (1008 of 1888) PASS: lldb-api :: tools/lldb-vscode/breakpoint/TestVSCode_setExceptionBreakpoints.py (1009 of 1888) PASS: lldb-shell :: Driver/TestCommands.test (1010 of 1888) PASS: lldb-unit :: Utility/./UtilityTests/StringListTest.GetMaxStringLengthEqualSize (1011 of 1888) PASS: lldb-unit :: Utility/./UtilityTests/AnsiTerminal.WhiteSpace (1012 of 1888) PASS: lldb-api :: lang/objc/objc-super/TestObjCSuper.py (1013 of 1888) PASS: lldb-api :: functionalities/postmortem/minidump-new/TestMiniDumpNew.py (1014 of 1888) PASS: lldb-shell :: SymbolFile/DWARF/debug_loc.s (1015 of 1888) PASS: lldb-unit :: Utility/./UtilityTests/CompletionRequest.TryCompleteCurrentArgBad (1016 of 1888) PASS: lldb-api :: functionalities/data-formatter/data-formatter-stl/libcxx/variant/TestDataFormatterLibcxxVariant.py (1017 of 1888) PASS: lldb-api :: commands/expression/codegen-crash-typedefdecl-not-in_declcontext/TestCodegenCrashTypedefDeclNotInDeclContext.py (1018 of 1888) PASS: lldb-unit :: Platform/./LLDBPlatformTests/PlatformDarwinTest.TestParseVersionBuildDir (1019 of 1888) PASS: lldb-api :: python_api/sbvalue_persist/TestSBValuePersist.py (1020 of 1888) PASS: lldb-api :: lang/c/local_variables/TestLocalVariables.py (1021 of 1888) PASS: lldb-unit :: Editline/./EditlineTests/EditlineTestFixture.EditlineReceivesMultiLineText (1022 of 1888) PASS: lldb-shell :: ObjectFile/PECOFF/symbol.yaml (1023 of 1888) UNSUPPORTED: lldb-api :: functionalities/darwin_log/filter/exact_match/activity-chain/TestDarwinLogFilterMatchActivityChain.py (1024 of 1888) PASS: lldb-api :: functionalities/thread/concurrent_events/TestConcurrentSignalDelayBreak.py (1025 of 1888) PASS: lldb-api :: functionalities/data-formatter/data-formatter-stl/libcxx/function/TestLibCxxFunction.py (1026 of 1888) PASS: lldb-api :: types/TestRecursiveTypes.py (1027 of 1888) PASS: lldb-unit :: Utility/./UtilityTests/StreamTest.AddressEmptyPrefix (1028 of 1888) UNSUPPORTED: lldb-api :: tools/lldb-server/signal-filtering/TestGdbRemote_QPassSignals.py (1029 of 1888) PASS: lldb-shell :: Driver/TestFile.test (1030 of 1888) PASS: lldb-api :: functionalities/tail_call_frames/disambiguate_call_site/TestDisambiguateCallSite.py (1031 of 1888) PASS: lldb-unit :: Utility/./UtilityTests/FileSpecTest.EqualSeparator (1032 of 1888) PASS: lldb-api :: functionalities/data-formatter/data-formatter-stl/libcxx/string/TestDataFormatterLibcxxString.py (1033 of 1888) PASS: lldb-unit :: Utility/./UtilityTests/StringListTest.Join (1034 of 1888) PASS: lldb-unit :: tools/lldb-server/tests/./LLDBServerTests/TestBase.LaunchModePreservesEnvironment (1035 of 1888) PASS: lldb-unit :: SymbolFile/DWARF/./SymbolFileDWARFTests/DWARFASTParserClangTests.EnsureAllDIEsInDeclContextHaveBeenParsedParsesOnlyMatchingEntries (1036 of 1888) PASS: lldb-api :: python_api/default-constructor/TestDefaultConstructorForAPIObjects.py (1037 of 1888) PASS: lldb-shell :: SymbolFile/DWARF/dir-separator-posix.s (1038 of 1888) PASS: lldb-api :: commands/expression/top-level/TestTopLevelExprs.py (1039 of 1888) PASS: lldb-unit :: Process/gdb-remote/./ProcessGdbRemoteTests/GDBRemoteCommunicationClientTest.GetMemoryRegionInfoInvalidResponse (1040 of 1888) PASS: lldb-api :: functionalities/gdb_remote_client/TestNestedRegDefinitions.py (1041 of 1888) PASS: lldb-unit :: Expression/./ExpressionTests/DiagnosticManagerTest.AppendMessageAttachToLastDiag (1042 of 1888) PASS: lldb-api :: lang/objc/foundation/TestObjCMethods.py (1043 of 1888) PASS: lldb-api :: functionalities/gdb_remote_client/TestWriteMemory.py (1044 of 1888) PASS: lldb-unit :: Utility/./UtilityTests/RangeTest.Copy (1045 of 1888) PASS: lldb-api :: functionalities/set-data/TestSetData.py (1046 of 1888) PASS: lldb-api :: tools/lldb-vscode/breakpoint/TestVSCode_setBreakpoints.py (1047 of 1888) PASS: lldb-api :: functionalities/thread/step_out/TestThreadStepOut.py (1048 of 1888) PASS: lldb-unit :: Expression/./ExpressionTests/DiagnosticManagerTest.GetStringSeverityLabels (1049 of 1888) PASS: lldb-api :: functionalities/float-display/TestFloatDisplay.py (1050 of 1888) PASS: lldb-api :: functionalities/breakpoint/serialize/TestBreakpointSerialization.py (1051 of 1888) PASS: lldb-api :: commands/expression/persistent_variables/TestPersistentVariables.py (1052 of 1888) PASS: lldb-api :: functionalities/load_using_paths/TestLoadUsingPaths.py (1053 of 1888) PASS: lldb-shell :: Reproducer/TestGDBRemoteRepro.test (1054 of 1888) PASS: lldb-unit :: Process/minidump/./LLDBMinidumpTests/MinidumpParserTest.GetMemoryRegionInfoLinuxMaps (1055 of 1888) PASS: lldb-unit :: Utility/./UtilityTests/SubsystemRAIITest.NormalSubsystem (1056 of 1888) PASS: lldb-unit :: Language/CPlusPlus/./LanguageCPlusPlusTests/CPlusPlusLanguage.MethodNameParsing (1057 of 1888) PASS: lldb-unit :: Utility/./UtilityTests/OptionsWithRawTest.SingleWordSuffix (1058 of 1888) PASS: lldb-unit :: Host/./HostTests/Host.WaitStatusFormat (1059 of 1888) PASS: lldb-unit :: Process/gdb-remote/./ProcessGdbRemoteTests/GDBRemoteClientBaseTest.SendContinueAndInterrupt (1060 of 1888) PASS: lldb-unit :: Utility/./UtilityTests/AnsiTerminal.Empty (1061 of 1888) UNSUPPORTED: lldb-shell :: Unwind/eh-frame-small-fde.test (1062 of 1888) PASS: lldb-api :: tools/lldb-server/TestGdbRemoteKill.py (1063 of 1888) PASS: lldb-unit :: Utility/./UtilityTests/Flags.Reset (1064 of 1888) PASS: lldb-unit :: Utility/./UtilityTests/NameMatchesTest.Contains (1065 of 1888) PASS: lldb-api :: lang/cpp/template/TestTemplateArgs.py (1066 of 1888) PASS: lldb-api :: functionalities/data-formatter/data-formatter-stl/libcxx/bitset/TestDataFormatterLibcxxBitset.py (1067 of 1888) PASS: lldb-unit :: Host/./HostTests/SocketTest.TCPListen0GetPort (1068 of 1888) PASS: lldb-unit :: Host/./HostTests/Host.GetEnvironment (1069 of 1888) PASS: lldb-unit :: Utility/./UtilityTests/SerializationRountripTest.SerializeDeserializeObjectPointer (1070 of 1888) PASS: lldb-unit :: Utility/./UtilityTests/RangeTest.Clear (1071 of 1888) UNSUPPORTED: lldb-api :: functionalities/data-formatter/data-formatter-stl/libstdcpp/smart_ptr/TestDataFormatterStdSmartPtr.py (1072 of 1888) PASS: lldb-api :: commands/watchpoints/multiple_hits/TestMultipleHits.py (1073 of 1888) PASS: lldb-unit :: Utility/./UtilityTests/NameMatchesTest.StartsWith (1074 of 1888) PASS: lldb-shell :: SymbolFile/DWARF/debug_loc_and_loclists.s (1075 of 1888) PASS: lldb-unit :: Utility/./UtilityTests/StringLexerTest.NextIfList (1076 of 1888) PASS: lldb-shell :: ObjectFile/ELF/PT_LOAD.yaml (1077 of 1888) PASS: lldb-unit :: Utility/./UtilityTests/OptionsWithRawTest.WhitespaceInput (1078 of 1888) PASS: lldb-api :: functionalities/show_location/TestShowLocationDwarf5.py (1079 of 1888) PASS: lldb-unit :: Process/minidump/./LLDBMinidumpTests/RegisterContextMinidump.CheckRegisterContextMinidump_ARM (1080 of 1888) PASS: lldb-unit :: Expression/./ExpressionTests/CppModuleConfigurationTest.Xcode (1081 of 1888) PASS: lldb-api :: commands/breakpoint/command/list/TestBreakpointCommandList.py (1082 of 1888) PASS: lldb-unit :: Host/./HostTests/MainLoopTest.TerminatesImmediately (1083 of 1888) PASS: lldb-api :: functionalities/stats_api/TestStatisticsAPI.py (1084 of 1888) PASS: lldb-unit :: Language/Highlighting/./HighlighterTests/HighlighterTest.DefaultHighlighter (1085 of 1888) PASS: lldb-api :: lang/c/bitfields/TestBitfields.py (1086 of 1888) PASS: lldb-unit :: Utility/./UtilityTests/StringListTest.JoinEmpty (1087 of 1888) PASS: lldb-shell :: Minidump/disassemble-no-module.yaml (1088 of 1888) PASS: lldb-unit :: Utility/./UtilityTests/RecordReplayTest.InstrumentedBarPtr (1089 of 1888) UNSUPPORTED: lldb-shell :: ScriptInterpreter/Lua/bindings.test (1090 of 1888) PASS: lldb-unit :: Utility/./UtilityTests/StreamTest.PutCStringWithStringRef (1091 of 1888) PASS: lldb-unit :: Utility/./UtilityTests/StringListTest.Assignment (1092 of 1888) PASS: lldb-unit :: UnwindAssembly/x86/./UnwindAssemblyx86Tests/Testx86AssemblyInspectionEngine.TestPushR14 (1093 of 1888) PASS: lldb-api :: commands/expression/radar_9673664/TestExprHelpExamples.py (1094 of 1888) PASS: lldb-unit :: UnwindAssembly/x86/./UnwindAssemblyx86Tests/Testx86AssemblyInspectionEngine.TestCALLNextInsn (1095 of 1888) PASS: lldb-shell :: Register/x86-64-read.test (1096 of 1888) PASS: lldb-api :: lang/c/shared_lib/TestSharedLib.py (1097 of 1888) PASS: lldb-shell :: SymbolFile/DWARF/debug_rnglists-dwo.s (1098 of 1888) PASS: lldb-unit :: Utility/./UtilityTests/StringListTest.GetSize (1099 of 1888) PASS: lldb-unit :: Utility/./UtilityTests/ScalarTest.SetValueFromCString (1100 of 1888) PASS: lldb-shell :: Reproducer/Functionalities/TestExpressionEvaluation.test (1101 of 1888) PASS: lldb-api :: functionalities/history/TestHistoryRecall.py (1102 of 1888) PASS: lldb-shell :: Breakpoint/single-file-split-dwarf.test (1103 of 1888) UNSUPPORTED: lldb-shell :: Register/x86-gp-read.test (1104 of 1888) PASS: lldb-unit :: Symbol/./SymbolTests/TestClangASTImporter.CopyTypeTagDecl (1105 of 1888) UNSUPPORTED: lldb-api :: lang/objc/bitfield_ivars/TestBitfieldIvars.py (1106 of 1888) PASS: lldb-api :: functionalities/breakpoint/breakpoint_by_line_and_column/TestBreakpointByLineAndColumn.py (1107 of 1888) PASS: lldb-api :: commands/expression/po_verbosity/TestPoVerbosity.py (1108 of 1888) PASS: lldb-api :: commands/disassemble/basic/TestDisassembleBreakpoint.py (1109 of 1888) PASS: lldb-shell :: SymbolFile/DWARF/clang-ast-from-dwarf-objc-property.m (1110 of 1888) PASS: lldb-api :: commands/expression/context-object-objc/TestContextObjectObjc.py (1111 of 1888) PASS: lldb-shell :: ObjectFile/MachO/lc_version_min.yaml (1112 of 1888) PASS: lldb-api :: functionalities/gdb_remote_client/TestGDBRemoteLoad.py (1113 of 1888) PASS: lldb-api :: types/TestShortTypeExpr.py (1114 of 1888) PASS: lldb-api :: python_api/rdar-12481949/Test-rdar-12481949.py (1115 of 1888) PASS: lldb-unit :: Process/minidump/./LLDBMinidumpTests/MinidumpParserTest.FindMemoryRange (1116 of 1888) PASS: lldb-api :: commands/expression/radar_8638051/Test8638051.py (1117 of 1888) PASS: lldb-unit :: Utility/./UtilityTests/ProcessInstanceInfoMatch.Name (1118 of 1888) PASS: lldb-unit :: Utility/./UtilityTests/StringListTest.JoinNonSpace (1119 of 1888) UNSUPPORTED: lldb-api :: functionalities/tsan/multiple/TestTsanMultiple.py (1120 of 1888) PASS: lldb-api :: lang/objcxx/class-name-clash/TestNameClash.py (1121 of 1888) PASS: lldb-unit :: Utility/./UtilityTests/RegularExpression.Match (1122 of 1888) PASS: lldb-api :: commands/expression/fixits/TestFixIts.py (1123 of 1888) UNSUPPORTED: lldb-shell :: SymbolFile/PDB/pointers.test (1124 of 1888) UNSUPPORTED: lldb-shell :: Register/x86-64-gp-write.test (1125 of 1888) PASS: lldb-api :: lang/cpp/dynamic-value-same-basename/TestDynamicValueSameBase.py (1126 of 1888) PASS: lldb-shell :: Commands/CommandScriptImmediateOutput/CommandScriptImmediateOutputFile.test (1127 of 1888) PASS: lldb-unit :: Utility/./UtilityTests/ProcessInstanceInfo.DumpTable (1128 of 1888) PASS: lldb-api :: commands/register/register/register_command/TestRegisters.py (1129 of 1888) PASS: lldb-unit :: Utility/./UtilityTests/UriParserTest.SchemeHostSeparator2 (1130 of 1888) UNSUPPORTED: lldb-shell :: SymbolFile/PDB/compilands.test (1131 of 1888) PASS: lldb-unit :: Language/Highlighting/./HighlighterTests/HighlighterTest.ClangCursorPosEndOfLine (1132 of 1888) PASS: lldb-api :: commands/expression/options/TestExprOptions.py (1133 of 1888) PASS: lldb-api :: functionalities/gdb_remote_client/TestRegDefinitionInParts.py (1134 of 1888) PASS: lldb-shell :: SymbolFile/NativePDB/global-classes.cpp (1135 of 1888) PASS: lldb-unit :: Host/./HostTests/HostInfoTest.GetAugmentedArchSpec (1136 of 1888) PASS: lldb-api :: functionalities/data-formatter/type_summary_list_arg/TestTypeSummaryListArg.py (1137 of 1888) PASS: lldb-api :: commands/expression/ignore-artificial-constructors/TestIgnoreArtificialConstructors.py (1138 of 1888) PASS: lldb-shell :: ObjectFile/ELF/minidebuginfo-find-symbols.yaml (1139 of 1888) PASS: lldb-shell :: Minidump/Windows/find-module.test (1140 of 1888) PASS: lldb-api :: commands/expression/completion/TestExprCompletion.py (1141 of 1888) PASS: lldb-unit :: Utility/./UtilityTests/BinaryStreamTest.PutSLEB128TwoBytes (1142 of 1888) PASS: lldb-unit :: Utility/./UtilityTests/StreamTest.PutNHex8 (1143 of 1888) PASS: lldb-shell :: SymbolFile/Breakpad/symtab.test (1144 of 1888) PASS: lldb-api :: commands/expression/persist_objc_pointeetype/TestPersistObjCPointeeType.py (1145 of 1888) PASS: lldb-api :: functionalities/tail_call_frames/inlining_and_tail_calls/TestInliningAndTailCalls.py (1146 of 1888) PASS: lldb-unit :: Host/./HostTests/SocketTest.TCPListen0ConnectAccept (1147 of 1888) UNSUPPORTED: lldb-shell :: SymbolFile/PDB/class-layout.test (1148 of 1888) UNSUPPORTED: lldb-shell :: Register/x86-ymm-read.test (1149 of 1888) PASS: lldb-unit :: Utility/./UtilityTests/StatusTest.ErrorConstructor (1150 of 1888) PASS: lldb-api :: functionalities/thread/concurrent_events/TestConcurrentSignalDelayWatch.py (1151 of 1888) PASS: lldb-api :: lang/cpp/namespace/TestNamespace.py (1152 of 1888) PASS: lldb-unit :: Utility/./UtilityTests/StringExtractorTest.GetNameColonValueNoColon (1153 of 1888) PASS: lldb-unit :: ScriptInterpreter/Python/./ScriptInterpreterPythonTests/PythonDataObjectsTest.TestPythonCallableInvoke (1154 of 1888) PASS: lldb-unit :: Utility/./UtilityTests/StringExtractorTest.DecodeHexU8_InvalidHex (1155 of 1888) PASS: lldb-unit :: UnwindAssembly/x86/./UnwindAssemblyx86Tests/Testx86AssemblyInspectionEngine.TestStackRealign32BitDisp_x86_64 (1156 of 1888) PASS: lldb-unit :: Language/Highlighting/./HighlighterTests/HighlighterTest.ClangScalarLiterals (1157 of 1888) PASS: lldb-unit :: Utility/./UtilityTests/StringListTest.ShiftStdString (1158 of 1888) PASS: lldb-api :: functionalities/breakpoint/global_constructor/TestBreakpointInGlobalConstructor.py (1159 of 1888) PASS: lldb-unit :: ScriptInterpreter/Python/./ScriptInterpreterPythonTests/PythonDataObjectsTest.TestPythonString (1160 of 1888) PASS: lldb-unit :: Utility/./UtilityTests/FileSpecTest.EqualDotsPosixRoot (1161 of 1888) PASS: lldb-api :: python_api/lldbutil/iter/TestRegistersIterator.py (1162 of 1888) PASS: lldb-api :: lang/objc/objc-struct-argument/TestObjCStructArgument.py (1163 of 1888) PASS: lldb-api :: lang/c/step_over_no_deadlock/TestStepOverDoesntBlock.py (1164 of 1888) PASS: lldb-api :: lang/objc/objc_direct-methods/TestObjCDirectMethods.py (1165 of 1888) PASS: lldb-api :: commands/expression/import-std-module/weak_ptr-dbg-info-content/TestDbgInfoContentWeakPtr.py (1166 of 1888) PASS: lldb-shell :: ObjectFile/ELF/section-overlap.yaml (1167 of 1888) PASS: lldb-shell :: SymbolFile/DWARF/debug-types-basic.test (1168 of 1888) PASS: lldb-unit :: ScriptInterpreter/Python/./ScriptInterpreterPythonTests/PythonDataObjectsTest.TestExceptions (1169 of 1888) PASS: lldb-shell :: Driver/TestCore.test (1170 of 1888) UNSUPPORTED: lldb-shell :: SymbolFile/PDB/calling-conventions.test (1171 of 1888) PASS: lldb-shell :: Heap/heap-cstr.test (1172 of 1888) PASS: lldb-unit :: Utility/./UtilityTests/UriParserTest.SchemeHostSeparator4 (1173 of 1888) PASS: lldb-unit :: Language/Highlighting/./HighlighterTests/HighlighterTest.ClangComments (1174 of 1888) PASS: lldb-shell :: SymbolFile/DWARF/debug_rnglists.s (1175 of 1888) PASS: lldb-unit :: Utility/./UtilityTests/ConstStringTest.FromMidOfBufferStringRef (1176 of 1888) PASS: lldb-api :: lang/c/inlines/TestRedefinitionsInInlines.py (1177 of 1888) PASS: lldb-unit :: Signals/./SignalsTests/UnixSignalsTest.GetFilteredSignals (1178 of 1888) UNSUPPORTED: lldb-shell :: Unwind/unwind-plan-dwarf-dump.test (1179 of 1888) PASS: lldb-api :: lang/cpp/enum_types/TestCPP11EnumTypes.py (1180 of 1888) PASS: lldb-unit :: Utility/./UtilityTests/StringListTest.Clear (1181 of 1888) PASS: lldb-unit :: Utility/./UtilityTests/ArgsTest.ReplaceArgumentAtIndexFarOutOfRange (1182 of 1888) PASS: lldb-unit :: Process/minidump/./LLDBMinidumpTests/MinidumpParserTest.GetMemoryRegionInfoFromMemoryList (1183 of 1888) XFAIL: lldb-shell :: Register/x86-mm-xmm-write.test (1184 of 1888) PASS: lldb-api :: python_api/lldbutil/TestSwigVersion.py (1185 of 1888) UNSUPPORTED: lldb-shell :: SymbolFile/PDB/expressions.test (1186 of 1888) PASS: lldb-api :: commands/frame/diagnose/inheritance/TestDiagnoseInheritance.py (1187 of 1888) PASS: lldb-api :: functionalities/breakpoint/breakpoint_ids/TestBreakpointIDs.py (1188 of 1888) PASS: lldb-api :: functionalities/memory/find/TestMemoryFind.py (1189 of 1888) PASS: lldb-api :: commands/watchpoints/watchpoint_set_command/TestWatchLocationWithWatchSet.py (1190 of 1888) PASS: lldb-unit :: Utility/./UtilityTests/DataExtractorTest.PeekData (1191 of 1888) PASS: lldb-shell :: BuildScript/toolchain-clang.test (1192 of 1888) PASS: lldb-unit :: ScriptInterpreter/Python/./ScriptInterpreterPythonTests/PythonDataObjectsTest.TestPythonListToStructuredList (1193 of 1888) PASS: lldb-unit :: Host/./HostTests/FileActionTest.Open (1194 of 1888) PASS: lldb-api :: api/log/TestAPILog.py (1195 of 1888) PASS: lldb-unit :: Utility/./UtilityTests/LogTest.Unregister (1196 of 1888) PASS: lldb-api :: tools/lldb-server/inferior-crash/TestGdbRemoteAbort.py (1197 of 1888) PASS: lldb-api :: lang/c/step-target/TestStepTarget.py (1198 of 1888) PASS: lldb-unit :: Utility/./UtilityTests/StringExtractorTest.GetHexU8_Exact (1199 of 1888) PASS: lldb-api :: functionalities/data-formatter/data-formatter-synthtype/TestDataFormatterSynthType.py (1200 of 1888) PASS: lldb-unit :: Process/minidump/./LLDBMinidumpTests/MinidumpParserTest.GetThreadContext_x86_64 (1201 of 1888) PASS: lldb-unit :: Utility/./UtilityTests/StreamTest.PutHex32ByteOrderLittle (1202 of 1888) PASS: lldb-unit :: Utility/./UtilityTests/LogChannelTest.Disable (1203 of 1888) PASS: lldb-api :: python_api/debugger/TestDebuggerAPI.py (1204 of 1888) PASS: lldb-api :: python_api/disassemble-raw-data/TestDisassembleRawData.py (1205 of 1888) PASS: lldb-unit :: Language/Highlighting/./HighlighterTests/HighlighterTest.ClangCursorPosInOtherToken (1206 of 1888) PASS: lldb-unit :: ScriptInterpreter/Python/./ScriptInterpreterPythonTests/PythonDataObjectsTest.TestPythonIntegerToStructuredInteger (1207 of 1888) PASS: lldb-api :: commands/expression/formatters/TestFormatters.py (1208 of 1888) PASS: lldb-unit :: Core/./LLDBCoreTests/UniqueCStringMap.NoDefaultConstructor (1209 of 1888) PASS: lldb-unit :: UnwindAssembly/x86/./UnwindAssemblyx86Tests/Testx86AssemblyInspectionEngine.TestPopEDI (1210 of 1888) PASS: lldb-shell :: ExecControl/StopHook/stop-hook.test (1211 of 1888) PASS: lldb-api :: functionalities/dead-strip/TestDeadStrip.py (1212 of 1888) PASS: lldb-api :: functionalities/gdb_remote_client/TestArmRegisterDefinition.py (1213 of 1888) PASS: lldb-api :: functionalities/thread/concurrent_events/TestConcurrentDelaySignalWatch.py (1214 of 1888) PASS: lldb-unit :: Utility/./UtilityTests/VMRange.Comparison (1215 of 1888) PASS: lldb-unit :: Process/gdb-remote/./ProcessGdbRemoteTests/GDBRemoteCommunicationClientTest.SendGetTraceConfigPacket (1216 of 1888) PASS: lldb-api :: commands/expression/calculator_mode/TestCalculatorMode.py (1217 of 1888) PASS: lldb-api :: lang/cpp/offsetof/TestOffsetofCpp.py (1218 of 1888) PASS: lldb-shell :: ObjectFile/ELF/basic-info.yaml (1219 of 1888) PASS: lldb-api :: functionalities/thread/concurrent_events/TestConcurrentTwoBreakpointsOneSignal.py (1220 of 1888) PASS: lldb-api :: functionalities/plugins/command_plugin/TestPluginCommands.py (1221 of 1888) PASS: lldb-unit :: Utility/./UtilityTests/StreamTest.PutPtr (1222 of 1888) PASS: lldb-api :: functionalities/breakpoint/breakpoint_options/TestBreakpointOptions.py (1223 of 1888) PASS: lldb-api :: functionalities/memory/read/TestMemoryRead.py (1224 of 1888) PASS: lldb-unit :: debugserver/./debugserverTests/RNBSocket.LoopBackConnectIPv6 (1225 of 1888) PASS: lldb-api :: lang/cpp/operator-overload/TestOperatorOverload.py (1226 of 1888) PASS: lldb-api :: functionalities/return-value/TestReturnValue.py (1227 of 1888) UNSUPPORTED: lldb-api :: functionalities/data-formatter/data-formatter-stl/libstdcpp/vector/TestDataFormatterStdVector.py (1228 of 1888) UNSUPPORTED: lldb-api :: commands/watchpoints/variable_out_of_scope/TestWatchedVarHitWhenInScope.py (1229 of 1888) PASS: lldb-unit :: Utility/./UtilityTests/StringListTest.ForRangeEmpty (1230 of 1888) PASS: lldb-api :: lang/c/anonymous/TestAnonymous.py (1231 of 1888) PASS: lldb-unit :: Symbol/./SymbolTests/PostfixExpression.ParseFPOProgram (1232 of 1888) PASS: lldb-unit :: Utility/./UtilityTests/StringListTest.InsertStringAtIndexEnd (1233 of 1888) PASS: lldb-unit :: Utility/./UtilityTests/OptionsWithRawTest.WhitespaceSuffix (1234 of 1888) PASS: lldb-unit :: Interpreter/./InterpreterTests/CompletionTest.DirCompletionAbsolute (1235 of 1888) PASS: lldb-unit :: Symbol/./SymbolTests/TestClangASTImporter.DeportTypeTagDecl (1236 of 1888) PASS: lldb-api :: commands/expression/dollar-in-variable/TestDollarInVariable.py (1237 of 1888) PASS: lldb-unit :: UnwindAssembly/x86/./UnwindAssemblyx86Tests/Testx86AssemblyInspectionEngine.TestMovRSPtoRBP (1238 of 1888) PASS: lldb-api :: tools/lldb-server/TestGdbRemoteProcessInfo.py (1239 of 1888) PASS: lldb-unit :: Utility/./UtilityTests/NameMatchesTest.Ignore (1240 of 1888) PASS: lldb-unit :: ScriptInterpreter/Python/./ScriptInterpreterPythonTests/PythonDataObjectsTest.TestObjectAttributes (1241 of 1888) PASS: lldb-api :: commands/target/dump-symtab-demangle/TestDumpSymtabDemangle.py (1242 of 1888) PASS: lldb-api :: lang/cpp/frame-var-anon-unions/TestFrameVariableAnonymousUnions.py (1243 of 1888) PASS: lldb-unit :: Utility/./UtilityTests/ReproducerTest.SetReplay (1244 of 1888) PASS: lldb-unit :: Language/Highlighting/./HighlighterTests/HighlighterTest.ClangTrailingBackslashBeforeNewline (1245 of 1888) PASS: lldb-unit :: Utility/./UtilityTests/SubsystemRAIITest.SubsystemWithErrorFailure (1246 of 1888) PASS: lldb-unit :: debugserver/./debugserverTests/RNBSocket.LoopBackListenIPv4 (1247 of 1888) PASS: lldb-api :: api/check_public_api_headers/TestPublicAPIHeaders.py (1248 of 1888) PASS: lldb-unit :: Process/minidump/./LLDBMinidumpTests/MinidumpParserTest.GetFilteredModuleList (1249 of 1888) PASS: lldb-shell :: ObjectFile/ELF/many-sections.s (1250 of 1888) PASS: lldb-api :: lang/objc/objc-new-syntax/TestObjCNewSyntaxArray.py (1251 of 1888) PASS: lldb-api :: python_api/class_members/TestSBTypeClassMembers.py (1252 of 1888) PASS: lldb-api :: commands/expression/import-std-module/list-dbg-info-content/TestDbgInfoContentList.py (1253 of 1888) PASS: lldb-unit :: Utility/./UtilityTests/CompletionRequest.FakeLastArg (1254 of 1888) UNSUPPORTED: lldb-api :: benchmarks/expression/TestExpressionCmd.py (1255 of 1888) UNSUPPORTED: lldb-api :: functionalities/darwin_log/filter/exact_match/category/TestDarwinLogFilterMatchCategory.py (1256 of 1888) PASS: lldb-unit :: Utility/./UtilityTests/UriParserTest.Minimal (1257 of 1888) PASS: lldb-unit :: Utility/./UtilityTests/StreamTest.PutChar (1258 of 1888) UNSUPPORTED: lldb-api :: functionalities/tsan/thread_numbers/TestTsanThreadNumbers.py (1259 of 1888) PASS: lldb-api :: commands/expression/save_jit_objects/TestSaveJITObjects.py (1260 of 1888) PASS: lldb-shell :: ObjectFile/ELF/minidebuginfo-corrupt-xz.yaml (1261 of 1888) PASS: lldb-api :: lang/c/struct_types/TestStructTypes.py (1262 of 1888) PASS: lldb-api :: commands/expression/inline-namespace/TestInlineNamespace.py (1263 of 1888) PASS: lldb-unit :: Utility/./UtilityTests/StringLexerTest.Next (1264 of 1888) PASS: lldb-unit :: SymbolFile/DWARF/./SymbolFileDWARFTests/SymbolFileDWARFTests.TestAbbrevValidAttrNullForm (1265 of 1888) PASS: lldb-api :: api/multiple-targets/TestMultipleTargets.py (1266 of 1888) PASS: lldb-api :: commands/expression/scoped_enums/TestScopedEnumType.py (1267 of 1888) UNSUPPORTED: lldb-shell :: Minidump/Windows/arm-fp-unwind.test (1268 of 1888) FAIL: lldb-api :: functionalities/data-formatter/data-formatter-stl/libcxx/iterator/TestDataFormatterLibccIterator.py (1269 of 1888) ******************** TEST 'lldb-api :: functionalities/data-formatter/data-formatter-stl/libcxx/iterator/TestDataFormatterLibccIterator.py' FAILED ******************** lldb version 10.0.99 (http://labmaster3.local/git/llvm-project.git revision 1e25109f93ffe5b28b28a2359e69143b7fb4aa5f) clang revision 995c18fc5051850782b1c096233867b8e56e0dea llvm revision 995c18fc5051850782b1c096233867b8e56e0dea LLDB library dir: /Users/buildslave/jenkins/workspace/lldb-cmake-sanitized/lldb-build/bin LLDB import library dir: /Users/buildslave/jenkins/workspace/lldb-cmake-sanitized/lldb-build/bin libstdcxx tests will not be run because: Don't know how to build with libstdcxx on macosx Skipping following debug info categories: ['dwo']

Hide Details

Session logs for test failures/errors/unexpected successes will go into directory '/Users/buildslave/jenkins/workspace/lldb-cmake-sanitized/test/logs' Command invoked: /Users/buildslave/jenkins/workspace/lldb-cmake-sanitized/llvm-project/lldb/test/API/dotest.py --arch=x86_64 -s /Users/buildslave/jenkins/workspace/lldb-cmake-sanitized/lldb-build/lldb-test-traces -S nm -u CXXFLAGS -u CFLAGS --executable /Users/buildslave/jenkins/workspace/lldb-cmake-sanitized/lldb-build/./bin/lldb --compiler /Users/buildslave/jenkins/workspace/lldb-cmake-sanitized/lldb-build/./bin/clang --dsymutil /Users/buildslave/jenkins/workspace/lldb-cmake-sanitized/lldb-build/./bin/dsymutil --filecheck /Users/buildslave/jenkins/workspace/lldb-cmake-sanitized/lldb-build/./bin/FileCheck --codesign-identity lldb_codesign --server /Users/buildslave/jenkins/workspace/lldb-cmake-sanitized/lldb-build/./bin/debugserver --arch x86_64 --build-dir /Users/buildslave/jenkins/workspace/lldb-cmake-sanitized/lldb-build/lldb-test-build.noindex -s=/Users/buildslave/jenkins/workspace/lldb-cmake-sanitized/test/logs -t --env TERM=vt100 --env LLVM_LIBS_DIR=/Users/buildslave/jenkins/workspace/lldb-cmake-sanitized/lldb-build/./lib --build-dir /Users/buildslave/jenkins/workspace/lldb-cmake-sanitized/lldb-build/lldb-test-build.noindex --lldb-module-cache-dir /Users/buildslave/jenkins/workspace/lldb-cmake-sanitized/lldb-build/lldb-test-build.noindex/module-cache-lldb/lldb-api --clang-module-cache-dir /Users/buildslave/jenkins/workspace/lldb-cmake-sanitized/lldb-build/lldb-test-build.noindex/module-cache-clang/lldb-api /Users/buildslave/jenkins/workspace/lldb-cmake-sanitized/llvm-project/lldb/packages/Python/lldbsuite/test/functionalities/data-formatter/data-formatter-stl/libcxx/iterator -p TestDataFormatterLibccIterator.py Change dir to: /Users/buildslave/jenkins/workspace/lldb-cmake-sanitized/llvm-project/lldb/packages/Python/lldbsuite/test/functionalities/data-formatter/data-formatter-stl/libcxx/iterator runCmd: settings set symbols.enable-external-lookup false output:

Hide Details

runCmd: settings set plugin.process.gdb-remote.packet-timeout 60 output:

Hide Details

runCmd: settings set symbols.clang-modules-cache-path "/Users/buildslave/jenkins/workspace/lldb-cmake-sanitized/lldb-build/lldb-test-build.noindex/module-cache-lldb/lldb-api" output:

Hide Details

runCmd: settings set use-color false output:

Hide Details

runCmd: file /Users/buildslave/jenkins/workspace/lldb-cmake-sanitized/lldb-build/lldb-test-build.noindex/functionalities/data-formatter/data-formatter-stl/libcxx/iterator/TestDataFormatterLibccIterator.test_with_run_command_dsym/a.out output: Current executable set to '/Users/buildslave/jenkins/workspace/lldb-cmake-sanitized/lldb-build/lldb-test-build.noindex/functionalities/data-formatter/data-formatter-stl/libcxx/iterator/TestDataFormatterLibccIterator.test_with_run_command_dsym/a.out' (x86_64).

Hide Details

Hide Details

runCmd: breakpoint set -f "main.cpp" -l 37 output: Breakpoint 1: where = a.out`main + 354 at main.cpp:37:2, address = 0x0000000100000b32

Hide Details

Hide Details

Expecting pattern: ^Breakpoint (?P<bpno>[0-9]+): (?P<num_locations>[0-9]+) locations\.$ Not matched

Hide Details

Expecting pattern: ^Breakpoint (?P<bpno>[0-9]+): (?P<num_locations>no) locations \(pending\)\. Not matched

Hide Details

Expecting pattern: ^Breakpoint (?P<bpno>[0-9]+): where = (?P<module>.*)`(?P<symbol>[+\-]{0,1}[^+]+)( \+ (?P<offset>[0-9]+)){0,1}( \[inlined\] (?P<inline_symbol>.*)){0,1} at (?P<file>[^:]+):(?P<line_no>[0-9]+)(?P<column>(:[0-9]+)?), address = (?P<address>0x[0-9a-fA-F]+)$ Matched

Hide Details

runCmd: run output: Process 31928 stopped * thread #1, queue = 'com.apple.main-thread', stop reason = breakpoint 1.1 frame #0: 0x0000000100000b32 a.out`main at main.cpp:37:2 34 ivter ivI = iv.begin(); 35 svter svI = sv.begin(); 36 -> 37 return 0; // Set break point at this line. ^ 38 }

Hide Details

Process 31928 launched: '/Users/buildslave/jenkins/workspace/lldb-cmake-sanitized/lldb-build/lldb-test-build.noindex/functionalities/data-formatter/data-formatter-stl/libcxx/iterator/TestDataFormatterLibccIterator.test_with_run_command_dsym/a.out' (x86_64)

Hide Details

Hide Details

runCmd: thread list output: Process 31928 stopped * thread #1: tid = 0x862f9b0, 0x0000000100000b32 a.out`main at main.cpp:37:2, queue = 'com.apple.main-thread', stop reason = breakpoint 1.1

Hide Details

Hide Details

Expecting sub string: stopped Matched

Hide Details

Expecting sub string: stop reason = breakpoint Matched

Hide Details

Adding tearDown hook: def cleanup(): self.runCmd('type format clear', check=False) self.runCmd('type summary clear', check=False) self.runCmd('type filter clear', check=False) self.runCmd('type synth clear', check=False) self.runCmd( "settings set target.max-children-count 256", check=False)

Hide Details

Hide Details

runCmd: frame variable ivI output: (ivter) ivI = (item = 3)

Hide Details

Hide Details

Expecting sub string: item = 3 Matched

Hide Details

runCmd: expr ivI output: (ivter) $0 = (item = 3)

Hide Details

Hide Details

Expecting sub string: item = 3 Matched

Hide Details

runCmd: frame variable iimI output: (iimter) iimI = (first = 43981, second = 61681)

Hide Details

Hide Details

Expecting sub string: first = 43981 Matched

Hide Details

Expecting sub string: second = 61681 Matched

Hide Details

runCmd: expr iimI output: (iimter) $1 = (first = 43981, second = 61681)

Hide Details

Hide Details

Expecting sub string: first = 43981 Matched

Hide Details

Expecting sub string: second = 61681 Matched

Hide Details

runCmd: frame variable simI output: (simter) simI = (first = "world", second = 42)

Hide Details

Hide Details

Expecting sub string: first = "world" Matched

Hide Details

Expecting sub string: second = 42 Matched

Hide Details

runCmd: expr simI output: (simter) $2 = (first = "world", second = 42)

Hide Details

Hide Details

Expecting sub string: first = "world" Matched

Hide Details

Expecting sub string: second = 42 Matched

Hide Details

runCmd: frame variable svI output: (svter) svI = (item = "hello")

Hide Details

Hide Details

Expecting sub string: item = "hello" Matched

Hide Details

runCmd: expr svI output: (svter) $3 = (item = "hello")

Hide Details

Hide Details

Expecting sub string: item = "hello" Matched

Hide Details

<bound method SBProcess.Kill of <lldb.SBProcess; proxy of <Swig Object of type 'lldb::SBProcess *' at 0x10c907bd0> >>: success

Hide Details

Executing tearDown hook: def cleanup(): self.runCmd('type format clear', check=False) self.runCmd('type summary clear', check=False) self.runCmd('type filter clear', check=False) self.runCmd('type synth clear', check=False) self.runCmd( "settings set target.max-children-count 256", check=False)

Hide Details

Hide Details

runCmd: type format clear check of return status not required output:

Hide Details

runCmd: type summary clear check of return status not required output:

Hide Details

runCmd: type filter clear check of return status not required output:

Hide Details

runCmd: type synth clear check of return status not required output:

Hide Details

runCmd: settings set target.max-children-count 256 check of return status not required output:

Hide Details

PASS: LLDB (/Users/buildslave/jenkins/workspace/lldb-cmake-sanitized/lldb-build/bin/clang-10-x86_64) :: test_with_run_command_dsym (TestDataFormatterLibccIterator.LibcxxIteratorDataFormatterTestCase) runCmd: settings set symbols.enable-external-lookup false output:

Hide Details

runCmd: settings set plugin.process.gdb-remote.packet-timeout 60 output:

Hide Details

runCmd: settings set symbols.clang-modules-cache-path "/Users/buildslave/jenkins/workspace/lldb-cmake-sanitized/lldb-build/lldb-test-build.noindex/module-cache-lldb/lldb-api" output:

Hide Details

runCmd: settings set use-color false output:

Hide Details

runCmd: file /Users/buildslave/jenkins/workspace/lldb-cmake-sanitized/lldb-build/lldb-test-build.noindex/functionalities/data-formatter/data-formatter-stl/libcxx/iterator/TestDataFormatterLibccIterator.test_with_run_command_dwarf/a.out output: Current executable set to '/Users/buildslave/jenkins/workspace/lldb-cmake-sanitized/lldb-build/lldb-test-build.noindex/functionalities/data-formatter/data-formatter-stl/libcxx/iterator/TestDataFormatterLibccIterator.test_with_run_command_dwarf/a.out' (x86_64).

Hide Details

Hide Details

runCmd: breakpoint set -f "main.cpp" -l 37 output: Breakpoint 1: where = a.out`main + 354 at main.cpp:37:2, address = 0x0000000100000b32

Hide Details

Hide Details

Expecting pattern: ^Breakpoint (?P<bpno>[0-9]+): (?P<num_locations>[0-9]+) locations\.$ Not matched

Hide Details

Expecting pattern: ^Breakpoint (?P<bpno>[0-9]+): (?P<num_locations>no) locations \(pending\)\. Not matched

Hide Details

Expecting pattern: ^Breakpoint (?P<bpno>[0-9]+): where = (?P<module>.*)`(?P<symbol>[+\-]{0,1}[^+]+)( \+ (?P<offset>[0-9]+)){0,1}( \[inlined\] (?P<inline_symbol>.*)){0,1} at (?P<file>[^:]+):(?P<line_no>[0-9]+)(?P<column>(:[0-9]+)?), address = (?P<address>0x[0-9a-fA-F]+)$ Matched

Hide Details

runCmd: run output: Process 33725 stopped * thread #1, queue = 'com.apple.main-thread', stop reason = breakpoint 1.1 frame #0: 0x0000000100000b32 a.out`main at main.cpp:37:2 34 ivter ivI = iv.begin(); 35 svter svI = sv.begin(); 36 -> 37 return 0; // Set break point at this line. ^ 38 }

Hide Details

Process 33725 launched: '/Users/buildslave/jenkins/workspace/lldb-cmake-sanitized/lldb-build/lldb-test-build.noindex/functionalities/data-formatter/data-formatter-stl/libcxx/iterator/TestDataFormatterLibccIterator.test_with_run_command_dwarf/a.out' (x86_64)

Hide Details

Hide Details

runCmd: thread list output: Process 33725 stopped * thread #1: tid = 0x863064e, 0x0000000100000b32 a.out`main at main.cpp:37:2, queue = 'com.apple.main-thread', stop reason = breakpoint 1.1

Hide Details

Hide Details

Expecting sub string: stopped Matched

Hide Details

Expecting sub string: stop reason = breakpoint Matched

Hide Details

Adding tearDown hook: def cleanup(): self.runCmd('type format clear', check=False) self.runCmd('type summary clear', check=False) self.runCmd('type filter clear', check=False) self.runCmd('type synth clear', check=False) self.runCmd( "settings set target.max-children-count 256", check=False)

Hide Details

Hide Details

runCmd: frame variable ivI output: (ivter) ivI = (item = 3)

Hide Details

Hide Details

Expecting sub string: item = 3 Matched

Hide Details

runCmd: expr ivI output: (ivter) $0 = (item = 3)

Hide Details

Hide Details

Expecting sub string: item = 3 Matched

Hide Details

runCmd: frame variable iimI output: (iimter) iimI = (first = 43981, second = 61681)

Hide Details

Hide Details

Expecting sub string: first = 43981 Matched

Hide Details

Expecting sub string: second = 61681 Matched

Hide Details

runCmd: expr iimI output: (iimter) $1 = (first = 43981, second = 61681)

Hide Details

Hide Details

Expecting sub string: first = 43981 Matched

Hide Details

Expecting sub string: second = 61681 Matched

Hide Details

runCmd: frame variable simI output: (simter) simI = (first = "world", second = 42)

Hide Details

Hide Details

Expecting sub string: first = "world" Matched

Hide Details

Expecting sub string: second = 42 Matched

Hide Details

runCmd: expr simI output: (simter) $2 = (first = "world", second = 42)

Hide Details

Hide Details

Expecting sub string: first = "world" Matched

Hide Details

Expecting sub string: second = 42 Matched

Hide Details

runCmd: frame variable svI output: (svter) svI = (item = "hello")

Hide Details

Hide Details

Expecting sub string: item = "hello" Matched

Hide Details

runCmd: expr svI output: (svter) $3 = (item = "hello")

Hide Details

Hide Details

Expecting sub string: item = "hello" Matched

Hide Details

<bound method SBProcess.Kill of <lldb.SBProcess; proxy of <Swig Object of type 'lldb::SBProcess *' at 0x10bc66b10> >>: success

Hide Details

Executing tearDown hook: def cleanup(): self.runCmd('type format clear', check=False) self.runCmd('type summary clear', check=False) self.runCmd('type filter clear', check=False) self.runCmd('type synth clear', check=False) self.runCmd( "settings set target.max-children-count 256", check=False)

Hide Details

Hide Details

runCmd: type format clear check of return status not required output:

Hide Details

runCmd: type summary clear check of return status not required output:

Hide Details

runCmd: type filter clear check of return status not required output:

Hide Details

runCmd: type synth clear check of return status not required output:

Hide Details

runCmd: settings set target.max-children-count 256 check of return status not required output:

Hide Details

PASS: LLDB (/Users/buildslave/jenkins/workspace/lldb-cmake-sanitized/lldb-build/bin/clang-10-x86_64) :: test_with_run_command_dwarf (TestDataFormatterLibccIterator.LibcxxIteratorDataFormatterTestCase) UNSUPPORTED: LLDB (/Users/buildslave/jenkins/workspace/lldb-cmake-sanitized/lldb-build/bin/clang-10-x86_64) :: test_with_run_command_dwo (TestDataFormatterLibccIterator.LibcxxIteratorDataFormatterTestCase) (test case does not fall in any category of interest for this run) runCmd: settings set symbols.enable-external-lookup false output:

Hide Details

runCmd: settings set plugin.process.gdb-remote.packet-timeout 60 output:

Hide Details

runCmd: settings set symbols.clang-modules-cache-path "/Users/buildslave/jenkins/workspace/lldb-cmake-sanitized/lldb-build/lldb-test-build.noindex/module-cache-lldb/lldb-api" output:

Hide Details

runCmd: settings set use-color false output:

Hide Details

runCmd: file /Users/buildslave/jenkins/workspace/lldb-cmake-sanitized/lldb-build/lldb-test-build.noindex/functionalities/data-formatter/data-formatter-stl/libcxx/iterator/TestDataFormatterLibccIterator.test_with_run_command_gmodules/a.out output: Current executable set to '/Users/buildslave/jenkins/workspace/lldb-cmake-sanitized/lldb-build/lldb-test-build.noindex/functionalities/data-formatter/data-formatter-stl/libcxx/iterator/TestDataFormatterLibccIterator.test_with_run_command_gmodules/a.out' (x86_64).

Hide Details

Hide Details

runCmd: breakpoint set -f "main.cpp" -l 37 output: Breakpoint 1: where = a.out`main + 354 at main.cpp:37:2, address = 0x0000000100000b32

Hide Details

Hide Details

Expecting pattern: ^Breakpoint (?P<bpno>[0-9]+): (?P<num_locations>[0-9]+) locations\.$ Not matched

Hide Details

Expecting pattern: ^Breakpoint (?P<bpno>[0-9]+): (?P<num_locations>no) locations \(pending\)\. Not matched

Hide Details

Expecting pattern: ^Breakpoint (?P<bpno>[0-9]+): where = (?P<module>.*)`(?P<symbol>[+\-]{0,1}[^+]+)( \+ (?P<offset>[0-9]+)){0,1}( \[inlined\] (?P<inline_symbol>.*)){0,1} at (?P<file>[^:]+):(?P<line_no>[0-9]+)(?P<column>(:[0-9]+)?), address = (?P<address>0x[0-9a-fA-F]+)$ Matched

Hide Details

runCmd: run output: Process 35077 stopped * thread #1, queue = 'com.apple.main-thread', stop reason = breakpoint 1.1 frame #0: 0x0000000100000b32 a.out`main at main.cpp:37:2 34 ivter ivI = iv.begin(); 35 svter svI = sv.begin(); 36 -> 37 return 0; // Set break point at this line. ^ 38 }

Hide Details

Process 35077 launched: '/Users/buildslave/jenkins/workspace/lldb-cmake-sanitized/lldb-build/lldb-test-build.noindex/functionalities/data-formatter/data-formatter-stl/libcxx/iterator/TestDataFormatterLibccIterator.test_with_run_command_gmodules/a.out' (x86_64)

Hide Details

Hide Details

runCmd: thread list output: Process 35077 stopped * thread #1: tid = 0x863109b, 0x0000000100000b32 a.out`main at main.cpp:37:2, queue = 'com.apple.main-thread', stop reason = breakpoint 1.1

Hide Details

Hide Details

Expecting sub string: stopped Matched

Hide Details

Expecting sub string: stop reason = breakpoint Matched

Hide Details

Adding tearDown hook: def cleanup(): self.runCmd('type format clear', check=False) self.runCmd('type summary clear', check=False) self.runCmd('type filter clear', check=False) self.runCmd('type synth clear', check=False) self.runCmd( "settings set target.max-children-count 256", check=False)

Hide Details

Hide Details

runCmd: frame variable ivI output: (ivter) ivI = (item = 3)

Hide Details

Hide Details

Expecting sub string: item = 3 Matched

Hide Details

runCmd: expr ivI output: (ivter) $0 = (item = 3)

Hide Details

Hide Details

Expecting sub string: item = 3 Matched

Hide Details

runCmd: frame variable iimI output: (iimter) iimI = (first = 43981, second = 61681)

Hide Details

Hide Details

Expecting sub string: first = 43981 Matched

Hide Details

Expecting sub string: second = 61681 Matched

Hide Details

runCmd: expr iimI output: (iimter) $1 = (first = 43981, second = 61681)

Hide Details

Hide Details

Expecting sub string: first = 43981 Matched

Hide Details

Expecting sub string: second = 61681 Matched

Hide Details

runCmd: frame variable simI output: (simter) simI = (first = "world", second = 42)

Hide Details

Hide Details

Expecting sub string: first = "world" Matched

Hide Details

Expecting sub string: second = 42 Matched

Hide Details

runCmd: expr simI output: (simter) $2 = {}

Hide Details

Hide Details

Expecting sub string: first = "world" Not matched

Hide Details

FAIL: LLDB (/Users/buildslave/jenkins/workspace/lldb-cmake-sanitized/lldb-build/bin/clang-10-x86_64) :: test_with_run_command_gmodules (TestDataFormatterLibccIterator.LibcxxIteratorDataFormatterTestCase) <bound method SBProcess.Kill of <lldb.SBProcess; proxy of <Swig Object of type 'lldb::SBProcess *' at 0x10c907db0> >>: success

Hide Details

Executing tearDown hook: def cleanup(): self.runCmd('type format clear', check=False) self.runCmd('type summary clear', check=False) self.runCmd('type filter clear', check=False) self.runCmd('type synth clear', check=False) self.runCmd( "settings set target.max-children-count 256", check=False)

Hide Details

Hide Details

runCmd: type format clear check of return status not required output:

Hide Details

runCmd: type summary clear check of return status not required output:

Hide Details

runCmd: type filter clear check of return status not required output:

Hide Details

runCmd: type synth clear check of return status not required output:

Hide Details

runCmd: settings set target.max-children-count 256 check of return status not required output:

Hide Details

Restore dir to: /Users/buildslave/jenkins/workspace/lldb-cmake-sanitized/lldb-build/tools/lldb/test ====================================================================== FAIL: test_with_run_command_gmodules (TestDataFormatterLibccIterator.LibcxxIteratorDataFormatterTestCase) Test that libc++ iterators format properly. ---------------------------------------------------------------------- Traceback (most recent call last): File "/Users/buildslave/jenkins/workspace/lldb-cmake-sanitized/llvm-project/lldb/packages/Python/lldbsuite/test/lldbtest.py", line 1732, in test_method return attrvalue(self) File "/Users/buildslave/jenkins/workspace/lldb-cmake-sanitized/llvm-project/lldb/packages/Python/lldbsuite/test/functionalities/data-formatter/data-formatter-stl/libcxx/iterator/TestDataFormatterLibccIterator.py", line 70, in test_with_run_command self.expect('expr simI', substrs=['first = "world"', 'second = 42']) File "/Users/buildslave/jenkins/workspace/lldb-cmake-sanitized/llvm-project/lldb/packages/Python/lldbsuite/test/lldbtest.py", line 2367, in expect msg if msg else EXP_MSG(str, output, exe)) AssertionError: False is not True : 'expr simI' returns expected result, got '(simter) $2 = {}' Config=x86_64-/Users/buildslave/jenkins/workspace/lldb-cmake-sanitized/lldb-build/bin/clang-10 ---------------------------------------------------------------------- Ran 4 tests in 129.060s

Hide Details

RESULT: FAILED (2 passes, 1 failures, 0 errors, 1 skipped, 0 expected failures, 0 unexpected successes)

Hide Details

******************** PASS: lldb-unit :: Utility/./UtilityTests/LogChannelEnabledTest.log_options (1270 of 1888) PASS: lldb-shell :: Reproducer/Modules/TestModuleCXX.test (1271 of 1888) PASS: lldb-api :: commands/expression/import-std-module/vector-bool/TestBoolVector.py (1272 of 1888) PASS: lldb-api :: functionalities/thread/concurrent_events/TestConcurrentManyWatchpoints.py (1273 of 1888) UNSUPPORTED: lldb-shell :: Register/x86-64-ymm16-write.test (1274 of 1888) PASS: lldb-unit :: Utility/./UtilityTests/StringExtractorTest.GetHexU8_Extra_NoEof (1275 of 1888) PASS: lldb-api :: functionalities/fat_archives/TestFatArchives.py (1276 of 1888) PASS: lldb-api :: macosx/duplicate-archive-members/TestDuplicateMembers.py (1277 of 1888) PASS: lldb-unit :: SymbolFile/NativePDB/./SymbolFileNativePDBTests/PDBFPOProgramToDWARFExpressionTests.UnknownOp (1278 of 1888) UNSUPPORTED: lldb-shell :: Register/x86-64-ymm16-read.test (1279 of 1888) PASS: lldb-unit :: Utility/./UtilityTests/UriParserTest.MinimalPort (1280 of 1888) PASS: lldb-shell :: SymbolFile/DWARF/dwarf5_locations.s (1281 of 1888) PASS: lldb-api :: sanity/TestModuleCacheSanity.py (1282 of 1888) PASS: lldb-unit :: Host/./HostTests/MainLoopTest.UnmonitoredSignal (1283 of 1888) PASS: lldb-api :: lang/c/local_types/TestUseClosestType.py (1284 of 1888) UNSUPPORTED: lldb-api :: python_api/event/TestEvents.py (1285 of 1888) PASS: lldb-unit :: Expression/./ExpressionTests/DiagnosticManagerTest.AddDiagnostic (1286 of 1888) PASS: lldb-unit :: UnwindAssembly/x86/./UnwindAssemblyx86Tests/Testx86AssemblyInspectionEngine.Testi386IgnoredRegisters (1287 of 1888) PASS: lldb-shell :: SymbolFile/DWARF/find-method.cpp (1288 of 1888) PASS: lldb-unit :: Utility/./UtilityTests/StreamTest.AddressNoSuffix (1289 of 1888) PASS: lldb-unit :: Utility/./UtilityTests/StreamTest.PutULEB128 (1290 of 1888) PASS: lldb-unit :: Process/minidump/./LLDBMinidumpTests/MinidumpParserTest.MinidumpModuleOrder (1291 of 1888) PASS: lldb-api :: functionalities/data-formatter/synthupdate/TestSyntheticFilterRecompute.py (1292 of 1888) PASS: lldb-unit :: Utility/./UtilityTests/StringListTest.InsertStringAtIndexMove (1293 of 1888) PASS: lldb-api :: macosx/find-dsym/bundle-with-dot-in-filename/TestBundleWithDotInFilename.py (1294 of 1888) PASS: lldb-shell :: SymbolFile/DWARF/find-inline-method.s (1295 of 1888) PASS: lldb-api :: lang/cpp/type_lookup/TestCppTypeLookup.py (1296 of 1888) PASS: lldb-api :: commands/platform/basic/TestPlatformCommand.py (1297 of 1888) PASS: lldb-shell :: Expr/TestIRMemoryMap.test (1298 of 1888) UNSUPPORTED: lldb-shell :: SymbolFile/DWARF/debug-types-expressions.test (1299 of 1888) UNSUPPORTED: lldb-shell :: ScriptInterpreter/Lua/lua.test (1300 of 1888) PASS: lldb-api :: functionalities/breakpoint/inlined_breakpoints/TestInlinedBreakpoints.py (1301 of 1888) UNSUPPORTED: lldb-shell :: SymbolFile/target-symbols-add-unwind.test (1302 of 1888) PASS: lldb-api :: lang/cpp/nsimport/TestCppNsImport.py (1303 of 1888) PASS: lldb-api :: functionalities/thread/thread_specific_break/TestThreadSpecificBreakpoint.py (1304 of 1888) PASS: lldb-unit :: Signals/./SignalsTests/UnixSignalsTest.Iteration (1305 of 1888) PASS: lldb-api :: functionalities/inferior-crashing/TestInferiorCrashingStep.py (1306 of 1888) PASS: lldb-shell :: ObjectFile/PECOFF/invalid-export-table.yaml (1307 of 1888) PASS: lldb-unit :: Process/gdb-remote/./ProcessGdbRemoteTests/GDBRemoteClientBaseTest.SendContinueAndLateInterrupt (1308 of 1888) PASS: lldb-unit :: Process/gdb-remote/./ProcessGdbRemoteTests/GDBRemoteCommunicationClientTest.SaveRestoreRegistersNoSuffix (1309 of 1888) UNSUPPORTED: lldb-shell :: ScriptInterpreter/Lua/independent_state.test (1310 of 1888) XFAIL: lldb-shell :: SymbolFile/DWARF/find-type-in-function.cpp (1311 of 1888) PASS: lldb-api :: commands/expression/dont_allow_jit/TestAllowJIT.py (1312 of 1888) PASS: lldb-unit :: Symbol/./SymbolTests/SymbolsTest.TerminateLocateExecutableSymbolFileForUnknownExecutableAndUnknownSymbolFile (1313 of 1888) PASS: lldb-api :: types/TestFloatTypes.py (1314 of 1888) PASS: lldb-unit :: Host/./HostTests/FileSystemTest.EnumerateDirectory (1315 of 1888) PASS: lldb-api :: commands/expression/completion-crash-incomplete-record/TestCompletionCrashIncompleteRecord.py (1316 of 1888) PASS: lldb-shell :: Breakpoint/split-dwarf5-debug-stroffsets.test (1317 of 1888) PASS: lldb-unit :: Process/minidump/./LLDBMinidumpTests/MinidumpParserTest.GetPid (1318 of 1888) PASS: lldb-unit :: Process/minidump/./LLDBMinidumpTests/MinidumpParserTest.GetMiscInfo_no_stream (1319 of 1888) PASS: lldb-api :: lang/cpp/bool/TestCPPBool.py (1320 of 1888) PASS: lldb-unit :: Utility/./UtilityTests/ArchSpecTest.Compatibility (1321 of 1888) PASS: lldb-unit :: ScriptInterpreter/Python/./ScriptInterpreterPythonTests/PythonDataObjectsTest.TestPythonDictionaryToStructuredDictionary (1322 of 1888) PASS: lldb-unit :: Utility/./UtilityTests/DataExtractorTest.GetMaxU64 (1323 of 1888) PASS: lldb-unit :: Utility/./UtilityTests/RangeTest.SetRangeBase (1324 of 1888) PASS: lldb-api :: lang/objc/variadic_methods/TestVariadicMethods.py (1325 of 1888) PASS: lldb-shell :: Minidump/memory-region-from-module.yaml (1326 of 1888) PASS: lldb-api :: functionalities/unwind/noreturn/module-end/TestNoReturnModuleEnd.py (1327 of 1888) PASS: lldb-api :: functionalities/memory/cache/TestMemoryCache.py (1328 of 1888) PASS: lldb-shell :: ObjectFile/ELF/PT_LOAD-overlap-PT_TLS.yaml (1329 of 1888) PASS: lldb-unit :: Utility/./UtilityTests/VASprintfTest.NoBufferResize (1330 of 1888) PASS: lldb-api :: lang/cpp/lambdas/TestLambdas.py (1331 of 1888) PASS: lldb-shell :: SymbolFile/DWARF/forward-declarations.s (1332 of 1888) PASS: lldb-shell :: Reproducer/TestDiscard.test (1333 of 1888) PASS: lldb-unit :: Utility/./UtilityTests/RecordReplayTest.InstrumentedBar (1334 of 1888) PASS: lldb-api :: functionalities/memory-region/TestMemoryRegion.py (1335 of 1888) PASS: lldb-unit :: Utility/./UtilityTests/StringListTest.JoinSingle (1336 of 1888) PASS: lldb-shell :: Process/TestEnvironment.test (1337 of 1888) PASS: lldb-api :: functionalities/gdb_remote_client/TestJLink6Armv7RegisterDefinition.py (1338 of 1888) PASS: lldb-unit :: Target/./TargetTests/PathMappingListTest.RelativeTests (1339 of 1888) PASS: lldb-unit :: Utility/./UtilityTests/DataExtractorTest.GetMaxS64 (1340 of 1888) PASS: lldb-unit :: Utility/./UtilityTests/RangeTest.LessThanInvalid (1341 of 1888) PASS: lldb-unit :: Language/Highlighting/./HighlighterTests/HighlighterTest.ClangCursorPos (1342 of 1888) PASS: lldb-shell :: Register/x86-64-gp-read.test (1343 of 1888) PASS: lldb-unit :: Utility/./UtilityTests/Flags.Clear (1344 of 1888) PASS: lldb-unit :: Utility/./UtilityTests/UriParserTest.MinimalPath (1345 of 1888) PASS: lldb-unit :: ScriptInterpreter/Python/./ScriptInterpreterPythonTests/PythonDataObjectsTest.TestPythonTupleValues (1346 of 1888) PASS: lldb-unit :: Symbol/./SymbolTests/LineEntryTest.GetSameLineContiguousAddressRangeOneInline (1347 of 1888) UNSUPPORTED: lldb-shell :: SymbolFile/PDB/variables.test (1348 of 1888) PASS: lldb-shell :: SymbolFile/DWARF/debug-types-dwarf5.s (1349 of 1888) PASS: lldb-api :: functionalities/data-formatter/data-formatter-disabling/TestDataFormatterDisabling.py (1350 of 1888) PASS: lldb-unit :: Utility/./UtilityTests/StreamTest.PutBytesAsRawHex8ToMixedEndian (1351 of 1888) PASS: lldb-api :: commands/expression/class_template_specialization_empty_pack/TestClassTemplateSpecializationParametersHandling.py (1352 of 1888) PASS: lldb-unit :: Process/minidump/./LLDBMinidumpTests/MinidumpParserTest.GetArchitecture (1353 of 1888) PASS: lldb-unit :: Utility/./UtilityTests/StreamTeeTest.GetStreamAtIndexOutOfBounds (1354 of 1888) PASS: lldb-shell :: SymbolFile/DWARF/gnu-style-compression.cpp (1355 of 1888) PASS: lldb-api :: commands/command/script/import/rdar-12586188/TestRdar12586188.py (1356 of 1888) PASS: lldb-api :: functionalities/type_lookup/TestTypeLookup.py (1357 of 1888) PASS: lldb-unit :: Host/./HostTests/ConnectionFileDescriptorTest.TCPGetURIv4 (1358 of 1888) PASS: lldb-shell :: ObjectFile/ELF/short-build-id.yaml (1359 of 1888) PASS: lldb-api :: functionalities/data-formatter/data-formatter-stl/libcxx/list/loop/TestDataFormatterLibcxxListLoop.py (1360 of 1888) PASS: lldb-shell :: SymbolFile/NativePDB/ast-types.cpp (1361 of 1888) PASS: lldb-unit :: ScriptInterpreter/Python/./ScriptInterpreterPythonTests/PythonDataObjectsTest.TestPythonStringToStructuredString (1362 of 1888) PASS: lldb-api :: lang/objc/blocks/TestObjCIvarsInBlocks.py (1363 of 1888) PASS: lldb-api :: functionalities/thread/concurrent_events/TestConcurrentTwoBreakpointThreads.py (1364 of 1888) PASS: lldb-unit :: Language/Highlighting/./HighlighterTests/HighlighterTest.Keywords (1365 of 1888) PASS: lldb-api :: functionalities/thread/concurrent_events/TestConcurrentSignalWatch.py (1366 of 1888) PASS: lldb-shell :: ObjectFile/ELF/PT_LOAD-overlap-section.yaml (1367 of 1888) PASS: lldb-shell :: SymbolFile/NativePDB/bitfields.cpp (1368 of 1888) UNSUPPORTED: lldb-shell :: Register/arm-fp-read.test (1369 of 1888) UNSUPPORTED: lldb-api :: functionalities/breakpoint/hardware_breakpoints/hardware_breakpoint_on_multiple_threads/TestHWBreakMultiThread.py (1370 of 1888) PASS: lldb-unit :: Language/Highlighting/./HighlighterTests/HighlighterTest.FallbackHighlighter (1371 of 1888) PASS: lldb-unit :: Utility/./UtilityTests/StringExtractorTest.GetHexU8_Extra (1372 of 1888) UNSUPPORTED: lldb-api :: functionalities/darwin_log/filter/regex/message/TestDarwinLogFilterRegexMessage.py (1373 of 1888) PASS: lldb-shell :: Breakpoint/implicit_const_form_support.test (1374 of 1888) PASS: lldb-unit :: Process/gdb-remote/./ProcessGdbRemoteTests/GDBRemoteCommunicationClientTest.SendStopTracePacket (1375 of 1888) PASS: lldb-shell :: Commands/CommandScriptImmediateOutput/CommandScriptImmediateOutputConsole.test (1376 of 1888) PASS: lldb-shell :: SymbolFile/DWARF/DW_AT_loclists_base.s (1377 of 1888) PASS: lldb-unit :: Utility/./UtilityTests/UriParserTest.MinimalPortPath (1378 of 1888) PASS: lldb-unit :: Process/gdb-remote/./ProcessGdbRemoteTests/GDBRemoteCommunicationClientTest.GetModulesInfo (1379 of 1888) PASS: lldb-api :: commands/expression/import-std-module/conflicts/TestStdModuleWithConflicts.py (1380 of 1888) PASS: lldb-shell :: Breakpoint/jitbp_elf.test (1381 of 1888) PASS: lldb-api :: functionalities/breakpoint/breakpoint_language/TestBreakpointLanguage.py (1382 of 1888) PASS: lldb-unit :: Utility/./UtilityTests/StringLexerTest.GetUnlexed (1383 of 1888) PASS: lldb-unit :: Interpreter/./InterpreterTests/OptionArgParserTest.toChar (1384 of 1888) PASS: lldb-unit :: Utility/./UtilityTests/RangeTest.Constructor (1385 of 1888) PASS: lldb-api :: functionalities/data-formatter/ostypeformatting/TestFormattersOsType.py (1386 of 1888) PASS: lldb-api :: functionalities/data-formatter/data-formatter-script/TestDataFormatterScript.py (1387 of 1888) PASS: lldb-unit :: SymbolFile/DWARF/./SymbolFileDWARFTests/SymbolFileDWARFTests.TestAbbrevOutOfOrder (1388 of 1888) PASS: lldb-shell :: SymbolFile/NativePDB/disassembly.cpp (1389 of 1888) PASS: lldb-unit :: Language/Highlighting/./HighlighterTests/HighlighterTest.ClangEmptyInput (1390 of 1888) PASS: lldb-unit :: Process/gdb-remote/./ProcessGdbRemoteTests/GDBRemoteClientBaseTest.SendPacketAndReceiveResponseWithOutputSupport (1391 of 1888) UNSUPPORTED: lldb-api :: commands/register/register/intel_xtended_registers/TestMPXRegisters.py (1392 of 1888) PASS: lldb-unit :: Utility/./UtilityTests/StringListTest.RemoveBlankLines (1393 of 1888) PASS: lldb-unit :: Utility/./UtilityTests/StreamTeeTest.AppendStream (1394 of 1888) PASS: lldb-api :: lang/c/offsetof/TestOffsetof.py (1395 of 1888) PASS: lldb-unit :: Target/./TargetTests/ExecutionContextTest.GetByteOrderProcess (1396 of 1888) PASS: lldb-shell :: Quit/TestQuitExitCode-30.test (1397 of 1888) PASS: lldb-api :: functionalities/thread/concurrent_events/TestConcurrentTwoBreakpointsOneWatchpoint.py (1398 of 1888) PASS: lldb-shell :: Reproducer/TestDump.test (1399 of 1888) PASS: lldb-api :: lang/c/forward/TestForwardDeclaration.py (1400 of 1888) PASS: lldb-api :: commands/expression/persistent_types/TestPersistentTypes.py (1401 of 1888) PASS: lldb-unit :: Utility/./UtilityTests/VMRange.SetEndAddress (1402 of 1888) PASS: lldb-shell :: SymbolFile/DWARF/array-sizes.s (1403 of 1888) PASS: lldb-api :: functionalities/data-formatter/data-formatter-synth/TestDataFormatterSynth.py (1404 of 1888) PASS: lldb-api :: types/TestCharTypeExpr.py (1405 of 1888) PASS: lldb-unit :: Utility/./UtilityTests/StringListTest.InsertStringAtIndexStart (1406 of 1888) PASS: lldb-api :: python_api/watchpoint/TestWatchpointIter.py (1407 of 1888) UNSUPPORTED: lldb-shell :: SymbolFile/NativePDB/ast-functions-msvc.cpp (1408 of 1888) PASS: lldb-api :: macosx/load-kext/TestLoadKext.py (1409 of 1888) PASS: lldb-unit :: Utility/./UtilityTests/BinaryStreamTest.PutSLEB128SixBytes (1410 of 1888) PASS: lldb-api :: functionalities/signal/TestSendSignal.py (1411 of 1888) PASS: lldb-unit :: Expression/./ExpressionTests/CppModuleConfigurationTest.LibCppV2 (1412 of 1888) PASS: lldb-unit :: ScriptInterpreter/Python/./ScriptInterpreterPythonTests/PythonDataObjectsTest.TestTypeNameResolutionNoDot (1413 of 1888) PASS: lldb-api :: lang/c/const_variables/TestConstVariables.py (1414 of 1888) PASS: lldb-unit :: Symbol/./SymbolTests/TestClangASTContext.TestIsClangType (1415 of 1888) UNSUPPORTED: lldb-shell :: SymbolFile/PDB/ast-restore.test (1416 of 1888) PASS: lldb-shell :: SymbolFile/DWARF/compilercontext.ll (1417 of 1888) PASS: lldb-api :: functionalities/tail_call_frames/thread_step_out_message/TestArtificialFrameStepOutMessage.py (1418 of 1888) PASS: lldb-api :: macosx/thread-names/TestInterruptThreadNames.py (1419 of 1888) PASS: lldb-api :: commands/apropos/basic/TestApropos.py (1420 of 1888) PASS: lldb-api :: functionalities/postmortem/netbsd-core/TestNetBSDCore.py (1421 of 1888) PASS: lldb-api :: lang/objc/conflicting-definition/TestConflictingDefinition.py (1422 of 1888) PASS: lldb-unit :: Host/./HostTests/NativeProcessProtocolTest.ReadCStringFromMemory (1423 of 1888) PASS: lldb-api :: commands/expression/unicode-in-variable/TestUnicodeInVariable.py (1424 of 1888) PASS: lldb-unit :: Symbol/./SymbolTests/TestClangASTContext.TestFunctionTemplateInRecordConstruction (1425 of 1888) PASS: lldb-api :: commands/apropos/with-process/TestAproposWithProcess.py (1426 of 1888) UNSUPPORTED: lldb-shell :: SymbolFile/PDB/type-quals.test (1427 of 1888) PASS: lldb-api :: functionalities/thread/concurrent_events/TestConcurrentCrashWithWatchpoint.py (1428 of 1888) PASS: lldb-unit :: Utility/./UtilityTests/RegularExpression.Empty (1429 of 1888) PASS: lldb-unit :: Utility/./UtilityTests/ArgsTest.TestSingleArgWithQuotedSpace (1430 of 1888) PASS: lldb-api :: commands/expression/rdar44436068/Test128BitsInteger.py (1431 of 1888) PASS: lldb-unit :: Host/./HostTests/MainLoopTest.ReadObject (1432 of 1888) PASS: lldb-unit :: Process/gdb-remote/./ProcessGdbRemoteTests/GDBRemoteCommunicationServerTest.SendErrorResponse_UnimplementedError (1433 of 1888) PASS: lldb-api :: commands/command/script/TestCommandScript.py (1434 of 1888) PASS: lldb-unit :: SymbolFile/NativePDB/./SymbolFileNativePDBTests/PDBFPOProgramToDWARFExpressionTests.UnresolvedRegisterReference (1435 of 1888) PASS: lldb-unit :: Utility/./UtilityTests/LogChannelEnabledTest.LogThread (1436 of 1888) PASS: lldb-api :: tools/lldb-server/TestLldbGdbServer.py (1437 of 1888) PASS: lldb-shell :: Breakpoint/debug_rnglistx_rlex.test (1438 of 1888) PASS: lldb-shell :: SymbolFile/DWARF/find-function-regex.cpp (1439 of 1888) PASS: lldb-api :: functionalities/gdb_remote_client/TestGDBRemoteClient.py (1440 of 1888) PASS: lldb-unit :: Utility/./UtilityTests/ScalarTest.Scalar_512 (1441 of 1888) PASS: lldb-unit :: Language/Highlighting/./HighlighterTests/HighlighterTest.DefaultHighlighterWithCursorOutOfBounds (1442 of 1888) PASS: lldb-unit :: UnwindAssembly/x86/./UnwindAssemblyx86Tests/Testx86AssemblyInspectionEngine.TestLEAVE (1443 of 1888) PASS: lldb-unit :: Host/./HostTests/FileSystemTest.Resolve (1444 of 1888) UNSUPPORTED: lldb-api :: benchmarks/startup/TestStartupDelays.py (1445 of 1888) PASS: lldb-api :: functionalities/gdb_remote_client/TestTargetXMLArch.py (1446 of 1888) PASS: lldb-unit :: Utility/./UtilityTests/StringExtractorTest.GetHexBytes (1447 of 1888) PASS: lldb-unit :: Utility/./UtilityTests/ReproducerTest.SetCapture (1448 of 1888) PASS: lldb-api :: api/listeners/TestListener.py (1449 of 1888) PASS: lldb-api :: commands/expression/timeout/TestCallWithTimeout.py (1450 of 1888) PASS: lldb-api :: commands/expression/import-std-module/vector-basic/TestBasicVector.py (1451 of 1888) UNSUPPORTED: lldb-api :: tools/lldb-server/libraries-svr4/TestGdbRemoteLibrariesSvr4Support.py (1452 of 1888) PASS: lldb-api :: lang/c/unions/TestUnionMembers.py (1453 of 1888) PASS: lldb-unit :: Utility/./UtilityTests/BinaryStreamTest.PutSLEB128ThreeBytes (1454 of 1888) PASS: lldb-unit :: Symbol/./SymbolTests/TestClangASTContext.TestGetTypeClassNested (1455 of 1888) PASS: lldb-api :: functionalities/thread/concurrent_events/TestConcurrentWatchpointDelayWatchpointOneBreakpoint.py (1456 of 1888) PASS: lldb-api :: macosx/indirect_symbol/TestIndirectSymbols.py (1457 of 1888) PASS: lldb-api :: functionalities/tail_call_frames/unambiguous_sequence/TestUnambiguousTailCalls.py (1458 of 1888) PASS: lldb-unit :: Utility/./UtilityTests/StringExtractorTest.DecodeHexU8_Exact (1459 of 1888) PASS: lldb-unit :: Language/Highlighting/./HighlighterTests/HighlighterTest.ClangTrailingBackslashMissingNewLine (1460 of 1888) PASS: lldb-unit :: Utility/./UtilityTests/StreamTest.PutBytesAsRawHex8ToBigEndian (1461 of 1888) PASS: lldb-api :: functionalities/data-formatter/var-in-aggregate-misuse/TestVarInAggregateMisuse.py (1462 of 1888) PASS: lldb-api :: tools/lldb-server/register-reading/TestGdbRemoteGPacket.py (1463 of 1888) PASS: lldb-api :: commands/expression/import-std-module/deque-dbg-info-content/TestDbgInfoContentDeque.py (1464 of 1888) PASS: lldb-unit :: Language/Highlighting/./HighlighterTests/HighlighterTest.ClangPreserveNewLine (1465 of 1888) PASS: lldb-unit :: Utility/./UtilityTests/ConstStringTest.CompareConstString (1466 of 1888) PASS: lldb-unit :: Utility/./UtilityTests/BinaryStreamTest.PutULEB128SixBytes (1467 of 1888) PASS: lldb-api :: functionalities/wrong_commands/TestWrongCommands.py (1468 of 1888) UNSUPPORTED: lldb-api :: benchmarks/continue/TestBenchmarkContinue.py (1469 of 1888) PASS: lldb-api :: lang/cpp/class_static/TestStaticVariables.py (1470 of 1888) PASS: lldb-unit :: Process/minidump/./LLDBMinidumpTests/MinidumpParserTest.GetMemoryRegionInfoFromMemory64List (1471 of 1888) PASS: lldb-api :: python_api/sbstructureddata/TestStructuredDataAPI.py (1472 of 1888) PASS: lldb-api :: commands/expression/import-std-module/sysroot/TestStdModuleSysroot.py (1473 of 1888) PASS: lldb-api :: lang/c/find_struct_type/TestFindStructTypes.py (1474 of 1888) PASS: lldb-api :: lang/cpp/gmodules/TestWithModuleDebugging.py (1475 of 1888) PASS: lldb-shell :: ObjectFile/ELF/duplicate-section.yaml (1476 of 1888) PASS: lldb-unit :: Utility/./UtilityTests/StreamTest.AddressRangeInvalidRange (1477 of 1888) PASS: lldb-unit :: Utility/./UtilityTests/StringLexerTest.Peek (1478 of 1888) PASS: lldb-api :: lang/objc/objc-new-syntax/TestObjCNewSyntaxLiteral.py (1479 of 1888) PASS: lldb-unit :: Utility/./UtilityTests/ConstStringTest.UpdateMangledCounterpart (1480 of 1888) PASS: lldb-unit :: Host/./HostTests/File.GetStreamFromDescriptor (1481 of 1888) PASS: lldb-unit :: ObjectFile/ELF/./ObjectFileELFTests/ObjectFileELFTest.GetModuleSpecifications_EarlySectionHeaders (1482 of 1888) PASS: lldb-shell :: Minidump/Windows/broken-unwind.test (1483 of 1888) PASS: lldb-api :: functionalities/thread/concurrent_events/TestConcurrentManyBreakpoints.py (1484 of 1888) PASS: lldb-unit :: Core/./LLDBCoreTests/RichManglingContextTest.FromCxxMethodName (1485 of 1888) PASS: lldb-unit :: Host/./HostTests/NativeProcessProtocolTest.SetBreakpointFailRead (1486 of 1888) PASS: lldb-api :: commands/expression/rdar42038760/TestScalarURem.py (1487 of 1888) PASS: lldb-api :: functionalities/data-formatter/data-formatter-stl/libcxx/optional/TestDataFormatterLibcxxOptional.py (1488 of 1888) PASS: lldb-unit :: Utility/./UtilityTests/CompletionRequest.Constructor (1489 of 1888) PASS: lldb-api :: lang/cpp/accelerator-table/TestCPPAccelerator.py (1490 of 1888) PASS: lldb-unit :: Utility/./UtilityTests/RangeTest.SizeTypes (1491 of 1888) PASS: lldb-api :: lang/objc/foundation/TestObjCMethodsNSArray.py (1492 of 1888) UNSUPPORTED: lldb-shell :: ScriptInterpreter/Lua/nested_sessions.test (1493 of 1888) PASS: lldb-unit :: Utility/./UtilityTests/NameMatchesTest.Equals (1494 of 1888) PASS: lldb-api :: functionalities/tail_call_frames/disambiguate_paths_to_common_sink/TestDisambiguatePathsToCommonSink.py (1495 of 1888) PASS: lldb-api :: tools/lldb-server/TestGdbRemoteThreadsInStopReply.py (1496 of 1888) PASS: lldb-unit :: Utility/./UtilityTests/DataExtractorTest.GetCStr (1497 of 1888) PASS: lldb-api :: commands/expression/call-throws/TestCallThatThrows.py (1498 of 1888) PASS: lldb-api :: commands/expression/function_template_specialization_temp_args/TestFunctionTemplateSpecializationTempArgs.py (1499 of 1888) PASS: lldb-unit :: Symbol/./SymbolTests/TestClangASTContext.TestGetBasicTypeFromEnum (1500 of 1888) PASS: lldb-unit :: Utility/./UtilityTests/UriParserTest.PortOverflow (1501 of 1888) PASS: lldb-api :: lang/cpp/inlines/TestInlines.py (1502 of 1888) PASS: lldb-api :: functionalities/data-formatter/vector-types/TestVectorTypesFormatting.py (1503 of 1888) PASS: lldb-api :: functionalities/thread/concurrent_events/TestConcurrentCrashWithSignal.py (1504 of 1888) PASS: lldb-unit :: Utility/./UtilityTests/StreamTest.AddressRangeEmptyRange (1505 of 1888) PASS: lldb-shell :: Breakpoint/debug_addrx.test (1506 of 1888) PASS: lldb-api :: python_api/exprpath_synthetic/TestExprPathSynthetic.py (1507 of 1888) PASS: lldb-unit :: Language/Highlighting/./HighlighterTests/HighlighterTest.ClangPPDirectives (1508 of 1888) PASS: lldb-api :: python_api/module_section/TestModuleAndSection.py (1509 of 1888) PASS: lldb-unit :: Utility/./UtilityTests/StringExtractorTest.GetNameColonValueContainsColon (1510 of 1888) PASS: lldb-api :: functionalities/lazy-loading/TestLazyLoading.py (1511 of 1888) UNSUPPORTED: lldb-shell :: Register/aarch64-fp-read.test (1512 of 1888) PASS: lldb-api :: functionalities/breakpoint/breakpoint_hit_count/TestBreakpointHitCount.py (1513 of 1888) PASS: lldb-unit :: Process/gdb-remote/./ProcessGdbRemoteTests/GDBRemoteClientBaseTest.SendContinueDelegateStructuredDataReceipt (1514 of 1888) PASS: lldb-api :: python_api/value/empty_class/TestValueAPIEmptyClass.py (1515 of 1888) PASS: lldb-shell :: Driver/TestConvenienceVariables.test (1516 of 1888) PASS: lldb-unit :: Utility/./UtilityTests/IndexToObjectTest.ObjectForIndex (1517 of 1888) UNSUPPORTED: lldb-shell :: ObjectFile/ELF/minidebuginfo-set-and-hit-breakpoint.test (1518 of 1888) PASS: lldb-api :: commands/platform/basic/TestPlatformPython.py (1519 of 1888) PASS: lldb-api :: functionalities/data-formatter/data-formatter-objc/TestDataFormatterObjCNSError.py (1520 of 1888) UNSUPPORTED: lldb-api :: benchmarks/libcxxlist/TestBenchmarkLibcxxList.py (1521 of 1888) PASS: lldb-api :: commands/settings/quoting/TestQuoting.py (1522 of 1888) PASS: lldb-unit :: Utility/./UtilityTests/TimeoutTest.Format (1523 of 1888) PASS: lldb-unit :: Utility/./UtilityTests/StreamTest.PutBytesAsRawHex8ToLittleEndian (1524 of 1888) PASS: lldb-shell :: SymbolFile/DWARF/debug-names-compressed.cpp (1525 of 1888) PASS: lldb-api :: functionalities/thread/exit_during_step/TestExitDuringStep.py (1526 of 1888) PASS: lldb-unit :: ObjectFile/ELF/./ObjectFileELFTests/ObjectFileELFTest.GetSymtab_NoSymEntryPointArmAddressClass (1527 of 1888) PASS: lldb-api :: functionalities/breakpoint/auto_continue/TestBreakpointAutoContinue.py (1528 of 1888) PASS: lldb-api :: functionalities/data-formatter/data-formatter-objc/TestDataFormatterObjCExpr.py (1529 of 1888) UNSUPPORTED: lldb-api :: macosx/macabi/TestMacABImacOSFramework.py (1530 of 1888) PASS: lldb-unit :: Utility/./UtilityTests/ArgsTest.TestQuotedTrailingBackslash (1531 of 1888) PASS: lldb-unit :: Utility/./UtilityTests/StringListTest.AppendListCStringArray (1532 of 1888) PASS: lldb-api :: functionalities/thread/step_until/TestStepUntil.py (1533 of 1888) PASS: lldb-unit :: Utility/./UtilityTests/OptionsWithRawTest.MultiWordSuffix (1534 of 1888) PASS: lldb-api :: functionalities/data-formatter/data-formatter-stl/libcxx/forward_list/TestDataFormatterLibcxxForwardList.py (1535 of 1888) UNSUPPORTED: lldb-api :: functionalities/thread/thread_specific_break_plus_condition/TestThreadSpecificBpPlusCondition.py (1536 of 1888) PASS: lldb-unit :: Utility/./UtilityTests/StringListTest.ForRange (1537 of 1888) UNSUPPORTED: lldb-shell :: Watchpoint/netbsd-nouserdbregs.test (1538 of 1888) PASS: lldb-api :: functionalities/inferior-assert/TestInferiorAssert.py (1539 of 1888) PASS: lldb-unit :: Process/gdb-remote/./ProcessGdbRemoteTests/GDBRemoteClientBaseTest.InterruptNoResponse (1540 of 1888) PASS: lldb-unit :: Utility/./UtilityTests/StateTest.Formatv (1541 of 1888) PASS: lldb-unit :: Utility/./UtilityTests/ProcessInstanceInfo.Dump (1542 of 1888) UNSUPPORTED: lldb-api :: functionalities/thread/create_during_step/TestCreateDuringStep.py (1543 of 1888) UNSUPPORTED: lldb-api :: functionalities/thread/break_after_join/TestBreakAfterJoin.py (1544 of 1888) PASS: lldb-api :: functionalities/data-formatter/frameformat_smallstruct/TestFrameFormatSmallStruct.py (1545 of 1888) PASS: lldb-api :: functionalities/thread/concurrent_events/TestConcurrentDelayedCrashWithBreakpointSignal.py (1546 of 1888) UNSUPPORTED: lldb-api :: tools/lldb-vscode/completions/TestVSCode_completions.py (1547 of 1888) PASS: lldb-api :: commands/command/script/import/TestImport.py (1548 of 1888) PASS: lldb-unit :: Utility/./UtilityTests/ScalarTest.ExtractBitfield (1549 of 1888) PASS: lldb-unit :: UnwindAssembly/x86/./UnwindAssemblyx86Tests/Testx86AssemblyInspectionEngine.Test64bitFramelessBigStackFrame (1550 of 1888) PASS: lldb-api :: lang/cpp/diamond/TestDiamond.py (1551 of 1888) PASS: lldb-api :: commands/command/history/TestCommandHistory.py (1552 of 1888) PASS: lldb-shell :: SymbolFile/DWARF/parallel-indexing-stress.s (1553 of 1888) PASS: lldb-shell :: Register/x86-64-ymm-read.test (1554 of 1888) PASS: lldb-unit :: Host/./HostTests/NativeProcessProtocolTest.ReadCStringFromMemory_MaxSize (1555 of 1888) PASS: lldb-api :: python_api/process/TestProcessAPI.py (1556 of 1888) PASS: lldb-api :: commands/watchpoints/watchpoint_commands/command/TestWatchpointCommandLLDB.py (1557 of 1888) PASS: lldb-unit :: Target/./TargetTests/PathMappingListTest.RemapRoot (1558 of 1888) PASS: lldb-unit :: Utility/./UtilityTests/DataExtractorTest.GetCStrAtEnd (1559 of 1888) PASS: lldb-unit :: Symbol/./SymbolTests/PostfixExpression.ParseOneExpression (1560 of 1888) PASS: lldb-unit :: Utility/./UtilityTests/BinaryStreamTest.PutULEB128One (1561 of 1888) PASS: lldb-unit :: ObjectFile/Breakpad/./ObjectFileBreakpadTests/PublicRecord.parse (1562 of 1888) PASS: lldb-api :: python_api/signals/TestSignalsAPI.py (1563 of 1888) PASS: lldb-unit :: Utility/./UtilityTests/OptionsWithRawTest.SingleWhitespaceInput (1564 of 1888) PASS: lldb-api :: python_api/value/change_values/TestChangeValueAPI.py (1565 of 1888) PASS: lldb-unit :: Breakpoint/./LLDBBreakpointTests/BreakpointIDTest.StringIsBreakpointName (1566 of 1888) PASS: lldb-unit :: Utility/./UtilityTests/CompletionRequest.DuplicateFilteringWithComments (1567 of 1888) PASS: lldb-shell :: ObjectFile/PECOFF/sections-names.yaml (1568 of 1888) PASS: lldb-unit :: Utility/./UtilityTests/StreamTest.ShiftOperatorStrings (1569 of 1888) PASS: lldb-unit :: Utility/./UtilityTests/ArchSpecTest.TestParseMachCPUDashSubtypeTripleExtra (1570 of 1888) PASS: lldb-unit :: Expression/./ExpressionTests/DiagnosticManagerTest.GetStringBasic (1571 of 1888) PASS: lldb-unit :: Utility/./UtilityTests/StreamTest.PutStringAsRawHex8 (1572 of 1888) PASS: lldb-api :: lang/objc/modules-incomplete/TestIncompleteModules.py (1573 of 1888) PASS: lldb-unit :: Utility/./UtilityTests/ListenerTest.GetEventImmediate (1574 of 1888) PASS: lldb-api :: lang/objc/objc-dyn-sbtype/TestObjCDynamicSBType.py (1575 of 1888) PASS: lldb-api :: commands/expression/namespace_local_var_same_name_cpp_and_c/TestNamespaceLocalVarSameNameCppAndC.py (1576 of 1888) PASS: lldb-unit :: Utility/./UtilityTests/FileSpecTest.EqualDotsPosix (1577 of 1888) PASS: lldb-unit :: Symbol/./SymbolTests/DWARFCallFrameInfoTest.Basic_dwarf3 (1578 of 1888) PASS: lldb-unit :: Expression/./ExpressionTests/DWARFExpression.DW_OP_pick (1579 of 1888) PASS: lldb-shell :: Reproducer/TestCaptureEnvOverride.test (1580 of 1888) PASS: lldb-api :: lang/c/unicode/TestUnicodeSymbols.py (1581 of 1888) PASS: lldb-shell :: SymbolFile/DWARF/debug-line-basic.s (1582 of 1888) PASS: lldb-unit :: SymbolFile/DWARF/./SymbolFileDWARFTests/SymbolFileDWARFTests.TestAbbrevOrder1Start1 (1583 of 1888) PASS: lldb-shell :: SymbolFile/DWARF/dwarf5-index-is-used.cpp (1584 of 1888) PASS: lldb-unit :: Expression/./ExpressionTests/CppModuleConfigurationTest.Linux (1585 of 1888) UNSUPPORTED: lldb-shell :: Register/x86-64-xmm16-write.test (1586 of 1888) PASS: lldb-shell :: Host/TestCustomShell.test (1587 of 1888) PASS: lldb-shell :: SymbolFile/DWARF/debug-types-address-ranges.s (1588 of 1888) PASS: lldb-unit :: Interpreter/./InterpreterTests/CompletionTest.FileCompletionAbsolute (1589 of 1888) PASS: lldb-shell :: ObjectFile/ELF/section-types-edgecases.yaml (1590 of 1888) PASS: lldb-shell :: ObjectFile/Breakpad/discontiguous-sections.test (1591 of 1888) PASS: lldb-unit :: ScriptInterpreter/Python/./ScriptInterpreterPythonTests/PythonDataObjectsTest.TestPythonCallableCheck (1592 of 1888) PASS: lldb-unit :: ScriptInterpreter/Python/./ScriptInterpreterPythonTests/PythonDataObjectsTest.TestGlobalNameResolutionWithDot (1593 of 1888) PASS: lldb-api :: python_api/sblaunchinfo/TestSBLaunchInfo.py (1594 of 1888) PASS: lldb-shell :: SymbolFile/DWARF/win-i386-line-table.s (1595 of 1888) PASS: lldb-api :: commands/expression/import-std-module/unique_ptr-dbg-info-content/TestUniquePtrDbgInfoContent.py (1596 of 1888) PASS: lldb-unit :: Utility/./UtilityTests/StringExtractorTest.GetHexBytes_Underflow (1597 of 1888) UNSUPPORTED: lldb-api :: functionalities/darwin_log/source/debug/TestDarwinLogSourceDebug.py (1598 of 1888) PASS: lldb-api :: functionalities/thread/crash_during_step/TestCrashDuringStep.py (1599 of 1888) UNSUPPORTED: lldb-api :: lang/c/typedef/Testtypedef.py (1600 of 1888) PASS: lldb-api :: lang/objcxx/cxx-bridged-po/TestObjCXXBridgedPO.py (1601 of 1888) PASS: lldb-unit :: Host/./HostTests/FileSystemTest.OpenErrno (1602 of 1888) PASS: lldb-unit :: Utility/./UtilityTests/ConstStringTest.CompareStringRef (1603 of 1888) PASS: lldb-shell :: ObjectFile/ELF/base-address.yaml (1604 of 1888) PASS: lldb-unit :: Utility/./UtilityTests/BinaryStreamTest.PutULEB128FiveBytes (1605 of 1888) PASS: lldb-unit :: Utility/./UtilityTests/AnsiTerminal.AtEnd (1606 of 1888) PASS: lldb-unit :: Utility/./UtilityTests/AnsiTerminal.Unknown (1607 of 1888) PASS: lldb-shell :: SymbolFile/NativePDB/ast-functions.cpp (1608 of 1888) PASS: lldb-unit :: SymbolFile/DWARF/./SymbolFileDWARFTests/SymbolFileDWARFTests.TestAbbrevInvalidNULLTag (1609 of 1888) UNSUPPORTED: lldb-api :: functionalities/data-formatter/data-formatter-stl/libstdcpp/vbool/TestDataFormatterStdVBool.py (1610 of 1888) PASS: lldb-unit :: UnwindAssembly/x86/./UnwindAssemblyx86Tests/Testx86AssemblyInspectionEngine.TestDisassemblyMidFunctionEpilogues (1611 of 1888) PASS: lldb-shell :: Driver/TestNoUseColor.test (1612 of 1888) PASS: lldb-api :: functionalities/breakpoint/breakpoint_command/TestBreakpointCommandsFromPython.py (1613 of 1888) PASS: lldb-api :: commands/frame/var-scope/TestFrameVariableScope.py (1614 of 1888) PASS: lldb-unit :: Utility/./UtilityTests/ArgsTest.ReplaceArgumentAtIndexShort (1615 of 1888) UNSUPPORTED: lldb-shell :: SymbolFile/NativePDB/local-variables.cpp (1616 of 1888) PASS: lldb-unit :: Utility/./UtilityTests/ArgsTest.TestInsertArg (1617 of 1888) PASS: lldb-api :: lang/c/vla/TestVLA.py (1618 of 1888) PASS: lldb-shell :: SymbolFile/DWARF/dir-separator-no-comp-dir.s (1619 of 1888) PASS: lldb-unit :: Process/minidump/./LLDBMinidumpTests/MinidumpParserTest.GetPidWow64 (1620 of 1888) PASS: lldb-unit :: SymbolFile/NativePDB/./SymbolFileNativePDBTests/PDBFPOProgramToDWARFExpressionTests.UnresolvedCyclicRegisterAssignmentReference (1621 of 1888) PASS: lldb-shell :: SymbolFile/DWARF/find-basic-variable.cpp (1622 of 1888) PASS: lldb-unit :: Utility/./UtilityTests/RegularExpression.CopyAssignment (1623 of 1888) UNSUPPORTED: lldb-api :: functionalities/data-formatter/data-formatter-stl/libstdcpp/iterator/TestDataFormatterStdIterator.py (1624 of 1888) PASS: lldb-unit :: Utility/./UtilityTests/StringExtractorTest.GetU32BigEndian (1625 of 1888) PASS: lldb-unit :: Process/gdb-remote/./ProcessGdbRemoteTests/GDBRemoteCommunicationClientTest.WriteRegisterNoSuffix (1626 of 1888) PASS: lldb-unit :: Utility/./UtilityTests/FileSpecTest.RemoveLastPathComponent (1627 of 1888) PASS: lldb-shell :: Quit/TestQuitExitCodeHexA.test (1628 of 1888) UNSUPPORTED: lldb-api :: iohandler/completion/TestIOHandlerCompletion.py (1629 of 1888) PASS: lldb-shell :: ScriptInterpreter/Python/scripted_breakpoint.test (1630 of 1888) PASS: lldb-unit :: Utility/./UtilityTests/BinaryStreamTest.PutSLEB128NineBytes (1631 of 1888) PASS: lldb-unit :: ScriptInterpreter/Python/./ScriptInterpreterPythonTests/PythonDataObjectsTest.TestPythonDictionaryValueEquality (1632 of 1888) PASS: lldb-unit :: Utility/./UtilityTests/UriParserTest.BracketedHostnameWithColon (1633 of 1888) PASS: lldb-unit :: Utility/./UtilityTests/StreamTest.AddressRange (1634 of 1888) PASS: lldb-unit :: Utility/./UtilityTests/ArgsTest.TestArgv (1635 of 1888) PASS: lldb-unit :: Expression/./ExpressionTests/CppModuleConfigurationTest.MissingUsrInclude (1636 of 1888) PASS: lldb-api :: functionalities/mtc/simple/TestMTCSimple.py (1637 of 1888) PASS: lldb-shell :: ObjectFile/Breakpad/breakpad-identification.test (1638 of 1888) UNSUPPORTED: lldb-api :: lang/objc/foundation/TestFoundationDisassembly.py (1639 of 1888) PASS: lldb-api :: commands/frame/diagnose/virtual-method-call/TestDiagnoseDereferenceVirtualMethodCall.py (1640 of 1888) PASS: lldb-unit :: Host/./HostTests/SocketTest.DecodeHostAndPort (1641 of 1888) PASS: lldb-api :: functionalities/data-formatter/data-formatter-objc/TestDataFormatterObjCPlain.py (1642 of 1888) UNSUPPORTED: lldb-api :: tools/lldb-server/TestGdbRemoteAuxvSupport.py (1643 of 1888) PASS: lldb-api :: commands/expression/call-function/TestCallBuiltinFunction.py (1644 of 1888) PASS: lldb-unit :: Utility/./UtilityTests/UriParserTest.BracketedHostnamePort (1645 of 1888) PASS: lldb-api :: lang/cpp/function_refs/TestFunctionRefs.py (1646 of 1888) UNSUPPORTED: lldb-shell :: ScriptInterpreter/Lua/convenience_variables.test (1647 of 1888) PASS: lldb-api :: commands/frame/select/TestFrameSelect.py (1648 of 1888) PASS: lldb-unit :: ScriptInterpreter/Python/./ScriptInterpreterPythonTests/PythonDataObjectsTest.TestInstanceNameResolutionNoDot (1649 of 1888) PASS: lldb-api :: commands/watchpoints/watchpoint_commands/TestWatchpointCommands.py (1650 of 1888) PASS: lldb-unit :: UnwindAssembly/x86/./UnwindAssemblyx86Tests/Testx86AssemblyInspectionEngine.TestStackRealignMSVC_i386 (1651 of 1888) PASS: lldb-unit :: UnwindAssembly/x86/./UnwindAssemblyx86Tests/Testx86AssemblyInspectionEngine.TestDisassemblyJunkBytes (1652 of 1888) PASS: lldb-unit :: SymbolFile/NativePDB/./SymbolFileNativePDBTests/PDBFPOProgramToDWARFExpressionTests.UnresolvedDependentCyclicRegisterAssignmentReference (1653 of 1888) PASS: lldb-api :: macosx/order/TestOrderFile.py (1654 of 1888) PASS: lldb-unit :: Utility/./UtilityTests/RangeTest.DefaultConstructor (1655 of 1888) PASS: lldb-api :: functionalities/thread/concurrent_events/TestConcurrentManyCrash.py (1656 of 1888) PASS: lldb-unit :: Process/minidump/./LLDBMinidumpTests/MinidumpParserTest.GetMemory (1657 of 1888) PASS: lldb-api :: lang/cpp/dynamic-value/TestDynamicValue.py (1658 of 1888) PASS: lldb-api :: python_api/lldbutil/frame/TestFrameUtils.py (1659 of 1888) PASS: lldb-unit :: Utility/./UtilityTests/StringListTest.AppendList (1660 of 1888) PASS: lldb-shell :: SymbolFile/NativePDB/function-types-classes.cpp (1661 of 1888) PASS: lldb-api :: terminal/TestSTTYBeforeAndAfter.py (1662 of 1888) PASS: lldb-unit :: Expression/./ExpressionTests/DiagnosticManagerTest.HasFixits (1663 of 1888) PASS: lldb-unit :: Utility/./UtilityTests/StreamTest.AddressPrefixAndSuffix (1664 of 1888) PASS: lldb-api :: lang/cpp/static_methods/TestCPPStaticMethods.py (1665 of 1888) PASS: lldb-unit :: Expression/./ExpressionTests/ClangHostTest.ComputeClangResourceDirectory (1666 of 1888) PASS: lldb-unit :: Utility/./UtilityTests/StreamTeeTest.SetStreamAtIndexOverwrite (1667 of 1888) PASS: lldb-unit :: Utility/./UtilityTests/StringExtractorTest.GetHexBytes_Partial (1668 of 1888) PASS: lldb-api :: macosx/nslog/TestDarwinNSLogOutput.py (1669 of 1888) PASS: lldb-unit :: ScriptInterpreter/Python/./ScriptInterpreterPythonTests/PythonDataObjectsTest.TestOwnedReferences (1670 of 1888) PASS: lldb-unit :: ScriptInterpreter/Python/./ScriptInterpreterPythonTests/PythonDataObjectsTest.TestPythonBoolean (1671 of 1888) PASS: lldb-unit :: Utility/./UtilityTests/BinaryStreamTest.PutSLEB128Zero (1672 of 1888) PASS: lldb-unit :: ObjectFile/Breakpad/./ObjectFileBreakpadTests/StackCFIRecord.parse (1673 of 1888) PASS: lldb-api :: lang/objc/modules-hash-mismatch/TestClangModulesHashMismatch.py (1674 of 1888) UNSUPPORTED: lldb-api :: benchmarks/libcxxmap/TestBenchmarkLibcxxMap.py (1675 of 1888) PASS: lldb-unit :: Utility/./UtilityTests/TimerTest.CategoryTimes2 (1676 of 1888) PASS: lldb-unit :: Language/Highlighting/./HighlighterTests/HighlighterTest.ClangTrailingBackslashWithWhitespace (1677 of 1888) PASS: lldb-unit :: Expression/./ExpressionTests/DiagnosticManagerTest.PutString (1678 of 1888) UNSUPPORTED: lldb-api :: functionalities/exec/TestExec.py (1679 of 1888) PASS: lldb-unit :: Utility/./UtilityTests/BinaryStreamTest.PutSLEB128SevenBytes (1680 of 1888) PASS: lldb-api :: commands/frame/diagnose/dereference-function-return/TestDiagnoseDereferenceFunctionReturn.py (1681 of 1888) PASS: lldb-api :: tools/lldb-server/TestGdbRemoteExitCode.py (1682 of 1888) PASS: lldb-unit :: Utility/./UtilityTests/Flags.AnySet (1683 of 1888) PASS: lldb-unit :: Utility/./UtilityTests/ConstStringTest.NullAndEmptyStates (1684 of 1888) PASS: lldb-api :: functionalities/data-formatter/data-formatter-stl/libcxx/vbool/TestDataFormatterLibcxxVBool.py (1685 of 1888) UNSUPPORTED: lldb-api :: functionalities/longjmp/TestLongjmp.py (1686 of 1888) PASS: lldb-unit :: Utility/./UtilityTests/StreamTest.PutMaxHex64ByteOrderLittle (1687 of 1888) PASS: lldb-unit :: UnwindAssembly/x86/./UnwindAssemblyx86Tests/Testx86AssemblyInspectionEngine.TestPushExtended (1688 of 1888) PASS: lldb-api :: functionalities/breakpoint/cpp/TestCPPBreakpointLocations.py (1689 of 1888) PASS: lldb-unit :: Utility/./UtilityTests/RangeTest.ContainsAddr (1690 of 1888) PASS: lldb-unit :: Utility/./UtilityTests/FileSpecTest.GuessPathStyle (1691 of 1888) PASS: lldb-unit :: ScriptInterpreter/Python/./ScriptInterpreterPythonTests/PythonDataObjectsTest.TestPythonBytes (1692 of 1888) PASS: lldb-api :: functionalities/breakpoint/dummy_target_breakpoints/TestBreakpointsWithNoTargets.py (1693 of 1888) PASS: lldb-api :: commands/source/info/TestSourceInfo.py (1694 of 1888) PASS: lldb-unit :: Utility/./UtilityTests/AnsiTerminal.Basic (1695 of 1888) PASS: lldb-unit :: Host/./HostTests/TaskPoolTest.TaskMap (1696 of 1888) PASS: lldb-api :: python_api/hello_world/TestHelloWorld.py (1697 of 1888) PASS: lldb-shell :: Reproducer/Functionalities/TestImageList.test (1698 of 1888) PASS: lldb-unit :: ScriptInterpreter/Python/./ScriptInterpreterPythonTests/PythonDataObjectsTest.TestPythonStringToStr (1699 of 1888) UNSUPPORTED: lldb-api :: functionalities/thread/multi_break/TestMultipleBreakpoints.py (1700 of 1888) PASS: lldb-api :: functionalities/plugins/python_os_plugin/TestPythonOSPlugin.py (1701 of 1888) PASS: lldb-shell :: Minidump/fb-dump.test (1702 of 1888) PASS: lldb-api :: driver/batch_mode/TestBatchMode.py (1703 of 1888) PASS: lldb-shell :: Reproducer/TestWorkingDir.test (1704 of 1888) PASS: lldb-api :: lang/objc/objc-checker/TestObjCCheckers.py (1705 of 1888) PASS: lldb-api :: functionalities/thread/concurrent_events/TestConcurrentNWatchNBreak.py (1706 of 1888) UNSUPPORTED: lldb-api :: functionalities/tty/TestTerminal.py (1707 of 1888) PASS: lldb-api :: lang/cpp/std-function-step-into-callable/TestStdFunctionStepIntoCallable.py (1708 of 1888) PASS: lldb-api :: commands/expression/issue_11588/Test11588.py (1709 of 1888) PASS: lldb-api :: functionalities/multiword-commands/TestMultiWordCommands.py (1710 of 1888) PASS: lldb-unit :: Process/gdb-remote/./ProcessGdbRemoteTests/GDBRemoteCommunicationServerTest.SendErrorResponse_Status (1711 of 1888) PASS: lldb-unit :: Utility/./UtilityTests/StringLexerTest.AdvanceIf (1712 of 1888) PASS: lldb-unit :: Symbol/./SymbolTests/SymbolsTest.LocateExecutableSymbolFileForUnknownExecutableAndMissingSymbolFile (1713 of 1888) PASS: lldb-unit :: Utility/./UtilityTests/ArgsTest.EscapeLLDBCommandArgument (1714 of 1888) PASS: lldb-unit :: Utility/./UtilityTests/VASprintfTest.EncodingError (1715 of 1888) PASS: lldb-unit :: UnwindAssembly/x86/./UnwindAssemblyx86Tests/Testx86AssemblyInspectionEngine.TestSpillRegToStackViaMOVi386 (1716 of 1888) PASS: lldb-unit :: Utility/./UtilityTests/ArchSpecTest.MergeFromMachOUnknown (1717 of 1888) PASS: lldb-unit :: Process/gdb-remote/./ProcessGdbRemoteTests/GDBRemoteCommunicationClientTest.SyncThreadState (1718 of 1888) PASS: lldb-shell :: Settings/TestFrameFormatNoColor.test (1719 of 1888) PASS: lldb-unit :: UnwindAssembly/x86/./UnwindAssemblyx86Tests/Testx86AssemblyInspectionEngine.TestPushEAX (1720 of 1888) PASS: lldb-unit :: Utility/./UtilityTests/TimerTest.CategoryTimesStats (1721 of 1888) UNSUPPORTED: lldb-api :: functionalities/asan/TestReportData.py (1722 of 1888) PASS: lldb-shell :: Commands/command-source.test (1723 of 1888) PASS: lldb-api :: functionalities/target_var/TestTargetVar.py (1724 of 1888) PASS: lldb-unit :: Utility/./UtilityTests/StructuredDataTest.ParseJSONFromFile (1725 of 1888) PASS: lldb-unit :: Utility/./UtilityTests/StringExtractorTest.GetU32LittleEndian (1726 of 1888) PASS: lldb-api :: lang/objc/modules-inline-functions/TestModulesInlineFunctions.py (1727 of 1888) PASS: lldb-shell :: SymbolFile/DWARF/debug-types-dwo-cross-reference.cpp (1728 of 1888) PASS: lldb-unit :: Process/gdb-remote/./ProcessGdbRemoteTests/GDBRemoteClientBaseTest.SendContinueAndAsyncPacket (1729 of 1888) PASS: lldb-api :: functionalities/breakpoint/require_hw_breakpoints/TestRequireHWBreakpoints.py (1730 of 1888) PASS: lldb-shell :: SymbolFile/NativePDB/ast-methods.cpp (1731 of 1888) UNSUPPORTED: lldb-shell :: SymbolFile/PDB/variables-locations.test (1732 of 1888) PASS: lldb-unit :: Host/./HostTests/SocketTest.TCPGetConnectURI (1733 of 1888) UNSUPPORTED: lldb-api :: commands/watchpoints/multi_watchpoint_slots/TestWatchpointMultipleSlots.py (1734 of 1888) PASS: lldb-api :: functionalities/data-formatter/data-formatter-categories/TestDataFormatterCategories.py (1735 of 1888) PASS: lldb-unit :: Utility/./UtilityTests/UserIDResolver.GetUserName (1736 of 1888) PASS: lldb-unit :: SymbolFile/DWARF/./SymbolFileDWARFTests/SymbolFileDWARFTests.TestAbilitiesForDWARF (1737 of 1888) PASS: lldb-shell :: ObjectFile/ELF/PT_LOAD-empty.yaml (1738 of 1888) PASS: lldb-unit :: Utility/./UtilityTests/UriParserTest.BracketedHostname (1739 of 1888) PASS: lldb-api :: types/TestDoubleTypesExpr.py (1740 of 1888) PASS: lldb-api :: lang/cpp/const_this/TestConstThis.py (1741 of 1888) PASS: lldb-unit :: Utility/./UtilityTests/ArgsTest.TestSingleQuotedArgWithSpace (1742 of 1888) UNSUPPORTED: lldb-shell :: Register/x86-64-zmm-read.test (1743 of 1888) PASS: lldb-api :: functionalities/thread/concurrent_events/TestConcurrentSignalNWatchNBreak.py (1744 of 1888) PASS: lldb-unit :: Symbol/./SymbolTests/Type.GetTypeScopeAndBasename (1745 of 1888) PASS: lldb-api :: lang/cpp/global_operators/TestCppGlobalOperators.py (1746 of 1888) PASS: lldb-api :: functionalities/postmortem/elf-core/gcore/TestGCore.py (1747 of 1888) PASS: lldb-unit :: Utility/./UtilityTests/Flags.GetBitSize (1748 of 1888) PASS: lldb-shell :: ObjectFile/ELF/compressed-sections.yaml (1749 of 1888) UNSUPPORTED: lldb-shell :: SymbolFile/PDB/func-symbols.test (1750 of 1888) PASS: lldb-unit :: Utility/./UtilityTests/Flags.AllSet (1751 of 1888) UNSUPPORTED: lldb-api :: api/multiple-debuggers/TestMultipleDebuggers.py (1752 of 1888) PASS: lldb-api :: commands/expression/import-std-module/shared_ptr/TestSharedPtr.py (1753 of 1888) PASS: lldb-api :: python_api/symbol-context/two-files/TestSymbolContextTwoFiles.py (1754 of 1888) PASS: lldb-unit :: Utility/./UtilityTests/StringListTest.CopyListEmpty (1755 of 1888) PASS: lldb-api :: lang/cpp/global_variables/TestCPPGlobalVariables.py (1756 of 1888) PASS: lldb-unit :: Utility/./UtilityTests/StreamTeeTest.GetStreamAtIndexOutOfBoundsEmpty (1757 of 1888) PASS: lldb-unit :: ScriptInterpreter/Python/./ScriptInterpreterPythonTests/PythonDataObjectsTest.TestPythonInteger (1758 of 1888) PASS: lldb-api :: commands/expression/argument_passing_restrictions/TestArgumentPassingRestrictions.py (1759 of 1888) PASS: lldb-unit :: debugserver/./debugserverTests/RNBSocket.LoopBackListenIPv6 (1760 of 1888) PASS: lldb-unit :: Process/gdb-remote/./ProcessGdbRemoteTests/GDBRemoteClientBaseTest.SendContinueAndAsyncSignal (1761 of 1888) PASS: lldb-api :: commands/add-dsym/uuid/TestAddDsymCommand.py (1762 of 1888) PASS: lldb-unit :: Language/Highlighting/./HighlighterTests/HighlighterTest.ClangSquareBrackets (1763 of 1888) PASS: lldb-api :: functionalities/data-formatter/data-formatter-python-synth/TestDataFormatterPythonSynth.py (1764 of 1888) PASS: lldb-api :: lang/cpp/thread_local/TestThreadLocal.py (1765 of 1888) PASS: lldb-api :: lang/cpp/operators/TestCppOperators.py (1766 of 1888) PASS: lldb-api :: lang/objc/print-obj/TestPrintObj.py (1767 of 1888) PASS: lldb-unit :: Utility/./UtilityTests/StringExtractorTest.GetNameColonValueSuccess (1768 of 1888) PASS: lldb-shell :: Reproducer/TestVersionCheck.test (1769 of 1888) PASS: lldb-api :: tools/lldb-vscode/attach/TestVSCode_attach.py (1770 of 1888) UNSUPPORTED: lldb-shell :: Register/aarch64-gp-read.test (1771 of 1888) PASS: lldb-api :: lang/objc/objc-new-syntax/TestObjCNewSyntaxDictionary.py (1772 of 1888) PASS: lldb-unit :: Host/./HostTests/NativeProcessProtocolTest.SetBreakpointFailVerify (1773 of 1888) PASS: lldb-unit :: Utility/./UtilityTests/VMRange.ContainsRange (1774 of 1888) UNSUPPORTED: lldb-api :: tools/lldb-server/platform-process-connect/TestPlatformProcessConnect.py (1775 of 1888) PASS: lldb-unit :: Utility/./UtilityTests/UriParserTest.SchemeHostSeparator (1776 of 1888) PASS: lldb-shell :: SymbolFile/DWARF/dir-separator-windows.s (1777 of 1888) PASS: lldb-shell :: Expr/TestMultilineExpr.test (1778 of 1888) PASS: lldb-api :: lang/cpp/virtual-overload/TestVirtualOverload.py (1779 of 1888) PASS: lldb-unit :: Host/./HostTests/NativeProcessProtocolTest.ReadCStringFromMemory_CrossPageBoundary (1780 of 1888) PASS: lldb-unit :: Symbol/./SymbolTests/TestClangASTContext.TestRemoveFastQualifiers (1781 of 1888) PASS: lldb-unit :: UnwindAssembly/x86/./UnwindAssemblyx86Tests/Testx86AssemblyInspectionEngine.TestAddRSP (1782 of 1888) PASS: lldb-unit :: Utility/./UtilityTests/ArgsTest.BareSingleQuote (1783 of 1888) PASS: lldb-unit :: Utility/./UtilityTests/UriParserTest.Empty (1784 of 1888) PASS: lldb-api :: functionalities/postmortem/minidump-new/TestMiniDumpUUID.py (1785 of 1888) PASS: lldb-unit :: DataFormatter/./LLDBFormatterTests/FormatManagerTests.CompatibleLangs (1786 of 1888) UNSUPPORTED: lldb-api :: benchmarks/frame_variable/TestFrameVariableResponse.py (1787 of 1888) PASS: lldb-unit :: Utility/./UtilityTests/StringListTest.ShiftCString (1788 of 1888) PASS: lldb-api :: lang/cpp/rvalue-references/TestRvalueReferences.py (1789 of 1888) PASS: lldb-api :: functionalities/multidebugger_commands/TestMultipleDebuggersCommands.py (1790 of 1888) PASS: lldb-api :: lang/objc/hidden-ivars/TestHiddenIvars.py (1791 of 1888) PASS: lldb-unit :: Expression/./ExpressionTests/DiagnosticManagerTest.FixedExpression (1792 of 1888) UNSUPPORTED: lldb-api :: tools/lldb-server/thread-name/TestGdbRemoteThreadName.py (1793 of 1888) PASS: lldb-shell :: ObjectFile/ELF/PT_TLS-overlap-PT_LOAD.yaml (1794 of 1888) PASS: lldb-unit :: ScriptInterpreter/Python/./ScriptInterpreterPythonTests/PythonDataObjectsTest.TestRun (1795 of 1888) PASS: lldb-api :: python_api/type/TestTypeList.py (1796 of 1888) PASS: lldb-api :: functionalities/data-formatter/nsarraysynth/TestNSArraySynthetic.py (1797 of 1888) PASS: lldb-unit :: Utility/./UtilityTests/SubsystemRAIITest.SubsystemWithErrorSuccess (1798 of 1888) PASS: lldb-unit :: Utility/./UtilityTests/StreamTest.AddressSuffix (1799 of 1888) PASS: lldb-api :: functionalities/thread/exit_during_break/TestExitDuringBreak.py (1800 of 1888) PASS: lldb-api :: functionalities/thread/num_threads/TestNumThreads.py (1801 of 1888) PASS: lldb-api :: functionalities/archives/TestBSDArchives.py (1802 of 1888) PASS: lldb-unit :: ScriptInterpreter/Python/./ScriptInterpreterPythonTests/PythonDataObjectsTest.TestCallable (1803 of 1888) PASS: lldb-shell :: Breakpoint/debug_rnglist_basic.test (1804 of 1888) PASS: lldb-api :: functionalities/tail_call_frames/disambiguate_tail_call_seq/TestDisambiguateTailCallSeq.py (1805 of 1888) PASS: lldb-api :: commands/expression/regression-access-function-template-in-record/TestRegressionAccessFunctionTemplateInRecord.py (1806 of 1888) UNSUPPORTED: lldb-api :: tools/lldb-server/TestGdbRemoteModuleInfo.py (1807 of 1888) PASS: lldb-api :: python_api/target/TestTargetAPI.py (1808 of 1888) PASS: lldb-api :: functionalities/breakpoint/comp_dir_symlink/TestCompDirSymLink.py (1809 of 1888) PASS: lldb-unit :: Utility/./UtilityTests/StringExtractorTest.GetU64LittleEndian (1810 of 1888) PASS: lldb-api :: lang/cpp/gmodules-templates/TestGModules.py (1811 of 1888) PASS: lldb-unit :: Utility/./UtilityTests/StreamTeeTest.Constructor2Streams (1812 of 1888) PASS: lldb-unit :: Core/./LLDBCoreTests/MangledTest.NameIndexes_FindFunctionSymbols (1813 of 1888) PASS: lldb-api :: commands/statistics/basic/TestStats.py (1814 of 1888) PASS: lldb-api :: python_api/symbol-context/TestSymbolContext.py (1815 of 1888) PASS: lldb-shell :: ObjectFile/MachO/lc_build_version.yaml (1816 of 1888) PASS: lldb-unit :: Utility/./UtilityTests/RegularExpression.Invalid (1817 of 1888) PASS: lldb-api :: functionalities/data-formatter/data-formatter-objc/TestDataFormatterObjCNSData.py (1818 of 1888) PASS: lldb-api :: functionalities/breakpoint/breakpoint_set_restart/TestBreakpointSetRestart.py (1819 of 1888) PASS: lldb-unit :: UnwindAssembly/x86/./UnwindAssemblyx86Tests/Testx86AssemblyInspectionEngine.TestPushECX (1820 of 1888) PASS: lldb-shell :: ObjectFile/ELF/gnu-debuglink.yaml (1821 of 1888) PASS: lldb-api :: commands/expression/call-function/TestCallUserDefinedFunction.py (1822 of 1888) PASS: lldb-unit :: Utility/./UtilityTests/StringListTest.LongestCommonPrefixSingleElement (1823 of 1888) PASS: lldb-shell :: Settings/TestStopCommandSourceOnError.test (1824 of 1888) PASS: lldb-shell :: SymbolFile/Breakpad/line-table-edgecases.test (1825 of 1888) PASS: lldb-unit :: Utility/./UtilityTests/StringExtractorTest.GetNameColonValueNoSemicolon (1826 of 1888) UNSUPPORTED: lldb-api :: functionalities/process_save_core/TestProcessSaveCore.py (1827 of 1888) PASS: lldb-api :: commands/frame/diagnose/array/TestArray.py (1828 of 1888) PASS: lldb-unit :: Utility/./UtilityTests/DeserializerTest.HasData (1829 of 1888) PASS: lldb-api :: commands/frame/recognizer/TestFrameRecognizer.py (1830 of 1888) PASS: lldb-api :: lang/c/blocks/TestBlocks.py (1831 of 1888) PASS: lldb-api :: commands/expression/import-std-module/empty-module/TestEmptyStdModule.py (1832 of 1888) PASS: lldb-shell :: SymbolFile/Breakpad/line-table.test (1833 of 1888) PASS: lldb-api :: lang/objc/modules/TestObjCModules.py (1834 of 1888) PASS: lldb-unit :: Process/minidump/./LLDBMinidumpTests/MinidumpParserTest.GetMiscInfoWindows (1835 of 1888) PASS: lldb-unit :: ScriptInterpreter/Python/./ScriptInterpreterPythonTests/PythonDataObjectsTest.TestPythonTupleSize (1836 of 1888) PASS: lldb-api :: functionalities/thread/backtrace_limit/TestBacktraceLimit.py (1837 of 1888) UNSUPPORTED: lldb-api :: benchmarks/expression/TestRepeatedExprs.py (1838 of 1888) PASS: lldb-unit :: Utility/./UtilityTests/StringExtractorTest.GetHexU8_Underflow2_NoEof (1839 of 1888) PASS: lldb-shell :: ObjectFile/PECOFF/section-types.yaml (1840 of 1888) PASS: lldb-unit :: Utility/./UtilityTests/BinaryStreamTest.PutULEB128ThreeBytes (1841 of 1888) PASS: lldb-shell :: SymbolFile/DWARF/inline-function-address.ll (1842 of 1888) PASS: lldb-unit :: Language/CPlusPlus/./LanguageCPlusPlusTests/CPlusPlusLanguage.FindAlternateFunctionManglings (1843 of 1888) PASS: lldb-api :: python_api/frame/TestFrames.py (1844 of 1888) PASS: lldb-api :: functionalities/data-formatter/data-formatter-proper-plurals/TestFormattersOneIsSingular.py (1845 of 1888) PASS: lldb-shell :: ObjectFile/ELF/PT_LOAD-overlap-PT_INTERP.yaml (1846 of 1888) PASS: lldb-shell :: SymbolFile/DWARF/clang-ast-from-dwarf-unamed-and-anon-structs.cpp (1847 of 1888) PASS: lldb-unit :: UnwindAssembly/x86/./UnwindAssemblyx86Tests/Testx86AssemblyInspectionEngine.TestPopRBX (1848 of 1888) XFAIL: lldb-shell :: Unwind/prefer-debug-over-eh-frame.test (1849 of 1888) PASS: lldb-unit :: Utility/./UtilityTests/StreamTest.PutHex8 (1850 of 1888) PASS: lldb-shell :: ObjectFile/ELF/netbsd-core-amd64.test (1851 of 1888) PASS: lldb-unit :: debugserver/./debugserverTests/RNBSocket.LoopBackConnectIPv4 (1852 of 1888) PASS: lldb-unit :: UnwindAssembly/x86/./UnwindAssemblyx86Tests/Testx86AssemblyInspectionEngine.Test32BitOnlyInstruction (1853 of 1888) PASS: lldb-unit :: Expression/./ExpressionTests/DiagnosticManagerTest.GetStringMultiline (1854 of 1888) PASS: lldb-unit :: Utility/./UtilityTests/RangeTest.NotEqualInvalid (1855 of 1888) PASS: lldb-unit :: Utility/./UtilityTests/UUIDTest.StringConverion (1856 of 1888) PASS: lldb-unit :: Host/./HostTests/ConnectionFileDescriptorTest.TCPGetURIv6 (1857 of 1888) PASS: lldb-unit :: Utility/./UtilityTests/VASprintfTest.BufferResize (1858 of 1888) PASS: lldb-api :: commands/watchpoints/watchpoint_events/TestWatchpointEvents.py (1859 of 1888) PASS: lldb-shell :: Quit/TestQuitExitCode0.test (1860 of 1888) PASS: lldb-unit :: Utility/./UtilityTests/CompletionRequest.TryCompleteCurrentArgGood (1861 of 1888) PASS: lldb-unit :: Symbol/./SymbolTests/TestClangASTImporter.MetadataPropagation (1862 of 1888) PASS: lldb-api :: tools/lldb-server/TestAppleSimulatorOSType.py (1863 of 1888) PASS: lldb-api :: functionalities/breakpoint/address_breakpoints/TestBadAddressBreakpoints.py (1864 of 1888) PASS: lldb-api :: functionalities/data-formatter/data-formatter-caching/TestDataFormatterCaching.py (1865 of 1888) PASS: lldb-api :: lang/objc/modules-app-update/TestClangModulesAppUpdate.py (1866 of 1888) PASS: lldb-api :: types/TestCharType.py (1867 of 1888) PASS: lldb-unit :: Utility/./UtilityTests/StringListTest.CopyListSingle (1868 of 1888) PASS: lldb-shell :: SymbolFile/Breakpad/line-table-missing-file.test (1869 of 1888) PASS: lldb-api :: lang/cpp/wchar_t/TestCxxWCharT.py (1870 of 1888) PASS: lldb-api :: commands/target/create-no-such-arch/TestNoSuchArch.py (1871 of 1888) PASS: lldb-api :: functionalities/pre_run_dylibs/TestPreRunDylibs.py (1872 of 1888) PASS: lldb-unit :: Expression/./ExpressionTests/ClangHostTest.MacOSX (1873 of 1888) PASS: lldb-api :: commands/watchpoints/watchpoint_commands/command/TestWatchpointCommandPython.py (1874 of 1888) PASS: lldb-api :: commands/expression/test/TestExprs2.py (1875 of 1888) PASS: lldb-api :: macosx/DBGSourcePathRemapping/TestDSYMSourcePathRemapping.py (1876 of 1888) PASS: lldb-api :: lang/objc/foundation/TestConstStrings.py (1877 of 1888) PASS: lldb-api :: lang/cpp/overloaded-functions/TestOverloadedFunctions.py (1878 of 1888) PASS: lldb-api :: functionalities/breakpoint/breakpoint_names/TestBreakpointNames.py (1879 of 1888) PASS: lldb-api :: types/TestLongTypes.py (1880 of 1888) PASS: lldb-api :: commands/expression/no-deadlock/TestExprDoesntBlock.py (1881 of 1888) PASS: lldb-api :: functionalities/breakpoint/breakpoint_conditions/TestBreakpointConditions.py (1882 of 1888) PASS: lldb-api :: lang/objc/foundation/TestSymbolTable.py (1883 of 1888) PASS: lldb-api :: python_api/watchpoint/watchlocation/TestSetWatchlocation.py (1884 of 1888) PASS: lldb-api :: lang/objc/objc-ivar-offsets/TestObjCIvarOffsets.py (1885 of 1888) PASS: lldb-api :: lang/objc/forward-decl/TestForwardDecl.py (1886 of 1888) PASS: lldb-api :: lang/objc/foundation/TestObjCMethodsNSError.py (1887 of 1888) PASS: lldb-api :: types/TestLongTypesExpr.py (1888 of 1888)

Hide Details

Testing Time: 3868.41s ******************** Failing Tests (6): lldb-api :: functionalities/data-formatter/data-formatter-stl/libcxx/map/TestDataFormatterLibccMap.py lldb-api :: functionalities/data-formatter/data-formatter-stl/libcxx/vector/TestDataFormatterLibcxxVector.py lldb-api :: functionalities/data-formatter/data-formatter-stl/libcxx/multiset/TestDataFormatterLibcxxMultiSet.py lldb-api :: functionalities/data-formatter/data-formatter-stl/libcxx/set/TestDataFormatterLibcxxSet.py lldb-api :: functionalities/data-formatter/data-formatter-stl/libcxx/multimap/TestDataFormatterLibccMultiMap.py lldb-api :: functionalities/data-formatter/data-formatter-stl/libcxx/iterator/TestDataFormatterLibccIterator.py

Hide Details

Hide Details

Slowest Tests: -------------------------------------------------------------------------- 303.09s: lldb-api :: lang/objc/conflicting-definition/TestConflictingDefinition.py 305.95s: lldb-api :: commands/expression/import-std-module/stack/TestStack.py 320.36s: lldb-api :: types/TestIntegerType.py 321.08s: lldb-api :: functionalities/recursion/TestValueObjectRecursion.py 335.79s: lldb-api :: types/TestIntegerTypeExpr.py 345.10s: lldb-api :: functionalities/data-formatter/compactvectors/TestCompactVectors.py 383.06s: lldb-api :: tools/lldb-server/TestGdbRemoteThreadsInStopReply.py 385.57s: lldb-api :: python_api/lldbutil/iter/TestLLDBIterator.py 438.35s: lldb-api :: lang/objc/objc-new-syntax/TestObjCNewSyntaxArray.py 440.71s: lldb-api :: lang/objc/foundation/TestObjCMethodsString.py 461.30s: lldb-api :: lang/objc/objc-new-syntax/TestObjCNewSyntaxDictionary.py 504.38s: lldb-api :: lang/objc/exceptions/TestObjCExceptions.py 547.12s: lldb-api :: lang/objc/real-definition/TestRealDefinition.py 578.79s: lldb-api :: lang/objc/objc-new-syntax/TestObjCNewSyntaxLiteral.py 668.70s: lldb-api :: lang/cpp/namespace/TestNamespaceLookup.py 838.45s: lldb-api :: lang/objc/foundation/TestObjCMethods.py 945.52s: lldb-api :: lang/objc/hidden-ivars/TestHiddenIvars.py 985.16s: lldb-api :: lang/cpp/enum_types/TestCPP11EnumTypes.py 992.77s: lldb-api :: api/multithreaded/TestMultithreaded.py 1090.21s: lldb-api :: tools/lldb-server/TestLldbGdbServer.py

Hide Details

Tests Times: -------------------------------------------------------------------------- [ Range ] :: [ Percentage ] :: [ Count ] -------------------------------------------------------------------------- [ 0s, 100s) :: [************************************ ] :: [1703/1888] [ 100s, 200s) :: [** ] :: [ 129/1888] [ 200s, 300s) :: [ ] :: [ 35/1888] [ 300s, 400s) :: [ ] :: [ 9/1888] [ 400s, 500s) :: [ ] :: [ 3/1888] [ 500s, 600s) :: [ ] :: [ 3/1888] [ 600s, 700s) :: [ ] :: [ 1/1888] [ 700s, 800s) :: [ ] :: [ 0/1888] [ 800s, 900s) :: [ ] :: [ 1/1888] [ 900s,1000s) :: [ ] :: [ 2/1888] [1000s,1100s) :: [ ] :: [ 2/1888] Expected Passes : 1715 Expected Failures : 6 Unsupported Tests : 161 Unexpected Failures: 6 FAILED: tools/lldb/test/CMakeFiles/check-lldb-lit cd /Users/buildslave/jenkins/workspace/lldb-cmake-sanitized/lldb-build/tools/lldb/test && /usr/local/bin/python /Users/buildslave/jenkins/workspace/lldb-cmake-sanitized/lldb-build/./bin/llvm-lit -v --time-tests --shuffle --xunit-xml-output=/Users/buildslave/jenkins/workspace/lldb-cmake-sanitized/test/results.xml -v --timeout 1200 /Users/buildslave/jenkins/workspace/lldb-cmake-sanitized/lldb-build/tools/lldb/test ninja: build stopped: subcommand failed. Command failed: Command '['/usr/bin/env', 'TERM=vt100', '/usr/local/bin/ninja', '-v', 'check-lldb']' returned non-zero exit status 1. Command: ['/usr/bin/env', 'TERM=vt100', '/usr/local/bin/ninja', '-v', 'check-lldb'] [Pipeline] } [Pipeline] // timeout [Pipeline] } [Pipeline] // stage [Pipeline] stage [Pipeline] { (Declarative: Post Actions) [Pipeline] scanForIssues No credentials specified [Clang (LLVM based)] Sleeping for 5 seconds due to JENKINS-32191... [Clang (LLVM based)] Parsing console log (workspace: '/Users/buildslave/jenkins/workspace/lldb-cmake-sanitized') [Pipeline] junit Recording test results [Pipeline] } [Pipeline] // stage [Pipeline] } [Pipeline] // withEnv [Pipeline] } [Pipeline] // node [Pipeline] End of Pipeline ERROR: script returned exit code 1 Finished: FAILURE