FailedConsole Output

Skipping 4,846 KB.. Full Log
m_pthread.dylib`thread_start + 13
  thread #25
    frame #0: 0x0000000100001e8b a.out`int std::__1::__cxx_atomic_load<int>(__a=0x0000000100005168, __order=memory_order_seq_cst) at atomic:0:12
    frame #1: 0x00000001000012be a.out`std::__1::__atomic_base<int, false>::load(this=0x0000000100005168, __m=memory_order_seq_cst) const at atomic:1487:17
    frame #2: 0x0000000100001369 a.out`watchpoint_func(input=0x0000000000000000) at main.cpp:73:5
    frame #3: 0x00007fff6e48233d libsystem_pthread.dylib`_pthread_body + 126
    frame #4: 0x00007fff6e4852a7 libsystem_pthread.dylib`_pthread_start + 70
    frame #5: 0x00007fff6e481425 libsystem_pthread.dylib`thread_start + 13
  thread #26
    frame #0: 0x0000000100001e86 a.out`int std::__1::__cxx_atomic_load<int>(__a=0x0000000100005168, __order=memory_order_seq_cst) at atomic:970:12
    frame #1: 0x00000001000012be a.out`std::__1::__atomic_base<int, false>::load(this=0x0000000100005168, __m=memory_order_seq_cst) const at atomic:1487:17
    frame #2: 0x0000000100001369 a.out`watchpoint_func(input=0x0000000000000000) at main.cpp:73:5
    frame #3: 0x00007fff6e48233d libsystem_pthread.dylib`_pthread_body + 126
    frame #4: 0x00007fff6e4852a7 libsystem_pthread.dylib`_pthread_start + 70
    frame #5: 0x00007fff6e481425 libsystem_pthread.dylib`thread_start + 13
  thread #27
    frame #0: 0x00000001000012a0 a.out`std::__1::__atomic_base<int, false>::load(this=0x0000000000000000, __m=memory_order_relaxed) const at atomic:1487
    frame #1: 0x0000000100001369 a.out`watchpoint_func(input=0x0000000000000000) at main.cpp:73:5
    frame #2: 0x00007fff6e48233d libsystem_pthread.dylib`_pthread_body + 126
    frame #3: 0x00007fff6e4852a7 libsystem_pthread.dylib`_pthread_start + 70
    frame #4: 0x00007fff6e481425 libsystem_pthread.dylib`thread_start + 13
  thread #28
    frame #0: 0x0000000100001ec4 a.out`int std::__1::__cxx_atomic_load<int>(__a=0x0000000100005168, __order=memory_order_seq_cst) at atomic:970:5
    frame #1: 0x00000001000012be a.out`std::__1::__atomic_base<int, false>::load(this=0x0000000100005168, __m=memory_order_seq_cst) const at atomic:1487:17
    frame #2: 0x0000000100001369 a.out`watchpoint_func(input=0x0000000000000000) at main.cpp:73:5
    frame #3: 0x00007fff6e48233d libsystem_pthread.dylib`_pthread_body + 126
    frame #4: 0x00007fff6e4852a7 libsystem_pthread.dylib`_pthread_start + 70
    frame #5: 0x00007fff6e481425 libsystem_pthread.dylib`thread_start + 13
  thread #29, stop reason = watchpoint 1
    frame #0: 0x0000000100001391 a.out`watchpoint_func(input=0x0000000000000000) at main.cpp:77:5
    frame #1: 0x00007fff6e48233d libsystem_pthread.dylib`_pthread_body + 126
    frame #2: 0x00007fff6e4852a7 libsystem_pthread.dylib`_pthread_start + 70
    frame #3: 0x00007fff6e481425 libsystem_pthread.dylib`thread_start + 13
  thread #30
    frame #0: 0x00000001000012a8 a.out`std::__1::__atomic_base<int, false>::load(this=0x0000000100005168, __m=memory_order_seq_cst) const at atomic:1487
    frame #1: 0x0000000100001369 a.out`watchpoint_func(input=0x0000000000000000) at main.cpp:73:5
    frame #2: 0x00007fff6e48233d libsystem_pthread.dylib`_pthread_body + 126
    frame #3: 0x00007fff6e4852a7 libsystem_pthread.dylib`_pthread_start + 70
    frame #4: 0x00007fff6e481425 libsystem_pthread.dylib`thread_start + 13
  thread #31
    frame #0: 0x0000000100001ec4 a.out`int std::__1::__cxx_atomic_load<int>(__a=0x0000000100005168, __order=memory_order_seq_cst) at atomic:970:5
    frame #1: 0x00000001000012be a.out`std::__1::__atomic_base<int, false>::load(this=0x0000000100005168, __m=memory_order_seq_cst) const at atomic:1487:17
    frame #2: 0x0000000100001369 a.out`watchpoint_func(input=0x0000000000000000) at main.cpp:73:5
    frame #3: 0x00007fff6e48233d libsystem_pthread.dylib`_pthread_body + 126
    frame #4: 0x00007fff6e4852a7 libsystem_pthread.dylib`_pthread_start + 70
    frame #5: 0x00007fff6e481425 libsystem_pthread.dylib`thread_start + 13
  thread #32
    frame #0: 0x0000000100001e61 a.out`int std::__1::__cxx_atomic_load<int>(__a=0x0000000100005168, __order=memory_order_seq_cst) at atomic:968
    frame #1: 0x00000001000012be a.out`std::__1::__atomic_base<int, false>::load(this=0x0000000100005168, __m=memory_order_seq_cst) const at atomic:1487:17
    frame #2: 0x0000000100001369 a.out`watchpoint_func(input=0x0000000000000000) at main.cpp:73:5
    frame #3: 0x00007fff6e48233d libsystem_pthread.dylib`_pthread_body + 126
    frame #4: 0x00007fff6e4852a7 libsystem_pthread.dylib`_pthread_start + 70
    frame #5: 0x00007fff6e481425 libsystem_pthread.dylib`thread_start + 13
  thread #33
    frame #0: 0x00000001000012b6 a.out`std::__1::__atomic_base<int, false>::load(this=0x0000000100005168, __m=memory_order_seq_cst) const at atomic:1487:17
    frame #1: 0x0000000100001369 a.out`watchpoint_func(input=0x0000000000000000) at main.cpp:73:5
    frame #2: 0x00007fff6e48233d libsystem_pthread.dylib`_pthread_body + 126
    frame #3: 0x00007fff6e4852a7 libsystem_pthread.dylib`_pthread_start + 70
    frame #4: 0x00007fff6e481425 libsystem_pthread.dylib`thread_start + 13
  thread #34
    frame #0: 0x0000000100001ec4 a.out`int std::__1::__cxx_atomic_load<int>(__a=0x0000000100005168, __order=memory_order_seq_cst) at atomic:970:5
    frame #1: 0x00000001000012be a.out`std::__1::__atomic_base<int, false>::load(this=0x0000000100005168, __m=memory_order_seq_cst) const at atomic:1487:17
    frame #2: 0x0000000100001369 a.out`watchpoint_func(input=0x0000000000000000) at main.cpp:73:5
    frame #3: 0x00007fff6e48233d libsystem_pthread.dylib`_pthread_body + 126
    frame #4: 0x00007fff6e4852a7 libsystem_pthread.dylib`_pthread_start + 70
    frame #5: 0x00007fff6e481425 libsystem_pthread.dylib`thread_start + 13
  thread #35
    frame #0: 0x0000000100001e86 a.out`int std::__1::__cxx_atomic_load<int>(__a=0x0000000100005168, __order=memory_order_seq_cst) at atomic:970:12
    frame #1: 0x00000001000012be a.out`std::__1::__atomic_base<int, false>::load(this=0x0000000100005168, __m=memory_order_seq_cst) const at atomic:1487:17
    frame #2: 0x0000000100001369 a.out`watchpoint_func(input=0x0000000000000000) at main.cpp:73:5
    frame #3: 0x00007fff6e48233d libsystem_pthread.dylib`_pthread_body + 126
    frame #4: 0x00007fff6e4852a7 libsystem_pthread.dylib`_pthread_start + 70
    frame #5: 0x00007fff6e481425 libsystem_pthread.dylib`thread_start + 13
  thread #36
    frame #0: 0x00000001000012b3 a.out`std::__1::__atomic_base<int, false>::load(this=0x0000000100005168, __m=memory_order_seq_cst) const at atomic:1487:42
    frame #1: 0x0000000100001369 a.out`watchpoint_func(input=0x0000000000000000) at main.cpp:73:5
    frame #2: 0x00007fff6e48233d libsystem_pthread.dylib`_pthread_body + 126
    frame #3: 0x00007fff6e4852a7 libsystem_pthread.dylib`_pthread_start + 70
    frame #4: 0x00007fff6e481425 libsystem_pthread.dylib`thread_start + 13
  thread #37
    frame #0: 0x0000000100001e6f a.out`int std::__1::__cxx_atomic_load<int>(__a=0x0000000100005168, __order=memory_order_seq_cst) at atomic:970:112
    frame #1: 0x00000001000012be a.out`std::__1::__atomic_base<int, false>::load(this=0x0000000100005168, __m=memory_order_seq_cst) const at atomic:1487:17
    frame #2: 0x0000000100001369 a.out`watchpoint_func(input=0x0000000000000000) at main.cpp:73:5
    frame #3: 0x00007fff6e48233d libsystem_pthread.dylib`_pthread_body + 126
    frame #4: 0x00007fff6e4852a7 libsystem_pthread.dylib`_pthread_start + 70
    frame #5: 0x00007fff6e481425 libsystem_pthread.dylib`thread_start + 13
  thread #38, stop reason = watchpoint 1
    frame #0: 0x0000000100001391 a.out`watchpoint_func(input=0x0000000000000000) at main.cpp:77:5
    frame #1: 0x00007fff6e48233d libsystem_pthread.dylib`_pthread_body + 126
    frame #2: 0x00007fff6e4852a7 libsystem_pthread.dylib`_pthread_start + 70
    frame #3: 0x00007fff6e481425 libsystem_pthread.dylib`thread_start + 13
  thread #39
    frame #0: 0x00000001000012a0 a.out`std::__1::__atomic_base<int, false>::load(this=0x0000000000000000, __m=memory_order_relaxed) const at atomic:1487
    frame #1: 0x0000000100001369 a.out`watchpoint_func(input=0x0000000000000000) at main.cpp:73:5
    frame #2: 0x00007fff6e48233d libsystem_pthread.dylib`_pthread_body + 126
    frame #3: 0x00007fff6e4852a7 libsystem_pthread.dylib`_pthread_start + 70
    frame #4: 0x00007fff6e481425 libsystem_pthread.dylib`thread_start + 13
  thread #40
    frame #0: 0x0000000100001e8e a.out`int std::__1::__cxx_atomic_load<int>(__a=0x0000000100005168, __order=memory_order_seq_cst) at atomic:970:12
    frame #1: 0x00000001000012be a.out`std::__1::__atomic_base<int, false>::load(this=0x0000000100005168, __m=memory_order_seq_cst) const at atomic:1487:17
    frame #2: 0x0000000100001369 a.out`watchpoint_func(input=0x0000000000000000) at main.cpp:73:5
    frame #3: 0x00007fff6e48233d libsystem_pthread.dylib`_pthread_body + 126
    frame #4: 0x00007fff6e4852a7 libsystem_pthread.dylib`_pthread_start + 70
    frame #5: 0x00007fff6e481425 libsystem_pthread.dylib`thread_start + 13
  thread #41
    frame #0: 0x0000000100001ec4 a.out`int std::__1::__cxx_atomic_load<int>(__a=0x0000000100005168, __order=memory_order_seq_cst) at atomic:970:5
    frame #1: 0x00000001000012be a.out`std::__1::__atomic_base<int, false>::load(this=0x0000000100005168, __m=memory_order_seq_cst) const at atomic:1487:17
    frame #2: 0x0000000100001369 a.out`watchpoint_func(input=0x0000000000000000) at main.cpp:73:5
    frame #3: 0x00007fff6e48233d libsystem_pthread.dylib`_pthread_body + 126
    frame #4: 0x00007fff6e4852a7 libsystem_pthread.dylib`_pthread_start + 70
    frame #5: 0x00007fff6e481425 libsystem_pthread.dylib`thread_start + 13
  thread #42
    frame #0: 0x0000000100001ec4 a.out`int std::__1::__cxx_atomic_load<int>(__a=0x0000000100005168, __order=memory_order_seq_cst) at atomic:970:5
    frame #1: 0x00000001000012be a.out`std::__1::__atomic_base<int, false>::load(this=0x0000000100005168, __m=memory_order_seq_cst) const at atomic:1487:17
    frame #2: 0x0000000100001369 a.out`watchpoint_func(input=0x0000000000000000) at main.cpp:73:5
    frame #3: 0x00007fff6e48233d libsystem_pthread.dylib`_pthread_body + 126
    frame #4: 0x00007fff6e4852a7 libsystem_pthread.dylib`_pthread_start + 70
    frame #5: 0x00007fff6e481425 libsystem_pthread.dylib`thread_start + 13
  thread #43
    frame #0: 0x00000001000012a8 a.out`std::__1::__atomic_base<int, false>::load(this=0x0000000100005168, __m=memory_order_seq_cst) const at atomic:1487
    frame #1: 0x0000000100001369 a.out`watchpoint_func(input=0x0000000000000000) at main.cpp:73:5
    frame #2: 0x00007fff6e48233d libsystem_pthread.dylib`_pthread_body + 126
    frame #3: 0x00007fff6e4852a7 libsystem_pthread.dylib`_pthread_start + 70
    frame #4: 0x00007fff6e481425 libsystem_pthread.dylib`thread_start + 13
  thread #44
    frame #0: 0x0000000100001e6f a.out`int std::__1::__cxx_atomic_load<int>(__a=0x0000000100005168, __order=memory_order_seq_cst) at atomic:970:112
    frame #1: 0x00000001000012be a.out`std::__1::__atomic_base<int, false>::load(this=0x0000000100005168, __m=memory_order_seq_cst) const at atomic:1487:17
    frame #2: 0x0000000100001369 a.out`watchpoint_func(input=0x0000000000000000) at main.cpp:73:5
    frame #3: 0x00007fff6e48233d libsystem_pthread.dylib`_pthread_body + 126
    frame #4: 0x00007fff6e4852a7 libsystem_pthread.dylib`_pthread_start + 70
    frame #5: 0x00007fff6e481425 libsystem_pthread.dylib`thread_start + 13
  thread #45
    frame #0: 0x0000000100001e6b a.out`int std::__1::__cxx_atomic_load<int>(__a=0x0000000100005168, __order=memory_order_seq_cst) at atomic:970:54
    frame #1: 0x00000001000012be a.out`std::__1::__atomic_base<int, false>::load(this=0x0000000100005168, __m=memory_order_seq_cst) const at atomic:1487:17
    frame #2: 0x0000000100001369 a.out`watchpoint_func(input=0x0000000000000000) at main.cpp:73:5
    frame #3: 0x00007fff6e48233d libsystem_pthread.dylib`_pthread_body + 126
    frame #4: 0x00007fff6e4852a7 libsystem_pthread.dylib`_pthread_start + 70
    frame #5: 0x00007fff6e481425 libsystem_pthread.dylib`thread_start + 13
  thread #46
    frame #0: 0x00000001000012b3 a.out`std::__1::__atomic_base<int, false>::load(this=0x0000000100005168, __m=memory_order_seq_cst) const at atomic:1487:42
    frame #1: 0x0000000100001369 a.out`watchpoint_func(input=0x0000000000000000) at main.cpp:73:5
    frame #2: 0x00007fff6e48233d libsystem_pthread.dylib`_pthread_body + 126
    frame #3: 0x00007fff6e4852a7 libsystem_pthread.dylib`_pthread_start + 70
    frame #4: 0x00007fff6e481425 libsystem_pthread.dylib`thread_start + 13
  thread #47
    frame #0: 0x0000000100001358 a.out`watchpoint_func(input=0x0000000000000000) at main.cpp:73:5
    frame #1: 0x00007fff6e48233d libsystem_pthread.dylib`_pthread_body + 126
    frame #2: 0x00007fff6e4852a7 libsystem_pthread.dylib`_pthread_start + 70
    frame #3: 0x00007fff6e481425 libsystem_pthread.dylib`thread_start + 13
  thread #48
    frame #0: 0x00000001000012a0 a.out`std::__1::__atomic_base<int, false>::load(this=0x0000000000000000, __m=memory_order_relaxed) const at atomic:1487
    frame #1: 0x0000000100001369 a.out`watchpoint_func(input=0x0000000000000000) at main.cpp:73:5
    frame #2: 0x00007fff6e48233d libsystem_pthread.dylib`_pthread_body + 126
    frame #3: 0x00007fff6e4852a7 libsystem_pthread.dylib`_pthread_start + 70
    frame #4: 0x00007fff6e481425 libsystem_pthread.dylib`thread_start + 13
  thread #49
    frame #0: 0x0000000100001e6f a.out`int std::__1::__cxx_atomic_load<int>(__a=0x0000000100005168, __order=memory_order_seq_cst) at atomic:970:112
    frame #1: 0x00000001000012be a.out`std::__1::__atomic_base<int, false>::load(this=0x0000000100005168, __m=memory_order_seq_cst) const at atomic:1487:17
    frame #2: 0x0000000100001369 a.out`watchpoint_func(input=0x0000000000000000) at main.cpp:73:5
    frame #3: 0x00007fff6e48233d libsystem_pthread.dylib`_pthread_body + 126
    frame #4: 0x00007fff6e4852a7 libsystem_pthread.dylib`_pthread_start + 70
    frame #5: 0x00007fff6e481425 libsystem_pthread.dylib`thread_start + 13
  thread #50
    frame #0: 0x00000001000012b3 a.out`std::__1::__atomic_base<int, false>::load(this=0x0000000100005168, __m=memory_order_seq_cst) const at atomic:1487:42
    frame #1: 0x0000000100001369 a.out`watchpoint_func(input=0x0000000000000000) at main.cpp:73:5
    frame #2: 0x00007fff6e48233d libsystem_pthread.dylib`_pthread_body + 126
    frame #3: 0x00007fff6e4852a7 libsystem_pthread.dylib`_pthread_start + 70
    frame #4: 0x00007fff6e481425 libsystem_pthread.dylib`thread_start + 13
  thread #51
    frame #0: 0x0000000100001e8e a.out`int std::__1::__cxx_atomic_load<int>(__a=0x0000000100005168, __order=memory_order_seq_cst) at atomic:970:12
    frame #1: 0x00000001000012be a.out`std::__1::__atomic_base<int, false>::load(this=0x0000000100005168, __m=memory_order_seq_cst) const at atomic:1487:17
    frame #2: 0x0000000100001369 a.out`watchpoint_func(input=0x0000000000000000) at main.cpp:73:5
    frame #3: 0x00007fff6e48233d libsystem_pthread.dylib`_pthread_body + 126
    frame #4: 0x00007fff6e4852a7 libsystem_pthread.dylib`_pthread_start + 70
    frame #5: 0x00007fff6e481425 libsystem_pthread.dylib`thread_start + 13
  thread #52
    frame #0: 0x0000000100001391 a.out`watchpoint_func(input=0x0000000000000000) at main.cpp:77:5
    frame #1: 0x00007fff6e48233d libsystem_pthread.dylib`_pthread_body + 126
    frame #2: 0x00007fff6e4852a7 libsystem_pthread.dylib`_pthread_start + 70
    frame #3: 0x00007fff6e481425 libsystem_pthread.dylib`thread_start + 13
  thread #53
    frame #0: 0x00000001000012a8 a.out`std::__1::__atomic_base<int, false>::load(this=0x0000000100005168, __m=memory_order_seq_cst) const at atomic:1487
    frame #1: 0x0000000100001369 a.out`watchpoint_func(input=0x0000000000000000) at main.cpp:73:5
    frame #2: 0x00007fff6e48233d libsystem_pthread.dylib`_pthread_body + 126
    frame #3: 0x00007fff6e4852a7 libsystem_pthread.dylib`_pthread_start + 70
    frame #4: 0x00007fff6e481425 libsystem_pthread.dylib`thread_start + 13
  thread #54
    frame #0: 0x0000000100001e6b a.out`int std::__1::__cxx_atomic_load<int>(__a=0x0000000100005168, __order=memory_order_seq_cst) at atomic:970:54
    frame #1: 0x00000001000012be a.out`std::__1::__atomic_base<int, false>::load(this=0x0000000100005168, __m=memory_order_seq_cst) const at atomic:1487:17
    frame #2: 0x0000000100001369 a.out`watchpoint_func(input=0x0000000000000000) at main.cpp:73:5
    frame #3: 0x00007fff6e48233d libsystem_pthread.dylib`_pthread_body + 126
    frame #4: 0x00007fff6e4852a7 libsystem_pthread.dylib`_pthread_start + 70
    frame #5: 0x00007fff6e481425 libsystem_pthread.dylib`thread_start + 13
  thread #55
    frame #0: 0x00000001000012c2 a.out`std::__1::__atomic_base<int, false>::load(this=0x0000000100005168, __m=memory_order_seq_cst) const at atomic:1487:10
    frame #1: 0x0000000100001369 a.out`watchpoint_func(input=0x0000000000000000) at main.cpp:73:5
    frame #2: 0x00007fff6e48233d libsystem_pthread.dylib`_pthread_body + 126
    frame #3: 0x00007fff6e4852a7 libsystem_pthread.dylib`_pthread_start + 70
    frame #4: 0x00007fff6e481425 libsystem_pthread.dylib`thread_start + 13
  thread #56
    frame #0: 0x0000000100001ec4 a.out`int std::__1::__cxx_atomic_load<int>(__a=0x0000000100005168, __order=memory_order_seq_cst) at atomic:970:5
    frame #1: 0x00000001000012be a.out`std::__1::__atomic_base<int, false>::load(this=0x0000000100005168, __m=memory_order_seq_cst) const at atomic:1487:17
    frame #2: 0x0000000100001369 a.out`watchpoint_func(input=0x0000000000000000) at main.cpp:73:5
    frame #3: 0x00007fff6e48233d libsystem_pthread.dylib`_pthread_body + 126
    frame #4: 0x00007fff6e4852a7 libsystem_pthread.dylib`_pthread_start + 70
    frame #5: 0x00007fff6e481425 libsystem_pthread.dylib`thread_start + 13
  thread #57
    frame #0: 0x00000001000012a0 a.out`std::__1::__atomic_base<int, false>::load(this=0x0000000000000000, __m=memory_order_relaxed) const at atomic:1487
    frame #1: 0x0000000100001369 a.out`watchpoint_func(input=0x0000000000000000) at main.cpp:73:5
    frame #2: 0x00007fff6e48233d libsystem_pthread.dylib`_pthread_body + 126
    frame #3: 0x00007fff6e4852a7 libsystem_pthread.dylib`_pthread_start + 70
    frame #4: 0x00007fff6e481425 libsystem_pthread.dylib`thread_start + 13
  thread #58
    frame #0: 0x00000001000012b6 a.out`std::__1::__atomic_base<int, false>::load(this=0x0000000100005168, __m=memory_order_seq_cst) const at atomic:1487:17
    frame #1: 0x0000000100001369 a.out`watchpoint_func(input=0x0000000000000000) at main.cpp:73:5
    frame #2: 0x00007fff6e48233d libsystem_pthread.dylib`_pthread_body + 126
    frame #3: 0x00007fff6e4852a7 libsystem_pthread.dylib`_pthread_start + 70
    frame #4: 0x00007fff6e481425 libsystem_pthread.dylib`thread_start + 13
  thread #59
    frame #0: 0x0000000100001ebe a.out`int std::__1::__cxx_atomic_load<int>(__a=0x0000000100005168, __order=memory_order_seq_cst) at atomic:970:12
    frame #1: 0x00000001000012be a.out`std::__1::__atomic_base<int, false>::load(this=0x0000000100005168, __m=memory_order_seq_cst) const at atomic:1487:17
    frame #2: 0x0000000100001369 a.out`watchpoint_func(input=0x0000000000000000) at main.cpp:73:5
    frame #3: 0x00007fff6e48233d libsystem_pthread.dylib`_pthread_body + 126
    frame #4: 0x00007fff6e4852a7 libsystem_pthread.dylib`_pthread_start + 70
    frame #5: 0x00007fff6e481425 libsystem_pthread.dylib`thread_start + 13
  thread #60
    frame #0: 0x0000000100001ec1 a.out`int std::__1::__cxx_atomic_load<int>(__a=0x0000000100005168, __order=memory_order_seq_cst) at atomic:970:12
    frame #1: 0x00000001000012be a.out`std::__1::__atomic_base<int, false>::load(this=0x0000000100005168, __m=memory_order_seq_cst) const at atomic:1487:17
    frame #2: 0x0000000100001369 a.out`watchpoint_func(input=0x0000000000000000) at main.cpp:73:5
    frame #3: 0x00007fff6e48233d libsystem_pthread.dylib`_pthread_body + 126
    frame #4: 0x00007fff6e4852a7 libsystem_pthread.dylib`_pthread_start + 70
    frame #5: 0x00007fff6e481425 libsystem_pthread.dylib`thread_start + 13
  thread #61, stop reason = watchpoint 1
    frame #0: 0x0000000100001391 a.out`watchpoint_func(input=0x0000000000000000) at main.cpp:77:5
    frame #1: 0x00007fff6e48233d libsystem_pthread.dylib`_pthread_body + 126
    frame #2: 0x00007fff6e4852a7 libsystem_pthread.dylib`_pthread_start + 70
    frame #3: 0x00007fff6e481425 libsystem_pthread.dylib`thread_start + 13
  thread #62
    frame #0: 0x0000000100001e6b a.out`int std::__1::__cxx_atomic_load<int>(__a=0x0000000100005168, __order=memory_order_seq_cst) at atomic:970:54
    frame #1: 0x00000001000012be a.out`std::__1::__atomic_base<int, false>::load(this=0x0000000100005168, __m=memory_order_seq_cst) const at atomic:1487:17
    frame #2: 0x0000000100001369 a.out`watchpoint_func(input=0x0000000000000000) at main.cpp:73:5
    frame #3: 0x00007fff6e48233d libsystem_pthread.dylib`_pthread_body + 126
    frame #4: 0x00007fff6e4852a7 libsystem_pthread.dylib`_pthread_start + 70
    frame #5: 0x00007fff6e481425 libsystem_pthread.dylib`thread_start + 13
  thread #63
    frame #0: 0x00000001000012a8 a.out`std::__1::__atomic_base<int, false>::load(this=0x0000000100005168, __m=memory_order_seq_cst) const at atomic:1487
    frame #1: 0x0000000100001369 a.out`watchpoint_func(input=0x0000000000000000) at main.cpp:73:5
    frame #2: 0x00007fff6e48233d libsystem_pthread.dylib`_pthread_body + 126
    frame #3: 0x00007fff6e4852a7 libsystem_pthread.dylib`_pthread_start + 70
    frame #4: 0x00007fff6e481425 libsystem_pthread.dylib`thread_start + 13
  thread #64
    frame #0: 0x0000000100001358 a.out`watchpoint_func(input=0x0000000000000000) at main.cpp:73:5
    frame #1: 0x00007fff6e48233d libsystem_pthread.dylib`_pthread_body + 126
    frame #2: 0x00007fff6e4852a7 libsystem_pthread.dylib`_pthread_start + 70
    frame #3: 0x00007fff6e481425 libsystem_pthread.dylib`thread_start + 13
  thread #65
    frame #0: 0x00000001000012a8 a.out`std::__1::__atomic_base<int, false>::load(this=0x0000000100005168, __m=memory_order_seq_cst) const at atomic:1487
    frame #1: 0x0000000100001369 a.out`watchpoint_func(input=0x0000000000000000) at main.cpp:73:5
    frame #2: 0x00007fff6e48233d libsystem_pthread.dylib`_pthread_body + 126
    frame #3: 0x00007fff6e4852a7 libsystem_pthread.dylib`_pthread_start + 70
    frame #4: 0x00007fff6e481425 libsystem_pthread.dylib`thread_start + 13
  thread #66
    frame #0: 0x00000001000012a4 a.out`std::__1::__atomic_base<int, false>::load(this=0x0000000100005168, __m=memory_order_seq_cst) const at atomic:1487
    frame #1: 0x0000000100001369 a.out`watchpoint_func(input=0x0000000000000000) at main.cpp:73:5
    frame #2: 0x00007fff6e48233d libsystem_pthread.dylib`_pthread_body + 126
    frame #3: 0x00007fff6e4852a7 libsystem_pthread.dylib`_pthread_start + 70
    frame #4: 0x00007fff6e481425 libsystem_pthread.dylib`thread_start + 13
  thread #67
    frame #0: 0x0000000100001eb8 a.out`int std::__1::__cxx_atomic_load<int>(__a=0x0000000100005168, __order=memory_order_seq_cst) at atomic:0:12
    frame #1: 0x00000001000012be a.out`std::__1::__atomic_base<int, false>::load(this=0x0000000100005168, __m=memory_order_seq_cst) const at atomic:1487:17
    frame #2: 0x0000000100001369 a.out`watchpoint_func(input=0x0000000000000000) at main.cpp:73:5
    frame #3: 0x00007fff6e48233d libsystem_pthread.dylib`_pthread_body + 126
    frame #4: 0x00007fff6e4852a7 libsystem_pthread.dylib`_pthread_start + 70
    frame #5: 0x00007fff6e481425 libsystem_pthread.dylib`thread_start + 13
  thread #68, stop reason = watchpoint 1
    frame #0: 0x0000000100001391 a.out`watchpoint_func(input=0x0000000000000000) at main.cpp:77:5
    frame #1: 0x00007fff6e48233d libsystem_pthread.dylib`_pthread_body + 126
    frame #2: 0x00007fff6e4852a7 libsystem_pthread.dylib`_pthread_start + 70
    frame #3: 0x00007fff6e481425 libsystem_pthread.dylib`thread_start + 13
  thread #69
    frame #0: 0x0000000100001358 a.out`watchpoint_func(input=0x0000000000000000) at main.cpp:73:5
    frame #1: 0x00007fff6e48233d libsystem_pthread.dylib`_pthread_body + 126
    frame #2: 0x00007fff6e4852a7 libsystem_pthread.dylib`_pthread_start + 70
    frame #3: 0x00007fff6e481425 libsystem_pthread.dylib`thread_start + 13
  thread #70, stop reason = watchpoint 1
    frame #0: 0x0000000100001391 a.out`watchpoint_func(input=0x0000000000000000) at main.cpp:77:5
    frame #1: 0x00007fff6e48233d libsystem_pthread.dylib`_pthread_body + 126
    frame #2: 0x00007fff6e4852a7 libsystem_pthread.dylib`_pthread_start + 70
    frame #3: 0x00007fff6e481425 libsystem_pthread.dylib`thread_start + 13
  thread #71, stop reason = watchpoint 1
    frame #0: 0x0000000100001391 a.out`watchpoint_func(input=0x0000000000000000) at main.cpp:77:5
    frame #1: 0x00007fff6e48233d libsystem_pthread.dylib`_pthread_body + 126
    frame #2: 0x00007fff6e4852a7 libsystem_pthread.dylib`_pthread_start + 70
    frame #3: 0x00007fff6e481425 libsystem_pthread.dylib`thread_start + 13
  thread #72
    frame #0: 0x0000000100001e86 a.out`int std::__1::__cxx_atomic_load<int>(__a=0x0000000100005168, __order=memory_order_seq_cst) at atomic:970:12
    frame #1: 0x00000001000012be a.out`std::__1::__atomic_base<int, false>::load(this=0x0000000100005168, __m=memory_order_seq_cst) const at atomic:1487:17
    frame #2: 0x0000000100001369 a.out`watchpoint_func(input=0x0000000000000000) at main.cpp:73:5
    frame #3: 0x00007fff6e48233d libsystem_pthread.dylib`_pthread_body + 126
    frame #4: 0x00007fff6e4852a7 libsystem_pthread.dylib`_pthread_start + 70
    frame #5: 0x00007fff6e481425 libsystem_pthread.dylib`thread_start + 13
  thread #73
    frame #0: 0x00000001000012b6 a.out`std::__1::__atomic_base<int, false>::load(this=0x0000000100005168, __m=memory_order_seq_cst) const at atomic:1487:17
    frame #1: 0x0000000100001369 a.out`watchpoint_func(input=0x0000000000000000) at main.cpp:73:5
    frame #2: 0x00007fff6e48233d libsystem_pthread.dylib`_pthread_body + 126
    frame #3: 0x00007fff6e4852a7 libsystem_pthread.dylib`_pthread_start + 70
    frame #4: 0x00007fff6e481425 libsystem_pthread.dylib`thread_start + 13
  thread #74
    frame #0: 0x0000000100001e6f a.out`int std::__1::__cxx_atomic_load<int>(__a=0x0000000100005168, __order=memory_order_seq_cst) at atomic:970:112
    frame #1: 0x00000001000012be a.out`std::__1::__atomic_base<int, false>::load(this=0x0000000100005168, __m=memory_order_seq_cst) const at atomic:1487:17
    frame #2: 0x0000000100001369 a.out`watchpoint_func(input=0x0000000000000000) at main.cpp:73:5
    frame #3: 0x00007fff6e48233d libsystem_pthread.dylib`_pthread_body + 126
    frame #4: 0x00007fff6e4852a7 libsystem_pthread.dylib`_pthread_start + 70
    frame #5: 0x00007fff6e481425 libsystem_pthread.dylib`thread_start + 13
  thread #75
    frame #0: 0x00000001000012a8 a.out`std::__1::__atomic_base<int, false>::load(this=0x0000000100005168, __m=memory_order_seq_cst) const at atomic:1487
    frame #1: 0x0000000100001369 a.out`watchpoint_func(input=0x0000000000000000) at main.cpp:73:5
    frame #2: 0x00007fff6e48233d libsystem_pthread.dylib`_pthread_body + 126
    frame #3: 0x00007fff6e4852a7 libsystem_pthread.dylib`_pthread_start + 70
    frame #4: 0x00007fff6e481425 libsystem_pthread.dylib`thread_start + 13
  thread #76
    frame #0: 0x0000000100001ec4 a.out`int std::__1::__cxx_atomic_load<int>(__a=0x0000000100005168, __order=memory_order_seq_cst) at atomic:970:5
    frame #1: 0x00000001000012be a.out`std::__1::__atomic_base<int, false>::load(this=0x0000000100005168, __m=memory_order_seq_cst) const at atomic:1487:17
    frame #2: 0x0000000100001369 a.out`watchpoint_func(input=0x0000000000000000) at main.cpp:73:5
    frame #3: 0x00007fff6e48233d libsystem_pthread.dylib`_pthread_body + 126
    frame #4: 0x00007fff6e4852a7 libsystem_pthread.dylib`_pthread_start + 70
    frame #5: 0x00007fff6e481425 libsystem_pthread.dylib`thread_start + 13
  thread #77
    frame #0: 0x00000001000012b6 a.out`std::__1::__atomic_base<int, false>::load(this=0x0000000100005168, __m=memory_order_seq_cst) const at atomic:1487:17
    frame #1: 0x0000000100001369 a.out`watchpoint_func(input=0x0000000000000000) at main.cpp:73:5
    frame #2: 0x00007fff6e48233d libsystem_pthread.dylib`_pthread_body + 126
    frame #3: 0x00007fff6e4852a7 libsystem_pthread.dylib`_pthread_start + 70
    frame #4: 0x00007fff6e481425 libsystem_pthread.dylib`thread_start + 13
  thread #78
    frame #0: 0x00000001000012a8 a.out`std::__1::__atomic_base<int, false>::load(this=0x0000000100005168, __m=memory_order_seq_cst) const at atomic:1487
    frame #1: 0x0000000100001369 a.out`watchpoint_func(input=0x0000000000000000) at main.cpp:73:5
    frame #2: 0x00007fff6e48233d libsystem_pthread.dylib`_pthread_body + 126
    frame #3: 0x00007fff6e4852a7 libsystem_pthread.dylib`_pthread_start + 70
    frame #4: 0x00007fff6e481425 libsystem_pthread.dylib`thread_start + 13
  thread #79
    frame #0: 0x0000000100001369 a.out`watchpoint_func(input=0x0000000000000000) at main.cpp:73:5
    frame #1: 0x00007fff6e48233d libsystem_pthread.dylib`_pthread_body + 126
    frame #2: 0x00007fff6e4852a7 libsystem_pthread.dylib`_pthread_start + 70
    frame #3: 0x00007fff6e481425 libsystem_pthread.dylib`thread_start + 13
  thread #80
    frame #0: 0x0000000100001e8e a.out`int std::__1::__cxx_atomic_load<int>(__a=0x0000000100005168, __order=memory_order_seq_cst) at atomic:970:12
    frame #1: 0x00000001000012be a.out`std::__1::__atomic_base<int, false>::load(this=0x0000000100005168, __m=memory_order_seq_cst) const at atomic:1487:17
    frame #2: 0x0000000100001369 a.out`watchpoint_func(input=0x0000000000000000) at main.cpp:73:5
    frame #3: 0x00007fff6e48233d libsystem_pthread.dylib`_pthread_body + 126
    frame #4: 0x00007fff6e4852a7 libsystem_pthread.dylib`_pthread_start + 70
    frame #5: 0x00007fff6e481425 libsystem_pthread.dylib`thread_start + 13
  thread #81
    frame #0: 0x0000000100001e72 a.out`int std::__1::__cxx_atomic_load<int>(__a=0x0000000100005168, __order=memory_order_seq_cst) at atomic:970:12
    frame #1: 0x00000001000012be a.out`std::__1::__atomic_base<int, false>::load(this=0x0000000100005168, __m=memory_order_seq_cst) const at atomic:1487:17
    frame #2: 0x0000000100001369 a.out`watchpoint_func(input=0x0000000000000000) at main.cpp:73:5
    frame #3: 0x00007fff6e48233d libsystem_pthread.dylib`_pthread_body + 126
    frame #4: 0x00007fff6e4852a7 libsystem_pthread.dylib`_pthread_start + 70
    frame #5: 0x00007fff6e481425 libsystem_pthread.dylib`thread_start + 13
  thread #82
    frame #0: 0x0000000100001e79 a.out`int std::__1::__cxx_atomic_load<int>(__a=0x0000000100005168, __order=memory_order_seq_cst) at atomic:970:12
    frame #1: 0x00000001000012be a.out`std::__1::__atomic_base<int, false>::load(this=0x0000000100005168, __m=memory_order_seq_cst) const at atomic:1487:17
    frame #2: 0x0000000100001369 a.out`watchpoint_func(input=0x0000000000000000) at main.cpp:73:5
    frame #3: 0x00007fff6e48233d libsystem_pthread.dylib`_pthread_body + 126
    frame #4: 0x00007fff6e4852a7 libsystem_pthread.dylib`_pthread_start + 70
    frame #5: 0x00007fff6e481425 libsystem_pthread.dylib`thread_start + 13
  thread #83, stop reason = watchpoint 1
    frame #0: 0x0000000100001391 a.out`watchpoint_func(input=0x0000000000000000) at main.cpp:77:5
    frame #1: 0x00007fff6e48233d libsystem_pthread.dylib`_pthread_body + 126
    frame #2: 0x00007fff6e4852a7 libsystem_pthread.dylib`_pthread_start + 70
    frame #3: 0x00007fff6e481425 libsystem_pthread.dylib`thread_start + 13
  thread #84, stop reason = watchpoint 1
    frame #0: 0x0000000100001391 a.out`watchpoint_func(input=0x0000000000000000) at main.cpp:77:5
    frame #1: 0x00007fff6e48233d libsystem_pthread.dylib`_pthread_body + 126
    frame #2: 0x00007fff6e4852a7 libsystem_pthread.dylib`_pthread_start + 70
    frame #3: 0x00007fff6e481425 libsystem_pthread.dylib`thread_start + 13
  thread #85, stop reason = watchpoint 1
    frame #0: 0x0000000100001391 a.out`watchpoint_func(input=0x0000000000000000) at main.cpp:77:5
    frame #1: 0x00007fff6e48233d libsystem_pthread.dylib`_pthread_body + 126
    frame #2: 0x00007fff6e4852a7 libsystem_pthread.dylib`_pthread_start + 70
    frame #3: 0x00007fff6e481425 libsystem_pthread.dylib`thread_start + 13
  thread #86, stop reason = watchpoint 1
    frame #0: 0x0000000100001391 a.out`watchpoint_func(input=0x0000000000000000) at main.cpp:77:5
    frame #1: 0x00007fff6e48233d libsystem_pthread.dylib`_pthread_body + 126
    frame #2: 0x00007fff6e4852a7 libsystem_pthread.dylib`_pthread_start + 70
    frame #3: 0x00007fff6e481425 libsystem_pthread.dylib`thread_start + 13
  thread #87, stop reason = watchpoint 1
    frame #0: 0x0000000100001391 a.out`watchpoint_func(input=0x0000000000000000) at main.cpp:77:5
    frame #1: 0x00007fff6e48233d libsystem_pthread.dylib`_pthread_body + 126
    frame #2: 0x00007fff6e4852a7 libsystem_pthread.dylib`_pthread_start + 70
    frame #3: 0x00007fff6e481425 libsystem_pthread.dylib`thread_start + 13
  thread #88, stop reason = watchpoint 1
    frame #0: 0x0000000100001391 a.out`watchpoint_func(input=0x0000000000000000) at main.cpp:77:5
    frame #1: 0x00007fff6e48233d libsystem_pthread.dylib`_pthread_body + 126
    frame #2: 0x00007fff6e4852a7 libsystem_pthread.dylib`_pthread_start + 70
    frame #3: 0x00007fff6e481425 libsystem_pthread.dylib`thread_start + 13
  thread #89, stop reason = watchpoint 1
    frame #0: 0x0000000100001391 a.out`watchpoint_func(input=0x0000000000000000) at main.cpp:77:5
    frame #1: 0x00007fff6e48233d libsystem_pthread.dylib`_pthread_body + 126
    frame #2: 0x00007fff6e4852a7 libsystem_pthread.dylib`_pthread_start + 70
    frame #3: 0x00007fff6e481425 libsystem_pthread.dylib`thread_start + 13
  thread #90, stop reason = watchpoint 1
    frame #0: 0x0000000100001391 a.out`watchpoint_func(input=0x0000000000000000) at main.cpp:77:5
    frame #1: 0x00007fff6e48233d libsystem_pthread.dylib`_pthread_body + 126
    frame #2: 0x00007fff6e4852a7 libsystem_pthread.dylib`_pthread_start + 70
    frame #3: 0x00007fff6e481425 libsystem_pthread.dylib`thread_start + 13
  thread #91, stop reason = watchpoint 1
    frame #0: 0x0000000100001391 a.out`watchpoint_func(input=0x0000000000000000) at main.cpp:77:5
    frame #1: 0x00007fff6e48233d libsystem_pthread.dylib`_pthread_body + 126
    frame #2: 0x00007fff6e4852a7 libsystem_pthread.dylib`_pthread_start + 70
    frame #3: 0x00007fff6e481425 libsystem_pthread.dylib`thread_start + 13
  thread #92, stop reason = watchpoint 1
    frame #0: 0x0000000100001391 a.out`watchpoint_func(input=0x0000000000000000) at main.cpp:77:5
    frame #1: 0x00007fff6e48233d libsystem_pthread.dylib`_pthread_body + 126
    frame #2: 0x00007fff6e4852a7 libsystem_pthread.dylib`_pthread_start + 70
    frame #3: 0x00007fff6e481425 libsystem_pthread.dylib`thread_start + 13
  thread #93
    frame #0: 0x00000001000012a8 a.out`std::__1::__atomic_base<int, false>::load(this=0x0000000100005168, __m=memory_order_seq_cst) const at atomic:1487
    frame #1: 0x0000000100001369 a.out`watchpoint_func(input=0x0000000000000000) at main.cpp:73:5
    frame #2: 0x00007fff6e48233d libsystem_pthread.dylib`_pthread_body + 126
    frame #3: 0x00007fff6e4852a7 libsystem_pthread.dylib`_pthread_start + 70
    frame #4: 0x00007fff6e481425 libsystem_pthread.dylib`thread_start + 13
  thread #94
    frame #0: 0x0000000100001ebe a.out`int std::__1::__cxx_atomic_load<int>(__a=0x0000000100005168, __order=memory_order_seq_cst) at atomic:970:12
    frame #1: 0x00000001000012be a.out`std::__1::__atomic_base<int, false>::load(this=0x0000000100005168, __m=memory_order_seq_cst) const at atomic:1487:17
    frame #2: 0x0000000100001369 a.out`watchpoint_func(input=0x0000000000000000) at main.cpp:73:5
    frame #3: 0x00007fff6e48233d libsystem_pthread.dylib`_pthread_body + 126
    frame #4: 0x00007fff6e4852a7 libsystem_pthread.dylib`_pthread_start + 70
    frame #5: 0x00007fff6e481425 libsystem_pthread.dylib`thread_start + 13
  thread #95
    frame #0: 0x0000000100001e6b a.out`int std::__1::__cxx_atomic_load<int>(__a=0x0000000100005168, __order=memory_order_seq_cst) at atomic:970:54
    frame #1: 0x00000001000012be a.out`std::__1::__atomic_base<int, false>::load(this=0x0000000100005168, __m=memory_order_seq_cst) const at atomic:1487:17
    frame #2: 0x0000000100001369 a.out`watchpoint_func(input=0x0000000000000000) at main.cpp:73:5
    frame #3: 0x00007fff6e48233d libsystem_pthread.dylib`_pthread_body + 126
    frame #4: 0x00007fff6e4852a7 libsystem_pthread.dylib`_pthread_start + 70
    frame #5: 0x00007fff6e481425 libsystem_pthread.dylib`thread_start + 13
  thread #96
    frame #0: 0x0000000100001ebe a.out`int std::__1::__cxx_atomic_load<int>(__a=0x0000000100005168, __order=memory_order_seq_cst) at atomic:970:12
    frame #1: 0x00000001000012be a.out`std::__1::__atomic_base<int, false>::load(this=0x0000000100005168, __m=memory_order_seq_cst) const at atomic:1487:17
    frame #2: 0x0000000100001369 a.out`watchpoint_func(input=0x0000000000000000) at main.cpp:73:5
    frame #3: 0x00007fff6e48233d libsystem_pthread.dylib`_pthread_body + 126
    frame #4: 0x00007fff6e4852a7 libsystem_pthread.dylib`_pthread_start + 70
    frame #5: 0x00007fff6e481425 libsystem_pthread.dylib`thread_start + 13
  thread #97
    frame #0: 0x0000000100001eb8 a.out`int std::__1::__cxx_atomic_load<int>(__a=0x0000000100005168, __order=memory_order_seq_cst) at atomic:0:12
    frame #1: 0x00000001000012be a.out`std::__1::__atomic_base<int, false>::load(this=0x0000000100005168, __m=memory_order_seq_cst) const at atomic:1487:17
    frame #2: 0x0000000100001369 a.out`watchpoint_func(input=0x0000000000000000) at main.cpp:73:5
    frame #3: 0x00007fff6e48233d libsystem_pthread.dylib`_pthread_body + 126
    frame #4: 0x00007fff6e4852a7 libsystem_pthread.dylib`_pthread_start + 70
    frame #5: 0x00007fff6e481425 libsystem_pthread.dylib`thread_start + 13
  thread #98
    frame #0: 0x0000000100001e6b a.out`int std::__1::__cxx_atomic_load<int>(__a=0x0000000100005168, __order=memory_order_seq_cst) at atomic:970:54
    frame #1: 0x00000001000012be a.out`std::__1::__atomic_base<int, false>::load(this=0x0000000100005168, __m=memory_order_seq_cst) const at atomic:1487:17
    frame #2: 0x0000000100001369 a.out`watchpoint_func(input=0x0000000000000000) at main.cpp:73:5
    frame #3: 0x00007fff6e48233d libsystem_pthread.dylib`_pthread_body + 126
    frame #4: 0x00007fff6e4852a7 libsystem_pthread.dylib`_pthread_start + 70
    frame #5: 0x00007fff6e481425 libsystem_pthread.dylib`thread_start + 13
  thread #99
    frame #0: 0x0000000100001e86 a.out`int std::__1::__cxx_atomic_load<int>(__a=0x0000000100005168, __order=memory_order_seq_cst) at atomic:970:12
    frame #1: 0x00000001000012be a.out`std::__1::__atomic_base<int, false>::load(this=0x0000000100005168, __m=memory_order_seq_cst) const at atomic:1487:17
    frame #2: 0x0000000100001369 a.out`watchpoint_func(input=0x0000000000000000) at main.cpp:73:5
    frame #3: 0x00007fff6e48233d libsystem_pthread.dylib`_pthread_body + 126
    frame #4: 0x00007fff6e4852a7 libsystem_pthread.dylib`_pthread_start + 70
    frame #5: 0x00007fff6e481425 libsystem_pthread.dylib`thread_start + 13
  thread #100, stop reason = watchpoint 1
    frame #0: 0x0000000100001391 a.out`watchpoint_func(input=0x0000000000000000) at main.cpp:77:5
    frame #1: 0x00007fff6e48233d libsystem_pthread.dylib`_pthread_body + 126
    frame #2: 0x00007fff6e4852a7 libsystem_pthread.dylib`_pthread_start + 70
    frame #3: 0x00007fff6e481425 libsystem_pthread.dylib`thread_start + 13
  thread #101, stop reason = watchpoint 1
    frame #0: 0x0000000100001391 a.out`watchpoint_func(input=0x0000000000000000) at main.cpp:77:5
    frame #1: 0x00007fff6e48233d libsystem_pthread.dylib`_pthread_body + 126
    frame #2: 0x00007fff6e4852a7 libsystem_pthread.dylib`_pthread_start + 70
    frame #3: 0x00007fff6e481425 libsystem_pthread.dylib`thread_start + 13

Hide Details

Hide Details

runCmd: continue output: Process 29204 resuming Process 29204 stopped * thread #2, stop reason = watchpoint 1 frame #0: 0x0000000100001391 a.out`watchpoint_func(input=0x0000000000000000) at main.cpp:77:5 74 do_action_args(input); 75 76 g_watchme = 1; // watchpoint triggers here -> 77 return 0; ^ 78 } 79 80 void * thread #3, stop reason = watchpoint 1 frame #0: 0x0000000100001391 a.out`watchpoint_func(input=0x0000000000000000) at main.cpp:77:5 74 do_action_args(input); 75 76 g_watchme = 1; // watchpoint triggers here -> 77 return 0; ^ 78 } 79 80 void * thread #4, stop reason = watchpoint 1 frame #0: 0x0000000100001391 a.out`watchpoint_func(input=0x0000000000000000) at main.cpp:77:5 74 do_action_args(input); 75 76 g_watchme = 1; // watchpoint triggers here -> 77 return 0; ^ 78 } 79 80 void * thread #5, stop reason = watchpoint 1 frame #0: 0x0000000100001391 a.out`watchpoint_func(input=0x0000000000000000) at main.cpp:77:5 74 do_action_args(input); 75 76 g_watchme = 1; // watchpoint triggers here -> 77 return 0; ^ 78 } 79 80 void * thread #6, stop reason = watchpoint 1 frame #0: 0x0000000100001391 a.out`watchpoint_func(input=0x0000000000000000) at main.cpp:77:5 74 do_action_args(input); 75 76 g_watchme = 1; // watchpoint triggers here -> 77 return 0; ^ 78 } 79 80 void * thread #7, stop reason = watchpoint 1 frame #0: 0x0000000100001391 a.out`watchpoint_func(input=0x0000000000000000) at main.cpp:77:5 74 do_action_args(input); 75 76 g_watchme = 1; // watchpoint triggers here -> 77 return 0; ^ 78 } 79 80 void * thread #8, stop reason = watchpoint 1 frame #0: 0x0000000100001391 a.out`watchpoint_func(input=0x0000000000000000) at main.cpp:77:5 74 do_action_args(input); 75 76 g_watchme = 1; // watchpoint triggers here -> 77 return 0; ^ 78 } 79 80 void * thread #9, stop reason = watchpoint 1 frame #0: 0x0000000100001391 a.out`watchpoint_func(input=0x0000000000000000) at main.cpp:77:5 74 do_action_args(input); 75 76 g_watchme = 1; // watchpoint triggers here -> 77 return 0; ^ 78 } 79 80 void * thread #10, stop reason = watchpoint 1 frame #0: 0x0000000100001391 a.out`watchpoint_func(input=0x0000000000000000) at main.cpp:77:5 74 do_action_args(input); 75 76 g_watchme = 1; // watchpoint triggers here -> 77 return 0; ^ 78 } 79 80 void * thread #12, stop reason = watchpoint 1 frame #0: 0x0000000100001391 a.out`watchpoint_func(input=0x0000000000000000) at main.cpp:77:5 74 do_action_args(input); 75 76 g_watchme = 1; // watchpoint triggers here -> 77 return 0; ^ 78 } 79 80 void * thread #13, stop reason = watchpoint 1 frame #0: 0x0000000100001391 a.out`watchpoint_func(input=0x0000000000000000) at main.cpp:77:5 74 do_action_args(input); 75 76 g_watchme = 1; // watchpoint triggers here -> 77 return 0; ^ 78 } 79 80 void * thread #14, stop reason = watchpoint 1 frame #0: 0x0000000100001391 a.out`watchpoint_func(input=0x0000000000000000) at main.cpp:77:5 74 do_action_args(input); 75 76 g_watchme = 1; // watchpoint triggers here -> 77 return 0; ^ 78 } 79 80 void * thread #16, stop reason = watchpoint 1 frame #0: 0x0000000100001391 a.out`watchpoint_func(input=0x0000000000000000) at main.cpp:77:5 74 do_action_args(input); 75 76 g_watchme = 1; // watchpoint triggers here -> 77 return 0; ^ 78 } 79 80 void * thread #17, stop reason = watchpoint 1 frame #0: 0x0000000100001391 a.out`watchpoint_func(input=0x0000000000000000) at main.cpp:77:5 74 do_action_args(input); 75 76 g_watchme = 1; // watchpoint triggers here -> 77 return 0; ^ 78 } 79 80 void * thread #18, stop reason = watchpoint 1 frame #0: 0x0000000100001391 a.out`watchpoint_func(input=0x0000000000000000) at main.cpp:77:5 74 do_action_args(input); 75 76 g_watchme = 1; // watchpoint triggers here -> 77 return 0; ^ 78 } 79 80 void * thread #19, stop reason = watchpoint 1 frame #0: 0x0000000100001391 a.out`watchpoint_func(input=0x0000000000000000) at main.cpp:77:5 74 do_action_args(input); 75 76 g_watchme = 1; // watchpoint triggers here -> 77 return 0; ^ 78 } 79 80 void * thread #21, stop reason = watchpoint 1 frame #0: 0x0000000100001391 a.out`watchpoint_func(input=0x0000000000000000) at main.cpp:77:5 74 do_action_args(input); 75 76 g_watchme = 1; // watchpoint triggers here -> 77 return 0; ^ 78 } 79 80 void * thread #22, stop reason = watchpoint 1 frame #0: 0x0000000100001391 a.out`watchpoint_func(input=0x0000000000000000) at main.cpp:77:5 74 do_action_args(input); 75 76 g_watchme = 1; // watchpoint triggers here -> 77 return 0; ^ 78 } 79 80 void * thread #23, stop reason = watchpoint 1 frame #0: 0x0000000100001391 a.out`watchpoint_func(input=0x0000000000000000) at main.cpp:77:5 74 do_action_args(input); 75 76 g_watchme = 1; // watchpoint triggers here -> 77 return 0; ^ 78 } 79 80 void * thread #24, stop reason = watchpoint 1 frame #0: 0x0000000100001391 a.out`watchpoint_func(input=0x0000000000000000) at main.cpp:77:5 74 do_action_args(input); 75 76 g_watchme = 1; // watchpoint triggers here -> 77 return 0; ^ 78 } 79 80 void * thread #25, stop reason = watchpoint 1 frame #0: 0x0000000100001391 a.out`watchpoint_func(input=0x0000000000000000) at main.cpp:77:5 74 do_action_args(input); 75 76 g_watchme = 1; // watchpoint triggers here -> 77 return 0; ^ 78 } 79 80 void * thread #26, stop reason = watchpoint 1 frame #0: 0x0000000100001391 a.out`watchpoint_func(input=0x0000000000000000) at main.cpp:77:5 74 do_action_args(input); 75 76 g_watchme = 1; // watchpoint triggers here -> 77 return 0; ^ 78 } 79 80 void * thread #27, stop reason = watchpoint 1 frame #0: 0x0000000100001391 a.out`watchpoint_func(input=0x0000000000000000) at main.cpp:77:5 74 do_action_args(input); 75 76 g_watchme = 1; // watchpoint triggers here -> 77 return 0; ^ 78 } 79 80 void * thread #28, stop reason = watchpoint 1 frame #0: 0x0000000100001391 a.out`watchpoint_func(input=0x0000000000000000) at main.cpp:77:5 74 do_action_args(input); 75 76 g_watchme = 1; // watchpoint triggers here -> 77 return 0; ^ 78 } 79 80 void * thread #30, stop reason = watchpoint 1 frame #0: 0x0000000100001391 a.out`watchpoint_func(input=0x0000000000000000) at main.cpp:77:5 74 do_action_args(input); 75 76 g_watchme = 1; // watchpoint triggers here -> 77 return 0; ^ 78 } 79 80 void * thread #31, stop reason = watchpoint 1 frame #0: 0x0000000100001391 a.out`watchpoint_func(input=0x0000000000000000) at main.cpp:77:5 74 do_action_args(input); 75 76 g_watchme = 1; // watchpoint triggers here -> 77 return 0; ^ 78 } 79 80 void * thread #32, stop reason = watchpoint 1 frame #0: 0x0000000100001391 a.out`watchpoint_func(input=0x0000000000000000) at main.cpp:77:5 74 do_action_args(input); 75 76 g_watchme = 1; // watchpoint triggers here -> 77 return 0; ^ 78 } 79 80 void * thread #33, stop reason = watchpoint 1 frame #0: 0x0000000100001391 a.out`watchpoint_func(input=0x0000000000000000) at main.cpp:77:5 74 do_action_args(input); 75 76 g_watchme = 1; // watchpoint triggers here -> 77 return 0; ^ 78 } 79 80 void * thread #34, stop reason = watchpoint 1 frame #0: 0x0000000100001391 a.out`watchpoint_func(input=0x0000000000000000) at main.cpp:77:5 74 do_action_args(input); 75 76 g_watchme = 1; // watchpoint triggers here -> 77 return 0; ^ 78 } 79 80 void * thread #35, stop reason = watchpoint 1 frame #0: 0x0000000100001391 a.out`watchpoint_func(input=0x0000000000000000) at main.cpp:77:5 74 do_action_args(input); 75 76 g_watchme = 1; // watchpoint triggers here -> 77 return 0; ^ 78 } 79 80 void * thread #36, stop reason = watchpoint 1 frame #0: 0x0000000100001391 a.out`watchpoint_func(input=0x0000000000000000) at main.cpp:77:5 74 do_action_args(input); 75 76 g_watchme = 1; // watchpoint triggers here -> 77 return 0; ^ 78 } 79 80 void * thread #37, stop reason = watchpoint 1 frame #0: 0x0000000100001391 a.out`watchpoint_func(input=0x0000000000000000) at main.cpp:77:5 74 do_action_args(input); 75 76 g_watchme = 1; // watchpoint triggers here -> 77 return 0; ^ 78 } 79 80 void * thread #39, stop reason = watchpoint 1 frame #0: 0x0000000100001391 a.out`watchpoint_func(input=0x0000000000000000) at main.cpp:77:5 74 do_action_args(input); 75 76 g_watchme = 1; // watchpoint triggers here -> 77 return 0; ^ 78 } 79 80 void * thread #40, stop reason = watchpoint 1 frame #0: 0x0000000100001391 a.out`watchpoint_func(input=0x0000000000000000) at main.cpp:77:5 74 do_action_args(input); 75 76 g_watchme = 1; // watchpoint triggers here -> 77 return 0; ^ 78 } 79 80 void * thread #41, stop reason = watchpoint 1 frame #0: 0x0000000100001391 a.out`watchpoint_func(input=0x0000000000000000) at main.cpp:77:5 74 do_action_args(input); 75 76 g_watchme = 1; // watchpoint triggers here -> 77 return 0; ^ 78 } 79 80 void * thread #42, stop reason = watchpoint 1 frame #0: 0x0000000100001391 a.out`watchpoint_func(input=0x0000000000000000) at main.cpp:77:5 74 do_action_args(input); 75 76 g_watchme = 1; // watchpoint triggers here -> 77 return 0; ^ 78 } 79 80 void * thread #43, stop reason = watchpoint 1 frame #0: 0x0000000100001391 a.out`watchpoint_func(input=0x0000000000000000) at main.cpp:77:5 74 do_action_args(input); 75 76 g_watchme = 1; // watchpoint triggers here -> 77 return 0; ^ 78 } 79 80 void * thread #44, stop reason = watchpoint 1 frame #0: 0x0000000100001391 a.out`watchpoint_func(input=0x0000000000000000) at main.cpp:77:5 74 do_action_args(input); 75 76 g_watchme = 1; // watchpoint triggers here -> 77 return 0; ^ 78 } 79 80 void * thread #45, stop reason = watchpoint 1 frame #0: 0x0000000100001391 a.out`watchpoint_func(input=0x0000000000000000) at main.cpp:77:5 74 do_action_args(input); 75 76 g_watchme = 1; // watchpoint triggers here -> 77 return 0; ^ 78 } 79 80 void * thread #46, stop reason = watchpoint 1 frame #0: 0x0000000100001391 a.out`watchpoint_func(input=0x0000000000000000) at main.cpp:77:5 74 do_action_args(input); 75 76 g_watchme = 1; // watchpoint triggers here -> 77 return 0; ^ 78 } 79 80 void * thread #47, stop reason = watchpoint 1 frame #0: 0x0000000100001391 a.out`watchpoint_func(input=0x0000000000000000) at main.cpp:77:5 74 do_action_args(input); 75 76 g_watchme = 1; // watchpoint triggers here -> 77 return 0; ^ 78 } 79 80 void * thread #48, stop reason = watchpoint 1 frame #0: 0x0000000100001391 a.out`watchpoint_func(input=0x0000000000000000) at main.cpp:77:5 74 do_action_args(input); 75 76 g_watchme = 1; // watchpoint triggers here -> 77 return 0; ^ 78 } 79 80 void * thread #49, stop reason = watchpoint 1 frame #0: 0x0000000100001391 a.out`watchpoint_func(input=0x0000000000000000) at main.cpp:77:5 74 do_action_args(input); 75 76 g_watchme = 1; // watchpoint triggers here -> 77 return 0; ^ 78 } 79 80 void * thread #50, stop reason = watchpoint 1 frame #0: 0x0000000100001391 a.out`watchpoint_func(input=0x0000000000000000) at main.cpp:77:5 74 do_action_args(input); 75 76 g_watchme = 1; // watchpoint triggers here -> 77 return 0; ^ 78 } 79 80 void * thread #51, stop reason = watchpoint 1 frame #0: 0x0000000100001391 a.out`watchpoint_func(input=0x0000000000000000) at main.cpp:77:5 74 do_action_args(input); 75 76 g_watchme = 1; // watchpoint triggers here -> 77 return 0; ^ 78 } 79 80 void * thread #53, stop reason = watchpoint 1 frame #0: 0x0000000100001391 a.out`watchpoint_func(input=0x0000000000000000) at main.cpp:77:5 74 do_action_args(input); 75 76 g_watchme = 1; // watchpoint triggers here -> 77 return 0; ^ 78 } 79 80 void * thread #54, stop reason = watchpoint 1 frame #0: 0x0000000100001391 a.out`watchpoint_func(input=0x0000000000000000) at main.cpp:77:5 74 do_action_args(input); 75 76 g_watchme = 1; // watchpoint triggers here -> 77 return 0; ^ 78 } 79 80 void * thread #55, stop reason = watchpoint 1 frame #0: 0x0000000100001391 a.out`watchpoint_func(input=0x0000000000000000) at main.cpp:77:5 74 do_action_args(input); 75 76 g_watchme = 1; // watchpoint triggers here -> 77 return 0; ^ 78 } 79 80 void * thread #56, stop reason = watchpoint 1 frame #0: 0x0000000100001391 a.out`watchpoint_func(input=0x0000000000000000) at main.cpp:77:5 74 do_action_args(input); 75 76 g_watchme = 1; // watchpoint triggers here -> 77 return 0; ^ 78 } 79 80 void * thread #57, stop reason = watchpoint 1 frame #0: 0x0000000100001391 a.out`watchpoint_func(input=0x0000000000000000) at main.cpp:77:5 74 do_action_args(input); 75 76 g_watchme = 1; // watchpoint triggers here -> 77 return 0; ^ 78 } 79 80 void * thread #58, stop reason = watchpoint 1 frame #0: 0x0000000100001391 a.out`watchpoint_func(input=0x0000000000000000) at main.cpp:77:5 74 do_action_args(input); 75 76 g_watchme = 1; // watchpoint triggers here -> 77 return 0; ^ 78 } 79 80 void * thread #59, stop reason = watchpoint 1 frame #0: 0x0000000100001391 a.out`watchpoint_func(input=0x0000000000000000) at main.cpp:77:5 74 do_action_args(input); 75 76 g_watchme = 1; // watchpoint triggers here -> 77 return 0; ^ 78 } 79 80 void * thread #60, stop reason = watchpoint 1 frame #0: 0x0000000100001391 a.out`watchpoint_func(input=0x0000000000000000) at main.cpp:77:5 74 do_action_args(input); 75 76 g_watchme = 1; // watchpoint triggers here -> 77 return 0; ^ 78 } 79 80 void * thread #62, stop reason = watchpoint 1 frame #0: 0x0000000100001391 a.out`watchpoint_func(input=0x0000000000000000) at main.cpp:77:5 74 do_action_args(input); 75 76 g_watchme = 1; // watchpoint triggers here -> 77 return 0; ^ 78 } 79 80 void * thread #63, stop reason = watchpoint 1 frame #0: 0x0000000100001391 a.out`watchpoint_func(input=0x0000000000000000) at main.cpp:77:5 74 do_action_args(input); 75 76 g_watchme = 1; // watchpoint triggers here -> 77 return 0; ^ 78 } 79 80 void * thread #64, stop reason = watchpoint 1 frame #0: 0x0000000100001391 a.out`watchpoint_func(input=0x0000000000000000) at main.cpp:77:5 74 do_action_args(input); 75 76 g_watchme = 1; // watchpoint triggers here -> 77 return 0; ^ 78 } 79 80 void * thread #65, stop reason = watchpoint 1 frame #0: 0x0000000100001391 a.out`watchpoint_func(input=0x0000000000000000) at main.cpp:77:5 74 do_action_args(input); 75 76 g_watchme = 1; // watchpoint triggers here -> 77 return 0; ^ 78 } 79 80 void * thread #66, stop reason = watchpoint 1 frame #0: 0x0000000100001391 a.out`watchpoint_func(input=0x0000000000000000) at main.cpp:77:5 74 do_action_args(input); 75 76 g_watchme = 1; // watchpoint triggers here -> 77 return 0; ^ 78 } 79 80 void * thread #67, stop reason = watchpoint 1 frame #0: 0x0000000100001391 a.out`watchpoint_func(input=0x0000000000000000) at main.cpp:77:5 74 do_action_args(input); 75 76 g_watchme = 1; // watchpoint triggers here -> 77 return 0; ^ 78 } 79 80 void * thread #69, stop reason = watchpoint 1 frame #0: 0x0000000100001391 a.out`watchpoint_func(input=0x0000000000000000) at main.cpp:77:5 74 do_action_args(input); 75 76 g_watchme = 1; // watchpoint triggers here -> 77 return 0; ^ 78 } 79 80 void * thread #72, stop reason = watchpoint 1 frame #0: 0x0000000100001391 a.out`watchpoint_func(input=0x0000000000000000) at main.cpp:77:5 74 do_action_args(input); 75 76 g_watchme = 1; // watchpoint triggers here -> 77 return 0; ^ 78 } 79 80 void * thread #73, stop reason = watchpoint 1 frame #0: 0x0000000100001391 a.out`watchpoint_func(input=0x0000000000000000) at main.cpp:77:5 74 do_action_args(input); 75 76 g_watchme = 1; // watchpoint triggers here -> 77 return 0; ^ 78 } 79 80 void * thread #74, stop reason = watchpoint 1 frame #0: 0x0000000100001391 a.out`watchpoint_func(input=0x0000000000000000) at main.cpp:77:5 74 do_action_args(input); 75 76 g_watchme = 1; // watchpoint triggers here -> 77 return 0; ^ 78 } 79 80 void * thread #75, stop reason = watchpoint 1 frame #0: 0x0000000100001391 a.out`watchpoint_func(input=0x0000000000000000) at main.cpp:77:5 74 do_action_args(input); 75 76 g_watchme = 1; // watchpoint triggers here -> 77 return 0; ^ 78 } 79 80 void * thread #76, stop reason = watchpoint 1 frame #0: 0x0000000100001391 a.out`watchpoint_func(input=0x0000000000000000) at main.cpp:77:5 74 do_action_args(input); 75 76 g_watchme = 1; // watchpoint triggers here -> 77 return 0; ^ 78 } 79 80 void * thread #77, stop reason = watchpoint 1 frame #0: 0x0000000100001391 a.out`watchpoint_func(input=0x0000000000000000) at main.cpp:77:5 74 do_action_args(input); 75 76 g_watchme = 1; // watchpoint triggers here -> 77 return 0; ^ 78 } 79 80 void * thread #78, stop reason = watchpoint 1 frame #0: 0x0000000100001391 a.out`watchpoint_func(input=0x0000000000000000) at main.cpp:77:5 74 do_action_args(input); 75 76 g_watchme = 1; // watchpoint triggers here -> 77 return 0; ^ 78 } 79 80 void * thread #79, stop reason = watchpoint 1 frame #0: 0x0000000100001391 a.out`watchpoint_func(input=0x0000000000000000) at main.cpp:77:5 74 do_action_args(input); 75 76 g_watchme = 1; // watchpoint triggers here -> 77 return 0; ^ 78 } 79 80 void * thread #80, stop reason = watchpoint 1 frame #0: 0x0000000100001391 a.out`watchpoint_func(input=0x0000000000000000) at main.cpp:77:5 74 do_action_args(input); 75 76 g_watchme = 1; // watchpoint triggers here -> 77 return 0; ^ 78 } 79 80 void * thread #81, stop reason = watchpoint 1 frame #0: 0x0000000100001391 a.out`watchpoint_func(input=0x0000000000000000) at main.cpp:77:5 74 do_action_args(input); 75 76 g_watchme = 1; // watchpoint triggers here -> 77 return 0; ^ 78 } 79 80 void * thread #82, stop reason = watchpoint 1 frame #0: 0x0000000100001391 a.out`watchpoint_func(input=0x0000000000000000) at main.cpp:77:5 74 do_action_args(input); 75 76 g_watchme = 1; // watchpoint triggers here -> 77 return 0; ^ 78 } 79 80 void * thread #93, stop reason = watchpoint 1 frame #0: 0x0000000100001391 a.out`watchpoint_func(input=0x0000000000000000) at main.cpp:77:5 74 do_action_args(input); 75 76 g_watchme = 1; // watchpoint triggers here -> 77 return 0; ^ 78 } 79 80 void * thread #94, stop reason = watchpoint 1 frame #0: 0x0000000100001391 a.out`watchpoint_func(input=0x0000000000000000) at main.cpp:77:5 74 do_action_args(input); 75 76 g_watchme = 1; // watchpoint triggers here -> 77 return 0; ^ 78 } 79 80 void * thread #95, stop reason = watchpoint 1 frame #0: 0x0000000100001391 a.out`watchpoint_func(input=0x0000000000000000) at main.cpp:77:5 74 do_action_args(input); 75 76 g_watchme = 1; // watchpoint triggers here -> 77 return 0; ^ 78 } 79 80 void * thread #96, stop reason = watchpoint 1 frame #0: 0x0000000100001391 a.out`watchpoint_func(input=0x0000000000000000) at main.cpp:77:5 74 do_action_args(input); 75 76 g_watchme = 1; // watchpoint triggers here -> 77 return 0; ^ 78 } 79 80 void * thread #97, stop reason = watchpoint 1 frame #0: 0x0000000100001391 a.out`watchpoint_func(input=0x0000000000000000) at main.cpp:77:5 74 do_action_args(input); 75 76 g_watchme = 1; // watchpoint triggers here -> 77 return 0; ^ 78 } 79 80 void * thread #98, stop reason = watchpoint 1 frame #0: 0x0000000100001391 a.out`watchpoint_func(input=0x0000000000000000) at main.cpp:77:5 74 do_action_args(input); 75 76 g_watchme = 1; // watchpoint triggers here -> 77 return 0; ^ 78 } 79 80 void * thread #99, stop reason = watchpoint 1 frame #0: 0x0000000100001391 a.out`watchpoint_func(input=0x0000000000000000) at main.cpp:77:5 74 do_action_args(input); 75 76 g_watchme = 1; // watchpoint triggers here -> 77 return 0; ^ 78 } 79 80 void *

Hide Details

Hide Details

Hide Details

runCmd: thread backtrace all output: thread #1, queue = 'com.apple.main-thread' frame #0: 0x00007fff6e3cb36a libsystem_kernel.dylib`__ulock_wait + 10 frame #1: 0x00007fff6e48670b libsystem_pthread.dylib`_pthread_join + 356 frame #2: 0x0000000100001a4c a.out`dotest() at main.cpp:176:9 frame #3: 0x0000000100001d44 a.out`main at main.cpp:183:5 frame #4: 0x00007fff6e290085 libdyld.dylib`start + 1 * thread #2, stop reason = watchpoint 1 * frame #0: 0x0000000100001391 a.out`watchpoint_func(input=0x0000000000000000) at main.cpp:77:5 frame #1: 0x00007fff6e48233d libsystem_pthread.dylib`_pthread_body + 126 frame #2: 0x00007fff6e4852a7 libsystem_pthread.dylib`_pthread_start + 70 frame #3: 0x00007fff6e481425 libsystem_pthread.dylib`thread_start + 13 thread #3, stop reason = watchpoint 1 frame #0: 0x0000000100001391 a.out`watchpoint_func(input=0x0000000000000000) at main.cpp:77:5 frame #1: 0x00007fff6e48233d libsystem_pthread.dylib`_pthread_body + 126 frame #2: 0x00007fff6e4852a7 libsystem_pthread.dylib`_pthread_start + 70 frame #3: 0x00007fff6e481425 libsystem_pthread.dylib`thread_start + 13 thread #4, stop reason = watchpoint 1 frame #0: 0x0000000100001391 a.out`watchpoint_func(input=0x0000000000000000) at main.cpp:77:5 frame #1: 0x00007fff6e48233d libsystem_pthread.dylib`_pthread_body + 126 frame #2: 0x00007fff6e4852a7 libsystem_pthread.dylib`_pthread_start + 70 frame #3: 0x00007fff6e481425 libsystem_pthread.dylib`thread_start + 13 thread #5, stop reason = watchpoint 1 frame #0: 0x0000000100001391 a.out`watchpoint_func(input=0x0000000000000000) at main.cpp:77:5 frame #1: 0x00007fff6e48233d libsystem_pthread.dylib`_pthread_body + 126 frame #2: 0x00007fff6e4852a7 libsystem_pthread.dylib`_pthread_start + 70 frame #3: 0x00007fff6e481425 libsystem_pthread.dylib`thread_start + 13 thread #6, stop reason = watchpoint 1 frame #0: 0x0000000100001391 a.out`watchpoint_func(input=0x0000000000000000) at main.cpp:77:5 frame #1: 0x00007fff6e48233d libsystem_pthread.dylib`_pthread_body + 126 frame #2: 0x00007fff6e4852a7 libsystem_pthread.dylib`_pthread_start + 70 frame #3: 0x00007fff6e481425 libsystem_pthread.dylib`thread_start + 13 thread #7, stop reason = watchpoint 1 frame #0: 0x0000000100001391 a.out`watchpoint_func(input=0x0000000000000000) at main.cpp:77:5 frame #1: 0x00007fff6e48233d libsystem_pthread.dylib`_pthread_body + 126 frame #2: 0x00007fff6e4852a7 libsystem_pthread.dylib`_pthread_start + 70 frame #3: 0x00007fff6e481425 libsystem_pthread.dylib`thread_start + 13 thread #8, stop reason = watchpoint 1 frame #0: 0x0000000100001391 a.out`watchpoint_func(input=0x0000000000000000) at main.cpp:77:5 frame #1: 0x00007fff6e48233d libsystem_pthread.dylib`_pthread_body + 126 frame #2: 0x00007fff6e4852a7 libsystem_pthread.dylib`_pthread_start + 70 frame #3: 0x00007fff6e481425 libsystem_pthread.dylib`thread_start + 13 thread #9, stop reason = watchpoint 1 frame #0: 0x0000000100001391 a.out`watchpoint_func(input=0x0000000000000000) at main.cpp:77:5 frame #1: 0x00007fff6e48233d libsystem_pthread.dylib`_pthread_body + 126 frame #2: 0x00007fff6e4852a7 libsystem_pthread.dylib`_pthread_start + 70 frame #3: 0x00007fff6e481425 libsystem_pthread.dylib`thread_start + 13 thread #10, stop reason = watchpoint 1 frame #0: 0x0000000100001391 a.out`watchpoint_func(input=0x0000000000000000) at main.cpp:77:5 frame #1: 0x00007fff6e48233d libsystem_pthread.dylib`_pthread_body + 126 frame #2: 0x00007fff6e4852a7 libsystem_pthread.dylib`_pthread_start + 70 frame #3: 0x00007fff6e481425 libsystem_pthread.dylib`thread_start + 13 thread #11 frame #0: 0x00007fff6e3ca3de libsystem_kernel.dylib`__mmap + 10 frame #1: 0x0000000100150a59 libclang_rt.asan_osx_dynamic.dylib`__sanitizer::internal_mmap(void*, unsigned long, int, int, int, unsigned long long) + 25 frame #2: 0x00000001001530e4 libclang_rt.asan_osx_dynamic.dylib`__sanitizer::MmapNamed(void*, unsigned long, int, int, char const*) + 20 frame #3: 0x000000010015896a libclang_rt.asan_osx_dynamic.dylib`__sanitizer::MmapFixedNoReserve(unsigned long, unsigned long, char const*) + 122 frame #4: 0x00000001001427ae libclang_rt.asan_osx_dynamic.dylib`__asan::ReserveShadowMemoryRange(unsigned long, unsigned long, char const*) + 94 frame #5: 0x0000000100144b4a libclang_rt.asan_osx_dynamic.dylib`__asan::AsanThread::Destroy() + 186 frame #6: 0x00007fff6e4826af libsystem_pthread.dylib`_pthread_tsd_cleanup + 475 frame #7: 0x00007fff6e4856b1 libsystem_pthread.dylib`_pthread_exit + 70 frame #8: 0x00007fff6e482348 libsystem_pthread.dylib`_pthread_body + 137 frame #9: 0x00007fff6e4852a7 libsystem_pthread.dylib`_pthread_start + 70 frame #10: 0x00007fff6e481425 libsystem_pthread.dylib`thread_start + 13 thread #12, stop reason = watchpoint 1 frame #0: 0x0000000100001391 a.out`watchpoint_func(input=0x0000000000000000) at main.cpp:77:5 frame #1: 0x00007fff6e48233d libsystem_pthread.dylib`_pthread_body + 126 frame #2: 0x00007fff6e4852a7 libsystem_pthread.dylib`_pthread_start + 70 frame #3: 0x00007fff6e481425 libsystem_pthread.dylib`thread_start + 13 thread #13, stop reason = watchpoint 1 frame #0: 0x0000000100001391 a.out`watchpoint_func(input=0x0000000000000000) at main.cpp:77:5 frame #1: 0x00007fff6e48233d libsystem_pthread.dylib`_pthread_body + 126 frame #2: 0x00007fff6e4852a7 libsystem_pthread.dylib`_pthread_start + 70 frame #3: 0x00007fff6e481425 libsystem_pthread.dylib`thread_start + 13 thread #14, stop reason = watchpoint 1 frame #0: 0x0000000100001391 a.out`watchpoint_func(input=0x0000000000000000) at main.cpp:77:5 frame #1: 0x00007fff6e48233d libsystem_pthread.dylib`_pthread_body + 126 frame #2: 0x00007fff6e4852a7 libsystem_pthread.dylib`_pthread_start + 70 frame #3: 0x00007fff6e481425 libsystem_pthread.dylib`thread_start + 13 thread #15 frame #0: 0x00007fff6e479510 libsystem_platform.dylib`_platform_bzero$VARIANT$Ivybridge + 48 frame #1: 0x000000010013b708 libclang_rt.asan_osx_dynamic.dylib`__asan::PoisonShadow(unsigned long, unsigned long, unsigned char) + 616 frame #2: 0x0000000100104ec9 libclang_rt.asan_osx_dynamic.dylib`__asan::FakeStack::Destroy(int) + 73 frame #3: 0x0000000100144c12 libclang_rt.asan_osx_dynamic.dylib`__asan::AsanThread::Destroy() + 386 frame #4: 0x00007fff6e4826af libsystem_pthread.dylib`_pthread_tsd_cleanup + 475 frame #5: 0x00007fff6e4856b1 libsystem_pthread.dylib`_pthread_exit + 70 frame #6: 0x00007fff6e482348 libsystem_pthread.dylib`_pthread_body + 137 frame #7: 0x00007fff6e4852a7 libsystem_pthread.dylib`_pthread_start + 70 frame #8: 0x00007fff6e481425 libsystem_pthread.dylib`thread_start + 13 thread #16, stop reason = watchpoint 1 frame #0: 0x0000000100001391 a.out`watchpoint_func(input=0x0000000000000000) at main.cpp:77:5 frame #1: 0x00007fff6e48233d libsystem_pthread.dylib`_pthread_body + 126 frame #2: 0x00007fff6e4852a7 libsystem_pthread.dylib`_pthread_start + 70 frame #3: 0x00007fff6e481425 libsystem_pthread.dylib`thread_start + 13 thread #17, stop reason = watchpoint 1 frame #0: 0x0000000100001391 a.out`watchpoint_func(input=0x0000000000000000) at main.cpp:77:5 frame #1: 0x00007fff6e48233d libsystem_pthread.dylib`_pthread_body + 126 frame #2: 0x00007fff6e4852a7 libsystem_pthread.dylib`_pthread_start + 70 frame #3: 0x00007fff6e481425 libsystem_pthread.dylib`thread_start + 13 thread #18, stop reason = watchpoint 1 frame #0: 0x0000000100001391 a.out`watchpoint_func(input=0x0000000000000000) at main.cpp:77:5 frame #1: 0x00007fff6e48233d libsystem_pthread.dylib`_pthread_body + 126 frame #2: 0x00007fff6e4852a7 libsystem_pthread.dylib`_pthread_start + 70 frame #3: 0x00007fff6e481425 libsystem_pthread.dylib`thread_start + 13 thread #19, stop reason = watchpoint 1 frame #0: 0x0000000100001391 a.out`watchpoint_func(input=0x0000000000000000) at main.cpp:77:5 frame #1: 0x00007fff6e48233d libsystem_pthread.dylib`_pthread_body + 126 frame #2: 0x00007fff6e4852a7 libsystem_pthread.dylib`_pthread_start + 70 frame #3: 0x00007fff6e481425 libsystem_pthread.dylib`thread_start + 13 thread #20 frame #0: 0x00007fff6e3ca3de libsystem_kernel.dylib`__mmap + 10 frame #1: 0x0000000100150a59 libclang_rt.asan_osx_dynamic.dylib`__sanitizer::internal_mmap(void*, unsigned long, int, int, int, unsigned long long) + 25 frame #2: 0x00000001001530e4 libclang_rt.asan_osx_dynamic.dylib`__sanitizer::MmapNamed(void*, unsigned long, int, int, char const*) + 20 frame #3: 0x000000010015896a libclang_rt.asan_osx_dynamic.dylib`__sanitizer::MmapFixedNoReserve(unsigned long, unsigned long, char const*) + 122 frame #4: 0x00000001001427ae libclang_rt.asan_osx_dynamic.dylib`__asan::ReserveShadowMemoryRange(unsigned long, unsigned long, char const*) + 94 frame #5: 0x0000000100144b4a libclang_rt.asan_osx_dynamic.dylib`__asan::AsanThread::Destroy() + 186 frame #6: 0x00007fff6e4826af libsystem_pthread.dylib`_pthread_tsd_cleanup + 475 frame #7: 0x00007fff6e4856b1 libsystem_pthread.dylib`_pthread_exit + 70 frame #8: 0x00007fff6e482348 libsystem_pthread.dylib`_pthread_body + 137 frame #9: 0x00007fff6e4852a7 libsystem_pthread.dylib`_pthread_start + 70 frame #10: 0x00007fff6e481425 libsystem_pthread.dylib`thread_start + 13 thread #21, stop reason = watchpoint 1 frame #0: 0x0000000100001391 a.out`watchpoint_func(input=0x0000000000000000) at main.cpp:77:5 frame #1: 0x00007fff6e48233d libsystem_pthread.dylib`_pthread_body + 126 frame #2: 0x00007fff6e4852a7 libsystem_pthread.dylib`_pthread_start + 70 frame #3: 0x00007fff6e481425 libsystem_pthread.dylib`thread_start + 13 thread #22, stop reason = watchpoint 1 frame #0: 0x0000000100001391 a.out`watchpoint_func(input=0x0000000000000000) at main.cpp:77:5 frame #1: 0x00007fff6e48233d libsystem_pthread.dylib`_pthread_body + 126 frame #2: 0x00007fff6e4852a7 libsystem_pthread.dylib`_pthread_start + 70 frame #3: 0x00007fff6e481425 libsystem_pthread.dylib`thread_start + 13 thread #23, stop reason = watchpoint 1 frame #0: 0x0000000100001391 a.out`watchpoint_func(input=0x0000000000000000) at main.cpp:77:5 frame #1: 0x00007fff6e48233d libsystem_pthread.dylib`_pthread_body + 126 frame #2: 0x00007fff6e4852a7 libsystem_pthread.dylib`_pthread_start + 70 frame #3: 0x00007fff6e481425 libsystem_pthread.dylib`thread_start + 13 thread #24, stop reason = watchpoint 1 frame #0: 0x0000000100001391 a.out`watchpoint_func(input=0x0000000000000000) at main.cpp:77:5 frame #1: 0x00007fff6e48233d libsystem_pthread.dylib`_pthread_body + 126 frame #2: 0x00007fff6e4852a7 libsystem_pthread.dylib`_pthread_start + 70 frame #3: 0x00007fff6e481425 libsystem_pthread.dylib`thread_start + 13 thread #25, stop reason = watchpoint 1 frame #0: 0x0000000100001391 a.out`watchpoint_func(input=0x0000000000000000) at main.cpp:77:5 frame #1: 0x00007fff6e48233d libsystem_pthread.dylib`_pthread_body + 126 frame #2: 0x00007fff6e4852a7 libsystem_pthread.dylib`_pthread_start + 70 frame #3: 0x00007fff6e481425 libsystem_pthread.dylib`thread_start + 13 thread #26, stop reason = watchpoint 1 frame #0: 0x0000000100001391 a.out`watchpoint_func(input=0x0000000000000000) at main.cpp:77:5 frame #1: 0x00007fff6e48233d libsystem_pthread.dylib`_pthread_body + 126 frame #2: 0x00007fff6e4852a7 libsystem_pthread.dylib`_pthread_start + 70 frame #3: 0x00007fff6e481425 libsystem_pthread.dylib`thread_start + 13 thread #27, stop reason = watchpoint 1 frame #0: 0x0000000100001391 a.out`watchpoint_func(input=0x0000000000000000) at main.cpp:77:5 frame #1: 0x00007fff6e48233d libsystem_pthread.dylib`_pthread_body + 126 frame #2: 0x00007fff6e4852a7 libsystem_pthread.dylib`_pthread_start + 70 frame #3: 0x00007fff6e481425 libsystem_pthread.dylib`thread_start + 13 thread #28, stop reason = watchpoint 1 frame #0: 0x0000000100001391 a.out`watchpoint_func(input=0x0000000000000000) at main.cpp:77:5 frame #1: 0x00007fff6e48233d libsystem_pthread.dylib`_pthread_body + 126 frame #2: 0x00007fff6e4852a7 libsystem_pthread.dylib`_pthread_start + 70 frame #3: 0x00007fff6e481425 libsystem_pthread.dylib`thread_start + 13 thread #29 frame #0: 0x00007fff6e3ca5a6 libsystem_kernel.dylib`__munmap + 10 frame #1: 0x0000000100150aa3 libclang_rt.asan_osx_dynamic.dylib`__sanitizer::internal_munmap(void*, unsigned long) + 19 frame #2: 0x000000010015311f libclang_rt.asan_osx_dynamic.dylib`__sanitizer::UnmapOrDie(void*, unsigned long) + 31 frame #3: 0x000000010015864d libclang_rt.asan_osx_dynamic.dylib`__sanitizer::UnsetAlternateSignalStack() + 61 frame #4: 0x0000000100144adc libclang_rt.asan_osx_dynamic.dylib`__asan::AsanThread::Destroy() + 76 frame #5: 0x00007fff6e4826af libsystem_pthread.dylib`_pthread_tsd_cleanup + 475 frame #6: 0x00007fff6e4856b1 libsystem_pthread.dylib`_pthread_exit + 70 frame #7: 0x00007fff6e482348 libsystem_pthread.dylib`_pthread_body + 137 frame #8: 0x00007fff6e4852a7 libsystem_pthread.dylib`_pthread_start + 70 frame #9: 0x00007fff6e481425 libsystem_pthread.dylib`thread_start + 13 thread #30, stop reason = watchpoint 1 frame #0: 0x0000000100001391 a.out`watchpoint_func(input=0x0000000000000000) at main.cpp:77:5 frame #1: 0x00007fff6e48233d libsystem_pthread.dylib`_pthread_body + 126 frame #2: 0x00007fff6e4852a7 libsystem_pthread.dylib`_pthread_start + 70 frame #3: 0x00007fff6e481425 libsystem_pthread.dylib`thread_start + 13 thread #31, stop reason = watchpoint 1 frame #0: 0x0000000100001391 a.out`watchpoint_func(input=0x0000000000000000) at main.cpp:77:5 frame #1: 0x00007fff6e48233d libsystem_pthread.dylib`_pthread_body + 126 frame #2: 0x00007fff6e4852a7 libsystem_pthread.dylib`_pthread_start + 70 frame #3: 0x00007fff6e481425 libsystem_pthread.dylib`thread_start + 13 thread #32, stop reason = watchpoint 1 frame #0: 0x0000000100001391 a.out`watchpoint_func(input=0x0000000000000000) at main.cpp:77:5 frame #1: 0x00007fff6e48233d libsystem_pthread.dylib`_pthread_body + 126 frame #2: 0x00007fff6e4852a7 libsystem_pthread.dylib`_pthread_start + 70 frame #3: 0x00007fff6e481425 libsystem_pthread.dylib`thread_start + 13 thread #33, stop reason = watchpoint 1 frame #0: 0x0000000100001391 a.out`watchpoint_func(input=0x0000000000000000) at main.cpp:77:5 frame #1: 0x00007fff6e48233d libsystem_pthread.dylib`_pthread_body + 126 frame #2: 0x00007fff6e4852a7 libsystem_pthread.dylib`_pthread_start + 70 frame #3: 0x00007fff6e481425 libsystem_pthread.dylib`thread_start + 13 thread #34, stop reason = watchpoint 1 frame #0: 0x0000000100001391 a.out`watchpoint_func(input=0x0000000000000000) at main.cpp:77:5 frame #1: 0x00007fff6e48233d libsystem_pthread.dylib`_pthread_body + 126 frame #2: 0x00007fff6e4852a7 libsystem_pthread.dylib`_pthread_start + 70 frame #3: 0x00007fff6e481425 libsystem_pthread.dylib`thread_start + 13 thread #35, stop reason = watchpoint 1 frame #0: 0x0000000100001391 a.out`watchpoint_func(input=0x0000000000000000) at main.cpp:77:5 frame #1: 0x00007fff6e48233d libsystem_pthread.dylib`_pthread_body + 126 frame #2: 0x00007fff6e4852a7 libsystem_pthread.dylib`_pthread_start + 70 frame #3: 0x00007fff6e481425 libsystem_pthread.dylib`thread_start + 13 thread #36, stop reason = watchpoint 1 frame #0: 0x0000000100001391 a.out`watchpoint_func(input=0x0000000000000000) at main.cpp:77:5 frame #1: 0x00007fff6e48233d libsystem_pthread.dylib`_pthread_body + 126 frame #2: 0x00007fff6e4852a7 libsystem_pthread.dylib`_pthread_start + 70 frame #3: 0x00007fff6e481425 libsystem_pthread.dylib`thread_start + 13 thread #37, stop reason = watchpoint 1 frame #0: 0x0000000100001391 a.out`watchpoint_func(input=0x0000000000000000) at main.cpp:77:5 frame #1: 0x00007fff6e48233d libsystem_pthread.dylib`_pthread_body + 126 frame #2: 0x00007fff6e4852a7 libsystem_pthread.dylib`_pthread_start + 70 frame #3: 0x00007fff6e481425 libsystem_pthread.dylib`thread_start + 13 thread #38 frame #0: 0x00000001000f91e0 libclang_rt.asan_osx_dynamic.dylib`__asan::AsanThreadLocalMallocStorage::CommitBack() + 288 frame #1: 0x0000000100144aca libclang_rt.asan_osx_dynamic.dylib`__asan::AsanThread::Destroy() + 58 frame #2: 0x00007fff6e4826af libsystem_pthread.dylib`_pthread_tsd_cleanup + 475 frame #3: 0x00007fff6e4856b1 libsystem_pthread.dylib`_pthread_exit + 70 frame #4: 0x00007fff6e482348 libsystem_pthread.dylib`_pthread_body + 137 frame #5: 0x00007fff6e4852a7 libsystem_pthread.dylib`_pthread_start + 70 frame #6: 0x00007fff6e481425 libsystem_pthread.dylib`thread_start + 13 thread #39, stop reason = watchpoint 1 frame #0: 0x0000000100001391 a.out`watchpoint_func(input=0x0000000000000000) at main.cpp:77:5 frame #1: 0x00007fff6e48233d libsystem_pthread.dylib`_pthread_body + 126 frame #2: 0x00007fff6e4852a7 libsystem_pthread.dylib`_pthread_start + 70 frame #3: 0x00007fff6e481425 libsystem_pthread.dylib`thread_start + 13 thread #40, stop reason = watchpoint 1 frame #0: 0x0000000100001391 a.out`watchpoint_func(input=0x0000000000000000) at main.cpp:77:5 frame #1: 0x00007fff6e48233d libsystem_pthread.dylib`_pthread_body + 126 frame #2: 0x00007fff6e4852a7 libsystem_pthread.dylib`_pthread_start + 70 frame #3: 0x00007fff6e481425 libsystem_pthread.dylib`thread_start + 13 thread #41, stop reason = watchpoint 1 frame #0: 0x0000000100001391 a.out`watchpoint_func(input=0x0000000000000000) at main.cpp:77:5 frame #1: 0x00007fff6e48233d libsystem_pthread.dylib`_pthread_body + 126 frame #2: 0x00007fff6e4852a7 libsystem_pthread.dylib`_pthread_start + 70 frame #3: 0x00007fff6e481425 libsystem_pthread.dylib`thread_start + 13 thread #42, stop reason = watchpoint 1 frame #0: 0x0000000100001391 a.out`watchpoint_func(input=0x0000000000000000) at main.cpp:77:5 frame #1: 0x00007fff6e48233d libsystem_pthread.dylib`_pthread_body + 126 frame #2: 0x00007fff6e4852a7 libsystem_pthread.dylib`_pthread_start + 70 frame #3: 0x00007fff6e481425 libsystem_pthread.dylib`thread_start + 13 thread #43, stop reason = watchpoint 1 frame #0: 0x0000000100001391 a.out`watchpoint_func(input=0x0000000000000000) at main.cpp:77:5 frame #1: 0x00007fff6e48233d libsystem_pthread.dylib`_pthread_body + 126 frame #2: 0x00007fff6e4852a7 libsystem_pthread.dylib`_pthread_start + 70 frame #3: 0x00007fff6e481425 libsystem_pthread.dylib`thread_start + 13 thread #44, stop reason = watchpoint 1 frame #0: 0x0000000100001391 a.out`watchpoint_func(input=0x0000000000000000) at main.cpp:77:5 frame #1: 0x00007fff6e48233d libsystem_pthread.dylib`_pthread_body + 126 frame #2: 0x00007fff6e4852a7 libsystem_pthread.dylib`_pthread_start + 70 frame #3: 0x00007fff6e481425 libsystem_pthread.dylib`thread_start + 13 thread #45, stop reason = watchpoint 1 frame #0: 0x0000000100001391 a.out`watchpoint_func(input=0x0000000000000000) at main.cpp:77:5 frame #1: 0x00007fff6e48233d libsystem_pthread.dylib`_pthread_body + 126 frame #2: 0x00007fff6e4852a7 libsystem_pthread.dylib`_pthread_start + 70 frame #3: 0x00007fff6e481425 libsystem_pthread.dylib`thread_start + 13 thread #46, stop reason = watchpoint 1 frame #0: 0x0000000100001391 a.out`watchpoint_func(input=0x0000000000000000) at main.cpp:77:5 frame #1: 0x00007fff6e48233d libsystem_pthread.dylib`_pthread_body + 126 frame #2: 0x00007fff6e4852a7 libsystem_pthread.dylib`_pthread_start + 70 frame #3: 0x00007fff6e481425 libsystem_pthread.dylib`thread_start + 13 thread #47, stop reason = watchpoint 1 frame #0: 0x0000000100001391 a.out`watchpoint_func(input=0x0000000000000000) at main.cpp:77:5 frame #1: 0x00007fff6e48233d libsystem_pthread.dylib`_pthread_body + 126 frame #2: 0x00007fff6e4852a7 libsystem_pthread.dylib`_pthread_start + 70 frame #3: 0x00007fff6e481425 libsystem_pthread.dylib`thread_start + 13 thread #48, stop reason = watchpoint 1 frame #0: 0x0000000100001391 a.out`watchpoint_func(input=0x0000000000000000) at main.cpp:77:5 frame #1: 0x00007fff6e48233d libsystem_pthread.dylib`_pthread_body + 126 frame #2: 0x00007fff6e4852a7 libsystem_pthread.dylib`_pthread_start + 70 frame #3: 0x00007fff6e481425 libsystem_pthread.dylib`thread_start + 13 thread #49, stop reason = watchpoint 1 frame #0: 0x0000000100001391 a.out`watchpoint_func(input=0x0000000000000000) at main.cpp:77:5 frame #1: 0x00007fff6e48233d libsystem_pthread.dylib`_pthread_body + 126 frame #2: 0x00007fff6e4852a7 libsystem_pthread.dylib`_pthread_start + 70 frame #3: 0x00007fff6e481425 libsystem_pthread.dylib`thread_start + 13 thread #50, stop reason = watchpoint 1 frame #0: 0x0000000100001391 a.out`watchpoint_func(input=0x0000000000000000) at main.cpp:77:5 frame #1: 0x00007fff6e48233d libsystem_pthread.dylib`_pthread_body + 126 frame #2: 0x00007fff6e4852a7 libsystem_pthread.dylib`_pthread_start + 70 frame #3: 0x00007fff6e481425 libsystem_pthread.dylib`thread_start + 13 thread #51, stop reason = watchpoint 1 frame #0: 0x0000000100001391 a.out`watchpoint_func(input=0x0000000000000000) at main.cpp:77:5 frame #1: 0x00007fff6e48233d libsystem_pthread.dylib`_pthread_body + 126 frame #2: 0x00007fff6e4852a7 libsystem_pthread.dylib`_pthread_start + 70 frame #3: 0x00007fff6e481425 libsystem_pthread.dylib`thread_start + 13 thread #52 frame #0: 0x00000001000f91e0 libclang_rt.asan_osx_dynamic.dylib`__asan::AsanThreadLocalMallocStorage::CommitBack() + 288 frame #1: 0x0000000100144aca libclang_rt.asan_osx_dynamic.dylib`__asan::AsanThread::Destroy() + 58 frame #2: 0x00007fff6e4826af libsystem_pthread.dylib`_pthread_tsd_cleanup + 475 frame #3: 0x00007fff6e4856b1 libsystem_pthread.dylib`_pthread_exit + 70 frame #4: 0x00007fff6e482348 libsystem_pthread.dylib`_pthread_body + 137 frame #5: 0x00007fff6e4852a7 libsystem_pthread.dylib`_pthread_start + 70 frame #6: 0x00007fff6e481425 libsystem_pthread.dylib`thread_start + 13 thread #53, stop reason = watchpoint 1 frame #0: 0x0000000100001391 a.out`watchpoint_func(input=0x0000000000000000) at main.cpp:77:5 frame #1: 0x00007fff6e48233d libsystem_pthread.dylib`_pthread_body + 126 frame #2: 0x00007fff6e4852a7 libsystem_pthread.dylib`_pthread_start + 70 frame #3: 0x00007fff6e481425 libsystem_pthread.dylib`thread_start + 13 thread #54, stop reason = watchpoint 1 frame #0: 0x0000000100001391 a.out`watchpoint_func(input=0x0000000000000000) at main.cpp:77:5 frame #1: 0x00007fff6e48233d libsystem_pthread.dylib`_pthread_body + 126 frame #2: 0x00007fff6e4852a7 libsystem_pthread.dylib`_pthread_start + 70 frame #3: 0x00007fff6e481425 libsystem_pthread.dylib`thread_start + 13 thread #55, stop reason = watchpoint 1 frame #0: 0x0000000100001391 a.out`watchpoint_func(input=0x0000000000000000) at main.cpp:77:5 frame #1: 0x00007fff6e48233d libsystem_pthread.dylib`_pthread_body + 126 frame #2: 0x00007fff6e4852a7 libsystem_pthread.dylib`_pthread_start + 70 frame #3: 0x00007fff6e481425 libsystem_pthread.dylib`thread_start + 13 thread #56, stop reason = watchpoint 1 frame #0: 0x0000000100001391 a.out`watchpoint_func(input=0x0000000000000000) at main.cpp:77:5 frame #1: 0x00007fff6e48233d libsystem_pthread.dylib`_pthread_body + 126 frame #2: 0x00007fff6e4852a7 libsystem_pthread.dylib`_pthread_start + 70 frame #3: 0x00007fff6e481425 libsystem_pthread.dylib`thread_start + 13 thread #57, stop reason = watchpoint 1 frame #0: 0x0000000100001391 a.out`watchpoint_func(input=0x0000000000000000) at main.cpp:77:5 frame #1: 0x00007fff6e48233d libsystem_pthread.dylib`_pthread_body + 126 frame #2: 0x00007fff6e4852a7 libsystem_pthread.dylib`_pthread_start + 70 frame #3: 0x00007fff6e481425 libsystem_pthread.dylib`thread_start + 13 thread #58, stop reason = watchpoint 1 frame #0: 0x0000000100001391 a.out`watchpoint_func(input=0x0000000000000000) at main.cpp:77:5 frame #1: 0x00007fff6e48233d libsystem_pthread.dylib`_pthread_body + 126 frame #2: 0x00007fff6e4852a7 libsystem_pthread.dylib`_pthread_start + 70 frame #3: 0x00007fff6e481425 libsystem_pthread.dylib`thread_start + 13 thread #59, stop reason = watchpoint 1 frame #0: 0x0000000100001391 a.out`watchpoint_func(input=0x0000000000000000) at main.cpp:77:5 frame #1: 0x00007fff6e48233d libsystem_pthread.dylib`_pthread_body + 126 frame #2: 0x00007fff6e4852a7 libsystem_pthread.dylib`_pthread_start + 70 frame #3: 0x00007fff6e481425 libsystem_pthread.dylib`thread_start + 13 thread #60, stop reason = watchpoint 1 frame #0: 0x0000000100001391 a.out`watchpoint_func(input=0x0000000000000000) at main.cpp:77:5 frame #1: 0x00007fff6e48233d libsystem_pthread.dylib`_pthread_body + 126 frame #2: 0x00007fff6e4852a7 libsystem_pthread.dylib`_pthread_start + 70 frame #3: 0x00007fff6e481425 libsystem_pthread.dylib`thread_start + 13 thread #61 frame #0: 0x00000001000f91e0 libclang_rt.asan_osx_dynamic.dylib`__asan::AsanThreadLocalMallocStorage::CommitBack() + 288 frame #1: 0x0000000100144aca libclang_rt.asan_osx_dynamic.dylib`__asan::AsanThread::Destroy() + 58 frame #2: 0x00007fff6e4826af libsystem_pthread.dylib`_pthread_tsd_cleanup + 475 frame #3: 0x00007fff6e4856b1 libsystem_pthread.dylib`_pthread_exit + 70 frame #4: 0x00007fff6e482348 libsystem_pthread.dylib`_pthread_body + 137 frame #5: 0x00007fff6e4852a7 libsystem_pthread.dylib`_pthread_start + 70 frame #6: 0x00007fff6e481425 libsystem_pthread.dylib`thread_start + 13 thread #62, stop reason = watchpoint 1 frame #0: 0x0000000100001391 a.out`watchpoint_func(input=0x0000000000000000) at main.cpp:77:5 frame #1: 0x00007fff6e48233d libsystem_pthread.dylib`_pthread_body + 126 frame #2: 0x00007fff6e4852a7 libsystem_pthread.dylib`_pthread_start + 70 frame #3: 0x00007fff6e481425 libsystem_pthread.dylib`thread_start + 13 thread #63, stop reason = watchpoint 1 frame #0: 0x0000000100001391 a.out`watchpoint_func(input=0x0000000000000000) at main.cpp:77:5 frame #1: 0x00007fff6e48233d libsystem_pthread.dylib`_pthread_body + 126 frame #2: 0x00007fff6e4852a7 libsystem_pthread.dylib`_pthread_start + 70 frame #3: 0x00007fff6e481425 libsystem_pthread.dylib`thread_start + 13 thread #64, stop reason = watchpoint 1 frame #0: 0x0000000100001391 a.out`watchpoint_func(input=0x0000000000000000) at main.cpp:77:5 frame #1: 0x00007fff6e48233d libsystem_pthread.dylib`_pthread_body + 126 frame #2: 0x00007fff6e4852a7 libsystem_pthread.dylib`_pthread_start + 70 frame #3: 0x00007fff6e481425 libsystem_pthread.dylib`thread_start + 13 thread #65, stop reason = watchpoint 1 frame #0: 0x0000000100001391 a.out`watchpoint_func(input=0x0000000000000000) at main.cpp:77:5 frame #1: 0x00007fff6e48233d libsystem_pthread.dylib`_pthread_body + 126 frame #2: 0x00007fff6e4852a7 libsystem_pthread.dylib`_pthread_start + 70 frame #3: 0x00007fff6e481425 libsystem_pthread.dylib`thread_start + 13 thread #66, stop reason = watchpoint 1 frame #0: 0x0000000100001391 a.out`watchpoint_func(input=0x0000000000000000) at main.cpp:77:5 frame #1: 0x00007fff6e48233d libsystem_pthread.dylib`_pthread_body + 126 frame #2: 0x00007fff6e4852a7 libsystem_pthread.dylib`_pthread_start + 70 frame #3: 0x00007fff6e481425 libsystem_pthread.dylib`thread_start + 13 thread #67, stop reason = watchpoint 1 frame #0: 0x0000000100001391 a.out`watchpoint_func(input=0x0000000000000000) at main.cpp:77:5 frame #1: 0x00007fff6e48233d libsystem_pthread.dylib`_pthread_body + 126 frame #2: 0x00007fff6e4852a7 libsystem_pthread.dylib`_pthread_start + 70 frame #3: 0x00007fff6e481425 libsystem_pthread.dylib`thread_start + 13 thread #68 frame #0: 0x00000001000f91e0 libclang_rt.asan_osx_dynamic.dylib`__asan::AsanThreadLocalMallocStorage::CommitBack() + 288 frame #1: 0x0000000100144aca libclang_rt.asan_osx_dynamic.dylib`__asan::AsanThread::Destroy() + 58 frame #2: 0x00007fff6e4826af libsystem_pthread.dylib`_pthread_tsd_cleanup + 475 frame #3: 0x00007fff6e4856b1 libsystem_pthread.dylib`_pthread_exit + 70 frame #4: 0x00007fff6e482348 libsystem_pthread.dylib`_pthread_body + 137 frame #5: 0x00007fff6e4852a7 libsystem_pthread.dylib`_pthread_start + 70 frame #6: 0x00007fff6e481425 libsystem_pthread.dylib`thread_start + 13 thread #69, stop reason = watchpoint 1 frame #0: 0x0000000100001391 a.out`watchpoint_func(input=0x0000000000000000) at main.cpp:77:5 frame #1: 0x00007fff6e48233d libsystem_pthread.dylib`_pthread_body + 126 frame #2: 0x00007fff6e4852a7 libsystem_pthread.dylib`_pthread_start + 70 frame #3: 0x00007fff6e481425 libsystem_pthread.dylib`thread_start + 13 thread #70 frame #0: 0x00000001000f91e0 libclang_rt.asan_osx_dynamic.dylib`__asan::AsanThreadLocalMallocStorage::CommitBack() + 288 frame #1: 0x0000000100144aca libclang_rt.asan_osx_dynamic.dylib`__asan::AsanThread::Destroy() + 58 frame #2: 0x00007fff6e4826af libsystem_pthread.dylib`_pthread_tsd_cleanup + 475 frame #3: 0x00007fff6e4856b1 libsystem_pthread.dylib`_pthread_exit + 70 frame #4: 0x00007fff6e482348 libsystem_pthread.dylib`_pthread_body + 137 frame #5: 0x00007fff6e4852a7 libsystem_pthread.dylib`_pthread_start + 70 frame #6: 0x00007fff6e481425 libsystem_pthread.dylib`thread_start + 13 thread #71 frame #0: 0x00000001000f91e0 libclang_rt.asan_osx_dynamic.dylib`__asan::AsanThreadLocalMallocStorage::CommitBack() + 288 frame #1: 0x0000000100144aca libclang_rt.asan_osx_dynamic.dylib`__asan::AsanThread::Destroy() + 58 frame #2: 0x00007fff6e4826af libsystem_pthread.dylib`_pthread_tsd_cleanup + 475 frame #3: 0x00007fff6e4856b1 libsystem_pthread.dylib`_pthread_exit + 70 frame #4: 0x00007fff6e482348 libsystem_pthread.dylib`_pthread_body + 137 frame #5: 0x00007fff6e4852a7 libsystem_pthread.dylib`_pthread_start + 70 frame #6: 0x00007fff6e481425 libsystem_pthread.dylib`thread_start + 13 thread #72, stop reason = watchpoint 1 frame #0: 0x0000000100001391 a.out`watchpoint_func(input=0x0000000000000000) at main.cpp:77:5 frame #1: 0x00007fff6e48233d libsystem_pthread.dylib`_pthread_body + 126 frame #2: 0x00007fff6e4852a7 libsystem_pthread.dylib`_pthread_start + 70 frame #3: 0x00007fff6e481425 libsystem_pthread.dylib`thread_start + 13 thread #73, stop reason = watchpoint 1 frame #0: 0x0000000100001391 a.out`watchpoint_func(input=0x0000000000000000) at main.cpp:77:5 frame #1: 0x00007fff6e48233d libsystem_pthread.dylib`_pthread_body + 126 frame #2: 0x00007fff6e4852a7 libsystem_pthread.dylib`_pthread_start + 70 frame #3: 0x00007fff6e481425 libsystem_pthread.dylib`thread_start + 13 thread #74, stop reason = watchpoint 1 frame #0: 0x0000000100001391 a.out`watchpoint_func(input=0x0000000000000000) at main.cpp:77:5 frame #1: 0x00007fff6e48233d libsystem_pthread.dylib`_pthread_body + 126 frame #2: 0x00007fff6e4852a7 libsystem_pthread.dylib`_pthread_start + 70 frame #3: 0x00007fff6e481425 libsystem_pthread.dylib`thread_start + 13 thread #75, stop reason = watchpoint 1 frame #0: 0x0000000100001391 a.out`watchpoint_func(input=0x0000000000000000) at main.cpp:77:5 frame #1: 0x00007fff6e48233d libsystem_pthread.dylib`_pthread_body + 126 frame #2: 0x00007fff6e4852a7 libsystem_pthread.dylib`_pthread_start + 70 frame #3: 0x00007fff6e481425 libsystem_pthread.dylib`thread_start + 13 thread #76, stop reason = watchpoint 1 frame #0: 0x0000000100001391 a.out`watchpoint_func(input=0x0000000000000000) at main.cpp:77:5 frame #1: 0x00007fff6e48233d libsystem_pthread.dylib`_pthread_body + 126 frame #2: 0x00007fff6e4852a7 libsystem_pthread.dylib`_pthread_start + 70 frame #3: 0x00007fff6e481425 libsystem_pthread.dylib`thread_start + 13 thread #77, stop reason = watchpoint 1 frame #0: 0x0000000100001391 a.out`watchpoint_func(input=0x0000000000000000) at main.cpp:77:5 frame #1: 0x00007fff6e48233d libsystem_pthread.dylib`_pthread_body + 126 frame #2: 0x00007fff6e4852a7 libsystem_pthread.dylib`_pthread_start + 70 frame #3: 0x00007fff6e481425 libsystem_pthread.dylib`thread_start + 13 thread #78, stop reason = watchpoint 1 frame #0: 0x0000000100001391 a.out`watchpoint_func(input=0x0000000000000000) at main.cpp:77:5 frame #1: 0x00007fff6e48233d libsystem_pthread.dylib`_pthread_body + 126 frame #2: 0x00007fff6e4852a7 libsystem_pthread.dylib`_pthread_start + 70 frame #3: 0x00007fff6e481425 libsystem_pthread.dylib`thread_start + 13 thread #79, stop reason = watchpoint 1 frame #0: 0x0000000100001391 a.out`watchpoint_func(input=0x0000000000000000) at main.cpp:77:5 frame #1: 0x00007fff6e48233d libsystem_pthread.dylib`_pthread_body + 126 frame #2: 0x00007fff6e4852a7 libsystem_pthread.dylib`_pthread_start + 70 frame #3: 0x00007fff6e481425 libsystem_pthread.dylib`thread_start + 13 thread #80, stop reason = watchpoint 1 frame #0: 0x0000000100001391 a.out`watchpoint_func(input=0x0000000000000000) at main.cpp:77:5 frame #1: 0x00007fff6e48233d libsystem_pthread.dylib`_pthread_body + 126 frame #2: 0x00007fff6e4852a7 libsystem_pthread.dylib`_pthread_start + 70 frame #3: 0x00007fff6e481425 libsystem_pthread.dylib`thread_start + 13 thread #81, stop reason = watchpoint 1 frame #0: 0x0000000100001391 a.out`watchpoint_func(input=0x0000000000000000) at main.cpp:77:5 frame #1: 0x00007fff6e48233d libsystem_pthread.dylib`_pthread_body + 126 frame #2: 0x00007fff6e4852a7 libsystem_pthread.dylib`_pthread_start + 70 frame #3: 0x00007fff6e481425 libsystem_pthread.dylib`thread_start + 13 thread #82, stop reason = watchpoint 1 frame #0: 0x0000000100001391 a.out`watchpoint_func(input=0x0000000000000000) at main.cpp:77:5 frame #1: 0x00007fff6e48233d libsystem_pthread.dylib`_pthread_body + 126 frame #2: 0x00007fff6e4852a7 libsystem_pthread.dylib`_pthread_start + 70 frame #3: 0x00007fff6e481425 libsystem_pthread.dylib`thread_start + 13 thread #83 frame #0: 0x00000001000f91e0 libclang_rt.asan_osx_dynamic.dylib`__asan::AsanThreadLocalMallocStorage::CommitBack() + 288 frame #1: 0x0000000100144aca libclang_rt.asan_osx_dynamic.dylib`__asan::AsanThread::Destroy() + 58 frame #2: 0x00007fff6e4826af libsystem_pthread.dylib`_pthread_tsd_cleanup + 475 frame #3: 0x00007fff6e4856b1 libsystem_pthread.dylib`_pthread_exit + 70 frame #4: 0x00007fff6e482348 libsystem_pthread.dylib`_pthread_body + 137 frame #5: 0x00007fff6e4852a7 libsystem_pthread.dylib`_pthread_start + 70 frame #6: 0x00007fff6e481425 libsystem_pthread.dylib`thread_start + 13 thread #84 frame #0: 0x00000001000f91e0 libclang_rt.asan_osx_dynamic.dylib`__asan::AsanThreadLocalMallocStorage::CommitBack() + 288 frame #1: 0x0000000100144aca libclang_rt.asan_osx_dynamic.dylib`__asan::AsanThread::Destroy() + 58 frame #2: 0x00007fff6e4826af libsystem_pthread.dylib`_pthread_tsd_cleanup + 475 frame #3: 0x00007fff6e4856b1 libsystem_pthread.dylib`_pthread_exit + 70 frame #4: 0x00007fff6e482348 libsystem_pthread.dylib`_pthread_body + 137 frame #5: 0x00007fff6e4852a7 libsystem_pthread.dylib`_pthread_start + 70 frame #6: 0x00007fff6e481425 libsystem_pthread.dylib`thread_start + 13 thread #85 frame #0: 0x00000001000f91e0 libclang_rt.asan_osx_dynamic.dylib`__asan::AsanThreadLocalMallocStorage::CommitBack() + 288 frame #1: 0x0000000100144aca libclang_rt.asan_osx_dynamic.dylib`__asan::AsanThread::Destroy() + 58 frame #2: 0x00007fff6e4826af libsystem_pthread.dylib`_pthread_tsd_cleanup + 475 frame #3: 0x00007fff6e4856b1 libsystem_pthread.dylib`_pthread_exit + 70 frame #4: 0x00007fff6e482348 libsystem_pthread.dylib`_pthread_body + 137 frame #5: 0x00007fff6e4852a7 libsystem_pthread.dylib`_pthread_start + 70 frame #6: 0x00007fff6e481425 libsystem_pthread.dylib`thread_start + 13 thread #86 frame #0: 0x00000001000f91e0 libclang_rt.asan_osx_dynamic.dylib`__asan::AsanThreadLocalMallocStorage::CommitBack() + 288 frame #1: 0x0000000100144aca libclang_rt.asan_osx_dynamic.dylib`__asan::AsanThread::Destroy() + 58 frame #2: 0x00007fff6e4826af libsystem_pthread.dylib`_pthread_tsd_cleanup + 475 frame #3: 0x00007fff6e4856b1 libsystem_pthread.dylib`_pthread_exit + 70 frame #4: 0x00007fff6e482348 libsystem_pthread.dylib`_pthread_body + 137 frame #5: 0x00007fff6e4852a7 libsystem_pthread.dylib`_pthread_start + 70 frame #6: 0x00007fff6e481425 libsystem_pthread.dylib`thread_start + 13 thread #87 frame #0: 0x00000001000f91e0 libclang_rt.asan_osx_dynamic.dylib`__asan::AsanThreadLocalMallocStorage::CommitBack() + 288 frame #1: 0x0000000100144aca libclang_rt.asan_osx_dynamic.dylib`__asan::AsanThread::Destroy() + 58 frame #2: 0x00007fff6e4826af libsystem_pthread.dylib`_pthread_tsd_cleanup + 475 frame #3: 0x00007fff6e4856b1 libsystem_pthread.dylib`_pthread_exit + 70 frame #4: 0x00007fff6e482348 libsystem_pthread.dylib`_pthread_body + 137 frame #5: 0x00007fff6e4852a7 libsystem_pthread.dylib`_pthread_start + 70 frame #6: 0x00007fff6e481425 libsystem_pthread.dylib`thread_start + 13 thread #88 frame #0: 0x00000001000f91e0 libclang_rt.asan_osx_dynamic.dylib`__asan::AsanThreadLocalMallocStorage::CommitBack() + 288 frame #1: 0x0000000100144aca libclang_rt.asan_osx_dynamic.dylib`__asan::AsanThread::Destroy() + 58 frame #2: 0x00007fff6e4826af libsystem_pthread.dylib`_pthread_tsd_cleanup + 475 frame #3: 0x00007fff6e4856b1 libsystem_pthread.dylib`_pthread_exit + 70 frame #4: 0x00007fff6e482348 libsystem_pthread.dylib`_pthread_body + 137 frame #5: 0x00007fff6e4852a7 libsystem_pthread.dylib`_pthread_start + 70 frame #6: 0x00007fff6e481425 libsystem_pthread.dylib`thread_start + 13 thread #89 frame #0: 0x00000001000f91e0 libclang_rt.asan_osx_dynamic.dylib`__asan::AsanThreadLocalMallocStorage::CommitBack() + 288 frame #1: 0x0000000100144aca libclang_rt.asan_osx_dynamic.dylib`__asan::AsanThread::Destroy() + 58 frame #2: 0x00007fff6e4826af libsystem_pthread.dylib`_pthread_tsd_cleanup + 475 frame #3: 0x00007fff6e4856b1 libsystem_pthread.dylib`_pthread_exit + 70 frame #4: 0x00007fff6e482348 libsystem_pthread.dylib`_pthread_body + 137 frame #5: 0x00007fff6e4852a7 libsystem_pthread.dylib`_pthread_start + 70 frame #6: 0x00007fff6e481425 libsystem_pthread.dylib`thread_start + 13 thread #90 frame #0: 0x00000001000f91e0 libclang_rt.asan_osx_dynamic.dylib`__asan::AsanThreadLocalMallocStorage::CommitBack() + 288 frame #1: 0x0000000100144aca libclang_rt.asan_osx_dynamic.dylib`__asan::AsanThread::Destroy() + 58 frame #2: 0x00007fff6e4826af libsystem_pthread.dylib`_pthread_tsd_cleanup + 475 frame #3: 0x00007fff6e4856b1 libsystem_pthread.dylib`_pthread_exit + 70 frame #4: 0x00007fff6e482348 libsystem_pthread.dylib`_pthread_body + 137 frame #5: 0x00007fff6e4852a7 libsystem_pthread.dylib`_pthread_start + 70 frame #6: 0x00007fff6e481425 libsystem_pthread.dylib`thread_start + 13 thread #91 frame #0: 0x00000001000f91e0 libclang_rt.asan_osx_dynamic.dylib`__asan::AsanThreadLocalMallocStorage::CommitBack() + 288 frame #1: 0x0000000100144aca libclang_rt.asan_osx_dynamic.dylib`__asan::AsanThread::Destroy() + 58 frame #2: 0x00007fff6e4826af libsystem_pthread.dylib`_pthread_tsd_cleanup + 475 frame #3: 0x00007fff6e4856b1 libsystem_pthread.dylib`_pthread_exit + 70 frame #4: 0x00007fff6e482348 libsystem_pthread.dylib`_pthread_body + 137 frame #5: 0x00007fff6e4852a7 libsystem_pthread.dylib`_pthread_start + 70 frame #6: 0x00007fff6e481425 libsystem_pthread.dylib`thread_start + 13 thread #92 frame #0: 0x00000001000f91e0 libclang_rt.asan_osx_dynamic.dylib`__asan::AsanThreadLocalMallocStorage::CommitBack() + 288 frame #1: 0x0000000100144aca libclang_rt.asan_osx_dynamic.dylib`__asan::AsanThread::Destroy() + 58 frame #2: 0x00007fff6e4826af libsystem_pthread.dylib`_pthread_tsd_cleanup + 475 frame #3: 0x00007fff6e4856b1 libsystem_pthread.dylib`_pthread_exit + 70 frame #4: 0x00007fff6e482348 libsystem_pthread.dylib`_pthread_body + 137 frame #5: 0x00007fff6e4852a7 libsystem_pthread.dylib`_pthread_start + 70 frame #6: 0x00007fff6e481425 libsystem_pthread.dylib`thread_start + 13 thread #93, stop reason = watchpoint 1 frame #0: 0x0000000100001391 a.out`watchpoint_func(input=0x0000000000000000) at main.cpp:77:5 frame #1: 0x00007fff6e48233d libsystem_pthread.dylib`_pthread_body + 126 frame #2: 0x00007fff6e4852a7 libsystem_pthread.dylib`_pthread_start + 70 frame #3: 0x00007fff6e481425 libsystem_pthread.dylib`thread_start + 13 thread #94, stop reason = watchpoint 1 frame #0: 0x0000000100001391 a.out`watchpoint_func(input=0x0000000000000000) at main.cpp:77:5 frame #1: 0x00007fff6e48233d libsystem_pthread.dylib`_pthread_body + 126 frame #2: 0x00007fff6e4852a7 libsystem_pthread.dylib`_pthread_start + 70 frame #3: 0x00007fff6e481425 libsystem_pthread.dylib`thread_start + 13 thread #95, stop reason = watchpoint 1 frame #0: 0x0000000100001391 a.out`watchpoint_func(input=0x0000000000000000) at main.cpp:77:5 frame #1: 0x00007fff6e48233d libsystem_pthread.dylib`_pthread_body + 126 frame #2: 0x00007fff6e4852a7 libsystem_pthread.dylib`_pthread_start + 70 frame #3: 0x00007fff6e481425 libsystem_pthread.dylib`thread_start + 13 thread #96, stop reason = watchpoint 1 frame #0: 0x0000000100001391 a.out`watchpoint_func(input=0x0000000000000000) at main.cpp:77:5 frame #1: 0x00007fff6e48233d libsystem_pthread.dylib`_pthread_body + 126 frame #2: 0x00007fff6e4852a7 libsystem_pthread.dylib`_pthread_start + 70 frame #3: 0x00007fff6e481425 libsystem_pthread.dylib`thread_start + 13 thread #97, stop reason = watchpoint 1 frame #0: 0x0000000100001391 a.out`watchpoint_func(input=0x0000000000000000) at main.cpp:77:5 frame #1: 0x00007fff6e48233d libsystem_pthread.dylib`_pthread_body + 126 frame #2: 0x00007fff6e4852a7 libsystem_pthread.dylib`_pthread_start + 70 frame #3: 0x00007fff6e481425 libsystem_pthread.dylib`thread_start + 13 thread #98, stop reason = watchpoint 1 frame #0: 0x0000000100001391 a.out`watchpoint_func(input=0x0000000000000000) at main.cpp:77:5 frame #1: 0x00007fff6e48233d libsystem_pthread.dylib`_pthread_body + 126 frame #2: 0x00007fff6e4852a7 libsystem_pthread.dylib`_pthread_start + 70 frame #3: 0x00007fff6e481425 libsystem_pthread.dylib`thread_start + 13 thread #99, stop reason = watchpoint 1 frame #0: 0x0000000100001391 a.out`watchpoint_func(input=0x0000000000000000) at main.cpp:77:5 frame #1: 0x00007fff6e48233d libsystem_pthread.dylib`_pthread_body + 126 frame #2: 0x00007fff6e4852a7 libsystem_pthread.dylib`_pthread_start + 70 frame #3: 0x00007fff6e481425 libsystem_pthread.dylib`thread_start + 13 thread #100 frame #0: 0x00000001000f91e0 libclang_rt.asan_osx_dynamic.dylib`__asan::AsanThreadLocalMallocStorage::CommitBack() + 288 frame #1: 0x0000000100144aca libclang_rt.asan_osx_dynamic.dylib`__asan::AsanThread::Destroy() + 58 frame #2: 0x00007fff6e4826af libsystem_pthread.dylib`_pthread_tsd_cleanup + 475 frame #3: 0x00007fff6e4856b1 libsystem_pthread.dylib`_pthread_exit + 70 frame #4: 0x00007fff6e482348 libsystem_pthread.dylib`_pthread_body + 137 frame #5: 0x00007fff6e4852a7 libsystem_pthread.dylib`_pthread_start + 70 frame #6: 0x00007fff6e481425 libsystem_pthread.dylib`thread_start + 13 thread #101 frame #0: 0x00000001000f91e0 libclang_rt.asan_osx_dynamic.dylib`__asan::AsanThreadLocalMallocStorage::CommitBack() + 288 frame #1: 0x0000000100144aca libclang_rt.asan_osx_dynamic.dylib`__asan::AsanThread::Destroy() + 58 frame #2: 0x00007fff6e4826af libsystem_pthread.dylib`_pthread_tsd_cleanup + 475 frame #3: 0x00007fff6e4856b1 libsystem_pthread.dylib`_pthread_exit + 70 frame #4: 0x00007fff6e482348 libsystem_pthread.dylib`_pthread_body + 137 frame #5: 0x00007fff6e4852a7 libsystem_pthread.dylib`_pthread_start + 70 frame #6: 0x00007fff6e481425 libsystem_pthread.dylib`thread_start + 13

Hide Details

Hide Details

runCmd: continue output: Process 29204 resuming Process 29204 stopped * thread #1, queue = 'com.apple.main-thread', stop reason = breakpoint 2.1 frame #0: 0x0000000100001d49 a.out`main at main.cpp:184:5 181 int main () 182 { 183 dotest(); -> 184 return 0; // Break here and verify one thread is active. ^ 185 } 186 187

Hide Details

Hide Details

Hide Details

runCmd: continue output: Process 29204 resuming Process 29204 exited with status = 0 (0x00000000)

Hide Details

Hide Details

Hide Details

FAIL: LLDB (/Users/buildslave/jenkins/workspace/lldb-cmake-sanitized/lldb-build/bin/clang-10-x86_64) :: test (TestConcurrentManyWatchpoints.ConcurrentManyWatchpoints) <bound method SBProcess.Kill of <lldb.SBProcess; proxy of <Swig Object of type 'lldb::SBProcess *' at 0x107965540> >>: success

Hide Details

Restore dir to: /Users/buildslave/jenkins/workspace/lldb-cmake-sanitized/lldb-build/tools/lldb/test ====================================================================== FAIL: test (TestConcurrentManyWatchpoints.ConcurrentManyWatchpoints) Test 100 watchpoints from 100 threads. ---------------------------------------------------------------------- Traceback (most recent call last): File "/Users/buildslave/jenkins/workspace/lldb-cmake-sanitized/llvm-project/lldb/packages/Python/lldbsuite/test/decorators.py", line 140, in wrapper func(*args, **kwargs) File "/Users/buildslave/jenkins/workspace/lldb-cmake-sanitized/llvm-project/lldb/packages/Python/lldbsuite/test/decorators.py", line 140, in wrapper func(*args, **kwargs) File "/Users/buildslave/jenkins/workspace/lldb-cmake-sanitized/llvm-project/lldb/packages/Python/lldbsuite/test/functionalities/thread/concurrent_events/TestConcurrentManyWatchpoints.py", line 21, in test self.do_thread_actions(num_watchpoint_threads=100) File "/Users/buildslave/jenkins/workspace/lldb-cmake-sanitized/llvm-project/lldb/packages/Python/lldbsuite/test/concurrent_base.py", line 284, in do_thread_actions watchpoint_hit_count)) AssertionError: 100 != 99 : Expected 100 watchpoint hits, got 99 Config=x86_64-/Users/buildslave/jenkins/workspace/lldb-cmake-sanitized/lldb-build/bin/clang-10 ---------------------------------------------------------------------- Ran 1 test in 34.824s

Hide Details

RESULT: FAILED (0 passes, 1 failures, 0 errors, 0 skipped, 0 expected failures, 0 unexpected successes)

Hide Details

******************** PASS: lldb-api :: lang/cpp/limit-debug-info/TestWithLimitDebugInfo.py (1683 of 1892) PASS: lldb-api :: lang/objc/objc-optimized/TestObjcOptimized.py (1684 of 1892) PASS: lldb-api :: functionalities/stats_api/TestStatisticsAPI.py (1685 of 1892) PASS: lldb-unit :: Utility/./UtilityTests/StreamTest.PutHex64ByteOrderBig (1686 of 1892) PASS: lldb-unit :: ObjectFile/Breakpad/./ObjectFileBreakpadTests/InfoRecord.parse (1687 of 1892) PASS: lldb-unit :: Language/Highlighting/./HighlighterTests/HighlighterTest.ClangCommas (1688 of 1892) PASS: lldb-unit :: Utility/./UtilityTests/UUIDTest.Validity (1689 of 1892) PASS: lldb-api :: lang/objcxx/cxx-bridged-po/TestObjCXXBridgedPO.py (1690 of 1892) PASS: lldb-unit :: Utility/./UtilityTests/Flags.AllSet (1691 of 1892) PASS: lldb-unit :: Symbol/./SymbolTests/TestClangASTImporter.MetadataPropagationAfterCopying (1692 of 1892) PASS: lldb-unit :: Utility/./UtilityTests/StreamTest.AddressPrefixAndSuffix (1693 of 1892) PASS: lldb-api :: commands/expression/import-std-module/basic/TestImportStdModule.py (1694 of 1892) PASS: lldb-api :: functionalities/thread/concurrent_events/TestConcurrentDelaySignalWatch.py (1695 of 1892) PASS: lldb-unit :: Utility/./UtilityTests/DataExtractorTest.GetBitfield (1696 of 1892) PASS: lldb-unit :: Utility/./UtilityTests/FileSpecTest.CopyByAppendingPathComponent (1697 of 1892) PASS: lldb-api :: functionalities/data-formatter/data-formatter-python-synth/TestDataFormatterPythonSynth.py (1698 of 1892) PASS: lldb-api :: functionalities/thread/concurrent_events/TestConcurrentTwoBreakpointsOneWatchpoint.py (1699 of 1892) PASS: lldb-api :: functionalities/data-formatter/data-formatter-stl/libcxx/string/TestDataFormatterLibcxxString.py (1700 of 1892) PASS: lldb-api :: commands/command/invalid-args/TestInvalidArgsCommand.py (1701 of 1892) PASS: lldb-unit :: Utility/./UtilityTests/OptionsWithRawTest.EmptyArgsOnlySuffix (1702 of 1892) PASS: lldb-api :: python_api/process/read-mem-cstring/TestReadMemCString.py (1703 of 1892) PASS: lldb-api :: lang/objc/modules-cache/TestClangModulesCache.py (1704 of 1892) PASS: lldb-api :: functionalities/breakpoint/dummy_target_breakpoints/TestBreakpointsWithNoTargets.py (1705 of 1892) PASS: lldb-shell :: ExecControl/StopHook/stop-hook.test (1706 of 1892) PASS: lldb-unit :: Language/Highlighting/./HighlighterTests/HighlighterTest.ClangScalarLiterals (1707 of 1892) PASS: lldb-unit :: Host/./HostTests/NativeProcessProtocolTest.ReadCStringFromMemory_CrossPageBoundary (1708 of 1892) PASS: lldb-api :: python_api/lldbutil/TestSwigVersion.py (1709 of 1892) PASS: lldb-api :: python_api/watchpoint/watchlocation/TestSetWatchlocation.py (1710 of 1892) PASS: lldb-unit :: Utility/./UtilityTests/StatusTest.Formatv (1711 of 1892) PASS: lldb-api :: python_api/sbvalue_const_addrof/TestSBValueConstAddrOf.py (1712 of 1892) PASS: lldb-shell :: ObjectFile/Breakpad/uuid-matching-mac.test (1713 of 1892) PASS: lldb-api :: functionalities/breakpoint/breakpoint_command/TestRegexpBreakCommand.py (1714 of 1892) PASS: lldb-unit :: Utility/./UtilityTests/StringLexerTest.HasAtLeast (1715 of 1892) PASS: lldb-api :: lang/cpp/unicode-literals/TestUnicodeLiterals.py (1716 of 1892) PASS: lldb-api :: functionalities/data-formatter/refpointer-recursion/TestDataFormatterRefPtrRecursion.py (1717 of 1892) PASS: lldb-shell :: SymbolFile/NativePDB/tag-types.cpp (1718 of 1892) PASS: lldb-unit :: Utility/./UtilityTests/StreamTest.QuotedCString (1719 of 1892) PASS: lldb-api :: functionalities/thread/concurrent_events/TestConcurrentManyBreakpoints.py (1720 of 1892) UNSUPPORTED: lldb-api :: functionalities/process_save_core/TestProcessSaveCore.py (1721 of 1892) PASS: lldb-api :: lang/objc/objc-ivar-protocols/TestIvarProtocols.py (1722 of 1892) PASS: lldb-unit :: Utility/./UtilityTests/ArchSpecTest.TripleComponentsWereSpecified (1723 of 1892) PASS: lldb-unit :: SymbolFile/DWARF/./SymbolFileDWARFTests/SymbolFileDWARFTests.TestAbilitiesForDWARF (1724 of 1892) PASS: lldb-shell :: SymbolFile/DWARF/clang-ast-from-dwarf-unamed-and-anon-structs.cpp (1725 of 1892) PASS: lldb-api :: commands/expression/import-std-module/deque-basic/TestBasicDeque.py (1726 of 1892) PASS: lldb-api :: functionalities/data-formatter/language_category_updates/TestDataFormatterLanguageCategoryUpdates.py (1727 of 1892) PASS: lldb-api :: commands/expression/import-std-module/vector-basic/TestBasicVector.py (1728 of 1892) UNSUPPORTED: lldb-api :: functionalities/longjmp/TestLongjmp.py (1729 of 1892) UNSUPPORTED: lldb-shell :: ObjectFile/ELF/minidebuginfo-set-and-hit-breakpoint.test (1730 of 1892) PASS: lldb-unit :: UnwindAssembly/x86/./UnwindAssemblyx86Tests/Testx86AssemblyInspectionEngine.TestPushR14 (1731 of 1892) PASS: lldb-api :: functionalities/breakpoint/breakpoint_names/TestBreakpointNames.py (1732 of 1892) PASS: lldb-unit :: ScriptInterpreter/Python/./ScriptInterpreterPythonTests/PythonDataObjectsTest.TestPythonBoolean (1733 of 1892) PASS: lldb-unit :: Utility/./UtilityTests/StringListTest.PopBack (1734 of 1892) PASS: lldb-shell :: SymbolFile/DWARF/find-basic-namespace.cpp (1735 of 1892) PASS: lldb-unit :: UnwindAssembly/x86/./UnwindAssemblyx86Tests/Testx86AssemblyInspectionEngine.TestSubRSP (1736 of 1892) PASS: lldb-api :: api/log/TestAPILog.py (1737 of 1892) PASS: lldb-shell :: Unwind/trap_frame_sym_ctx.test (1738 of 1892) PASS: lldb-api :: commands/expression/import-std-module/sysroot/TestStdModuleSysroot.py (1739 of 1892) PASS: lldb-unit :: Process/gdb-remote/./ProcessGdbRemoteTests/GDBRemoteClientBaseTest.SendContinueAndLateInterrupt (1740 of 1892) PASS: lldb-api :: lang/c/struct_types/TestStructTypes.py (1741 of 1892) PASS: lldb-shell :: Breakpoint/dummy-target.test (1742 of 1892) PASS: lldb-api :: functionalities/signal/handle-abrt/TestHandleAbort.py (1743 of 1892) PASS: lldb-unit :: Utility/./UtilityTests/ScalarTest.Promotion (1744 of 1892) PASS: lldb-api :: lang/c/inlines/TestRedefinitionsInInlines.py (1745 of 1892) PASS: lldb-api :: lang/cpp/rvalue-references/TestRvalueReferences.py (1746 of 1892) PASS: lldb-api :: python_api/value/TestValueAPI.py (1747 of 1892) PASS: lldb-api :: commands/expression/completion-crash-incomplete-record/TestCompletionCrashIncompleteRecord.py (1748 of 1892) UNSUPPORTED: lldb-api :: python_api/event/TestEvents.py (1749 of 1892) UNSUPPORTED: lldb-shell :: BuildScript/toolchain-msvc.test (1750 of 1892) PASS: lldb-api :: commands/process/launch/TestProcessLaunch.py (1751 of 1892) PASS: lldb-shell :: Reproducer/TestDriverOptions.test (1752 of 1892) PASS: lldb-shell :: Driver/TestFile.test (1753 of 1892) PASS: lldb-unit :: Utility/./UtilityTests/LogChannelTest.Disable (1754 of 1892) PASS: lldb-unit :: Process/minidump/./LLDBMinidumpTests/MinidumpParserTest.GetThreadContext_x86_32 (1755 of 1892) PASS: lldb-unit :: Utility/./UtilityTests/RecordReplayTest.InstrumentedBar (1756 of 1892) PASS: lldb-api :: lang/c/array_types/TestArrayTypes.py (1757 of 1892) PASS: lldb-shell :: Reproducer/TestDump.test (1758 of 1892) PASS: lldb-unit :: Utility/./UtilityTests/StringExtractorTest.GetHexU8_Underflow2_NoEof (1759 of 1892) PASS: lldb-api :: types/TestShortType.py (1760 of 1892) PASS: lldb-unit :: UnwindAssembly/x86/./UnwindAssemblyx86Tests/Testx86AssemblyInspectionEngine.Test32BitOnlyInstruction (1761 of 1892) PASS: lldb-shell :: Reproducer/Functionalities/TestImageList.test (1762 of 1892) PASS: lldb-api :: python_api/rdar-12481949/Test-rdar-12481949.py (1763 of 1892) PASS: lldb-shell :: SymbolFile/DWARF/dwarf5_locations.s (1764 of 1892) PASS: lldb-unit :: UnwindAssembly/x86/./UnwindAssemblyx86Tests/Testx86AssemblyInspectionEngine.TestStackRealign32BitDisp_x86_64 (1765 of 1892) PASS: lldb-unit :: Target/./TargetTests/ModuleCacheTest.GetAndPutStrangeHostname (1766 of 1892) PASS: lldb-api :: functionalities/postmortem/minidump-new/TestMiniDumpUUID.py (1767 of 1892) PASS: lldb-shell :: SymbolFile/NativePDB/globals-fundamental.cpp (1768 of 1892) PASS: lldb-api :: arm/emulation/TestEmulations.py (1769 of 1892) PASS: lldb-api :: lang/objc/objc_direct-methods/TestObjCDirectMethods.py (1770 of 1892) PASS: lldb-unit :: UnwindAssembly/x86/./UnwindAssemblyx86Tests/Testx86AssemblyInspectionEngine.TestSubESP (1771 of 1892) PASS: lldb-api :: functionalities/mtc/simple/TestMTCSimple.py (1772 of 1892) PASS: lldb-api :: functionalities/thread/concurrent_events/TestConcurrentSignalDelayBreak.py (1773 of 1892) PASS: lldb-unit :: Language/Highlighting/./HighlighterTests/HighlighterTest.ClangSquareBrackets (1774 of 1892) PASS: lldb-unit :: Utility/./UtilityTests/Flags.Test (1775 of 1892) PASS: lldb-shell :: ObjectFile/ELF/PT_LOAD-overlap-section.yaml (1776 of 1892) PASS: lldb-unit :: Symbol/./SymbolTests/PostfixExpression.ToDWARF (1777 of 1892) PASS: lldb-unit :: Utility/./UtilityTests/ScalarTest.Division (1778 of 1892) PASS: lldb-api :: functionalities/show_location/TestShowLocationDwarf5.py (1779 of 1892) PASS: lldb-api :: commands/platform/process/TestProcessList.py (1780 of 1892) PASS: lldb-api :: driver/batch_mode/TestBatchMode.py (1781 of 1892) PASS: lldb-unit :: Process/minidump/./LLDBMinidumpTests/MinidumpParserTest.GetMemoryRegionInfo (1782 of 1892) PASS: lldb-unit :: Utility/./UtilityTests/StringExtractorTest.GetHexBytes_OddPair2 (1783 of 1892) PASS: lldb-unit :: Language/Highlighting/./HighlighterTests/HighlighterTest.ClangPreserveNewLine (1784 of 1892) PASS: lldb-api :: lang/c/unions/TestUnionMembers.py (1785 of 1892) UNSUPPORTED: lldb-api :: functionalities/data-formatter/data-formatter-stl/libstdcpp/tuple/TestDataFormatterStdTuple.py (1786 of 1892) PASS: lldb-unit :: Utility/./UtilityTests/ArchSpecTest.MergeFromMachOUnknown (1787 of 1892) PASS: lldb-api :: tools/lldb-server/inferior-crash/TestGdbRemoteSegFault.py (1788 of 1892) PASS: lldb-unit :: Utility/./UtilityTests/BinaryStreamTest.PutULEB128SixBytes (1789 of 1892) UNSUPPORTED: lldb-api :: functionalities/tty/TestTerminal.py (1790 of 1892) PASS: lldb-api :: lang/objc/objc-new-syntax/TestObjCNewSyntaxDictionary.py (1791 of 1892) PASS: lldb-shell :: SymbolFile/DWARF/split-dwarf-multiple-cu.ll (1792 of 1892) PASS: lldb-unit :: Utility/./UtilityTests/AnsiTerminal.AtStart (1793 of 1892) UNSUPPORTED: lldb-shell :: SymbolFile/PDB/variables.test (1794 of 1892) PASS: lldb-shell :: SymbolFile/DWARF/gnu-style-compression.cpp (1795 of 1892) PASS: lldb-shell :: ObjectFile/MachO/symtab.yaml (1796 of 1892) PASS: lldb-shell :: Expr/TestIRMemoryMap.test (1797 of 1892) PASS: lldb-api :: lang/cpp/dynamic-value/TestDynamicValue.py (1798 of 1892) UNSUPPORTED: lldb-api :: commands/expression/multiline-completion/TestMultilineCompletion.py (1799 of 1892) UNSUPPORTED: lldb-shell :: SymbolFile/PDB/compilands.test (1800 of 1892) PASS: lldb-unit :: Utility/./UtilityTests/BinaryStreamTest.PutSLEB128MaxValue (1801 of 1892) PASS: lldb-api :: functionalities/data-formatter/data-formatter-enum-format/TestDataFormatterEnumFormat.py (1802 of 1892) PASS: lldb-api :: lang/cpp/offsetof/TestOffsetofCpp.py (1803 of 1892) PASS: lldb-unit :: Host/./HostTests/MainLoopTest.UnmonitoredSignal (1804 of 1892) PASS: lldb-api :: functionalities/thread/concurrent_events/TestConcurrentCrashWithSignal.py (1805 of 1892) PASS: lldb-api :: functionalities/data-formatter/pyobjsynthprovider/TestPyObjSynthProvider.py (1806 of 1892) PASS: lldb-api :: commands/command/script/TestCommandScript.py (1807 of 1892) PASS: lldb-api :: functionalities/breakpoint/breakpoint_ids/TestBreakpointIDs.py (1808 of 1892) PASS: lldb-api :: functionalities/thread/concurrent_events/TestConcurrentTwoWatchpointsOneDelayBreakpoint.py (1809 of 1892) PASS: lldb-unit :: Utility/./UtilityTests/StreamTest.PutBytesAsRawHex8ToBigEndian (1810 of 1892) PASS: lldb-unit :: Utility/./UtilityTests/OptionsWithRawTest.MultiWordSuffix (1811 of 1892) PASS: lldb-unit :: Utility/./UtilityTests/Flags.AnyClear (1812 of 1892) PASS: lldb-unit :: ScriptInterpreter/Python/./ScriptInterpreterPythonTests/PythonDataObjectsTest.TestPythonByteArray (1813 of 1892) PASS: lldb-api :: functionalities/gdb_remote_client/TestNoGPacketSupported.py (1814 of 1892) PASS: lldb-unit :: Utility/./UtilityTests/DataExtractorTest.GetCStrAtEnd (1815 of 1892) PASS: lldb-unit :: Expression/./ExpressionTests/CppModuleConfigurationTest.UnknownLibCppFile (1816 of 1892) PASS: lldb-unit :: Utility/./UtilityTests/LogTest.LLDB_LOG_nullptr (1817 of 1892) UNSUPPORTED: lldb-api :: lang/objc/objc-dynamic-value/TestObjCDynamicValue.py (1818 of 1892) PASS: lldb-unit :: Expression/./ExpressionTests/DiagnosticManagerTest.GetStringSeverityLabels (1819 of 1892) UNSUPPORTED: lldb-shell :: Unwind/unwind-plan-dwarf-dump.test (1820 of 1892) PASS: lldb-unit :: UnwindAssembly/x86/./UnwindAssemblyx86Tests/Testx86AssemblyInspectionEngine.TestPushR13 (1821 of 1892) UNSUPPORTED: lldb-api :: benchmarks/expression/TestRepeatedExprs.py (1822 of 1892) PASS: lldb-unit :: SymbolFile/NativePDB/./SymbolFileNativePDBTests/PDBFPOProgramToDWARFExpressionTests.UnresolvedRegisterReference (1823 of 1892) PASS: lldb-unit :: Process/gdb-remote/./ProcessGdbRemoteTests/GDBRemoteCommunicationClientTest.SendGetTraceConfigPacket (1824 of 1892) PASS: lldb-api :: commands/expression/import_builtin_fileid/TestImportBuiltinFileID.py (1825 of 1892) PASS: lldb-unit :: Utility/./UtilityTests/LogTest.Unregister (1826 of 1892) PASS: lldb-unit :: ObjectFile/ELF/./ObjectFileELFTests/ObjectFileELFTest.GetModuleSpecifications_EarlySectionHeaders (1827 of 1892) PASS: lldb-unit :: Utility/./UtilityTests/StreamTeeTest.GetStreamAtIndexOutOfBoundsEmpty (1828 of 1892) UNSUPPORTED: lldb-shell :: Register/x86-gp-write.test (1829 of 1892) PASS: lldb-api :: functionalities/data-formatter/data-formatter-stl/libcxx/initializerlist/TestInitializerList.py (1830 of 1892) PASS: lldb-unit :: Language/Highlighting/./HighlighterTests/HighlighterTest.ClangTrailingBackslashWithWhitespace (1831 of 1892) PASS: lldb-api :: functionalities/data-formatter/array_typedef/TestArrayTypedef.py (1832 of 1892) PASS: lldb-api :: functionalities/data-formatter/synthupdate/TestSyntheticFilterRecompute.py (1833 of 1892) PASS: lldb-api :: commands/expression/persistent_variables/TestPersistentVariables.py (1834 of 1892) PASS: lldb-api :: lang/c/strings/TestCStrings.py (1835 of 1892) PASS: lldb-api :: commands/source/info/TestSourceInfo.py (1836 of 1892) PASS: lldb-api :: commands/expression/options/TestExprOptions.py (1837 of 1892) PASS: lldb-unit :: Utility/./UtilityTests/StateTest.Formatv (1838 of 1892) PASS: lldb-api :: commands/command/script_alias/TestCommandScriptAlias.py (1839 of 1892) PASS: lldb-api :: commands/breakpoint/command/list/TestBreakpointCommandList.py (1840 of 1892) PASS: lldb-api :: functionalities/postmortem/mach-core/TestMachCore.py (1841 of 1892) PASS: lldb-unit :: Utility/./UtilityTests/ScalarTest.Scalar_512 (1842 of 1892) PASS: lldb-shell :: Minidump/disassemble-no-module.yaml (1843 of 1892) PASS: lldb-unit :: Utility/./UtilityTests/StreamTest.PutCString (1844 of 1892) PASS: lldb-unit :: ObjectFile/Breakpad/./ObjectFileBreakpadTests/PublicRecord.parse (1845 of 1892) PASS: lldb-unit :: Utility/./UtilityTests/BinaryStreamTest.PutSLEB128ThreeBytes (1846 of 1892) PASS: lldb-unit :: Core/./LLDBCoreTests/MangledTest.ResultForValidName (1847 of 1892) PASS: lldb-api :: commands/help/TestHelp.py (1848 of 1892) PASS: lldb-unit :: Utility/./UtilityTests/StreamTest.PutHex32ByteOrderBig (1849 of 1892) PASS: lldb-unit :: Utility/./UtilityTests/ScalarTest.CastOperations (1850 of 1892) PASS: lldb-shell :: SymbolFile/DWARF/forward-declarations.s (1851 of 1892) PASS: lldb-api :: functionalities/postmortem/minidump/TestMiniDump.py (1852 of 1892) UNSUPPORTED: lldb-shell :: Register/x86-zmm-write.test (1853 of 1892) PASS: lldb-unit :: Utility/./UtilityTests/RangeTest.Slide (1854 of 1892) PASS: lldb-api :: lang/cpp/bool/TestCPPBool.py (1855 of 1892) PASS: lldb-unit :: Utility/./UtilityTests/StringExtractorTest.GetHexBytesAvail (1856 of 1892) PASS: lldb-unit :: Utility/./UtilityTests/UriParserTest.BadPort (1857 of 1892) PASS: lldb-shell :: ObjectFile/ELF/section-permissions.yaml (1858 of 1892) PASS: lldb-unit :: Utility/./UtilityTests/StreamTest.AddressNoSuffix (1859 of 1892) PASS: lldb-unit :: Process/minidump/./LLDBMinidumpTests/MinidumpParserTest.GetPid (1860 of 1892) PASS: lldb-api :: python_api/sbdata/TestSBData.py (1861 of 1892) PASS: lldb-shell :: SymbolFile/Breakpad/line-table-missing-file.test (1862 of 1892) UNSUPPORTED: lldb-shell :: SymbolFile/PDB/calling-conventions.test (1863 of 1892) PASS: lldb-unit :: Utility/./UtilityTests/StringExtractorTest.DecodeHexU8_Exact (1864 of 1892) PASS: lldb-api :: commands/expression/save_jit_objects/TestSaveJITObjects.py (1865 of 1892) PASS: lldb-unit :: Utility/./UtilityTests/StringLexerTest.Peek (1866 of 1892) PASS: lldb-unit :: Utility/./UtilityTests/StringListTest.JoinSingle (1867 of 1892) PASS: lldb-unit :: Process/minidump/./LLDBMinidumpTests/RegisterContextMinidump.ConvertMinidumpContext_x86_64 (1868 of 1892) PASS: lldb-shell :: ObjectFile/ELF/compressed-sections.yaml (1869 of 1892) PASS: lldb-unit :: Language/Highlighting/./HighlighterTests/HighlighterTest.HighlighterSelectionType (1870 of 1892) PASS: lldb-unit :: Language/CPlusPlus/./LanguageCPlusPlusTests/CPlusPlusLanguage.ExtractContextAndIdentifier (1871 of 1892) PASS: lldb-unit :: Symbol/./SymbolTests/TestClangASTImporter.CopyTypeTagDecl (1872 of 1892) PASS: lldb-unit :: Expression/./ExpressionTests/DiagnosticManagerTest.GetStringBasic (1873 of 1892) PASS: lldb-unit :: Signals/./SignalsTests/UnixSignalsTest.Iteration (1874 of 1892) PASS: lldb-api :: commands/expression/unicode-in-variable/TestUnicodeInVariable.py (1875 of 1892) PASS: lldb-api :: commands/expression/char/TestExprsChar.py (1876 of 1892) UNSUPPORTED: lldb-api :: functionalities/asan/TestMemoryHistory.py (1877 of 1892) PASS: lldb-api :: lang/objc/objc-baseclass-sbtype/TestObjCBaseClassSBType.py (1878 of 1892) PASS: lldb-api :: commands/target/basic/TestTargetCommand.py (1879 of 1892) PASS: lldb-api :: functionalities/thread/concurrent_events/TestConcurrentDelayedCrashWithBreakpointSignal.py (1880 of 1892) PASS: lldb-api :: functionalities/recursion/TestValueObjectRecursion.py (1881 of 1892) PASS: lldb-api :: commands/expression/import-std-module/shared_ptr/TestSharedPtr.py (1882 of 1892) PASS: lldb-api :: lang/objc/objc-super/TestObjCSuper.py (1883 of 1892) PASS: lldb-api :: lang/objc/foundation/TestObjCMethodsNSArray.py (1884 of 1892) FAIL: lldb-api :: functionalities/data-formatter/data-formatter-objc/TestDataFormatterObjCNSBundle.py (1885 of 1892) ******************** TEST 'lldb-api :: functionalities/data-formatter/data-formatter-objc/TestDataFormatterObjCNSBundle.py' FAILED ******************** lldb version 10.0.99 (http://labmaster3.local/git/llvm-project.git revision c1b13a1b17719aebace1b3be7a6ac7f90b1901a6) clang revision b1dcd84c7ea3c97ddd73f629441be24791f23624 llvm revision b1dcd84c7ea3c97ddd73f629441be24791f23624 LLDB library dir: /Users/buildslave/jenkins/workspace/lldb-cmake-sanitized/lldb-build/bin LLDB import library dir: /Users/buildslave/jenkins/workspace/lldb-cmake-sanitized/lldb-build/bin libstdcxx tests will not be run because: Don't know how to build with libstdcxx on macosx Skipping following debug info categories: ['dwo'] AddressSanitizer report breakpoint hit. Use 'thread info -s' to get extended information about the report. AddressSanitizer report breakpoint hit. Use 'thread info -s' to get extended information about the report. AddressSanitizer report breakpoint hit. Use 'thread info -s' to get extended information about the report.

Hide Details

Session logs for test failures/errors/unexpected successes will go into directory '/Users/buildslave/jenkins/workspace/lldb-cmake-sanitized/test/logs' Command invoked: /Users/buildslave/jenkins/workspace/lldb-cmake-sanitized/llvm-project/lldb/test/API/dotest.py --arch x86_64 -s /Users/buildslave/jenkins/workspace/lldb-cmake-sanitized/lldb-build/lldb-test-traces -S nm -u CXXFLAGS -u CFLAGS --codesign-identity lldb_codesign --server /Users/buildslave/jenkins/workspace/lldb-cmake-sanitized/lldb-build/./bin/debugserver --arch x86_64 --build-dir /Users/buildslave/jenkins/workspace/lldb-cmake-sanitized/lldb-build/lldb-test-build.noindex -s=/Users/buildslave/jenkins/workspace/lldb-cmake-sanitized/test/logs -t --env TERM=vt100 --env LLVM_LIBS_DIR=/Users/buildslave/jenkins/workspace/lldb-cmake-sanitized/lldb-build/./lib --inferior-env ASAN_OPTIONS=detect_stack_use_after_return=1 --inferior-env DYLD_INSERT_LIBRARIES=/Users/buildslave/jenkins/workspace/lldb-cmake-sanitized/host-compiler/lib/clang/10.0.0/lib/darwin/libclang_rt.asan_osx_dynamic.dylib --build-dir /Users/buildslave/jenkins/workspace/lldb-cmake-sanitized/lldb-build/lldb-test-build.noindex --lldb-module-cache-dir /Users/buildslave/jenkins/workspace/lldb-cmake-sanitized/lldb-build/lldb-test-build.noindex/module-cache-lldb/lldb-api --clang-module-cache-dir /Users/buildslave/jenkins/workspace/lldb-cmake-sanitized/lldb-build/lldb-test-build.noindex/module-cache-clang/lldb-api --executable /Users/buildslave/jenkins/workspace/lldb-cmake-sanitized/lldb-build/./bin/lldb --compiler /Users/buildslave/jenkins/workspace/lldb-cmake-sanitized/lldb-build/./bin/clang --dsymutil /Users/buildslave/jenkins/workspace/lldb-cmake-sanitized/lldb-build/./bin/dsymutil --filecheck /Users/buildslave/jenkins/workspace/lldb-cmake-sanitized/lldb-build/./bin/FileCheck /Users/buildslave/jenkins/workspace/lldb-cmake-sanitized/llvm-project/lldb/packages/Python/lldbsuite/test/functionalities/data-formatter/data-formatter-objc -p TestDataFormatterObjCNSBundle.py Change dir to: /Users/buildslave/jenkins/workspace/lldb-cmake-sanitized/llvm-project/lldb/packages/Python/lldbsuite/test/functionalities/data-formatter/data-formatter-objc runCmd: settings set symbols.enable-external-lookup false output:

Hide Details

runCmd: settings set plugin.process.gdb-remote.packet-timeout 60 output:

Hide Details

runCmd: settings set symbols.clang-modules-cache-path "/Users/buildslave/jenkins/workspace/lldb-cmake-sanitized/lldb-build/lldb-test-build.noindex/module-cache-lldb/lldb-api" output:

Hide Details

runCmd: settings set use-color false output:

Hide Details

runCmd: settings set target.env-vars ASAN_OPTIONS=detect_stack_use_after_return=1 DYLD_INSERT_LIBRARIES=/Users/buildslave/jenkins/workspace/lldb-cmake-sanitized/host-compiler/lib/clang/10.0.0/lib/darwin/libclang_rt.asan_osx_dynamic.dylib output:

Hide Details

runCmd: settings set target.env-vars ASAN_OPTIONS=detect_stack_use_after_return=1 DYLD_INSERT_LIBRARIES=/Users/buildslave/jenkins/workspace/lldb-cmake-sanitized/host-compiler/lib/clang/10.0.0/lib/darwin/libclang_rt.asan_osx_dynamic.dylib output:

Hide Details

FAIL: LLDB (/Users/buildslave/jenkins/workspace/lldb-cmake-sanitized/lldb-build/bin/clang-10-x86_64) :: test_nsbundle_with_run_command_dsym (TestDataFormatterObjCNSBundle.ObjCDataFormatterNSBundle) <bound method SBProcess.Kill of <lldb.SBProcess; proxy of <Swig Object of type 'lldb::SBProcess *' at 0x107605240> >>: success

Hide Details

runCmd: settings set symbols.enable-external-lookup false output:

Hide Details

runCmd: settings set plugin.process.gdb-remote.packet-timeout 60 output:

Hide Details

runCmd: settings set symbols.clang-modules-cache-path "/Users/buildslave/jenkins/workspace/lldb-cmake-sanitized/lldb-build/lldb-test-build.noindex/module-cache-lldb/lldb-api" output:

Hide Details

runCmd: settings set use-color false output:

Hide Details

runCmd: settings set target.env-vars ASAN_OPTIONS=detect_stack_use_after_return=1 DYLD_INSERT_LIBRARIES=/Users/buildslave/jenkins/workspace/lldb-cmake-sanitized/host-compiler/lib/clang/10.0.0/lib/darwin/libclang_rt.asan_osx_dynamic.dylib output:

Hide Details

runCmd: settings set target.env-vars ASAN_OPTIONS=detect_stack_use_after_return=1 DYLD_INSERT_LIBRARIES=/Users/buildslave/jenkins/workspace/lldb-cmake-sanitized/host-compiler/lib/clang/10.0.0/lib/darwin/libclang_rt.asan_osx_dynamic.dylib output:

Hide Details

FAIL: LLDB (/Users/buildslave/jenkins/workspace/lldb-cmake-sanitized/lldb-build/bin/clang-10-x86_64) :: test_nsbundle_with_run_command_dwarf (TestDataFormatterObjCNSBundle.ObjCDataFormatterNSBundle) <bound method SBProcess.Kill of <lldb.SBProcess; proxy of <Swig Object of type 'lldb::SBProcess *' at 0x107060630> >>: success

Hide Details

UNSUPPORTED: LLDB (/Users/buildslave/jenkins/workspace/lldb-cmake-sanitized/lldb-build/bin/clang-10-x86_64) :: test_nsbundle_with_run_command_dwo (TestDataFormatterObjCNSBundle.ObjCDataFormatterNSBundle) (test case does not fall in any category of interest for this run) runCmd: settings set symbols.enable-external-lookup false output:

Hide Details

runCmd: settings set plugin.process.gdb-remote.packet-timeout 60 output:

Hide Details

runCmd: settings set symbols.clang-modules-cache-path "/Users/buildslave/jenkins/workspace/lldb-cmake-sanitized/lldb-build/lldb-test-build.noindex/module-cache-lldb/lldb-api" output:

Hide Details

runCmd: settings set use-color false output:

Hide Details

runCmd: settings set target.env-vars ASAN_OPTIONS=detect_stack_use_after_return=1 DYLD_INSERT_LIBRARIES=/Users/buildslave/jenkins/workspace/lldb-cmake-sanitized/host-compiler/lib/clang/10.0.0/lib/darwin/libclang_rt.asan_osx_dynamic.dylib output:

Hide Details

runCmd: settings set target.env-vars ASAN_OPTIONS=detect_stack_use_after_return=1 DYLD_INSERT_LIBRARIES=/Users/buildslave/jenkins/workspace/lldb-cmake-sanitized/host-compiler/lib/clang/10.0.0/lib/darwin/libclang_rt.asan_osx_dynamic.dylib output:

Hide Details

FAIL: LLDB (/Users/buildslave/jenkins/workspace/lldb-cmake-sanitized/lldb-build/bin/clang-10-x86_64) :: test_nsbundle_with_run_command_gmodules (TestDataFormatterObjCNSBundle.ObjCDataFormatterNSBundle) <bound method SBProcess.Kill of <lldb.SBProcess; proxy of <Swig Object of type 'lldb::SBProcess *' at 0x107605570> >>: success

Hide Details

Restore dir to: /Users/buildslave/jenkins/workspace/lldb-cmake-sanitized/lldb-build/tools/lldb/test ====================================================================== FAIL: test_nsbundle_with_run_command_dsym (TestDataFormatterObjCNSBundle.ObjCDataFormatterNSBundle) Test formatters for NSBundle. ---------------------------------------------------------------------- Traceback (most recent call last): File "/Users/buildslave/jenkins/workspace/lldb-cmake-sanitized/llvm-project/lldb/packages/Python/lldbsuite/test/lldbtest.py", line 1732, in test_method return attrvalue(self) File "/Users/buildslave/jenkins/workspace/lldb-cmake-sanitized/llvm-project/lldb/packages/Python/lldbsuite/test/functionalities/data-formatter/data-formatter-objc/TestDataFormatterObjCNSBundle.py", line 20, in test_nsbundle_with_run_command self.appkit_tester_impl(self.nsbundle_data_formatter_commands) File "/Users/buildslave/jenkins/workspace/lldb-cmake-sanitized/llvm-project/lldb/packages/Python/lldbsuite/test/functionalities/data-formatter/data-formatter-objc/ObjCDataFormatterTestCase.py", line 19, in appkit_tester_impl self.appkit_common_data_formatters_command() File "/Users/buildslave/jenkins/workspace/lldb-cmake-sanitized/llvm-project/lldb/packages/Python/lldbsuite/test/functionalities/data-formatter/data-formatter-objc/ObjCDataFormatterTestCase.py", line 26, in appkit_common_data_formatters_command lldb.SBFileSpec('main.m', False)) File "/Users/buildslave/jenkins/workspace/lldb-cmake-sanitized/llvm-project/lldb/packages/Python/lldbsuite/test/lldbutil.py", line 868, in run_to_source_breakpoint only_one_thread, extra_images) File "/Users/buildslave/jenkins/workspace/lldb-cmake-sanitized/llvm-project/lldb/packages/Python/lldbsuite/test/lldbutil.py", line 797, in run_to_breakpoint_do_run test.assertEqual(num_threads, 1, "Expected 1 thread to stop at breakpoint, %d did."%(num_threads)) AssertionError: 0 != 1 : Expected 1 thread to stop at breakpoint, 0 did. Config=x86_64-/Users/buildslave/jenkins/workspace/lldb-cmake-sanitized/lldb-build/bin/clang-10 ====================================================================== FAIL: test_nsbundle_with_run_command_dwarf (TestDataFormatterObjCNSBundle.ObjCDataFormatterNSBundle) Test formatters for NSBundle. ---------------------------------------------------------------------- Traceback (most recent call last): File "/Users/buildslave/jenkins/workspace/lldb-cmake-sanitized/llvm-project/lldb/packages/Python/lldbsuite/test/lldbtest.py", line 1732, in test_method return attrvalue(self) File "/Users/buildslave/jenkins/workspace/lldb-cmake-sanitized/llvm-project/lldb/packages/Python/lldbsuite/test/functionalities/data-formatter/data-formatter-objc/TestDataFormatterObjCNSBundle.py", line 20, in test_nsbundle_with_run_command self.appkit_tester_impl(self.nsbundle_data_formatter_commands) File "/Users/buildslave/jenkins/workspace/lldb-cmake-sanitized/llvm-project/lldb/packages/Python/lldbsuite/test/functionalities/data-formatter/data-formatter-objc/ObjCDataFormatterTestCase.py", line 19, in appkit_tester_impl self.appkit_common_data_formatters_command() File "/Users/buildslave/jenkins/workspace/lldb-cmake-sanitized/llvm-project/lldb/packages/Python/lldbsuite/test/functionalities/data-formatter/data-formatter-objc/ObjCDataFormatterTestCase.py", line 26, in appkit_common_data_formatters_command lldb.SBFileSpec('main.m', False)) File "/Users/buildslave/jenkins/workspace/lldb-cmake-sanitized/llvm-project/lldb/packages/Python/lldbsuite/test/lldbutil.py", line 868, in run_to_source_breakpoint only_one_thread, extra_images) File "/Users/buildslave/jenkins/workspace/lldb-cmake-sanitized/llvm-project/lldb/packages/Python/lldbsuite/test/lldbutil.py", line 797, in run_to_breakpoint_do_run test.assertEqual(num_threads, 1, "Expected 1 thread to stop at breakpoint, %d did."%(num_threads)) AssertionError: 0 != 1 : Expected 1 thread to stop at breakpoint, 0 did. Config=x86_64-/Users/buildslave/jenkins/workspace/lldb-cmake-sanitized/lldb-build/bin/clang-10 ====================================================================== FAIL: test_nsbundle_with_run_command_gmodules (TestDataFormatterObjCNSBundle.ObjCDataFormatterNSBundle) Test formatters for NSBundle. ---------------------------------------------------------------------- Traceback (most recent call last): File "/Users/buildslave/jenkins/workspace/lldb-cmake-sanitized/llvm-project/lldb/packages/Python/lldbsuite/test/lldbtest.py", line 1732, in test_method return attrvalue(self) File "/Users/buildslave/jenkins/workspace/lldb-cmake-sanitized/llvm-project/lldb/packages/Python/lldbsuite/test/functionalities/data-formatter/data-formatter-objc/TestDataFormatterObjCNSBundle.py", line 20, in test_nsbundle_with_run_command self.appkit_tester_impl(self.nsbundle_data_formatter_commands) File "/Users/buildslave/jenkins/workspace/lldb-cmake-sanitized/llvm-project/lldb/packages/Python/lldbsuite/test/functionalities/data-formatter/data-formatter-objc/ObjCDataFormatterTestCase.py", line 19, in appkit_tester_impl self.appkit_common_data_formatters_command() File "/Users/buildslave/jenkins/workspace/lldb-cmake-sanitized/llvm-project/lldb/packages/Python/lldbsuite/test/functionalities/data-formatter/data-formatter-objc/ObjCDataFormatterTestCase.py", line 26, in appkit_common_data_formatters_command lldb.SBFileSpec('main.m', False)) File "/Users/buildslave/jenkins/workspace/lldb-cmake-sanitized/llvm-project/lldb/packages/Python/lldbsuite/test/lldbutil.py", line 868, in run_to_source_breakpoint only_one_thread, extra_images) File "/Users/buildslave/jenkins/workspace/lldb-cmake-sanitized/llvm-project/lldb/packages/Python/lldbsuite/test/lldbutil.py", line 797, in run_to_breakpoint_do_run test.assertEqual(num_threads, 1, "Expected 1 thread to stop at breakpoint, %d did."%(num_threads)) AssertionError: 0 != 1 : Expected 1 thread to stop at breakpoint, 0 did. Config=x86_64-/Users/buildslave/jenkins/workspace/lldb-cmake-sanitized/lldb-build/bin/clang-10 ---------------------------------------------------------------------- Ran 4 tests in 99.717s

Hide Details

RESULT: FAILED (0 passes, 3 failures, 0 errors, 1 skipped, 0 expected failures, 0 unexpected successes)

Hide Details

******************** PASS: lldb-api :: types/TestCharTypeExpr.py (1886 of 1892) PASS: lldb-api :: lang/objc/foundation/TestSymbolTable.py (1887 of 1892) PASS: lldb-api :: lang/objcxx/class-name-clash/TestNameClash.py (1888 of 1892) PASS: lldb-api :: tools/lldb-server/TestLldbGdbServer.py (1889 of 1892) PASS: lldb-api :: lang/objc/foundation/TestObjCMethodsNSError.py (1890 of 1892) PASS: lldb-api :: api/check_public_api_headers/TestPublicAPIHeaders.py (1891 of 1892) PASS: lldb-api :: api/multithreaded/TestMultithreaded.py (1892 of 1892)

Hide Details

Testing Time: 3572.86s ******************** Failing Tests (12): lldb-api :: functionalities/data-formatter/data-formatter-objc/TestDataFormatterObjNSException.py lldb-api :: functionalities/data-formatter/data-formatter-objc/TestDataFormatterObjCExpr.py lldb-api :: functionalities/data-formatter/data-formatter-objc/TestDataFormatterObjCKVO.py lldb-api :: functionalities/data-formatter/data-formatter-objc/TestDataFormatterObjCNSError.py lldb-api :: functionalities/data-formatter/data-formatter-objc/TestDataFormatterObjCNSDate.py lldb-api :: functionalities/data-formatter/data-formatter-objc/TestDataFormatterObjCNSURL.py lldb-api :: functionalities/data-formatter/data-formatter-objc/TestDataFormatterObjCCF.py lldb-api :: functionalities/data-formatter/data-formatter-objc/TestDataFormatterObjCNSContainer.py lldb-api :: functionalities/data-formatter/data-formatter-objc/TestDataFormatterObjCNSData.py lldb-api :: functionalities/data-formatter/data-formatter-objc/TestDataFormatterObjCPlain.py lldb-api :: functionalities/thread/concurrent_events/TestConcurrentManyWatchpoints.py lldb-api :: functionalities/data-formatter/data-formatter-objc/TestDataFormatterObjCNSBundle.py

Hide Details

Hide Details

Slowest Tests: -------------------------------------------------------------------------- 315.12s: lldb-api :: commands/expression/import-std-module/stack/TestStack.py 320.67s: lldb-api :: lang/objc/foundation/TestObjCMethodsNSError.py 323.75s: lldb-api :: functionalities/data-formatter/data-formatter-stl/libcxx/vector/TestDataFormatterLibcxxVector.py 327.04s: lldb-api :: functionalities/recursion/TestValueObjectRecursion.py 358.03s: lldb-api :: tools/lldb-server/TestGdbRemoteThreadsInStopReply.py 362.60s: lldb-api :: lang/objc/forward-decl/TestForwardDecl.py 375.55s: lldb-api :: python_api/lldbutil/iter/TestLLDBIterator.py 388.64s: lldb-api :: types/TestLongTypesExpr.py 427.81s: lldb-api :: lang/objc/objc-new-syntax/TestObjCNewSyntaxArray.py 439.07s: lldb-api :: lang/objc/foundation/TestObjCMethodsString.py 440.41s: lldb-api :: lang/objc/objc-new-syntax/TestObjCNewSyntaxDictionary.py 477.86s: lldb-api :: lang/objc/exceptions/TestObjCExceptions.py 500.09s: lldb-api :: api/multithreaded/TestMultithreaded.py 506.66s: lldb-api :: lang/cpp/namespace/TestNamespaceLookup.py 525.59s: lldb-api :: lang/objc/real-definition/TestRealDefinition.py 564.31s: lldb-api :: lang/objc/objc-new-syntax/TestObjCNewSyntaxLiteral.py 803.75s: lldb-api :: lang/objc/hidden-ivars/TestHiddenIvars.py 825.84s: lldb-api :: lang/objc/foundation/TestObjCMethods.py 968.80s: lldb-api :: lang/cpp/enum_types/TestCPP11EnumTypes.py 973.88s: lldb-api :: tools/lldb-server/TestLldbGdbServer.py

Hide Details

Tests Times: -------------------------------------------------------------------------- [ Range ] :: [ Percentage ] :: [ Count ] -------------------------------------------------------------------------- [ 0s, 50s) :: [********************************** ] :: [1613/1892] [ 50s,100s) :: [** ] :: [ 106/1892] [100s,150s) :: [* ] :: [ 65/1892] [150s,200s) :: [* ] :: [ 55/1892] [200s,250s) :: [ ] :: [ 24/1892] [250s,300s) :: [ ] :: [ 8/1892] [300s,350s) :: [ ] :: [ 5/1892] [350s,400s) :: [ ] :: [ 4/1892] [400s,450s) :: [ ] :: [ 1/1892] [450s,500s) :: [ ] :: [ 3/1892] [500s,550s) :: [ ] :: [ 3/1892] [550s,600s) :: [ ] :: [ 1/1892] [600s,650s) :: [ ] :: [ 0/1892] [650s,700s) :: [ ] :: [ 0/1892] [700s,750s) :: [ ] :: [ 0/1892] [750s,800s) :: [ ] :: [ 0/1892] [800s,850s) :: [ ] :: [ 2/1892] [850s,900s) :: [ ] :: [ 0/1892] [900s,950s) :: [ ] :: [ 0/1892] [950s,1000s) :: [ ] :: [ 2/1892] Expected Passes : 1712 Expected Failures : 6 Unsupported Tests : 162 Unexpected Failures: 12 FAILED: tools/lldb/test/CMakeFiles/check-lldb-lit cd /Users/buildslave/jenkins/workspace/lldb-cmake-sanitized/lldb-build/tools/lldb/test && /usr/local/bin/python /Users/buildslave/jenkins/workspace/lldb-cmake-sanitized/lldb-build/./bin/llvm-lit -v --time-tests --shuffle --xunit-xml-output=/Users/buildslave/jenkins/workspace/lldb-cmake-sanitized/test/results.xml -v --timeout 1200 /Users/buildslave/jenkins/workspace/lldb-cmake-sanitized/lldb-build/tools/lldb/test ninja: build stopped: subcommand failed. Command failed: Command '['/usr/bin/env', 'TERM=vt100', '/usr/local/bin/ninja', '-v', 'check-lldb']' returned non-zero exit status 1. Command: ['/usr/bin/env', 'TERM=vt100', '/usr/local/bin/ninja', '-v', 'check-lldb'] [Pipeline] } [Pipeline] // timeout [Pipeline] } [Pipeline] // stage [Pipeline] stage [Pipeline] { (Declarative: Post Actions) [Pipeline] scanForIssues No credentials specified [Clang (LLVM based)] Sleeping for 5 seconds due to JENKINS-32191... [Clang (LLVM based)] Parsing console log (workspace: '/Users/buildslave/jenkins/workspace/lldb-cmake-sanitized') [Pipeline] junit Recording test results [Pipeline] } [Pipeline] // stage [Pipeline] } [Pipeline] // withEnv [Pipeline] } [Pipeline] // node [Pipeline] End of Pipeline ERROR: script returned exit code 1 Finished: FAILURE