FailedConsole Output

Skipping 7,129 KB.. Full Log
erlap.yaml (1011 of 1895)
PASS: lldb-api :: functionalities/data-formatter/data-formatter-python-synth/TestDataFormatterPythonSynth.py (1012 of 1895)
PASS: lldb-unit :: debugserver/./debugserverTests/JSON.Parse (1013 of 1895)
PASS: lldb-api :: functionalities/breakpoint/source_regexp/TestSourceRegexBreakpoints.py (1014 of 1895)
PASS: lldb-unit :: Utility/./UtilityTests/FileSpecTest.GetPath (1015 of 1895)
PASS: lldb-unit :: Utility/./UtilityTests/SubsystemRAIITest.SubsystemWithErrorSuccess (1016 of 1895)
UNSUPPORTED: lldb-shell :: SymbolFile/target-symbols-add-unwind.test (1017 of 1895)
PASS: lldb-unit :: Utility/./UtilityTests/StreamTeeTest.CopyConstructor (1018 of 1895)
PASS: lldb-unit :: UnwindAssembly/x86/./UnwindAssemblyx86Tests/Testx86AssemblyInspectionEngine.TestSimplei386ugmented (1019 of 1895)
PASS: lldb-api :: python_api/sbtype_typeclass/TestSBTypeTypeClass.py (1020 of 1895)
PASS: lldb-unit :: Expression/./ExpressionTests/DiagnosticManagerTest.AppendMessageSubsequentDiags (1021 of 1895)
PASS: lldb-shell :: Minidump/fb-dump.test (1022 of 1895)
PASS: lldb-unit :: Utility/./UtilityTests/OptionsWithRawTest.EmptyArgsOnlySuffix (1023 of 1895)
PASS: lldb-unit :: Utility/./UtilityTests/StreamTest.AddressRange (1024 of 1895)
PASS: lldb-unit :: Utility/./UtilityTests/RangeTest.SetRangeBase (1025 of 1895)
PASS: lldb-unit :: Utility/./UtilityTests/StringExtractorTest.InitMisc (1026 of 1895)
PASS: lldb-unit :: Utility/./UtilityTests/FileSpecTest.Equal (1027 of 1895)
PASS: lldb-unit :: Utility/./UtilityTests/Flags.AllClear (1028 of 1895)
PASS: lldb-unit :: Utility/./UtilityTests/ArgsTest.TestUnknownEscape (1029 of 1895)
PASS: lldb-unit :: Utility/./UtilityTests/StreamTest.PutChar (1030 of 1895)
PASS: lldb-unit :: Process/minidump/./LLDBMinidumpTests/MinidumpParserTest.FindMemoryRange (1031 of 1895)
PASS: lldb-unit :: Utility/./UtilityTests/Predicate.WaitForValueEqualTo (1032 of 1895)
PASS: lldb-unit :: ScriptInterpreter/Python/./ScriptInterpreterPythonTests/PythonDataObjectsTest.TestPythonTupleInitializerList (1033 of 1895)
PASS: lldb-unit :: Utility/./UtilityTests/StringListTest.JoinSingle (1034 of 1895)
PASS: lldb-api :: functionalities/thread/concurrent_events/TestConcurrentTwoBreakpointsOneWatchpoint.py (1035 of 1895)
PASS: lldb-api :: python_api/exprpath_synthetic/TestExprPathSynthetic.py (1036 of 1895)
PASS: lldb-api :: lang/objc/modules-auto-import/TestModulesAutoImport.py (1037 of 1895)
PASS: lldb-api :: functionalities/data-formatter/language_category_updates/TestDataFormatterLanguageCategoryUpdates.py (1038 of 1895)
PASS: lldb-api :: macosx/find-dsym/bundle-with-dot-in-filename/TestBundleWithDotInFilename.py (1039 of 1895)
PASS: lldb-unit :: ScriptInterpreter/Python/./ScriptInterpreterPythonTests/PythonDataObjectsTest.TestPythonByteArray (1040 of 1895)
UNSUPPORTED: lldb-api :: functionalities/thread/concurrent_events/TestConcurrentManySignals.py (1041 of 1895)
UNSUPPORTED: lldb-api :: functionalities/darwin_log/filter/regex/activity-chain/TestDarwinLogFilterRegexActivityChain.py (1042 of 1895)
PASS: lldb-unit :: Process/gdb-remote/./ProcessGdbRemoteTests/GDBRemoteClientBaseTest.SendContinueAndWait (1043 of 1895)
PASS: lldb-unit :: ScriptInterpreter/Python/./ScriptInterpreterPythonTests/PythonDataObjectsTest.TestResetting (1044 of 1895)
PASS: lldb-shell :: ObjectFile/ELF/netbsd-core-amd64.test (1045 of 1895)
PASS: lldb-shell :: Quit/TestQuitExitCodeTooManyArgs.test (1046 of 1895)
UNSUPPORTED: lldb-api :: commands/expression/completion-crash1/TestCompletionCrash1.py (1047 of 1895)
PASS: lldb-unit :: Utility/./UtilityTests/LogChannelEnabledTest.LogGetLogThread (1048 of 1895)
PASS: lldb-api :: commands/expression/dont_allow_jit/TestAllowJIT.py (1049 of 1895)
PASS: lldb-shell :: SymbolFile/DWARF/DW_AT_low_pc-addrx.s (1050 of 1895)
PASS: lldb-api :: lang/cpp/call-function/TestCallCPPFunction.py (1051 of 1895)
PASS: lldb-api :: commands/watchpoints/watchpoint_commands/command/TestWatchpointCommandPython.py (1052 of 1895)
PASS: lldb-api :: commands/expression/ir-interpreter-phi-nodes/TestIRInterpreterPHINodes.py (1053 of 1895)
PASS: lldb-unit :: Utility/./UtilityTests/AnsiTerminal.Incomplete (1054 of 1895)
UNSUPPORTED: lldb-api :: lang/objc/bitfield_ivars/TestBitfieldIvars.py (1055 of 1895)
PASS: lldb-unit :: Utility/./UtilityTests/StringExtractorTest.GetHexU8_Underflow2 (1056 of 1895)
PASS: lldb-shell :: ObjectFile/Breakpad/breakpad-identification.test (1057 of 1895)
PASS: lldb-shell :: ObjectFile/ELF/section-types-edgecases.yaml (1058 of 1895)
PASS: lldb-unit :: Utility/./UtilityTests/StringListTest.ShiftStdString (1059 of 1895)
PASS: lldb-unit :: Host/./HostTests/SocketTest.UDPGetConnectURI (1060 of 1895)
PASS: lldb-unit :: ScriptInterpreter/Python/./ScriptInterpreterPythonTests/PythonDataObjectsTest.TestGlobalNameResolutionWithDot (1061 of 1895)
PASS: lldb-unit :: Utility/./UtilityTests/RangeTest.NotEqualInvalid (1062 of 1895)
PASS: lldb-api :: functionalities/data-formatter/type_summary_list_script/TestTypeSummaryListScript.py (1063 of 1895)
PASS: lldb-api :: lang/objc/modules-inline-functions/TestModulesInlineFunctions.py (1064 of 1895)
UNSUPPORTED: lldb-shell :: Register/arm-fp-read.test (1065 of 1895)
PASS: lldb-unit :: Utility/./UtilityTests/StringListTest.LongestCommonPrefixEmpty (1066 of 1895)
PASS: lldb-unit :: Host/./HostTests/MainLoopTest.TerminatesImmediately (1067 of 1895)
PASS: lldb-api :: lang/objc/modules-app-update/TestClangModulesAppUpdate.py (1068 of 1895)
UNSUPPORTED: lldb-api :: python_api/event/TestEvents.py (1069 of 1895)
PASS: lldb-unit :: Utility/./UtilityTests/DeserializerTest.HasData (1070 of 1895)
PASS: lldb-api :: functionalities/breakpoint/breakpoint_hit_count/TestBreakpointHitCount.py (1071 of 1895)
PASS: lldb-unit :: Language/Highlighting/./HighlighterTests/HighlighterTest.ClangEmptyInput (1072 of 1895)
PASS: lldb-api :: lang/objc/conflicting-definition/TestConflictingDefinition.py (1073 of 1895)
PASS: lldb-api :: types/TestCharType.py (1074 of 1895)
PASS: lldb-unit :: Symbol/./SymbolTests/TestClangASTImporter.MetadataPropagation (1075 of 1895)
PASS: lldb-api :: lang/cpp/namespace/TestNamespaceLookup.py (1076 of 1895)
UNSUPPORTED: lldb-api :: benchmarks/expression/TestExpressionCmd.py (1077 of 1895)
PASS: lldb-unit :: Host/./HostTests/HostInfoTest.GetAugmentedArchSpec (1078 of 1895)
PASS: lldb-unit :: Symbol/./SymbolTests/TestClangASTImporter.CanImportInvalidType (1079 of 1895)
PASS: lldb-api :: functionalities/breakpoint/comp_dir_symlink/TestCompDirSymLink.py (1080 of 1895)
PASS: lldb-api :: lang/c/function_types/TestFunctionTypes.py (1081 of 1895)
PASS: lldb-api :: types/TestRecursiveTypes.py (1082 of 1895)
PASS: lldb-api :: functionalities/breakpoint/breakpoint_language/TestBreakpointLanguage.py (1083 of 1895)
PASS: lldb-unit :: Core/./LLDBCoreTests/RichManglingContextTest.FromCxxMethodName (1084 of 1895)
PASS: lldb-unit :: Utility/./UtilityTests/VMRange.Clear (1085 of 1895)
PASS: lldb-unit :: Utility/./UtilityTests/RangeTest.ContainsAddrInvalid (1086 of 1895)
PASS: lldb-api :: lang/objc/objc-ivar-stripped/TestObjCIvarStripped.py (1087 of 1895)
PASS: lldb-shell :: Breakpoint/single-file-split-dwarf.test (1088 of 1895)
PASS: lldb-api :: lang/cpp/accelerator-table/TestCPPAccelerator.py (1089 of 1895)
PASS: lldb-api :: functionalities/return-value/TestReturnValue.py (1090 of 1895)
PASS: lldb-api :: functionalities/data-formatter/summary-string-onfail/Test-rdar-9974002.py (1091 of 1895)
PASS: lldb-api :: commands/expression/timeout/TestCallWithTimeout.py (1092 of 1895)
PASS: lldb-api :: lang/cpp/stl/TestSTL.py (1093 of 1895)
PASS: lldb-unit :: Utility/./UtilityTests/VMRange.IsValid (1094 of 1895)
PASS: lldb-api :: functionalities/thread/concurrent_events/TestConcurrentDelaySignalBreak.py (1095 of 1895)
PASS: lldb-unit :: Language/Highlighting/./HighlighterTests/HighlighterTest.ClangPPDirectives (1096 of 1895)
PASS: lldb-unit :: Utility/./UtilityTests/StreamTest.PutBytesAsRawHex8ToMixedEndian (1097 of 1895)
PASS: lldb-unit :: Utility/./UtilityTests/ArgsTest.TestAppendArg (1098 of 1895)
PASS: lldb-unit :: Utility/./UtilityTests/UriParserTest.MinimalPortPath (1099 of 1895)
PASS: lldb-unit :: ObjectFile/Breakpad/./ObjectFileBreakpadTests/ModuleRecord.parse (1100 of 1895)
PASS: lldb-unit :: Utility/./UtilityTests/StreamTest.ShiftOperatorStrings (1101 of 1895)
PASS: lldb-api :: functionalities/thread/thread_specific_break/TestThreadSpecificBreakpoint.py (1102 of 1895)
PASS: lldb-shell :: ObjectFile/ELF/PT_LOAD-overlap-PT_TLS.yaml (1103 of 1895)
PASS: lldb-unit :: Utility/./UtilityTests/GeneratorTest.Get (1104 of 1895)
PASS: lldb-api :: lang/c/struct_types/TestStructTypes.py (1105 of 1895)
PASS: lldb-unit :: Utility/./UtilityTests/OptionsWithRawTest.EmptyInput (1106 of 1895)
PASS: lldb-unit :: Utility/./UtilityTests/BinaryStreamTest.PutULEB128FourBytes (1107 of 1895)
PASS: lldb-shell :: ObjectFile/ELF/minidebuginfo-corrupt-xz.yaml (1108 of 1895)
UNSUPPORTED: lldb-api :: functionalities/asan/TestReportData.py (1109 of 1895)
PASS: lldb-shell :: SymbolFile/DWARF/find-basic-type.cpp (1110 of 1895)
PASS: lldb-unit :: ScriptInterpreter/Python/./ScriptInterpreterPythonTests/PythonDataObjectsTest.TestPythonDictionaryManipulation (1111 of 1895)
PASS: lldb-api :: lang/cpp/global_operators/TestCppGlobalOperators.py (1112 of 1895)
PASS: lldb-unit :: Host/./HostTests/SocketTest.DomainGetConnectURI (1113 of 1895)
PASS: lldb-api :: python_api/symbol-context/two-files/TestSymbolContextTwoFiles.py (1114 of 1895)
PASS: lldb-api :: commands/expression/scoped_enums/TestScopedEnumType.py (1115 of 1895)
PASS: lldb-unit :: Utility/./UtilityTests/Flags.Clear (1116 of 1895)
PASS: lldb-unit :: Process/minidump/./LLDBMinidumpTests/MinidumpParserTest.GetMemoryRegionInfo (1117 of 1895)
PASS: lldb-unit :: Utility/./UtilityTests/BroadcasterTest.EventTypeHasListeners (1118 of 1895)
PASS: lldb-api :: commands/expression/test/TestExprs2.py (1119 of 1895)
PASS: lldb-unit :: ScriptInterpreter/Python/./ScriptInterpreterPythonTests/PythonDataObjectsTest.TestPythonStringToStr (1120 of 1895)
PASS: lldb-unit :: Utility/./UtilityTests/LogTest.LLDB_LOG_nullptr (1121 of 1895)
PASS: lldb-api :: commands/expression/context-object-objc/TestContextObjectObjc.py (1122 of 1895)
PASS: lldb-api :: lang/cpp/class-template-parameter-pack/TestClassTemplateParameterPack.py (1123 of 1895)
PASS: lldb-api :: python_api/lldbutil/iter/TestRegistersIterator.py (1124 of 1895)
PASS: lldb-api :: functionalities/data-formatter/compactvectors/TestCompactVectors.py (1125 of 1895)
PASS: lldb-api :: functionalities/thread/concurrent_events/TestConcurrentSignalDelayBreak.py (1126 of 1895)
PASS: lldb-api :: commands/expression/import-std-module/unique_ptr/TestUniquePtr.py (1127 of 1895)
PASS: lldb-shell :: ObjectFile/ELF/aarch64-relocations.yaml (1128 of 1895)
PASS: lldb-unit :: Utility/./UtilityTests/ScalarTest.Division (1129 of 1895)
PASS: lldb-api :: macosx/DBGSourcePathRemapping/TestDSYMSourcePathRemapping.py (1130 of 1895)
PASS: lldb-unit :: Utility/./UtilityTests/StreamTeeTest.SetStreamAtIndexOverwrite (1131 of 1895)
UNSUPPORTED: lldb-api :: functionalities/data-formatter/data-formatter-stl/libstdcpp/vbool/TestDataFormatterStdVBool.py (1132 of 1895)
PASS: lldb-api :: lang/objc/objc-ivar-protocols/TestIvarProtocols.py (1133 of 1895)
PASS: lldb-api :: python_api/lldbutil/iter/TestLLDBIterator.py (1134 of 1895)
PASS: lldb-api :: commands/frame/diagnose/dereference-argument/TestDiagnoseDereferenceArgument.py (1135 of 1895)
PASS: lldb-unit :: ScriptInterpreter/Python/./ScriptInterpreterPythonTests/PythonDataObjectsTest.TestPythonTupleInitializerList2 (1136 of 1895)
PASS: lldb-api :: functionalities/thread/concurrent_events/TestConcurrentSignalNWatchNBreak.py (1137 of 1895)
PASS: lldb-api :: lang/cpp/rvalue-references/TestRvalueReferences.py (1138 of 1895)
PASS: lldb-api :: commands/frame/diagnose/bad-reference/TestBadReference.py (1139 of 1895)
PASS: lldb-unit :: Utility/./UtilityTests/StringExtractorTest.DecodeHexU8_Underflow (1140 of 1895)
PASS: lldb-unit :: Utility/./UtilityTests/StreamTest.PutHex32ByteOrderBig (1141 of 1895)
PASS: lldb-unit :: Symbol/./SymbolTests/TestClangASTImporter.DeportDeclTagDecl (1142 of 1895)
PASS: lldb-shell :: Settings/TestDisableColor.test (1143 of 1895)
PASS: lldb-api :: tools/lldb-server/TestGdbRemoteKill.py (1144 of 1895)
PASS: lldb-api :: functionalities/thread/concurrent_events/TestConcurrentTwoBreakpointsOneDelaySignal.py (1145 of 1895)
PASS: lldb-api :: functionalities/breakpoint/breakpoint_options/TestBreakpointOptions.py (1146 of 1895)
PASS: lldb-unit :: Utility/./UtilityTests/StreamTest.AddressRangeInvalidRange (1147 of 1895)
PASS: lldb-shell :: ObjectFile/ELF/minidebuginfo-find-symbols.yaml (1148 of 1895)
PASS: lldb-api :: python_api/value/change_values/TestChangeValueAPI.py (1149 of 1895)
UNSUPPORTED: lldb-api :: lang/c/typedef/Testtypedef.py (1150 of 1895)
PASS: lldb-api :: commands/expression/unwind_expression/TestUnwindExpression.py (1151 of 1895)
PASS: lldb-shell :: Quit/TestQuitExitCodeHex0.test (1152 of 1895)
PASS: lldb-shell :: Reproducer/TestRelativePath.test (1153 of 1895)
PASS: lldb-unit :: Utility/./UtilityTests/ScalarTest.ExtractBitfield (1154 of 1895)
PASS: lldb-api :: tools/lldb-server/inferior-crash/TestGdbRemoteAbort.py (1155 of 1895)
PASS: lldb-api :: functionalities/data-formatter/data-formatter-stl/libcxx/initializerlist/TestInitializerList.py (1156 of 1895)
PASS: lldb-unit :: UnwindAssembly/x86/./UnwindAssemblyx86Tests/Testx86AssemblyInspectionEngine.TestPushR15 (1157 of 1895)
UNSUPPORTED: lldb-shell :: SymbolFile/PDB/enums-layout.test (1158 of 1895)
PASS: lldb-shell :: Driver/TestFile.test (1159 of 1895)
PASS: lldb-api :: commands/expression/radar_9673664/TestExprHelpExamples.py (1160 of 1895)
PASS: lldb-api :: functionalities/data-formatter/format-propagation/TestFormatPropagation.py (1161 of 1895)
PASS: lldb-api :: lang/c/global_variables/TestGlobalVariables.py (1162 of 1895)
PASS: lldb-api :: lang/cpp/trivial_abi/TestTrivialABI.py (1163 of 1895)
PASS: lldb-api :: functionalities/data-formatter/vector-types/TestVectorTypesFormatting.py (1164 of 1895)
UNSUPPORTED: lldb-api :: functionalities/darwin_log/filter/exact_match/message/TestDarwinLogFilterMatchMessage.py (1165 of 1895)
PASS: lldb-unit :: Process/gdb-remote/./ProcessGdbRemoteTests/GDBRemoteClientBaseTest.SendContinueDelegateInterface (1166 of 1895)
PASS: lldb-unit :: Language/Highlighting/./HighlighterTests/HighlighterTest.ClangIdentifiers (1167 of 1895)
PASS: lldb-unit :: Utility/./UtilityTests/StreamTest.AddressPrefix (1168 of 1895)
PASS: lldb-api :: functionalities/thread/jump/TestThreadJump.py (1169 of 1895)
PASS: lldb-shell :: SymbolFile/DWARF/clang-ast-from-dwarf-objc-property.m (1170 of 1895)
PASS: lldb-unit :: Utility/./UtilityTests/RecordReplayTest.InstrumentedBar (1171 of 1895)
PASS: lldb-api :: functionalities/breakpoint/move_nearest/TestMoveNearest.py (1172 of 1895)
PASS: lldb-shell :: ObjectFile/ELF/PT_LOAD-empty.yaml (1173 of 1895)
PASS: lldb-shell :: SymbolFile/DWARF/childless-compile-unit.s (1174 of 1895)
PASS: lldb-api :: functionalities/type_completion/TestTypeCompletion.py (1175 of 1895)
PASS: lldb-unit :: Utility/./UtilityTests/UUIDTest.RelationalOperators (1176 of 1895)
PASS: lldb-unit :: Utility/./UtilityTests/StringListTest.GetMaxStringLengthMixed (1177 of 1895)
UNSUPPORTED: lldb-api :: benchmarks/startup/TestStartupDelays.py (1178 of 1895)
PASS: lldb-unit :: Utility/./UtilityTests/TimeoutTest.Construction (1179 of 1895)
PASS: lldb-unit :: Utility/./UtilityTests/IndexToObjectTest.ObjectForIndex (1180 of 1895)
PASS: lldb-unit :: Utility/./UtilityTests/BinaryStreamTest.PutULEB128SevenBytes (1181 of 1895)
PASS: lldb-shell :: ObjectFile/ELF/section-permissions.yaml (1182 of 1895)
PASS: lldb-api :: commands/expression/import-std-module/queue/TestQueue.py (1183 of 1895)
PASS: lldb-unit :: Utility/./UtilityTests/SubsystemRAIITest.NormalSubsystem (1184 of 1895)
PASS: lldb-api :: lang/cpp/namespace_conflicts/TestNamespaceConflicts.py (1185 of 1895)
PASS: lldb-unit :: Utility/./UtilityTests/ArgsTest.TestQuotedUnknownEscape (1186 of 1895)
PASS: lldb-shell :: ObjectFile/MachO/lc_build_version_notools.yaml (1187 of 1895)
PASS: lldb-unit :: Utility/./UtilityTests/StringExtractorTest.GetHexBytes_Underflow (1188 of 1895)
PASS: lldb-unit :: Utility/./UtilityTests/BinaryStreamTest.PutSLEB128SevenBytes (1189 of 1895)
PASS: lldb-unit :: Utility/./UtilityTests/StringListTest.CopyListEmpty (1190 of 1895)
UNSUPPORTED: lldb-api :: functionalities/thread/thread_specific_break_plus_condition/TestThreadSpecificBpPlusCondition.py (1191 of 1895)
PASS: lldb-unit :: Utility/./UtilityTests/RangeDataVector.FindEntryThatContains_Overlap (1192 of 1895)
XFAIL: lldb-shell :: Register/x86-mm-xmm-read.test (1193 of 1895)
PASS: lldb-api :: functionalities/data-formatter/hexcaps/TestDataFormatterHexCaps.py (1194 of 1895)
UNSUPPORTED: lldb-api :: linux/sepdebugsymlink/TestTargetSymbolsSepDebugSymlink.py (1195 of 1895)
PASS: lldb-unit :: ScriptInterpreter/Python/./ScriptInterpreterPythonTests/PythonDataObjectsTest.TestPythonBoolean (1196 of 1895)
PASS: lldb-unit :: SymbolFile/NativePDB/./SymbolFileNativePDBTests/PDBFPOProgramToDWARFExpressionTests.UnresolvedDependentCyclicRegisterAssignmentReference (1197 of 1895)
FAIL: lldb-api :: functionalities/data-formatter/data-formatter-objc/TestDataFormatterObjCCF.py (1198 of 1895)
******************** TEST 'lldb-api :: functionalities/data-formatter/data-formatter-objc/TestDataFormatterObjCCF.py' FAILED ********************
lldb version 11.0.99 (http://labmaster3.local/git/llvm-project.git revision c1b13a1b17719aebace1b3be7a6ac7f90b1901a6)
  clang revision 7ce2de2ce4e7d4dd8e1e5a7a5b35c0f98e46681d
  llvm revision 7ce2de2ce4e7d4dd8e1e5a7a5b35c0f98e46681d
LLDB library dir: /Users/buildslave/jenkins/workspace/lldb-cmake-sanitized/lldb-build/bin
LLDB import library dir: /Users/buildslave/jenkins/workspace/lldb-cmake-sanitized/lldb-build/bin
libstdcxx tests will not be run because: Don't know how to build with libstdcxx on macosx
Skipping following debug info categories: ['dwo']
setting set target.prefer-dynamic-value no-dynamic-values
AddressSanitizer report breakpoint hit. Use 'thread info -s' to get extended information about the report.
AddressSanitizer report breakpoint hit. Use 'thread info -s' to get extended information about the report.
AddressSanitizer report breakpoint hit. Use 'thread info -s' to get extended information about the report.

Hide Details

Session logs for test failures/errors/unexpected successes will go into directory '/Users/buildslave/jenkins/workspace/lldb-cmake-sanitized/test/logs' Command invoked: /Users/buildslave/jenkins/workspace/lldb-cmake-sanitized/llvm-project/lldb/test/API/dotest.py --arch x86_64 -s /Users/buildslave/jenkins/workspace/lldb-cmake-sanitized/lldb-build/lldb-test-traces -S nm -u CXXFLAGS -u CFLAGS --codesign-identity lldb_codesign --server /Users/buildslave/jenkins/workspace/lldb-cmake-sanitized/lldb-build/./bin/debugserver --arch x86_64 --build-dir /Users/buildslave/jenkins/workspace/lldb-cmake-sanitized/lldb-build/lldb-test-build.noindex -s=/Users/buildslave/jenkins/workspace/lldb-cmake-sanitized/test/logs -t --env TERM=vt100 --env LLVM_LIBS_DIR=/Users/buildslave/jenkins/workspace/lldb-cmake-sanitized/lldb-build/./lib --inferior-env ASAN_OPTIONS=detect_stack_use_after_return=1 --inferior-env DYLD_INSERT_LIBRARIES=/Users/buildslave/jenkins/workspace/lldb-cmake-sanitized/host-compiler/lib/clang/11.0.0/lib/darwin/libclang_rt.asan_osx_dynamic.dylib --build-dir /Users/buildslave/jenkins/workspace/lldb-cmake-sanitized/lldb-build/lldb-test-build.noindex --lldb-module-cache-dir /Users/buildslave/jenkins/workspace/lldb-cmake-sanitized/lldb-build/lldb-test-build.noindex/module-cache-lldb/lldb-api --clang-module-cache-dir /Users/buildslave/jenkins/workspace/lldb-cmake-sanitized/lldb-build/lldb-test-build.noindex/module-cache-clang/lldb-api --executable /Users/buildslave/jenkins/workspace/lldb-cmake-sanitized/lldb-build/./bin/lldb --compiler /Users/buildslave/jenkins/workspace/lldb-cmake-sanitized/lldb-build/./bin/clang --dsymutil /Users/buildslave/jenkins/workspace/lldb-cmake-sanitized/lldb-build/./bin/dsymutil --filecheck /Users/buildslave/jenkins/workspace/lldb-cmake-sanitized/lldb-build/./bin/FileCheck /Users/buildslave/jenkins/workspace/lldb-cmake-sanitized/llvm-project/lldb/packages/Python/lldbsuite/test/functionalities/data-formatter/data-formatter-objc -p TestDataFormatterObjCCF.py Change dir to: /Users/buildslave/jenkins/workspace/lldb-cmake-sanitized/llvm-project/lldb/packages/Python/lldbsuite/test/functionalities/data-formatter/data-formatter-objc runCmd: settings set symbols.enable-external-lookup false output:

Hide Details

runCmd: settings set plugin.process.gdb-remote.packet-timeout 60 output:

Hide Details

runCmd: settings set symbols.clang-modules-cache-path "/Users/buildslave/jenkins/workspace/lldb-cmake-sanitized/lldb-build/lldb-test-build.noindex/module-cache-lldb/lldb-api" output:

Hide Details

runCmd: settings set use-color false output:

Hide Details

runCmd: settings set target.env-vars ASAN_OPTIONS=detect_stack_use_after_return=1 DYLD_INSERT_LIBRARIES=/Users/buildslave/jenkins/workspace/lldb-cmake-sanitized/host-compiler/lib/clang/11.0.0/lib/darwin/libclang_rt.asan_osx_dynamic.dylib output:

Hide Details

runCmd: settings set target.env-vars ASAN_OPTIONS=detect_stack_use_after_return=1 DYLD_INSERT_LIBRARIES=/Users/buildslave/jenkins/workspace/lldb-cmake-sanitized/host-compiler/lib/clang/11.0.0/lib/darwin/libclang_rt.asan_osx_dynamic.dylib output:

Hide Details

FAIL: LLDB (/Users/buildslave/jenkins/workspace/lldb-cmake-sanitized/lldb-build/bin/clang-10-x86_64) :: test_coreframeworks_and_run_command_dsym (TestDataFormatterObjCCF.ObjCDataFormatterCF) <bound method SBProcess.Kill of <lldb.SBProcess; proxy of <Swig Object of type 'lldb::SBProcess *' at 0x10cd3cb10> >>: success

Hide Details

runCmd: settings set symbols.enable-external-lookup false output:

Hide Details

runCmd: settings set plugin.process.gdb-remote.packet-timeout 60 output:

Hide Details

runCmd: settings set symbols.clang-modules-cache-path "/Users/buildslave/jenkins/workspace/lldb-cmake-sanitized/lldb-build/lldb-test-build.noindex/module-cache-lldb/lldb-api" output:

Hide Details

runCmd: settings set use-color false output:

Hide Details

runCmd: settings set target.env-vars ASAN_OPTIONS=detect_stack_use_after_return=1 DYLD_INSERT_LIBRARIES=/Users/buildslave/jenkins/workspace/lldb-cmake-sanitized/host-compiler/lib/clang/11.0.0/lib/darwin/libclang_rt.asan_osx_dynamic.dylib output:

Hide Details

runCmd: settings set target.env-vars ASAN_OPTIONS=detect_stack_use_after_return=1 DYLD_INSERT_LIBRARIES=/Users/buildslave/jenkins/workspace/lldb-cmake-sanitized/host-compiler/lib/clang/11.0.0/lib/darwin/libclang_rt.asan_osx_dynamic.dylib output:

Hide Details

FAIL: LLDB (/Users/buildslave/jenkins/workspace/lldb-cmake-sanitized/lldb-build/bin/clang-10-x86_64) :: test_coreframeworks_and_run_command_dwarf (TestDataFormatterObjCCF.ObjCDataFormatterCF) <bound method SBProcess.Kill of <lldb.SBProcess; proxy of <Swig Object of type 'lldb::SBProcess *' at 0x10c15d630> >>: success

Hide Details

UNSUPPORTED: LLDB (/Users/buildslave/jenkins/workspace/lldb-cmake-sanitized/lldb-build/bin/clang-10-x86_64) :: test_coreframeworks_and_run_command_dwo (TestDataFormatterObjCCF.ObjCDataFormatterCF) (test case does not fall in any category of interest for this run) runCmd: settings set symbols.enable-external-lookup false output:

Hide Details

runCmd: settings set plugin.process.gdb-remote.packet-timeout 60 output:

Hide Details

runCmd: settings set symbols.clang-modules-cache-path "/Users/buildslave/jenkins/workspace/lldb-cmake-sanitized/lldb-build/lldb-test-build.noindex/module-cache-lldb/lldb-api" output:

Hide Details

runCmd: settings set use-color false output:

Hide Details

runCmd: settings set target.env-vars ASAN_OPTIONS=detect_stack_use_after_return=1 DYLD_INSERT_LIBRARIES=/Users/buildslave/jenkins/workspace/lldb-cmake-sanitized/host-compiler/lib/clang/11.0.0/lib/darwin/libclang_rt.asan_osx_dynamic.dylib output:

Hide Details

runCmd: settings set target.env-vars ASAN_OPTIONS=detect_stack_use_after_return=1 DYLD_INSERT_LIBRARIES=/Users/buildslave/jenkins/workspace/lldb-cmake-sanitized/host-compiler/lib/clang/11.0.0/lib/darwin/libclang_rt.asan_osx_dynamic.dylib output:

Hide Details

FAIL: LLDB (/Users/buildslave/jenkins/workspace/lldb-cmake-sanitized/lldb-build/bin/clang-10-x86_64) :: test_coreframeworks_and_run_command_gmodules (TestDataFormatterObjCCF.ObjCDataFormatterCF) <bound method SBProcess.Kill of <lldb.SBProcess; proxy of <Swig Object of type 'lldb::SBProcess *' at 0x10cd3cb10> >>: success

Hide Details

Restore dir to: /Users/buildslave/jenkins/workspace/lldb-cmake-sanitized/lldb-build/tools/lldb/test ====================================================================== FAIL: test_coreframeworks_and_run_command_dsym (TestDataFormatterObjCCF.ObjCDataFormatterCF) Test formatters for Core OSX frameworks. ---------------------------------------------------------------------- Traceback (most recent call last): File "/Users/buildslave/jenkins/workspace/lldb-cmake-sanitized/llvm-project/lldb/packages/Python/lldbsuite/test/lldbtest.py", line 1732, in test_method return attrvalue(self) File "/Users/buildslave/jenkins/workspace/lldb-cmake-sanitized/llvm-project/lldb/packages/Python/lldbsuite/test/functionalities/data-formatter/data-formatter-objc/TestDataFormatterObjCCF.py", line 23, in test_coreframeworks_and_run_command lldb.SBFileSpec('main.m', False)) File "/Users/buildslave/jenkins/workspace/lldb-cmake-sanitized/llvm-project/lldb/packages/Python/lldbsuite/test/lldbutil.py", line 868, in run_to_source_breakpoint only_one_thread, extra_images) File "/Users/buildslave/jenkins/workspace/lldb-cmake-sanitized/llvm-project/lldb/packages/Python/lldbsuite/test/lldbutil.py", line 797, in run_to_breakpoint_do_run test.assertEqual(num_threads, 1, "Expected 1 thread to stop at breakpoint, %d did."%(num_threads)) AssertionError: 0 != 1 : Expected 1 thread to stop at breakpoint, 0 did. Config=x86_64-/Users/buildslave/jenkins/workspace/lldb-cmake-sanitized/lldb-build/bin/clang-10 ====================================================================== FAIL: test_coreframeworks_and_run_command_dwarf (TestDataFormatterObjCCF.ObjCDataFormatterCF) Test formatters for Core OSX frameworks. ---------------------------------------------------------------------- Traceback (most recent call last): File "/Users/buildslave/jenkins/workspace/lldb-cmake-sanitized/llvm-project/lldb/packages/Python/lldbsuite/test/lldbtest.py", line 1732, in test_method return attrvalue(self) File "/Users/buildslave/jenkins/workspace/lldb-cmake-sanitized/llvm-project/lldb/packages/Python/lldbsuite/test/functionalities/data-formatter/data-formatter-objc/TestDataFormatterObjCCF.py", line 23, in test_coreframeworks_and_run_command lldb.SBFileSpec('main.m', False)) File "/Users/buildslave/jenkins/workspace/lldb-cmake-sanitized/llvm-project/lldb/packages/Python/lldbsuite/test/lldbutil.py", line 868, in run_to_source_breakpoint only_one_thread, extra_images) File "/Users/buildslave/jenkins/workspace/lldb-cmake-sanitized/llvm-project/lldb/packages/Python/lldbsuite/test/lldbutil.py", line 797, in run_to_breakpoint_do_run test.assertEqual(num_threads, 1, "Expected 1 thread to stop at breakpoint, %d did."%(num_threads)) AssertionError: 0 != 1 : Expected 1 thread to stop at breakpoint, 0 did. Config=x86_64-/Users/buildslave/jenkins/workspace/lldb-cmake-sanitized/lldb-build/bin/clang-10 ====================================================================== FAIL: test_coreframeworks_and_run_command_gmodules (TestDataFormatterObjCCF.ObjCDataFormatterCF) Test formatters for Core OSX frameworks. ---------------------------------------------------------------------- Traceback (most recent call last): File "/Users/buildslave/jenkins/workspace/lldb-cmake-sanitized/llvm-project/lldb/packages/Python/lldbsuite/test/lldbtest.py", line 1732, in test_method return attrvalue(self) File "/Users/buildslave/jenkins/workspace/lldb-cmake-sanitized/llvm-project/lldb/packages/Python/lldbsuite/test/functionalities/data-formatter/data-formatter-objc/TestDataFormatterObjCCF.py", line 23, in test_coreframeworks_and_run_command lldb.SBFileSpec('main.m', False)) File "/Users/buildslave/jenkins/workspace/lldb-cmake-sanitized/llvm-project/lldb/packages/Python/lldbsuite/test/lldbutil.py", line 868, in run_to_source_breakpoint only_one_thread, extra_images) File "/Users/buildslave/jenkins/workspace/lldb-cmake-sanitized/llvm-project/lldb/packages/Python/lldbsuite/test/lldbutil.py", line 797, in run_to_breakpoint_do_run test.assertEqual(num_threads, 1, "Expected 1 thread to stop at breakpoint, %d did."%(num_threads)) AssertionError: 0 != 1 : Expected 1 thread to stop at breakpoint, 0 did. Config=x86_64-/Users/buildslave/jenkins/workspace/lldb-cmake-sanitized/lldb-build/bin/clang-10 ---------------------------------------------------------------------- Ran 4 tests in 39.186s

Hide Details

RESULT: FAILED (0 passes, 3 failures, 0 errors, 1 skipped, 0 expected failures, 0 unexpected successes)

Hide Details

******************** PASS: lldb-unit :: Utility/./UtilityTests/StreamTest.AddressNoSuffix (1199 of 1895) PASS: lldb-unit :: Utility/./UtilityTests/SubsystemRAIITest.SubsystemWithErrorFailure (1200 of 1895) FAIL: lldb-api :: functionalities/data-formatter/data-formatter-objc/TestDataFormatterObjCKVO.py (1201 of 1895) ******************** TEST 'lldb-api :: functionalities/data-formatter/data-formatter-objc/TestDataFormatterObjCKVO.py' FAILED ******************** lldb version 11.0.99 (http://labmaster3.local/git/llvm-project.git revision c1b13a1b17719aebace1b3be7a6ac7f90b1901a6) clang revision 7ce2de2ce4e7d4dd8e1e5a7a5b35c0f98e46681d llvm revision 7ce2de2ce4e7d4dd8e1e5a7a5b35c0f98e46681d LLDB library dir: /Users/buildslave/jenkins/workspace/lldb-cmake-sanitized/lldb-build/bin LLDB import library dir: /Users/buildslave/jenkins/workspace/lldb-cmake-sanitized/lldb-build/bin libstdcxx tests will not be run because: Don't know how to build with libstdcxx on macosx Skipping following debug info categories: ['dwo'] setting set target.prefer-dynamic-value no-dynamic-values AddressSanitizer report breakpoint hit. Use 'thread info -s' to get extended information about the report. AddressSanitizer report breakpoint hit. Use 'thread info -s' to get extended information about the report. AddressSanitizer report breakpoint hit. Use 'thread info -s' to get extended information about the report.

Hide Details

Session logs for test failures/errors/unexpected successes will go into directory '/Users/buildslave/jenkins/workspace/lldb-cmake-sanitized/test/logs' Command invoked: /Users/buildslave/jenkins/workspace/lldb-cmake-sanitized/llvm-project/lldb/test/API/dotest.py --arch x86_64 -s /Users/buildslave/jenkins/workspace/lldb-cmake-sanitized/lldb-build/lldb-test-traces -S nm -u CXXFLAGS -u CFLAGS --codesign-identity lldb_codesign --server /Users/buildslave/jenkins/workspace/lldb-cmake-sanitized/lldb-build/./bin/debugserver --arch x86_64 --build-dir /Users/buildslave/jenkins/workspace/lldb-cmake-sanitized/lldb-build/lldb-test-build.noindex -s=/Users/buildslave/jenkins/workspace/lldb-cmake-sanitized/test/logs -t --env TERM=vt100 --env LLVM_LIBS_DIR=/Users/buildslave/jenkins/workspace/lldb-cmake-sanitized/lldb-build/./lib --inferior-env ASAN_OPTIONS=detect_stack_use_after_return=1 --inferior-env DYLD_INSERT_LIBRARIES=/Users/buildslave/jenkins/workspace/lldb-cmake-sanitized/host-compiler/lib/clang/11.0.0/lib/darwin/libclang_rt.asan_osx_dynamic.dylib --build-dir /Users/buildslave/jenkins/workspace/lldb-cmake-sanitized/lldb-build/lldb-test-build.noindex --lldb-module-cache-dir /Users/buildslave/jenkins/workspace/lldb-cmake-sanitized/lldb-build/lldb-test-build.noindex/module-cache-lldb/lldb-api --clang-module-cache-dir /Users/buildslave/jenkins/workspace/lldb-cmake-sanitized/lldb-build/lldb-test-build.noindex/module-cache-clang/lldb-api --executable /Users/buildslave/jenkins/workspace/lldb-cmake-sanitized/lldb-build/./bin/lldb --compiler /Users/buildslave/jenkins/workspace/lldb-cmake-sanitized/lldb-build/./bin/clang --dsymutil /Users/buildslave/jenkins/workspace/lldb-cmake-sanitized/lldb-build/./bin/dsymutil --filecheck /Users/buildslave/jenkins/workspace/lldb-cmake-sanitized/lldb-build/./bin/FileCheck /Users/buildslave/jenkins/workspace/lldb-cmake-sanitized/llvm-project/lldb/packages/Python/lldbsuite/test/functionalities/data-formatter/data-formatter-objc -p TestDataFormatterObjCKVO.py Change dir to: /Users/buildslave/jenkins/workspace/lldb-cmake-sanitized/llvm-project/lldb/packages/Python/lldbsuite/test/functionalities/data-formatter/data-formatter-objc runCmd: settings set symbols.enable-external-lookup false output:

Hide Details

runCmd: settings set plugin.process.gdb-remote.packet-timeout 60 output:

Hide Details

runCmd: settings set symbols.clang-modules-cache-path "/Users/buildslave/jenkins/workspace/lldb-cmake-sanitized/lldb-build/lldb-test-build.noindex/module-cache-lldb/lldb-api" output:

Hide Details

runCmd: settings set use-color false output:

Hide Details

runCmd: settings set target.env-vars ASAN_OPTIONS=detect_stack_use_after_return=1 DYLD_INSERT_LIBRARIES=/Users/buildslave/jenkins/workspace/lldb-cmake-sanitized/host-compiler/lib/clang/11.0.0/lib/darwin/libclang_rt.asan_osx_dynamic.dylib output:

Hide Details

runCmd: settings set target.env-vars ASAN_OPTIONS=detect_stack_use_after_return=1 DYLD_INSERT_LIBRARIES=/Users/buildslave/jenkins/workspace/lldb-cmake-sanitized/host-compiler/lib/clang/11.0.0/lib/darwin/libclang_rt.asan_osx_dynamic.dylib output:

Hide Details

FAIL: LLDB (/Users/buildslave/jenkins/workspace/lldb-cmake-sanitized/lldb-build/bin/clang-10-x86_64) :: test_kvo_with_run_command_dsym (TestDataFormatterObjCKVO.ObjCDataFormatterKVO) <bound method SBProcess.Kill of <lldb.SBProcess; proxy of <Swig Object of type 'lldb::SBProcess *' at 0x10abd7240> >>: success

Hide Details

runCmd: settings set symbols.enable-external-lookup false output:

Hide Details

runCmd: settings set plugin.process.gdb-remote.packet-timeout 60 output:

Hide Details

runCmd: settings set symbols.clang-modules-cache-path "/Users/buildslave/jenkins/workspace/lldb-cmake-sanitized/lldb-build/lldb-test-build.noindex/module-cache-lldb/lldb-api" output:

Hide Details

runCmd: settings set use-color false output:

Hide Details

runCmd: settings set target.env-vars ASAN_OPTIONS=detect_stack_use_after_return=1 DYLD_INSERT_LIBRARIES=/Users/buildslave/jenkins/workspace/lldb-cmake-sanitized/host-compiler/lib/clang/11.0.0/lib/darwin/libclang_rt.asan_osx_dynamic.dylib output:

Hide Details

runCmd: settings set target.env-vars ASAN_OPTIONS=detect_stack_use_after_return=1 DYLD_INSERT_LIBRARIES=/Users/buildslave/jenkins/workspace/lldb-cmake-sanitized/host-compiler/lib/clang/11.0.0/lib/darwin/libclang_rt.asan_osx_dynamic.dylib output:

Hide Details

FAIL: LLDB (/Users/buildslave/jenkins/workspace/lldb-cmake-sanitized/lldb-build/bin/clang-10-x86_64) :: test_kvo_with_run_command_dwarf (TestDataFormatterObjCKVO.ObjCDataFormatterKVO) <bound method SBProcess.Kill of <lldb.SBProcess; proxy of <Swig Object of type 'lldb::SBProcess *' at 0x10a62c630> >>: success

Hide Details

UNSUPPORTED: LLDB (/Users/buildslave/jenkins/workspace/lldb-cmake-sanitized/lldb-build/bin/clang-10-x86_64) :: test_kvo_with_run_command_dwo (TestDataFormatterObjCKVO.ObjCDataFormatterKVO) (test case does not fall in any category of interest for this run) runCmd: settings set symbols.enable-external-lookup false output:

Hide Details

runCmd: settings set plugin.process.gdb-remote.packet-timeout 60 output:

Hide Details

runCmd: settings set symbols.clang-modules-cache-path "/Users/buildslave/jenkins/workspace/lldb-cmake-sanitized/lldb-build/lldb-test-build.noindex/module-cache-lldb/lldb-api" output:

Hide Details

runCmd: settings set use-color false output:

Hide Details

runCmd: settings set target.env-vars ASAN_OPTIONS=detect_stack_use_after_return=1 DYLD_INSERT_LIBRARIES=/Users/buildslave/jenkins/workspace/lldb-cmake-sanitized/host-compiler/lib/clang/11.0.0/lib/darwin/libclang_rt.asan_osx_dynamic.dylib output:

Hide Details

runCmd: settings set target.env-vars ASAN_OPTIONS=detect_stack_use_after_return=1 DYLD_INSERT_LIBRARIES=/Users/buildslave/jenkins/workspace/lldb-cmake-sanitized/host-compiler/lib/clang/11.0.0/lib/darwin/libclang_rt.asan_osx_dynamic.dylib output:

Hide Details

FAIL: LLDB (/Users/buildslave/jenkins/workspace/lldb-cmake-sanitized/lldb-build/bin/clang-10-x86_64) :: test_kvo_with_run_command_gmodules (TestDataFormatterObjCKVO.ObjCDataFormatterKVO) <bound method SBProcess.Kill of <lldb.SBProcess; proxy of <Swig Object of type 'lldb::SBProcess *' at 0x10abd7540> >>: success

Hide Details

Restore dir to: /Users/buildslave/jenkins/workspace/lldb-cmake-sanitized/lldb-build/tools/lldb/test ====================================================================== FAIL: test_kvo_with_run_command_dsym (TestDataFormatterObjCKVO.ObjCDataFormatterKVO) Test the behavior of formatters when KVO is in use. ---------------------------------------------------------------------- Traceback (most recent call last): File "/Users/buildslave/jenkins/workspace/lldb-cmake-sanitized/llvm-project/lldb/packages/Python/lldbsuite/test/lldbtest.py", line 1732, in test_method return attrvalue(self) File "/Users/buildslave/jenkins/workspace/lldb-cmake-sanitized/llvm-project/lldb/packages/Python/lldbsuite/test/functionalities/data-formatter/data-formatter-objc/TestDataFormatterObjCKVO.py", line 23, in test_kvo_with_run_command lldb.SBFileSpec('main.m', False)) File "/Users/buildslave/jenkins/workspace/lldb-cmake-sanitized/llvm-project/lldb/packages/Python/lldbsuite/test/lldbutil.py", line 868, in run_to_source_breakpoint only_one_thread, extra_images) File "/Users/buildslave/jenkins/workspace/lldb-cmake-sanitized/llvm-project/lldb/packages/Python/lldbsuite/test/lldbutil.py", line 797, in run_to_breakpoint_do_run test.assertEqual(num_threads, 1, "Expected 1 thread to stop at breakpoint, %d did."%(num_threads)) AssertionError: 0 != 1 : Expected 1 thread to stop at breakpoint, 0 did. Config=x86_64-/Users/buildslave/jenkins/workspace/lldb-cmake-sanitized/lldb-build/bin/clang-10 ====================================================================== FAIL: test_kvo_with_run_command_dwarf (TestDataFormatterObjCKVO.ObjCDataFormatterKVO) Test the behavior of formatters when KVO is in use. ---------------------------------------------------------------------- Traceback (most recent call last): File "/Users/buildslave/jenkins/workspace/lldb-cmake-sanitized/llvm-project/lldb/packages/Python/lldbsuite/test/lldbtest.py", line 1732, in test_method return attrvalue(self) File "/Users/buildslave/jenkins/workspace/lldb-cmake-sanitized/llvm-project/lldb/packages/Python/lldbsuite/test/functionalities/data-formatter/data-formatter-objc/TestDataFormatterObjCKVO.py", line 23, in test_kvo_with_run_command lldb.SBFileSpec('main.m', False)) File "/Users/buildslave/jenkins/workspace/lldb-cmake-sanitized/llvm-project/lldb/packages/Python/lldbsuite/test/lldbutil.py", line 868, in run_to_source_breakpoint only_one_thread, extra_images) File "/Users/buildslave/jenkins/workspace/lldb-cmake-sanitized/llvm-project/lldb/packages/Python/lldbsuite/test/lldbutil.py", line 797, in run_to_breakpoint_do_run test.assertEqual(num_threads, 1, "Expected 1 thread to stop at breakpoint, %d did."%(num_threads)) AssertionError: 0 != 1 : Expected 1 thread to stop at breakpoint, 0 did. Config=x86_64-/Users/buildslave/jenkins/workspace/lldb-cmake-sanitized/lldb-build/bin/clang-10 ====================================================================== FAIL: test_kvo_with_run_command_gmodules (TestDataFormatterObjCKVO.ObjCDataFormatterKVO) Test the behavior of formatters when KVO is in use. ---------------------------------------------------------------------- Traceback (most recent call last): File "/Users/buildslave/jenkins/workspace/lldb-cmake-sanitized/llvm-project/lldb/packages/Python/lldbsuite/test/lldbtest.py", line 1732, in test_method return attrvalue(self) File "/Users/buildslave/jenkins/workspace/lldb-cmake-sanitized/llvm-project/lldb/packages/Python/lldbsuite/test/functionalities/data-formatter/data-formatter-objc/TestDataFormatterObjCKVO.py", line 23, in test_kvo_with_run_command lldb.SBFileSpec('main.m', False)) File "/Users/buildslave/jenkins/workspace/lldb-cmake-sanitized/llvm-project/lldb/packages/Python/lldbsuite/test/lldbutil.py", line 868, in run_to_source_breakpoint only_one_thread, extra_images) File "/Users/buildslave/jenkins/workspace/lldb-cmake-sanitized/llvm-project/lldb/packages/Python/lldbsuite/test/lldbutil.py", line 797, in run_to_breakpoint_do_run test.assertEqual(num_threads, 1, "Expected 1 thread to stop at breakpoint, %d did."%(num_threads)) AssertionError: 0 != 1 : Expected 1 thread to stop at breakpoint, 0 did. Config=x86_64-/Users/buildslave/jenkins/workspace/lldb-cmake-sanitized/lldb-build/bin/clang-10 ---------------------------------------------------------------------- Ran 4 tests in 39.273s

Hide Details

RESULT: FAILED (0 passes, 3 failures, 0 errors, 1 skipped, 0 expected failures, 0 unexpected successes)

Hide Details

******************** PASS: lldb-unit :: Utility/./UtilityTests/ConstStringTest.UpdateMangledCounterpart (1202 of 1895) PASS: lldb-unit :: Utility/./UtilityTests/ScalarTest.GetBytes (1203 of 1895) PASS: lldb-unit :: Expression/./ExpressionTests/DiagnosticManagerTest.FixedExpression (1204 of 1895) PASS: lldb-unit :: Utility/./UtilityTests/AnsiTerminal.AtEnd (1205 of 1895) PASS: lldb-unit :: Symbol/./SymbolTests/LineEntryTest.GetSameLineContiguousAddressRangeNoInlines (1206 of 1895) PASS: lldb-api :: macosx/order/TestOrderFile.py (1207 of 1895) UNSUPPORTED: lldb-api :: functionalities/thread/create_during_step/TestCreateDuringStep.py (1208 of 1895) PASS: lldb-api :: commands/expression/fixits/TestFixIts.py (1209 of 1895) PASS: lldb-shell :: Quit/TestQuitExitCode0.test (1210 of 1895) PASS: lldb-unit :: ScriptInterpreter/Python/./ScriptInterpreterPythonTests/PythonDataObjectsTest.TestPythonDictionaryToStructuredDictionary (1211 of 1895) UNSUPPORTED: lldb-api :: android/platform/TestDefaultCacheLineSize.py (1212 of 1895) PASS: lldb-api :: python_api/default-constructor/TestDefaultConstructorForAPIObjects.py (1213 of 1895) PASS: lldb-unit :: Utility/./UtilityTests/CompletionRequest.DuplicateFilteringWithComments (1214 of 1895) PASS: lldb-unit :: UnwindAssembly/x86/./UnwindAssemblyx86Tests/Testx86AssemblyInspectionEngine.Test64bitFramelessBigStackFrame (1215 of 1895) PASS: lldb-unit :: Utility/./UtilityTests/StringExtractorTest.GetHexU8_Extra (1216 of 1895) PASS: lldb-api :: functionalities/thread/concurrent_events/TestConcurrentManyBreakpoints.py (1217 of 1895) PASS: lldb-unit :: Expression/./ExpressionTests/DiagnosticManagerTest.AddDiagnostic (1218 of 1895) PASS: lldb-shell :: SymbolFile/NativePDB/function-types-classes.cpp (1219 of 1895) PASS: lldb-unit :: Utility/./UtilityTests/ArgsTest.TestSingleArgWithQuotedSpace (1220 of 1895) PASS: lldb-unit :: Utility/./UtilityTests/StringExtractorTest.GetHexU8_Extra_NoEof (1221 of 1895) PASS: lldb-api :: commands/expression/call-throws/TestCallThatThrows.py (1222 of 1895) PASS: lldb-unit :: Utility/./UtilityTests/StringListTest.LongestCommonPrefixDuplicateElement (1223 of 1895) PASS: lldb-unit :: Core/./LLDBCoreTests/MangledTest.ResultForValidName (1224 of 1895) PASS: lldb-api :: python_api/process/TestProcessAPI.py (1225 of 1895) PASS: lldb-api :: commands/log/basic/TestLogging.py (1226 of 1895) PASS: lldb-api :: commands/process/attach/TestProcessAttach.py (1227 of 1895) PASS: lldb-unit :: Process/gdb-remote/./ProcessGdbRemoteTests/GDBRemoteCommunicationClientTest.SendSignalsToIgnore (1228 of 1895) PASS: lldb-api :: functionalities/breakpoint/address_breakpoints/TestBadAddressBreakpoints.py (1229 of 1895) PASS: lldb-unit :: Utility/./UtilityTests/StringExtractorTest.GetHexU8_Underflow_NoEof (1230 of 1895) PASS: lldb-unit :: Utility/./UtilityTests/AnsiTerminal.Basic (1231 of 1895) PASS: lldb-api :: commands/expression/import-std-module/conflicts/TestStdModuleWithConflicts.py (1232 of 1895) PASS: lldb-unit :: Expression/./ExpressionTests/DiagnosticManagerTest.PutStringMultiple (1233 of 1895) PASS: lldb-shell :: Unwind/thread-step-out-ret-addr-check.test (1234 of 1895) PASS: lldb-unit :: Expression/./ExpressionTests/CppModuleConfigurationTest.LinuxLocalLibCpp (1235 of 1895) FAIL: lldb-api :: functionalities/data-formatter/data-formatter-objc/TestDataFormatterObjCNSContainer.py (1236 of 1895) ******************** TEST 'lldb-api :: functionalities/data-formatter/data-formatter-objc/TestDataFormatterObjCNSContainer.py' FAILED ******************** lldb version 11.0.99 (http://labmaster3.local/git/llvm-project.git revision c1b13a1b17719aebace1b3be7a6ac7f90b1901a6) clang revision 7ce2de2ce4e7d4dd8e1e5a7a5b35c0f98e46681d llvm revision 7ce2de2ce4e7d4dd8e1e5a7a5b35c0f98e46681d LLDB library dir: /Users/buildslave/jenkins/workspace/lldb-cmake-sanitized/lldb-build/bin LLDB import library dir: /Users/buildslave/jenkins/workspace/lldb-cmake-sanitized/lldb-build/bin libstdcxx tests will not be run because: Don't know how to build with libstdcxx on macosx Skipping following debug info categories: ['dwo'] setting set target.prefer-dynamic-value no-dynamic-values AddressSanitizer report breakpoint hit. Use 'thread info -s' to get extended information about the report. AddressSanitizer report breakpoint hit. Use 'thread info -s' to get extended information about the report. AddressSanitizer report breakpoint hit. Use 'thread info -s' to get extended information about the report.

Hide Details

Session logs for test failures/errors/unexpected successes will go into directory '/Users/buildslave/jenkins/workspace/lldb-cmake-sanitized/test/logs' Command invoked: /Users/buildslave/jenkins/workspace/lldb-cmake-sanitized/llvm-project/lldb/test/API/dotest.py --arch x86_64 -s /Users/buildslave/jenkins/workspace/lldb-cmake-sanitized/lldb-build/lldb-test-traces -S nm -u CXXFLAGS -u CFLAGS --codesign-identity lldb_codesign --server /Users/buildslave/jenkins/workspace/lldb-cmake-sanitized/lldb-build/./bin/debugserver --arch x86_64 --build-dir /Users/buildslave/jenkins/workspace/lldb-cmake-sanitized/lldb-build/lldb-test-build.noindex -s=/Users/buildslave/jenkins/workspace/lldb-cmake-sanitized/test/logs -t --env TERM=vt100 --env LLVM_LIBS_DIR=/Users/buildslave/jenkins/workspace/lldb-cmake-sanitized/lldb-build/./lib --inferior-env ASAN_OPTIONS=detect_stack_use_after_return=1 --inferior-env DYLD_INSERT_LIBRARIES=/Users/buildslave/jenkins/workspace/lldb-cmake-sanitized/host-compiler/lib/clang/11.0.0/lib/darwin/libclang_rt.asan_osx_dynamic.dylib --build-dir /Users/buildslave/jenkins/workspace/lldb-cmake-sanitized/lldb-build/lldb-test-build.noindex --lldb-module-cache-dir /Users/buildslave/jenkins/workspace/lldb-cmake-sanitized/lldb-build/lldb-test-build.noindex/module-cache-lldb/lldb-api --clang-module-cache-dir /Users/buildslave/jenkins/workspace/lldb-cmake-sanitized/lldb-build/lldb-test-build.noindex/module-cache-clang/lldb-api --executable /Users/buildslave/jenkins/workspace/lldb-cmake-sanitized/lldb-build/./bin/lldb --compiler /Users/buildslave/jenkins/workspace/lldb-cmake-sanitized/lldb-build/./bin/clang --dsymutil /Users/buildslave/jenkins/workspace/lldb-cmake-sanitized/lldb-build/./bin/dsymutil --filecheck /Users/buildslave/jenkins/workspace/lldb-cmake-sanitized/lldb-build/./bin/FileCheck /Users/buildslave/jenkins/workspace/lldb-cmake-sanitized/llvm-project/lldb/packages/Python/lldbsuite/test/functionalities/data-formatter/data-formatter-objc -p TestDataFormatterObjCNSContainer.py Change dir to: /Users/buildslave/jenkins/workspace/lldb-cmake-sanitized/llvm-project/lldb/packages/Python/lldbsuite/test/functionalities/data-formatter/data-formatter-objc runCmd: settings set symbols.enable-external-lookup false output:

Hide Details

runCmd: settings set plugin.process.gdb-remote.packet-timeout 60 output:

Hide Details

runCmd: settings set symbols.clang-modules-cache-path "/Users/buildslave/jenkins/workspace/lldb-cmake-sanitized/lldb-build/lldb-test-build.noindex/module-cache-lldb/lldb-api" output:

Hide Details

runCmd: settings set use-color false output:

Hide Details

runCmd: settings set target.env-vars ASAN_OPTIONS=detect_stack_use_after_return=1 DYLD_INSERT_LIBRARIES=/Users/buildslave/jenkins/workspace/lldb-cmake-sanitized/host-compiler/lib/clang/11.0.0/lib/darwin/libclang_rt.asan_osx_dynamic.dylib output:

Hide Details

runCmd: settings set target.env-vars ASAN_OPTIONS=detect_stack_use_after_return=1 DYLD_INSERT_LIBRARIES=/Users/buildslave/jenkins/workspace/lldb-cmake-sanitized/host-compiler/lib/clang/11.0.0/lib/darwin/libclang_rt.asan_osx_dynamic.dylib output:

Hide Details

FAIL: LLDB (/Users/buildslave/jenkins/workspace/lldb-cmake-sanitized/lldb-build/bin/clang-10-x86_64) :: test_nscontainers_with_run_command_dsym (TestDataFormatterObjCNSContainer.ObjCDataFormatterNSContainer) <bound method SBProcess.Kill of <lldb.SBProcess; proxy of <Swig Object of type 'lldb::SBProcess *' at 0x127e33210> >>: success

Hide Details

runCmd: settings set symbols.enable-external-lookup false output:

Hide Details

runCmd: settings set plugin.process.gdb-remote.packet-timeout 60 output:

Hide Details

runCmd: settings set symbols.clang-modules-cache-path "/Users/buildslave/jenkins/workspace/lldb-cmake-sanitized/lldb-build/lldb-test-build.noindex/module-cache-lldb/lldb-api" output:

Hide Details

runCmd: settings set use-color false output:

Hide Details

runCmd: settings set target.env-vars ASAN_OPTIONS=detect_stack_use_after_return=1 DYLD_INSERT_LIBRARIES=/Users/buildslave/jenkins/workspace/lldb-cmake-sanitized/host-compiler/lib/clang/11.0.0/lib/darwin/libclang_rt.asan_osx_dynamic.dylib output:

Hide Details

runCmd: settings set target.env-vars ASAN_OPTIONS=detect_stack_use_after_return=1 DYLD_INSERT_LIBRARIES=/Users/buildslave/jenkins/workspace/lldb-cmake-sanitized/host-compiler/lib/clang/11.0.0/lib/darwin/libclang_rt.asan_osx_dynamic.dylib output:

Hide Details

FAIL: LLDB (/Users/buildslave/jenkins/workspace/lldb-cmake-sanitized/lldb-build/bin/clang-10-x86_64) :: test_nscontainers_with_run_command_dwarf (TestDataFormatterObjCNSContainer.ObjCDataFormatterNSContainer) <bound method SBProcess.Kill of <lldb.SBProcess; proxy of <Swig Object of type 'lldb::SBProcess *' at 0x10f71c630> >>: success

Hide Details

UNSUPPORTED: LLDB (/Users/buildslave/jenkins/workspace/lldb-cmake-sanitized/lldb-build/bin/clang-10-x86_64) :: test_nscontainers_with_run_command_dwo (TestDataFormatterObjCNSContainer.ObjCDataFormatterNSContainer) (test case does not fall in any category of interest for this run) runCmd: settings set symbols.enable-external-lookup false output:

Hide Details

runCmd: settings set plugin.process.gdb-remote.packet-timeout 60 output:

Hide Details

runCmd: settings set symbols.clang-modules-cache-path "/Users/buildslave/jenkins/workspace/lldb-cmake-sanitized/lldb-build/lldb-test-build.noindex/module-cache-lldb/lldb-api" output:

Hide Details

runCmd: settings set use-color false output:

Hide Details

runCmd: settings set target.env-vars ASAN_OPTIONS=detect_stack_use_after_return=1 DYLD_INSERT_LIBRARIES=/Users/buildslave/jenkins/workspace/lldb-cmake-sanitized/host-compiler/lib/clang/11.0.0/lib/darwin/libclang_rt.asan_osx_dynamic.dylib output:

Hide Details

runCmd: settings set target.env-vars ASAN_OPTIONS=detect_stack_use_after_return=1 DYLD_INSERT_LIBRARIES=/Users/buildslave/jenkins/workspace/lldb-cmake-sanitized/host-compiler/lib/clang/11.0.0/lib/darwin/libclang_rt.asan_osx_dynamic.dylib output:

Hide Details

FAIL: LLDB (/Users/buildslave/jenkins/workspace/lldb-cmake-sanitized/lldb-build/bin/clang-10-x86_64) :: test_nscontainers_with_run_command_gmodules (TestDataFormatterObjCNSContainer.ObjCDataFormatterNSContainer) <bound method SBProcess.Kill of <lldb.SBProcess; proxy of <Swig Object of type 'lldb::SBProcess *' at 0x127e33540> >>: success

Hide Details

Restore dir to: /Users/buildslave/jenkins/workspace/lldb-cmake-sanitized/lldb-build/tools/lldb/test ====================================================================== FAIL: test_nscontainers_with_run_command_dsym (TestDataFormatterObjCNSContainer.ObjCDataFormatterNSContainer) Test formatters for NS container classes. ---------------------------------------------------------------------- Traceback (most recent call last): File "/Users/buildslave/jenkins/workspace/lldb-cmake-sanitized/llvm-project/lldb/packages/Python/lldbsuite/test/lldbtest.py", line 1732, in test_method return attrvalue(self) File "/Users/buildslave/jenkins/workspace/lldb-cmake-sanitized/llvm-project/lldb/packages/Python/lldbsuite/test/functionalities/data-formatter/data-formatter-objc/TestDataFormatterObjCNSContainer.py", line 20, in test_nscontainers_with_run_command self.appkit_tester_impl(self.nscontainers_data_formatter_commands) File "/Users/buildslave/jenkins/workspace/lldb-cmake-sanitized/llvm-project/lldb/packages/Python/lldbsuite/test/functionalities/data-formatter/data-formatter-objc/ObjCDataFormatterTestCase.py", line 19, in appkit_tester_impl self.appkit_common_data_formatters_command() File "/Users/buildslave/jenkins/workspace/lldb-cmake-sanitized/llvm-project/lldb/packages/Python/lldbsuite/test/functionalities/data-formatter/data-formatter-objc/ObjCDataFormatterTestCase.py", line 26, in appkit_common_data_formatters_command lldb.SBFileSpec('main.m', False)) File "/Users/buildslave/jenkins/workspace/lldb-cmake-sanitized/llvm-project/lldb/packages/Python/lldbsuite/test/lldbutil.py", line 868, in run_to_source_breakpoint only_one_thread, extra_images) File "/Users/buildslave/jenkins/workspace/lldb-cmake-sanitized/llvm-project/lldb/packages/Python/lldbsuite/test/lldbutil.py", line 797, in run_to_breakpoint_do_run test.assertEqual(num_threads, 1, "Expected 1 thread to stop at breakpoint, %d did."%(num_threads)) AssertionError: 0 != 1 : Expected 1 thread to stop at breakpoint, 0 did. Config=x86_64-/Users/buildslave/jenkins/workspace/lldb-cmake-sanitized/lldb-build/bin/clang-10 ====================================================================== FAIL: test_nscontainers_with_run_command_dwarf (TestDataFormatterObjCNSContainer.ObjCDataFormatterNSContainer) Test formatters for NS container classes. ---------------------------------------------------------------------- Traceback (most recent call last): File "/Users/buildslave/jenkins/workspace/lldb-cmake-sanitized/llvm-project/lldb/packages/Python/lldbsuite/test/lldbtest.py", line 1732, in test_method return attrvalue(self) File "/Users/buildslave/jenkins/workspace/lldb-cmake-sanitized/llvm-project/lldb/packages/Python/lldbsuite/test/functionalities/data-formatter/data-formatter-objc/TestDataFormatterObjCNSContainer.py", line 20, in test_nscontainers_with_run_command self.appkit_tester_impl(self.nscontainers_data_formatter_commands) File "/Users/buildslave/jenkins/workspace/lldb-cmake-sanitized/llvm-project/lldb/packages/Python/lldbsuite/test/functionalities/data-formatter/data-formatter-objc/ObjCDataFormatterTestCase.py", line 19, in appkit_tester_impl self.appkit_common_data_formatters_command() File "/Users/buildslave/jenkins/workspace/lldb-cmake-sanitized/llvm-project/lldb/packages/Python/lldbsuite/test/functionalities/data-formatter/data-formatter-objc/ObjCDataFormatterTestCase.py", line 26, in appkit_common_data_formatters_command lldb.SBFileSpec('main.m', False)) File "/Users/buildslave/jenkins/workspace/lldb-cmake-sanitized/llvm-project/lldb/packages/Python/lldbsuite/test/lldbutil.py", line 868, in run_to_source_breakpoint only_one_thread, extra_images) File "/Users/buildslave/jenkins/workspace/lldb-cmake-sanitized/llvm-project/lldb/packages/Python/lldbsuite/test/lldbutil.py", line 797, in run_to_breakpoint_do_run test.assertEqual(num_threads, 1, "Expected 1 thread to stop at breakpoint, %d did."%(num_threads)) AssertionError: 0 != 1 : Expected 1 thread to stop at breakpoint, 0 did. Config=x86_64-/Users/buildslave/jenkins/workspace/lldb-cmake-sanitized/lldb-build/bin/clang-10 ====================================================================== FAIL: test_nscontainers_with_run_command_gmodules (TestDataFormatterObjCNSContainer.ObjCDataFormatterNSContainer) Test formatters for NS container classes. ---------------------------------------------------------------------- Traceback (most recent call last): File "/Users/buildslave/jenkins/workspace/lldb-cmake-sanitized/llvm-project/lldb/packages/Python/lldbsuite/test/lldbtest.py", line 1732, in test_method return attrvalue(self) File "/Users/buildslave/jenkins/workspace/lldb-cmake-sanitized/llvm-project/lldb/packages/Python/lldbsuite/test/functionalities/data-formatter/data-formatter-objc/TestDataFormatterObjCNSContainer.py", line 20, in test_nscontainers_with_run_command self.appkit_tester_impl(self.nscontainers_data_formatter_commands) File "/Users/buildslave/jenkins/workspace/lldb-cmake-sanitized/llvm-project/lldb/packages/Python/lldbsuite/test/functionalities/data-formatter/data-formatter-objc/ObjCDataFormatterTestCase.py", line 19, in appkit_tester_impl self.appkit_common_data_formatters_command() File "/Users/buildslave/jenkins/workspace/lldb-cmake-sanitized/llvm-project/lldb/packages/Python/lldbsuite/test/functionalities/data-formatter/data-formatter-objc/ObjCDataFormatterTestCase.py", line 26, in appkit_common_data_formatters_command lldb.SBFileSpec('main.m', False)) File "/Users/buildslave/jenkins/workspace/lldb-cmake-sanitized/llvm-project/lldb/packages/Python/lldbsuite/test/lldbutil.py", line 868, in run_to_source_breakpoint only_one_thread, extra_images) File "/Users/buildslave/jenkins/workspace/lldb-cmake-sanitized/llvm-project/lldb/packages/Python/lldbsuite/test/lldbutil.py", line 797, in run_to_breakpoint_do_run test.assertEqual(num_threads, 1, "Expected 1 thread to stop at breakpoint, %d did."%(num_threads)) AssertionError: 0 != 1 : Expected 1 thread to stop at breakpoint, 0 did. Config=x86_64-/Users/buildslave/jenkins/workspace/lldb-cmake-sanitized/lldb-build/bin/clang-10 ---------------------------------------------------------------------- Ran 4 tests in 38.721s

Hide Details

RESULT: FAILED (0 passes, 3 failures, 0 errors, 1 skipped, 0 expected failures, 0 unexpected successes)

Hide Details

******************** PASS: lldb-api :: python_api/watchpoint/watchlocation/TestSetWatchlocation.py (1237 of 1895) PASS: lldb-api :: functionalities/gdb_remote_client/TestGDBRemoteClient.py (1238 of 1895) PASS: lldb-unit :: Symbol/./SymbolTests/Type.GetTypeScopeAndBasename (1239 of 1895) PASS: lldb-api :: lang/cpp/offsetof/TestOffsetofCpp.py (1240 of 1895) PASS: lldb-unit :: Utility/./UtilityTests/StringListTest.JoinThree (1241 of 1895) PASS: lldb-unit :: Utility/./UtilityTests/VMRange.Comparison (1242 of 1895) PASS: lldb-api :: commands/frame/language/TestGuessLanguage.py (1243 of 1895) PASS: lldb-unit :: Symbol/./SymbolTests/PostfixExpression.ParseOneExpression (1244 of 1895) PASS: lldb-unit :: Utility/./UtilityTests/StreamTest.QuotedCString (1245 of 1895) PASS: lldb-api :: lang/objc/objc-struct-return/TestObjCStructReturn.py (1246 of 1895) PASS: lldb-shell :: SymbolFile/Breakpad/line-table-mixed-path-styles.test (1247 of 1895) PASS: lldb-api :: functionalities/thread/concurrent_events/TestConcurrentTwoWatchpointsOneBreakpoint.py (1248 of 1895) PASS: lldb-api :: lang/cpp/std-function-step-into-callable/TestStdFunctionStepIntoCallable.py (1249 of 1895) UNSUPPORTED: lldb-shell :: Register/x86-gp-write.test (1250 of 1895) PASS: lldb-shell :: SymbolFile/DWARF/find-qualified-variable.cpp (1251 of 1895) PASS: lldb-unit :: Language/Highlighting/./HighlighterTests/HighlighterTest.HighlighterSelectionType (1252 of 1895) PASS: lldb-unit :: Utility/./UtilityTests/GeneratorTest.GetOrCreate (1253 of 1895) PASS: lldb-unit :: SymbolFile/NativePDB/./SymbolFileNativePDBTests/PDBFPOProgramToDWARFExpressionTests.InvalidOpBinary (1254 of 1895) UNSUPPORTED: lldb-api :: functionalities/ubsan/basic/TestUbsanBasic.py (1255 of 1895) PASS: lldb-api :: source-manager/TestSourceManager.py (1256 of 1895) UNSUPPORTED: lldb-api :: functionalities/ubsan/user-expression/TestUbsanUserExpression.py (1257 of 1895) PASS: lldb-api :: functionalities/step-avoids-no-debug/TestStepNoDebug.py (1258 of 1895) PASS: lldb-unit :: Utility/./UtilityTests/ArgsTest.TestTrailingBackslash (1259 of 1895) PASS: lldb-unit :: Symbol/./SymbolTests/TestClangASTContext.TestGetTypeClassTypeOf (1260 of 1895) UNSUPPORTED: lldb-api :: functionalities/thread/state/TestThreadStates.py (1261 of 1895) PASS: lldb-unit :: SymbolFile/NativePDB/./SymbolFileNativePDBTests/PDBFPOProgramToDWARFExpressionTests.UnresolvedRegisterReference (1262 of 1895) PASS: lldb-unit :: Interpreter/./InterpreterTests/CompletionTest.DirCompletionAbsolute (1263 of 1895) PASS: lldb-api :: functionalities/data-formatter/data-formatter-objc/nsindexpath/TestDataFormatterNSIndexPath.py (1264 of 1895) PASS: lldb-api :: functionalities/object-file/TestImageListMultiArchitecture.py (1265 of 1895) PASS: lldb-api :: lang/cpp/breakpoint-commands/TestCPPBreakpointCommands.py (1266 of 1895) UNSUPPORTED: lldb-shell :: ObjectFile/ELF/minidebuginfo-no-lzma.yaml (1267 of 1895) PASS: lldb-api :: commands/expression/inline-namespace/TestInlineNamespace.py (1268 of 1895) PASS: lldb-api :: functionalities/data-formatter/synthupdate/TestSyntheticFilterRecompute.py (1269 of 1895) PASS: lldb-api :: functionalities/data-formatter/array_typedef/TestArrayTypedef.py (1270 of 1895) PASS: lldb-unit :: Language/Highlighting/./HighlighterTests/HighlighterTest.ClangCursorPosEndOfLine (1271 of 1895) PASS: lldb-api :: functionalities/float-display/TestFloatDisplay.py (1272 of 1895) PASS: lldb-unit :: Language/Highlighting/./HighlighterTests/HighlighterTest.ClangScalarLiterals (1273 of 1895) UNSUPPORTED: lldb-shell :: SymbolFile/PDB/type-quals.test (1274 of 1895) PASS: lldb-shell :: SymbolFile/NativePDB/ast-methods.cpp (1275 of 1895) PASS: lldb-shell :: SymbolFile/DWARF/dir-separator-windows.s (1276 of 1895) PASS: lldb-api :: commands/expression/import-std-module/sysroot/TestStdModuleSysroot.py (1277 of 1895) PASS: lldb-api :: lang/objc/ivar-IMP/TestObjCiVarIMP.py (1278 of 1895) PASS: lldb-shell :: SymbolFile/DWARF/debug_ranges_and_rnglists.test (1279 of 1895) PASS: lldb-unit :: Host/./HostTests/FileActionTest.Open (1280 of 1895) PASS: lldb-unit :: Utility/./UtilityTests/StreamTest.PutBytesAsRawHex8ToBigEndian (1281 of 1895) PASS: lldb-unit :: Expression/./ExpressionTests/ClangHostTest.MacOSX (1282 of 1895) PASS: lldb-unit :: Utility/./UtilityTests/StreamTest.PutHex8 (1283 of 1895) UNSUPPORTED: lldb-api :: commands/gui/basic/TestGuiBasic.py (1284 of 1895) PASS: lldb-unit :: Utility/./UtilityTests/StringListTest.JoinMultiCharSeparator (1285 of 1895) PASS: lldb-unit :: Utility/./UtilityTests/UriParserTest.TypicalPortPath (1286 of 1895) PASS: lldb-unit :: Utility/./UtilityTests/LogChannelTest.Disable (1287 of 1895) PASS: lldb-unit :: Utility/./UtilityTests/NameMatchesTest.StartsWith (1288 of 1895) PASS: lldb-unit :: Process/gdb-remote/./ProcessGdbRemoteTests/GDBRemoteClientBaseTest.SendContinueAndAsyncSignal (1289 of 1895) PASS: lldb-api :: functionalities/data-formatter/boolreference/TestFormattersBoolRefPtr.py (1290 of 1895) PASS: lldb-unit :: Utility/./UtilityTests/StringListTest.ForRangeEmpty (1291 of 1895) PASS: lldb-unit :: Utility/./UtilityTests/ArchSpecTest.TestSetTriple (1292 of 1895) PASS: lldb-api :: commands/expression/persistent_types/TestPersistentTypes.py (1293 of 1895) PASS: lldb-api :: functionalities/postmortem/netbsd-core/TestNetBSDCore.py (1294 of 1895) PASS: lldb-api :: functionalities/data-formatter/frameformat_smallstruct/TestFrameFormatSmallStruct.py (1295 of 1895) PASS: lldb-api :: lang/cpp/extern_c/TestExternCSymbols.py (1296 of 1895) PASS: lldb-unit :: Host/./HostTests/NativeProcessProtocolTest.ReadCStringFromMemory (1297 of 1895) PASS: lldb-api :: lang/c/strings/TestCStrings.py (1298 of 1895) PASS: lldb-api :: tools/lldb-vscode/attach/TestVSCode_attach.py (1299 of 1895) PASS: lldb-unit :: Utility/./UtilityTests/SerializationRountripTest.SerializeDeserializePodPointers (1300 of 1895) PASS: lldb-unit :: Utility/./UtilityTests/ArchSpecTest.TripleComponentsWereSpecified (1301 of 1895) PASS: lldb-api :: lang/objc/orderedset/TestOrderedSet.py (1302 of 1895) PASS: lldb-shell :: Reproducer/TestDiscard.test (1303 of 1895) PASS: lldb-api :: commands/watchpoints/watchpoint_disable/TestWatchpointDisable.py (1304 of 1895) PASS: lldb-shell :: Reproducer/TestWorkingDir.test (1305 of 1895) PASS: lldb-api :: lang/c/stepping/TestStepAndBreakpoints.py (1306 of 1895) PASS: lldb-unit :: Utility/./UtilityTests/CompletionRequest.TryCompleteCurrentArgGood (1307 of 1895) PASS: lldb-unit :: Process/gdb-remote/./ProcessGdbRemoteTests/GDBRemoteClientBaseTest.SendContinueAndAsyncPacket (1308 of 1895) PASS: lldb-api :: lang/c/step-target/TestStepTarget.py (1309 of 1895) PASS: lldb-unit :: UnwindAssembly/x86/./UnwindAssemblyx86Tests/Testx86AssemblyInspectionEngine.TestPopEBP (1310 of 1895) UNSUPPORTED: lldb-shell :: SymbolFile/NativePDB/local-variables.cpp (1311 of 1895) PASS: lldb-api :: commands/disassemble/basic/TestFrameDisassemble.py (1312 of 1895) PASS: lldb-api :: functionalities/thread/concurrent_events/TestConcurrentCrashWithBreak.py (1313 of 1895) PASS: lldb-api :: functionalities/breakpoint/objc/TestObjCBreakpoints.py (1314 of 1895) PASS: lldb-api :: commands/expression/codegen-crash-typedefdecl-not-in_declcontext/TestCodegenCrashTypedefDeclNotInDeclContext.py (1315 of 1895) PASS: lldb-api :: python_api/watchpoint/TestWatchpointIter.py (1316 of 1895) PASS: lldb-shell :: ObjectFile/ELF/PT_TLS-overlap-PT_LOAD.yaml (1317 of 1895) PASS: lldb-unit :: Core/./LLDBCoreTests/MangledTest.NameIndexes_FindFunctionSymbols (1318 of 1895) PASS: lldb-unit :: Language/Highlighting/./HighlighterTests/HighlighterTest.ClangCursorOutOfBounds (1319 of 1895) PASS: lldb-api :: lang/cpp/operator-overload/TestOperatorOverload.py (1320 of 1895) PASS: lldb-api :: lang/objc/real-definition/TestRealDefinition.py (1321 of 1895) PASS: lldb-api :: lang/objc/foundation/TestRuntimeTypes.py (1322 of 1895) PASS: lldb-api :: commands/expression/completion-in-lambda-and-unnamed-class/TestCompletionInLambdaAndUnnamedClass.py (1323 of 1895) PASS: lldb-unit :: Utility/./UtilityTests/FileSpecTest.EqualSeparator (1324 of 1895) PASS: lldb-unit :: Utility/./UtilityTests/OptionsWithRawTest.WhitespaceSuffix (1325 of 1895) PASS: lldb-unit :: Host/./HostTests/NativeProcessProtocolTest.ReadMemoryWithoutTrap (1326 of 1895) PASS: lldb-api :: functionalities/data-formatter/data-formatter-stl/libcxx/atomic/TestLibCxxAtomic.py (1327 of 1895) PASS: lldb-api :: tools/lldb-vscode/breakpoint/TestVSCode_setBreakpoints.py (1328 of 1895) PASS: lldb-api :: functionalities/data-formatter/data-formatter-stl/libcxx/tuple/TestDataFormatterLibcxxTuple.py (1329 of 1895) PASS: lldb-api :: python_api/thread/TestThreadAPI.py (1330 of 1895) PASS: lldb-unit :: Utility/./UtilityTests/FileSpecTest.RemoveLastPathComponent (1331 of 1895) PASS: lldb-api :: lang/cpp/namespace_definitions/TestNamespaceDefinitions.py (1332 of 1895) PASS: lldb-unit :: Utility/./UtilityTests/StringExtractorTest.DecodeHexU8_Exact (1333 of 1895) PASS: lldb-api :: functionalities/gdb_remote_client/TestWriteMemory.py (1334 of 1895) PASS: lldb-unit :: Utility/./UtilityTests/BinaryStreamTest.PutULEB128SixBytes (1335 of 1895) PASS: lldb-unit :: Utility/./UtilityTests/BinaryStreamTest.PutSLEB128FourBytes (1336 of 1895) PASS: lldb-api :: lang/objc/objc-optimized/TestObjcOptimized.py (1337 of 1895) PASS: lldb-unit :: Utility/./UtilityTests/StringListTest.JoinEmpty (1338 of 1895) PASS: lldb-api :: lang/cpp/template/TestTemplateArgs.py (1339 of 1895) PASS: lldb-unit :: Utility/./UtilityTests/DataExtractorTest.PeekData (1340 of 1895) PASS: lldb-unit :: Language/Highlighting/./HighlighterTests/HighlighterTest.ClangSquareBrackets (1341 of 1895) PASS: lldb-api :: python_api/sbvalue_const_addrof/TestSBValueConstAddrOf.py (1342 of 1895) PASS: lldb-unit :: ObjectFile/Breakpad/./ObjectFileBreakpadTests/InfoRecord.parse (1343 of 1895) UNSUPPORTED: lldb-shell :: ObjectFile/PECOFF/disassemble-thumb.yaml (1344 of 1895) PASS: lldb-api :: python_api/class_members/TestSBTypeClassMembers.py (1345 of 1895) PASS: lldb-unit :: Utility/./UtilityTests/StringExtractorTest.GetHexU8_InvalidHex (1346 of 1895) PASS: lldb-unit :: Utility/./UtilityTests/CompletionRequest.FakeLastArg (1347 of 1895) PASS: lldb-unit :: Utility/./UtilityTests/NameMatchesTest.Ignore (1348 of 1895) PASS: lldb-api :: lang/cpp/virtual-overload/TestVirtualOverload.py (1349 of 1895) PASS: lldb-unit :: Utility/./UtilityTests/StreamTest.AddressEmptyPrefix (1350 of 1895) UNSUPPORTED: lldb-api :: functionalities/tsan/basic/TestTsanBasic.py (1351 of 1895) PASS: lldb-unit :: Expression/./ExpressionTests/DiagnosticManagerTest.GetStringSeverityLabels (1352 of 1895) PASS: lldb-api :: lang/objcxx/hide-runtime-values/TestObjCXXHideRuntimeValues.py (1353 of 1895) PASS: lldb-unit :: Utility/./UtilityTests/StringExtractorTest.DecodeHexU8_InvalidHex (1354 of 1895) PASS: lldb-unit :: Utility/./UtilityTests/OptionsWithRawTest.QuotedSuffix (1355 of 1895) PASS: lldb-api :: functionalities/avoids-fd-leak/TestFdLeak.py (1356 of 1895) PASS: lldb-api :: lang/cpp/modules-import/TestCXXModulesImport.py (1357 of 1895) PASS: lldb-api :: functionalities/thread/concurrent_events/TestConcurrentTwoWatchpointThreads.py (1358 of 1895) PASS: lldb-unit :: UnwindAssembly/x86/./UnwindAssemblyx86Tests/Testx86AssemblyInspectionEngine.Testi386IgnoredRegisters (1359 of 1895) PASS: lldb-unit :: Utility/./UtilityTests/StreamTest.PutPtr (1360 of 1895) PASS: lldb-api :: functionalities/stats_api/TestStatisticsAPI.py (1361 of 1895) PASS: lldb-unit :: Utility/./UtilityTests/AnsiTerminal.Empty (1362 of 1895) PASS: lldb-unit :: Utility/./UtilityTests/StreamTest.PutCStringWithStringRef (1363 of 1895) PASS: lldb-api :: lang/objc/objc-checker/TestObjCCheckers.py (1364 of 1895) PASS: lldb-api :: commands/frame/diagnose/complicated-expression/TestComplicatedExpression.py (1365 of 1895) PASS: lldb-api :: functionalities/plugins/command_plugin/TestPluginCommands.py (1366 of 1895) PASS: lldb-api :: functionalities/data-formatter/refpointer-recursion/TestDataFormatterRefPtrRecursion.py (1367 of 1895) PASS: lldb-shell :: SymbolFile/DWARF/dwarf5-atomic.s (1368 of 1895) PASS: lldb-api :: macosx/find-dsym/deep-bundle/TestDeepBundle.py (1369 of 1895) PASS: lldb-unit :: UnwindAssembly/x86/./UnwindAssemblyx86Tests/Testx86AssemblyInspectionEngine.TestDisassemblyJunkBytes (1370 of 1895) PASS: lldb-api :: commands/expression/import-std-module/empty-module/TestEmptyStdModule.py (1371 of 1895) PASS: lldb-unit :: UnwindAssembly/x86/./UnwindAssemblyx86Tests/Testx86AssemblyInspectionEngine.TestPush0 (1372 of 1895) PASS: lldb-api :: tools/lldb-vscode/variables/TestVSCode_variables.py (1373 of 1895) UNSUPPORTED: lldb-shell :: ScriptInterpreter/Lua/lua.test (1374 of 1895) PASS: lldb-api :: commands/expression/import-std-module/shared_ptr-dbg-info-content/TestSharedPtrDbgInfoContent.py (1375 of 1895) PASS: lldb-unit :: Utility/./UtilityTests/EnvironmentTest.EnvpConstruction (1376 of 1895) PASS: lldb-shell :: SymbolFile/DWARF/debug-types-line-tables.s (1377 of 1895) UNSUPPORTED: lldb-api :: commands/expression/call-restarts/TestCallThatRestarts.py (1378 of 1895) PASS: lldb-api :: lang/c/register_variables/TestRegisterVariables.py (1379 of 1895) UNSUPPORTED: lldb-shell :: Register/x86-64-ymm16-write.test (1380 of 1895) PASS: lldb-unit :: Utility/./UtilityTests/RegularExpression.CopyAssignment (1381 of 1895) PASS: lldb-unit :: Utility/./UtilityTests/StringExtractorTest.GetHexU8_Underflow2_NoEof (1382 of 1895) UNSUPPORTED: lldb-shell :: SymbolFile/PDB/compilands.test (1383 of 1895) PASS: lldb-api :: lang/objcxx/cxx-bridged-po/TestObjCXXBridgedPO.py (1384 of 1895) PASS: lldb-unit :: Utility/./UtilityTests/StringListTest.GetMaxStringLengthEmpty (1385 of 1895) PASS: lldb-unit :: Utility/./UtilityTests/RangeTest.Equal (1386 of 1895) PASS: lldb-unit :: Utility/./UtilityTests/BinaryStreamTest.PutULEB128TwoBytes (1387 of 1895) PASS: lldb-api :: functionalities/breakpoint/breakpoint_by_line_and_column/TestBreakpointByLineAndColumn.py (1388 of 1895) UNSUPPORTED: lldb-api :: functionalities/darwin_log/filter/regex/subsystem/TestDarwinLogFilterRegexSubsystem.py (1389 of 1895) UNSUPPORTED: lldb-api :: tools/lldb-server/TestGdbRemoteModuleInfo.py (1390 of 1895) PASS: lldb-unit :: Utility/./UtilityTests/CompletionRequest.TestCompletionOwnership (1391 of 1895) UNSUPPORTED: lldb-api :: commands/expression/macros/TestMacros.py (1392 of 1895) PASS: lldb-shell :: BuildScript/modes.test (1393 of 1895) PASS: lldb-unit :: Utility/./UtilityTests/StringListTest.AppendList (1394 of 1895) PASS: lldb-unit :: Utility/./UtilityTests/StringExtractorTest.GetNameColonValueNoSemicolon (1395 of 1895) UNSUPPORTED: lldb-api :: functionalities/darwin_log/format/TestDarwinLogMessageFormat.py (1396 of 1895) PASS: lldb-unit :: Process/minidump/./LLDBMinidumpTests/MinidumpParserTest.GetExceptionStream (1397 of 1895) PASS: lldb-unit :: Utility/./UtilityTests/StreamTeeTest.AppendStream (1398 of 1895) PASS: lldb-unit :: Host/./HostTests/FileSystemTest.GetByteSize (1399 of 1895) PASS: lldb-unit :: Utility/./UtilityTests/StringExtractorTest.GetHexBytes_OddPair (1400 of 1895) PASS: lldb-shell :: SymbolFile/DWARF/split-dwarf-multiple-cu.ll (1401 of 1895) PASS: lldb-api :: lang/objcxx/objcxx-ivar-vector/TestIvarVector.py (1402 of 1895) PASS: lldb-unit :: Language/Highlighting/./HighlighterTests/HighlighterTest.ClangCursorPosAfterOtherToken (1403 of 1895) PASS: lldb-api :: commands/expression/import_builtin_fileid/TestImportBuiltinFileID.py (1404 of 1895) PASS: lldb-api :: functionalities/target-new-solib-notifications/TestModuleLoadedNotifys.py (1405 of 1895) PASS: lldb-unit :: Utility/./UtilityTests/ArgsTest.TestSingleQuotedArgWithSpace (1406 of 1895) PASS: lldb-unit :: ScriptInterpreter/Python/./ScriptInterpreterPythonTests/PythonDataObjectsTest.TestPythonIntegerToStr (1407 of 1895) PASS: lldb-api :: lang/objc/objc-builtin-types/TestObjCBuiltinTypes.py (1408 of 1895) PASS: lldb-api :: functionalities/data-formatter/data-formatter-stl/libcxx/vector/TestDataFormatterLibcxxVector.py (1409 of 1895) PASS: lldb-unit :: SymbolFile/NativePDB/./SymbolFileNativePDBTests/PDBFPOProgramToDWARFExpressionTests.SingleAssignmentRegisterRef (1410 of 1895) PASS: lldb-unit :: SymbolFile/NativePDB/./SymbolFileNativePDBTests/PDBFPOProgramToDWARFExpressionTests.InvalidOpUnary (1411 of 1895) PASS: lldb-api :: python_api/lldbutil/process/TestPrintStackTraces.py (1412 of 1895) PASS: lldb-api :: python_api/frame/inlines/TestInlinedFrame.py (1413 of 1895) PASS: lldb-api :: tools/lldb-server/TestGdbRemoteExpeditedRegisters.py (1414 of 1895) PASS: lldb-unit :: Core/./LLDBCoreTests/MangledTest.ResultForBlockInvocation (1415 of 1895) PASS: lldb-shell :: Quit/TestQuitExitCode-30.test (1416 of 1895) PASS: lldb-api :: functionalities/step_scripted/TestStepScripted.py (1417 of 1895) PASS: lldb-unit :: Utility/./UtilityTests/ConstStringTest.CompareConstString (1418 of 1895) PASS: lldb-shell :: Reproducer/TestMultipleTargets.test (1419 of 1895) PASS: lldb-unit :: Utility/./UtilityTests/ArgsTest.TestQuotedTrailingBackslash (1420 of 1895) PASS: lldb-shell :: SymbolFile/Breakpad/line-table.test (1421 of 1895) PASS: lldb-unit :: Utility/./UtilityTests/LogChannelEnabledTest.log_options (1422 of 1895) PASS: lldb-api :: python_api/sbstructureddata/TestStructuredDataAPI.py (1423 of 1895) PASS: lldb-api :: functionalities/thread/concurrent_events/TestConcurrentSignalBreak.py (1424 of 1895) PASS: lldb-api :: tools/lldb-server/TestGdbRemoteThreadsInStopReply.py (1425 of 1895) PASS: lldb-unit :: Host/./HostTests/SocketAddressTest.GetAddressInfo (1426 of 1895) PASS: lldb-unit :: UnwindAssembly/x86/./UnwindAssemblyx86Tests/Testx86AssemblyInspectionEngine.TestPushEBX (1427 of 1895) PASS: lldb-unit :: Utility/./UtilityTests/StringLexerTest.Next (1428 of 1895) PASS: lldb-unit :: Language/Highlighting/./HighlighterTests/HighlighterTest.DefaultHighlighterWithCursor (1429 of 1895) PASS: lldb-shell :: Unwind/trap_frame_sym_ctx.test (1430 of 1895) PASS: lldb-api :: commands/expression/import-std-module/deque-basic/TestBasicDeque.py (1431 of 1895) PASS: lldb-unit :: Host/./HostTests/NativeProcessProtocolTest.SetBreakpoint (1432 of 1895) PASS: lldb-unit :: UnwindAssembly/x86/./UnwindAssemblyx86Tests/Testx86AssemblyInspectionEngine.TestSimplex86_64Augmented (1433 of 1895) PASS: lldb-shell :: Reproducer/TestReuseDirectory.test (1434 of 1895) PASS: lldb-unit :: Utility/./UtilityTests/FileSpecTest.EqualDotsWindows (1435 of 1895) PASS: lldb-api :: commands/expression/pr35310/TestExprsBug35310.py (1436 of 1895) PASS: lldb-api :: commands/expression/call-overridden-method/TestCallOverriddenMethod.py (1437 of 1895) PASS: lldb-api :: lang/objc/hidden-ivars/TestHiddenIvars.py (1438 of 1895) PASS: lldb-api :: commands/watchpoints/watchpoint_on_vectors/TestValueOfVectorVariable.py (1439 of 1895) UNSUPPORTED: lldb-api :: functionalities/darwin_log/filter/exact_match/activity-chain/TestDarwinLogFilterMatchActivityChain.py (1440 of 1895) PASS: lldb-api :: functionalities/tail_call_frames/disambiguate_call_site/TestDisambiguateCallSite.py (1441 of 1895) PASS: lldb-unit :: Utility/./UtilityTests/BinaryStreamTest.PutSLEB128OneByte (1442 of 1895) PASS: lldb-api :: commands/watchpoints/step_over_watchpoint/TestStepOverWatchpoint.py (1443 of 1895) PASS: lldb-api :: commands/command/script/import/rdar-12586188/TestRdar12586188.py (1444 of 1895) PASS: lldb-unit :: Utility/./UtilityTests/ArchSpecTest.Compatibility (1445 of 1895) PASS: lldb-unit :: Utility/./UtilityTests/BinaryStreamTest.PutSLEB128TwoBytes (1446 of 1895) PASS: lldb-api :: commands/expression/static-initializers/TestStaticInitializers.py (1447 of 1895) PASS: lldb-api :: functionalities/breakpoint/breakpoint_command/TestRegexpBreakCommand.py (1448 of 1895) PASS: lldb-api :: functionalities/gdb_remote_client/TestGDBRemoteLoad.py (1449 of 1895) PASS: lldb-api :: api/command-return-object/TestSBCommandReturnObject.py (1450 of 1895) PASS: lldb-api :: functionalities/tail_call_frames/inlining_and_tail_calls/TestInliningAndTailCalls.py (1451 of 1895) PASS: lldb-unit :: Process/gdb-remote/./ProcessGdbRemoteTests/GDBRemoteClientBaseTest.SendContinueAndInterrupt2PacketBug (1452 of 1895) PASS: lldb-api :: types/TestDoubleTypesExpr.py (1453 of 1895) PASS: lldb-api :: commands/expression/entry-bp/TestExprEntryBP.py (1454 of 1895) PASS: lldb-api :: python_api/signals/TestSignalsAPI.py (1455 of 1895) PASS: lldb-api :: lang/cpp/function_refs/TestFunctionRefs.py (1456 of 1895) PASS: lldb-unit :: Utility/./UtilityTests/OptionsWithRawTest.MultiWordSuffix (1457 of 1895) PASS: lldb-api :: python_api/process/read-mem-cstring/TestReadMemCString.py (1458 of 1895) PASS: lldb-unit :: Core/./LLDBCoreTests/UniqueCStringMap.NoDefaultConstructor (1459 of 1895) FAIL: lldb-api :: functionalities/data-formatter/data-formatter-objc/TestDataFormatterObjCNSURL.py (1460 of 1895) ******************** TEST 'lldb-api :: functionalities/data-formatter/data-formatter-objc/TestDataFormatterObjCNSURL.py' FAILED ******************** lldb version 11.0.99 (http://labmaster3.local/git/llvm-project.git revision c1b13a1b17719aebace1b3be7a6ac7f90b1901a6) clang revision 7ce2de2ce4e7d4dd8e1e5a7a5b35c0f98e46681d llvm revision 7ce2de2ce4e7d4dd8e1e5a7a5b35c0f98e46681d LLDB library dir: /Users/buildslave/jenkins/workspace/lldb-cmake-sanitized/lldb-build/bin LLDB import library dir: /Users/buildslave/jenkins/workspace/lldb-cmake-sanitized/lldb-build/bin libstdcxx tests will not be run because: Don't know how to build with libstdcxx on macosx Skipping following debug info categories: ['dwo'] setting set target.prefer-dynamic-value no-dynamic-values AddressSanitizer report breakpoint hit. Use 'thread info -s' to get extended information about the report. AddressSanitizer report breakpoint hit. Use 'thread info -s' to get extended information about the report. AddressSanitizer report breakpoint hit. Use 'thread info -s' to get extended information about the report.

Hide Details

Session logs for test failures/errors/unexpected successes will go into directory '/Users/buildslave/jenkins/workspace/lldb-cmake-sanitized/test/logs' Command invoked: /Users/buildslave/jenkins/workspace/lldb-cmake-sanitized/llvm-project/lldb/test/API/dotest.py --arch x86_64 -s /Users/buildslave/jenkins/workspace/lldb-cmake-sanitized/lldb-build/lldb-test-traces -S nm -u CXXFLAGS -u CFLAGS --codesign-identity lldb_codesign --server /Users/buildslave/jenkins/workspace/lldb-cmake-sanitized/lldb-build/./bin/debugserver --arch x86_64 --build-dir /Users/buildslave/jenkins/workspace/lldb-cmake-sanitized/lldb-build/lldb-test-build.noindex -s=/Users/buildslave/jenkins/workspace/lldb-cmake-sanitized/test/logs -t --env TERM=vt100 --env LLVM_LIBS_DIR=/Users/buildslave/jenkins/workspace/lldb-cmake-sanitized/lldb-build/./lib --inferior-env ASAN_OPTIONS=detect_stack_use_after_return=1 --inferior-env DYLD_INSERT_LIBRARIES=/Users/buildslave/jenkins/workspace/lldb-cmake-sanitized/host-compiler/lib/clang/11.0.0/lib/darwin/libclang_rt.asan_osx_dynamic.dylib --build-dir /Users/buildslave/jenkins/workspace/lldb-cmake-sanitized/lldb-build/lldb-test-build.noindex --lldb-module-cache-dir /Users/buildslave/jenkins/workspace/lldb-cmake-sanitized/lldb-build/lldb-test-build.noindex/module-cache-lldb/lldb-api --clang-module-cache-dir /Users/buildslave/jenkins/workspace/lldb-cmake-sanitized/lldb-build/lldb-test-build.noindex/module-cache-clang/lldb-api --executable /Users/buildslave/jenkins/workspace/lldb-cmake-sanitized/lldb-build/./bin/lldb --compiler /Users/buildslave/jenkins/workspace/lldb-cmake-sanitized/lldb-build/./bin/clang --dsymutil /Users/buildslave/jenkins/workspace/lldb-cmake-sanitized/lldb-build/./bin/dsymutil --filecheck /Users/buildslave/jenkins/workspace/lldb-cmake-sanitized/lldb-build/./bin/FileCheck /Users/buildslave/jenkins/workspace/lldb-cmake-sanitized/llvm-project/lldb/packages/Python/lldbsuite/test/functionalities/data-formatter/data-formatter-objc -p TestDataFormatterObjCNSURL.py Change dir to: /Users/buildslave/jenkins/workspace/lldb-cmake-sanitized/llvm-project/lldb/packages/Python/lldbsuite/test/functionalities/data-formatter/data-formatter-objc runCmd: settings set symbols.enable-external-lookup false output:

Hide Details

runCmd: settings set plugin.process.gdb-remote.packet-timeout 60 output:

Hide Details

runCmd: settings set symbols.clang-modules-cache-path "/Users/buildslave/jenkins/workspace/lldb-cmake-sanitized/lldb-build/lldb-test-build.noindex/module-cache-lldb/lldb-api" output:

Hide Details

runCmd: settings set use-color false output:

Hide Details

runCmd: settings set target.env-vars ASAN_OPTIONS=detect_stack_use_after_return=1 DYLD_INSERT_LIBRARIES=/Users/buildslave/jenkins/workspace/lldb-cmake-sanitized/host-compiler/lib/clang/11.0.0/lib/darwin/libclang_rt.asan_osx_dynamic.dylib output:

Hide Details

runCmd: settings set target.env-vars ASAN_OPTIONS=detect_stack_use_after_return=1 DYLD_INSERT_LIBRARIES=/Users/buildslave/jenkins/workspace/lldb-cmake-sanitized/host-compiler/lib/clang/11.0.0/lib/darwin/libclang_rt.asan_osx_dynamic.dylib output:

Hide Details

FAIL: LLDB (/Users/buildslave/jenkins/workspace/lldb-cmake-sanitized/lldb-build/bin/clang-10-x86_64) :: test_nsurl_with_run_command_dsym (TestDataFormatterObjCNSURL.ObjCDataFormatterNSURL) <bound method SBProcess.Kill of <lldb.SBProcess; proxy of <Swig Object of type 'lldb::SBProcess *' at 0x1075d6210> >>: success

Hide Details

runCmd: settings set symbols.enable-external-lookup false output:

Hide Details

runCmd: settings set plugin.process.gdb-remote.packet-timeout 60 output:

Hide Details

runCmd: settings set symbols.clang-modules-cache-path "/Users/buildslave/jenkins/workspace/lldb-cmake-sanitized/lldb-build/lldb-test-build.noindex/module-cache-lldb/lldb-api" output:

Hide Details

runCmd: settings set use-color false output:

Hide Details

runCmd: settings set target.env-vars ASAN_OPTIONS=detect_stack_use_after_return=1 DYLD_INSERT_LIBRARIES=/Users/buildslave/jenkins/workspace/lldb-cmake-sanitized/host-compiler/lib/clang/11.0.0/lib/darwin/libclang_rt.asan_osx_dynamic.dylib output:

Hide Details

runCmd: settings set target.env-vars ASAN_OPTIONS=detect_stack_use_after_return=1 DYLD_INSERT_LIBRARIES=/Users/buildslave/jenkins/workspace/lldb-cmake-sanitized/host-compiler/lib/clang/11.0.0/lib/darwin/libclang_rt.asan_osx_dynamic.dylib output:

Hide Details

FAIL: LLDB (/Users/buildslave/jenkins/workspace/lldb-cmake-sanitized/lldb-build/bin/clang-10-x86_64) :: test_nsurl_with_run_command_dwarf (TestDataFormatterObjCNSURL.ObjCDataFormatterNSURL) <bound method SBProcess.Kill of <lldb.SBProcess; proxy of <Swig Object of type 'lldb::SBProcess *' at 0x10702d630> >>: success

Hide Details

UNSUPPORTED: LLDB (/Users/buildslave/jenkins/workspace/lldb-cmake-sanitized/lldb-build/bin/clang-10-x86_64) :: test_nsurl_with_run_command_dwo (TestDataFormatterObjCNSURL.ObjCDataFormatterNSURL) (test case does not fall in any category of interest for this run) runCmd: settings set symbols.enable-external-lookup false output:

Hide Details

runCmd: settings set plugin.process.gdb-remote.packet-timeout 60 output:

Hide Details

runCmd: settings set symbols.clang-modules-cache-path "/Users/buildslave/jenkins/workspace/lldb-cmake-sanitized/lldb-build/lldb-test-build.noindex/module-cache-lldb/lldb-api" output:

Hide Details

runCmd: settings set use-color false output:

Hide Details

runCmd: settings set target.env-vars ASAN_OPTIONS=detect_stack_use_after_return=1 DYLD_INSERT_LIBRARIES=/Users/buildslave/jenkins/workspace/lldb-cmake-sanitized/host-compiler/lib/clang/11.0.0/lib/darwin/libclang_rt.asan_osx_dynamic.dylib output:

Hide Details

runCmd: settings set target.env-vars ASAN_OPTIONS=detect_stack_use_after_return=1 DYLD_INSERT_LIBRARIES=/Users/buildslave/jenkins/workspace/lldb-cmake-sanitized/host-compiler/lib/clang/11.0.0/lib/darwin/libclang_rt.asan_osx_dynamic.dylib output:

Hide Details

FAIL: LLDB (/Users/buildslave/jenkins/workspace/lldb-cmake-sanitized/lldb-build/bin/clang-10-x86_64) :: test_nsurl_with_run_command_gmodules (TestDataFormatterObjCNSURL.ObjCDataFormatterNSURL) <bound method SBProcess.Kill of <lldb.SBProcess; proxy of <Swig Object of type 'lldb::SBProcess *' at 0x1075d6540> >>: success

Hide Details

Restore dir to: /Users/buildslave/jenkins/workspace/lldb-cmake-sanitized/lldb-build/tools/lldb/test ====================================================================== FAIL: test_nsurl_with_run_command_dsym (TestDataFormatterObjCNSURL.ObjCDataFormatterNSURL) Test formatters for NSURL. ---------------------------------------------------------------------- Traceback (most recent call last): File "/Users/buildslave/jenkins/workspace/lldb-cmake-sanitized/llvm-project/lldb/packages/Python/lldbsuite/test/lldbtest.py", line 1732, in test_method return attrvalue(self) File "/Users/buildslave/jenkins/workspace/lldb-cmake-sanitized/llvm-project/lldb/packages/Python/lldbsuite/test/functionalities/data-formatter/data-formatter-objc/TestDataFormatterObjCNSURL.py", line 20, in test_nsurl_with_run_command self.appkit_tester_impl(self.nsurl_data_formatter_commands) File "/Users/buildslave/jenkins/workspace/lldb-cmake-sanitized/llvm-project/lldb/packages/Python/lldbsuite/test/functionalities/data-formatter/data-formatter-objc/ObjCDataFormatterTestCase.py", line 19, in appkit_tester_impl self.appkit_common_data_formatters_command() File "/Users/buildslave/jenkins/workspace/lldb-cmake-sanitized/llvm-project/lldb/packages/Python/lldbsuite/test/functionalities/data-formatter/data-formatter-objc/ObjCDataFormatterTestCase.py", line 26, in appkit_common_data_formatters_command lldb.SBFileSpec('main.m', False)) File "/Users/buildslave/jenkins/workspace/lldb-cmake-sanitized/llvm-project/lldb/packages/Python/lldbsuite/test/lldbutil.py", line 868, in run_to_source_breakpoint only_one_thread, extra_images) File "/Users/buildslave/jenkins/workspace/lldb-cmake-sanitized/llvm-project/lldb/packages/Python/lldbsuite/test/lldbutil.py", line 797, in run_to_breakpoint_do_run test.assertEqual(num_threads, 1, "Expected 1 thread to stop at breakpoint, %d did."%(num_threads)) AssertionError: 0 != 1 : Expected 1 thread to stop at breakpoint, 0 did. Config=x86_64-/Users/buildslave/jenkins/workspace/lldb-cmake-sanitized/lldb-build/bin/clang-10 ====================================================================== FAIL: test_nsurl_with_run_command_dwarf (TestDataFormatterObjCNSURL.ObjCDataFormatterNSURL) Test formatters for NSURL. ---------------------------------------------------------------------- Traceback (most recent call last): File "/Users/buildslave/jenkins/workspace/lldb-cmake-sanitized/llvm-project/lldb/packages/Python/lldbsuite/test/lldbtest.py", line 1732, in test_method return attrvalue(self) File "/Users/buildslave/jenkins/workspace/lldb-cmake-sanitized/llvm-project/lldb/packages/Python/lldbsuite/test/functionalities/data-formatter/data-formatter-objc/TestDataFormatterObjCNSURL.py", line 20, in test_nsurl_with_run_command self.appkit_tester_impl(self.nsurl_data_formatter_commands) File "/Users/buildslave/jenkins/workspace/lldb-cmake-sanitized/llvm-project/lldb/packages/Python/lldbsuite/test/functionalities/data-formatter/data-formatter-objc/ObjCDataFormatterTestCase.py", line 19, in appkit_tester_impl self.appkit_common_data_formatters_command() File "/Users/buildslave/jenkins/workspace/lldb-cmake-sanitized/llvm-project/lldb/packages/Python/lldbsuite/test/functionalities/data-formatter/data-formatter-objc/ObjCDataFormatterTestCase.py", line 26, in appkit_common_data_formatters_command lldb.SBFileSpec('main.m', False)) File "/Users/buildslave/jenkins/workspace/lldb-cmake-sanitized/llvm-project/lldb/packages/Python/lldbsuite/test/lldbutil.py", line 868, in run_to_source_breakpoint only_one_thread, extra_images) File "/Users/buildslave/jenkins/workspace/lldb-cmake-sanitized/llvm-project/lldb/packages/Python/lldbsuite/test/lldbutil.py", line 797, in run_to_breakpoint_do_run test.assertEqual(num_threads, 1, "Expected 1 thread to stop at breakpoint, %d did."%(num_threads)) AssertionError: 0 != 1 : Expected 1 thread to stop at breakpoint, 0 did. Config=x86_64-/Users/buildslave/jenkins/workspace/lldb-cmake-sanitized/lldb-build/bin/clang-10 ====================================================================== FAIL: test_nsurl_with_run_command_gmodules (TestDataFormatterObjCNSURL.ObjCDataFormatterNSURL) Test formatters for NSURL. ---------------------------------------------------------------------- Traceback (most recent call last): File "/Users/buildslave/jenkins/workspace/lldb-cmake-sanitized/llvm-project/lldb/packages/Python/lldbsuite/test/lldbtest.py", line 1732, in test_method return attrvalue(self) File "/Users/buildslave/jenkins/workspace/lldb-cmake-sanitized/llvm-project/lldb/packages/Python/lldbsuite/test/functionalities/data-formatter/data-formatter-objc/TestDataFormatterObjCNSURL.py", line 20, in test_nsurl_with_run_command self.appkit_tester_impl(self.nsurl_data_formatter_commands) File "/Users/buildslave/jenkins/workspace/lldb-cmake-sanitized/llvm-project/lldb/packages/Python/lldbsuite/test/functionalities/data-formatter/data-formatter-objc/ObjCDataFormatterTestCase.py", line 19, in appkit_tester_impl self.appkit_common_data_formatters_command() File "/Users/buildslave/jenkins/workspace/lldb-cmake-sanitized/llvm-project/lldb/packages/Python/lldbsuite/test/functionalities/data-formatter/data-formatter-objc/ObjCDataFormatterTestCase.py", line 26, in appkit_common_data_formatters_command lldb.SBFileSpec('main.m', False)) File "/Users/buildslave/jenkins/workspace/lldb-cmake-sanitized/llvm-project/lldb/packages/Python/lldbsuite/test/lldbutil.py", line 868, in run_to_source_breakpoint only_one_thread, extra_images) File "/Users/buildslave/jenkins/workspace/lldb-cmake-sanitized/llvm-project/lldb/packages/Python/lldbsuite/test/lldbutil.py", line 797, in run_to_breakpoint_do_run test.assertEqual(num_threads, 1, "Expected 1 thread to stop at breakpoint, %d did."%(num_threads)) AssertionError: 0 != 1 : Expected 1 thread to stop at breakpoint, 0 did. Config=x86_64-/Users/buildslave/jenkins/workspace/lldb-cmake-sanitized/lldb-build/bin/clang-10 ---------------------------------------------------------------------- Ran 4 tests in 40.180s

Hide Details

RESULT: FAILED (0 passes, 3 failures, 0 errors, 1 skipped, 0 expected failures, 0 unexpected successes)

Hide Details

******************** PASS: lldb-shell :: SymbolFile/DWARF/find-variable-file.cpp (1461 of 1895) PASS: lldb-api :: commands/target/create-deps/TestTargetCreateDeps.py (1462 of 1895) PASS: lldb-api :: lang/c/enum_types/TestEnumTypes.py (1463 of 1895) PASS: lldb-api :: functionalities/conditional_break/TestConditionalBreak.py (1464 of 1895) PASS: lldb-api :: lang/objc/rdar-11355592/TestRdar11355592.py (1465 of 1895) PASS: lldb-api :: commands/expression/weak_symbols/TestWeakSymbols.py (1466 of 1895) PASS: lldb-unit :: Utility/./UtilityTests/ArgsTest.GetArgumentArrayRef (1467 of 1895) PASS: lldb-api :: python_api/breakpoint/TestBreakpointAPI.py (1468 of 1895) PASS: lldb-api :: commands/expression/import-std-module/stack/TestStack.py (1469 of 1895) PASS: lldb-unit :: Process/minidump/./LLDBMinidumpTests/MinidumpParserTest.MinidumpModuleOrder (1470 of 1895) PASS: lldb-api :: functionalities/var_path/TestVarPath.py (1471 of 1895) PASS: lldb-unit :: Utility/./UtilityTests/CompletionRequest.TryCompleteCurrentArgBad (1472 of 1895) PASS: lldb-shell :: Register/x86-64-gp-read.test (1473 of 1895) PASS: lldb-unit :: UnwindAssembly/x86/./UnwindAssemblyx86Tests/Testx86AssemblyInspectionEngine.TestSpArithx86_64Augmented (1474 of 1895) PASS: lldb-unit :: Utility/./UtilityTests/RangeTest.DoesIntersect (1475 of 1895) XFAIL: lldb-shell :: Unwind/prefer-debug-over-eh-frame.test (1476 of 1895) UNSUPPORTED: lldb-shell :: ObjectFile/ELF/minidebuginfo-set-and-hit-breakpoint.test (1477 of 1895) PASS: lldb-unit :: Utility/./UtilityTests/BinaryStreamTest.PutSLEB128MaxValue (1478 of 1895) UNSUPPORTED: lldb-api :: commands/watchpoints/multi_watchpoint_slots/TestWatchpointMultipleSlots.py (1479 of 1895) PASS: lldb-api :: functionalities/thread/thread_exit/TestThreadExit.py (1480 of 1895) PASS: lldb-api :: functionalities/data-formatter/data-formatter-script/TestDataFormatterScript.py (1481 of 1895) PASS: lldb-unit :: Host/./HostTests/File.GetWaitableHandleFileno (1482 of 1895) PASS: lldb-unit :: Utility/./UtilityTests/StreamTest.ShiftOperatorPtr (1483 of 1895) XFAIL: lldb-shell :: Register/x86-64-ymm-write.test (1484 of 1895) PASS: lldb-unit :: Target/./TargetTests/ExecutionContextTest.GetByteOrderTarget (1485 of 1895) PASS: lldb-unit :: Utility/./UtilityTests/DataExtractorTest.GetCStrUnterminated (1486 of 1895) PASS: lldb-shell :: SymbolFile/DWARF/debug-types-signature-loop.s (1487 of 1895) PASS: lldb-api :: functionalities/data-formatter/data-formatter-objc/cmtime/TestDataFormatterCMTime.py (1488 of 1895) PASS: lldb-api :: functionalities/thread/num_threads/TestNumThreads.py (1489 of 1895) PASS: lldb-unit :: Expression/./ExpressionTests/DiagnosticManagerTest.AppendMessageAttachToLastDiag (1490 of 1895) PASS: lldb-unit :: Utility/./UtilityTests/ArgsTest.AppendArguments (1491 of 1895) PASS: lldb-unit :: SymbolFile/DWARF/./SymbolFileDWARFTests/SymbolFileDWARFTests.TestAbbrevOutOfOrder (1492 of 1895) PASS: lldb-unit :: Utility/./UtilityTests/StringLexerTest.AdvanceIf (1493 of 1895) PASS: lldb-unit :: ObjectFile/Breakpad/./ObjectFileBreakpadTests/FileRecord.parse (1494 of 1895) PASS: lldb-api :: lang/objc/objc-class-method/TestObjCClassMethod.py (1495 of 1895) PASS: lldb-api :: commands/watchpoints/watchpoint_set_command/TestWatchLocationWithWatchSet.py (1496 of 1895) PASS: lldb-shell :: Reproducer/TestFileRepro.test (1497 of 1895) PASS: lldb-unit :: Utility/./UtilityTests/RangeTest.ContainsEndInclusive (1498 of 1895) PASS: lldb-unit :: SymbolFile/DWARF/./SymbolFileDWARFTests/SymbolFileDWARFTests.TestAbbrevMissingTerminator (1499 of 1895) PASS: lldb-unit :: ScriptInterpreter/Python/./ScriptInterpreterPythonTests/PythonDataObjectsTest.TestScript (1500 of 1895) PASS: lldb-shell :: Breakpoint/debug_rnglist_basic.test (1501 of 1895) PASS: lldb-unit :: Utility/./UtilityTests/TimerTest.CategoryTimes (1502 of 1895) PASS: lldb-shell :: ObjectFile/ELF/basic-info.yaml (1503 of 1895) PASS: lldb-api :: macosx/find-app-in-bundle/TestFindAppInBundle.py (1504 of 1895) PASS: lldb-unit :: Utility/./UtilityTests/RegularExpression.Valid (1505 of 1895) PASS: lldb-unit :: Host/./HostTests/NativeProcessProtocolTest.SetBreakpointFailWrite (1506 of 1895) UNSUPPORTED: lldb-api :: functionalities/breakpoint/breakpoint_in_delayslot/TestAvoidBreakpointInDelaySlot.py (1507 of 1895) PASS: lldb-api :: python_api/watchpoint/TestWatchpointIgnoreCount.py (1508 of 1895) PASS: lldb-shell :: Driver/TestCommands.test (1509 of 1895) PASS: lldb-shell :: ObjectFile/PECOFF/sections.yaml (1510 of 1895) PASS: lldb-unit :: Utility/./UtilityTests/FileSpecTest.FormatFileSpec (1511 of 1895) PASS: lldb-api :: functionalities/signal/TestSendSignal.py (1512 of 1895) PASS: lldb-unit :: Utility/./UtilityTests/DataExtractorTest.GetCStrEmpty (1513 of 1895) PASS: lldb-unit :: UnwindAssembly/x86/./UnwindAssemblyx86Tests/Testx86AssemblyInspectionEngine.TestPushESI (1514 of 1895) PASS: lldb-api :: lang/c/forward/TestForwardDeclaration.py (1515 of 1895) PASS: lldb-api :: functionalities/data-formatter/data-formatter-stl/libcxx/optional/TestDataFormatterLibcxxOptional.py (1516 of 1895) PASS: lldb-unit :: Host/./HostTests/SocketAddressTest.Set (1517 of 1895) PASS: lldb-unit :: Utility/./UtilityTests/StructuredDataTest.ParseJSONFromFile (1518 of 1895) PASS: lldb-api :: commands/target/create-no-such-arch/TestNoSuchArch.py (1519 of 1895) PASS: lldb-api :: lang/objc/objc-foundation-dictionary-empty/TestNSDictionary0.py (1520 of 1895) PASS: lldb-api :: lang/cpp/incomplete-types/TestCppIncompleteTypes.py (1521 of 1895) PASS: lldb-unit :: Utility/./UtilityTests/StreamTeeTest.GetStreamAtIndexOutOfBoundsEmpty (1522 of 1895) PASS: lldb-unit :: Utility/./UtilityTests/StringListTest.LongestCommonPrefix (1523 of 1895) UNSUPPORTED: lldb-shell :: Register/x86-64-xmm16-write.test (1524 of 1895) PASS: lldb-api :: functionalities/thread/concurrent_events/TestConcurrentTwoBreakpointsOneSignal.py (1525 of 1895) PASS: lldb-api :: functionalities/inferior-assert/TestInferiorAssert.py (1526 of 1895) PASS: lldb-unit :: Expression/./ExpressionTests/CppModuleConfigurationTest.Sysroot (1527 of 1895) PASS: lldb-unit :: Expression/./ExpressionTests/DiagnosticManagerTest.PutString (1528 of 1895) PASS: lldb-unit :: Utility/./UtilityTests/RegularExpression.Invalid (1529 of 1895) PASS: lldb-unit :: Symbol/./SymbolTests/PostfixExpression.ToDWARF (1530 of 1895) PASS: lldb-unit :: Language/Highlighting/./HighlighterTests/HighlighterTest.FallbackHighlighter (1531 of 1895) PASS: lldb-shell :: ObjectFile/MachO/lc_build_version.yaml (1532 of 1895) PASS: lldb-api :: tools/lldb-server/commandline/TestStubReverseConnect.py (1533 of 1895) PASS: lldb-unit :: UnwindAssembly/x86/./UnwindAssemblyx86Tests/Testx86AssemblyInspectionEngine.TestPushR14 (1534 of 1895) PASS: lldb-unit :: Process/gdb-remote/./ProcessGdbRemoteTests/GDBRemoteCommunicationClientTest.GetMemoryRegionInfo (1535 of 1895) PASS: lldb-unit :: Utility/./UtilityTests/StringListTest.InsertStringAtIndexOutOfBounds (1536 of 1895) PASS: lldb-api :: functionalities/thread/exit_during_step/TestExitDuringStep.py (1537 of 1895) PASS: lldb-api :: functionalities/unwind/noreturn/module-end/TestNoReturnModuleEnd.py (1538 of 1895) PASS: lldb-api :: lang/cpp/gmodules/TestWithModuleDebugging.py (1539 of 1895) PASS: lldb-shell :: ObjectFile/PECOFF/sections-names.yaml (1540 of 1895) PASS: lldb-api :: commands/expression/xvalue/TestXValuePrinting.py (1541 of 1895) PASS: lldb-api :: commands/expression/persist_objc_pointeetype/TestPersistObjCPointeeType.py (1542 of 1895) PASS: lldb-shell :: SymbolFile/DWARF/debug_loclists-dwo.s (1543 of 1895) PASS: lldb-api :: lang/c/set_values/TestSetValues.py (1544 of 1895) PASS: lldb-api :: functionalities/thread/concurrent_events/TestConcurrentCrashWithWatchpointBreakpointSignal.py (1545 of 1895) PASS: lldb-api :: python_api/interpreter/TestRunCommandInterpreterAPI.py (1546 of 1895) PASS: lldb-unit :: Utility/./UtilityTests/StreamTest.PutRawBytesToBigEndian (1547 of 1895) PASS: lldb-api :: lang/c/bitfields/TestBitfields.py (1548 of 1895) PASS: lldb-api :: commands/expression/import-std-module/no-std-module/TestMissingStdModule.py (1549 of 1895) PASS: lldb-unit :: ScriptInterpreter/Python/./ScriptInterpreterPythonTests/PythonDataObjectsTest.TestPythonStringToStructuredString (1550 of 1895) PASS: lldb-unit :: Utility/./UtilityTests/StringListTest.AppendStringMove (1551 of 1895) UNSUPPORTED: lldb-shell :: Register/x86-zmm-read.test (1552 of 1895) PASS: lldb-shell :: SymbolFile/NativePDB/ast-types.cpp (1553 of 1895) PASS: lldb-unit :: SymbolFile/DWARF/./SymbolFileDWARFTests/SymbolFileDWARFTests.TestAbbrevNullAttrValidForm (1554 of 1895) PASS: lldb-api :: lang/c/offsetof/TestOffsetof.py (1555 of 1895) PASS: lldb-api :: functionalities/gdb_remote_client/TestNoWatchpointSupportInfo.py (1556 of 1895) UNSUPPORTED: lldb-shell :: Register/x86-64-gp-write.test (1557 of 1895) PASS: lldb-unit :: ScriptInterpreter/Python/./ScriptInterpreterPythonTests/PythonDataObjectsTest.TestPythonIntegerToStructuredInteger (1558 of 1895) PASS: lldb-api :: python_api/objc_type/TestObjCType.py (1559 of 1895) PASS: lldb-shell :: SymbolFile/DWARF/apple-index-is-used.cpp (1560 of 1895) PASS: lldb-api :: functionalities/thread/concurrent_events/TestConcurrentBreakpointsDelayedBreakpointOneWatchpoint.py (1561 of 1895) PASS: lldb-unit :: Symbol/./SymbolTests/TestClangASTImporter.CopyDeclTagDecl (1562 of 1895) PASS: lldb-api :: functionalities/data-formatter/nsarraysynth/TestNSArraySynthetic.py (1563 of 1895) PASS: lldb-shell :: SymbolFile/DWARF/find-inline-method.s (1564 of 1895) UNSUPPORTED: lldb-shell :: Unwind/eh-frame-small-fde.test (1565 of 1895) PASS: lldb-unit :: Expression/./ExpressionTests/CppModuleConfigurationTest.LibCppV2 (1566 of 1895) UNSUPPORTED: lldb-api :: functionalities/unwind/ehframe/TestEhFrameUnwind.py (1567 of 1895) PASS: lldb-api :: lang/objc/objc-static-method/TestObjCStaticMethod.py (1568 of 1895) PASS: lldb-shell :: Settings/TestFrameFormatNoColor.test (1569 of 1895) PASS: lldb-shell :: ObjectFile/ELF/PT_LOAD-overlap-section.yaml (1570 of 1895) PASS: lldb-unit :: UnwindAssembly/x86/./UnwindAssemblyx86Tests/Testx86AssemblyInspectionEngine.TestPopRBP (1571 of 1895) PASS: lldb-shell :: Process/TestEnvironment.test (1572 of 1895) PASS: lldb-unit :: Utility/./UtilityTests/StringExtractorTest.GetHexBytesAvail_Underflow (1573 of 1895) PASS: lldb-api :: lang/c/array_types/TestArrayTypes.py (1574 of 1895) UNSUPPORTED: lldb-api :: commands/expression/multiline-completion/TestMultilineCompletion.py (1575 of 1895) PASS: lldb-unit :: SymbolFile/NativePDB/./SymbolFileNativePDBTests/PDBFPOProgramToDWARFExpressionTests.InvalidAssignmentMultiple (1576 of 1895) PASS: lldb-api :: python_api/sbvalue_persist/TestSBValuePersist.py (1577 of 1895) PASS: lldb-unit :: Utility/./UtilityTests/StringListTest.GetSize (1578 of 1895) PASS: lldb-api :: types/TestFloatTypesExpr.py (1579 of 1895) PASS: lldb-unit :: Utility/./UtilityTests/ProcessInstanceInfoMatch.Name (1580 of 1895) PASS: lldb-unit :: Utility/./UtilityTests/OptionsWithRawTest.ArgsButNoLeadingDash (1581 of 1895) PASS: lldb-api :: functionalities/data-formatter/varscript_formatting/TestDataFormatterVarScriptFormatting.py (1582 of 1895) PASS: lldb-shell :: SymbolFile/symbol-binding.test (1583 of 1895) PASS: lldb-unit :: Utility/./UtilityTests/StreamTeeTest.Write (1584 of 1895) PASS: lldb-shell :: Settings/TestSettingsSet.test (1585 of 1895) PASS: lldb-shell :: SymbolFile/DWARF/debug-types-basic.test (1586 of 1895) PASS: lldb-unit :: Process/minidump/./LLDBMinidumpTests/MinidumpParserTest.GetThreadContext_x86_32_wow64 (1587 of 1895) PASS: lldb-unit :: Utility/./UtilityTests/RecordReplayTest.InstrumentedFooSameThis (1588 of 1895) PASS: lldb-shell :: ObjectFile/ELF/gnu-debuglink.yaml (1589 of 1895) PASS: lldb-shell :: Breakpoint/implicit_const_form_support.test (1590 of 1895) PASS: lldb-unit :: Target/./TargetTests/ModuleCacheTest.GetAndPutStrangeHostname (1591 of 1895) PASS: lldb-shell :: Quit/TestQuitExitCode30.test (1592 of 1895) PASS: lldb-unit :: Utility/./UtilityTests/Flags.AnySet (1593 of 1895) PASS: lldb-api :: functionalities/postmortem/elf-core/gcore/TestGCore.py (1594 of 1895) PASS: lldb-api :: functionalities/data-formatter/data-formatter-stl/libcxx/set/TestDataFormatterLibcxxSet.py (1595 of 1895) PASS: lldb-shell :: SymbolFile/Breakpad/unwind-via-stack-cfi.test (1596 of 1895) PASS: lldb-api :: commands/expression/ignore-artificial-constructors/TestIgnoreArtificialConstructors.py (1597 of 1895) PASS: lldb-api :: functionalities/data-formatter/data-formatter-synthtype/TestDataFormatterSynthType.py (1598 of 1895) PASS: lldb-api :: python_api/target/TestTargetAPI.py (1599 of 1895) PASS: lldb-unit :: ScriptInterpreter/Python/./ScriptInterpreterPythonTests/PythonDataObjectsTest.TestPythonCallableCheck (1600 of 1895) PASS: lldb-unit :: Utility/./UtilityTests/Flags.IsClear (1601 of 1895) PASS: lldb-api :: functionalities/data-formatter/var-in-aggregate-misuse/TestVarInAggregateMisuse.py (1602 of 1895) PASS: lldb-unit :: Utility/./UtilityTests/StringLexerTest.PutBack (1603 of 1895) PASS: lldb-api :: macosx/load-kext/TestLoadKext.py (1604 of 1895) PASS: lldb-unit :: Utility/./UtilityTests/DataExtractorTest.GetCStr (1605 of 1895) UNSUPPORTED: lldb-api :: benchmarks/expression/TestRepeatedExprs.py (1606 of 1895) PASS: lldb-api :: commands/expression/radar_8638051/Test8638051.py (1607 of 1895) PASS: lldb-api :: lang/cpp/overloaded-functions/TestOverloadedFunctions.py (1608 of 1895) PASS: lldb-api :: lang/objc/variadic_methods/TestVariadicMethods.py (1609 of 1895) PASS: lldb-api :: commands/frame/var/TestFrameVar.py (1610 of 1895) PASS: lldb-unit :: Host/./HostTests/NativeProcessProtocolTest.ReadCStringFromMemory_MaxSize (1611 of 1895) PASS: lldb-api :: python_api/process/io/TestProcessIO.py (1612 of 1895) PASS: lldb-unit :: ScriptInterpreter/Python/./ScriptInterpreterPythonTests/PythonDataObjectsTest.TestPythonListValueEquality (1613 of 1895) PASS: lldb-api :: functionalities/tail_call_frames/disambiguate_tail_call_seq/TestDisambiguateTailCallSeq.py (1614 of 1895) UNSUPPORTED: lldb-api :: tools/lldb-server/libraries-svr4/TestGdbRemoteLibrariesSvr4Support.py (1615 of 1895) PASS: lldb-shell :: ScriptInterpreter/Python/crashlog.test (1616 of 1895) PASS: lldb-unit :: Utility/./UtilityTests/StreamTest.PutSLEB128 (1617 of 1895) PASS: lldb-api :: commands/expression/namespace_local_var_same_name_obj_c/TestNamespaceLocalVarSameNameObjC.py (1618 of 1895) PASS: lldb-shell :: ObjectFile/ELF/duplicate-section.yaml (1619 of 1895) PASS: lldb-shell :: ObjectFile/MachO/subsections.yaml (1620 of 1895) PASS: lldb-unit :: Utility/./UtilityTests/UriParserTest.BadPort2 (1621 of 1895) PASS: lldb-unit :: Process/gdb-remote/./ProcessGdbRemoteTests/GDBRemoteCommunicationServerTest.SendErrorResponse_StringError (1622 of 1895) PASS: lldb-unit :: Symbol/./SymbolTests/TestClangASTImporter.ImportInvalidType (1623 of 1895) PASS: lldb-api :: functionalities/non-overlapping-index-variable-i/TestIndexVariable.py (1624 of 1895) PASS: lldb-shell :: SymbolFile/DWARF/array-sizes.s (1625 of 1895) PASS: lldb-api :: lang/objc/objc-static-method-stripped/TestObjCStaticMethodStripped.py (1626 of 1895) XFAIL: lldb-shell :: Register/x86-mm-xmm-write.test (1627 of 1895) PASS: lldb-api :: python_api/watchpoint/condition/TestWatchpointConditionAPI.py (1628 of 1895) PASS: lldb-unit :: Host/./HostTests/ConnectionFileDescriptorTest.TCPGetURIv6 (1629 of 1895) PASS: lldb-unit :: Interpreter/./InterpreterTests/OptionArgParserTest.toScriptLanguage (1630 of 1895) PASS: lldb-shell :: ScriptInterpreter/None/none.test (1631 of 1895) PASS: lldb-unit :: Utility/./UtilityTests/ProcessInfoTest.Constructor (1632 of 1895) PASS: lldb-api :: python_api/value/TestValueAPI.py (1633 of 1895) UNSUPPORTED: lldb-api :: functionalities/tsan/cpp_global_location/TestTsanCPPGlobalLocation.py (1634 of 1895) UNSUPPORTED: lldb-api :: functionalities/tsan/global_location/TestTsanGlobalLocation.py (1635 of 1895) UNSUPPORTED: lldb-shell :: Register/x86-zmm-write.test (1636 of 1895) PASS: lldb-shell :: ObjectFile/PECOFF/export-dllfunc.yaml (1637 of 1895) PASS: lldb-api :: functionalities/breakpoint/breakpoint_ignore_count/TestBreakpointIgnoreCount.py (1638 of 1895) PASS: lldb-unit :: Symbol/./SymbolTests/TestClangASTContext.TestGetTypeClassDeclType (1639 of 1895) PASS: lldb-unit :: Utility/./UtilityTests/DataExtractorTest.GetMaxU64_unchecked (1640 of 1895) PASS: lldb-unit :: ObjectFile/Breakpad/./ObjectFileBreakpadTests/PublicRecord.parse (1641 of 1895) PASS: lldb-api :: python_api/watchpoint/watchlocation/TestTargetWatchAddress.py (1642 of 1895) PASS: lldb-unit :: ScriptInterpreter/Python/./ScriptInterpreterPythonTests/PythonDataObjectsTest.TestPythonTupleValues (1643 of 1895) PASS: lldb-api :: functionalities/data-formatter/pyobjsynthprovider/TestPyObjSynthProvider.py (1644 of 1895) PASS: lldb-api :: types/TestIntegerType.py (1645 of 1895) PASS: lldb-api :: functionalities/breakpoint/breakpoint_command/TestBreakpointCommandsFromPython.py (1646 of 1895) PASS: lldb-api :: commands/process/attach/attach_denied/TestAttachDenied.py (1647 of 1895) PASS: lldb-api :: functionalities/data-formatter/data-formatter-stl/libcxx/string/TestDataFormatterLibcxxString.py (1648 of 1895) PASS: lldb-unit :: UnwindAssembly/x86/./UnwindAssemblyx86Tests/Testx86AssemblyInspectionEngine.Test64bitFramelessSmallStackFrame (1649 of 1895) PASS: lldb-unit :: Utility/./UtilityTests/StringLexerTest.NextIf (1650 of 1895) PASS: lldb-unit :: Process/gdb-remote/./ProcessGdbRemoteTests/GDBRemoteClientBaseTest.SendContinueAndLateInterrupt (1651 of 1895) PASS: lldb-api :: functionalities/postmortem/minidump-new/TestMiniDumpNew.py (1652 of 1895) PASS: lldb-api :: commands/expression/completion-crash-incomplete-record/TestCompletionCrashIncompleteRecord.py (1653 of 1895) PASS: lldb-unit :: Utility/./UtilityTests/RangeTest.Slide (1654 of 1895) PASS: lldb-unit :: Process/gdb-remote/./ProcessGdbRemoteTests/GDBRemoteCommunicationClientTest.SyncThreadState (1655 of 1895) PASS: lldb-unit :: Utility/./UtilityTests/StringListTest.InsertStringAtIndexStdString (1656 of 1895) PASS: lldb-unit :: Utility/./UtilityTests/VASprintfTest.EncodingError (1657 of 1895) PASS: lldb-unit :: Utility/./UtilityTests/BinaryStreamTest.PutULEB128FiveBytes (1658 of 1895) PASS: lldb-shell :: Host/TestCustomShell.test (1659 of 1895) PASS: lldb-api :: terminal/TestSTTYBeforeAndAfter.py (1660 of 1895) PASS: lldb-shell :: SymbolFile/DWARF/dwarf5-debug_line.s (1661 of 1895) PASS: lldb-unit :: Utility/./UtilityTests/StringListTest.CopyListSingle (1662 of 1895) PASS: lldb-api :: functionalities/thread/concurrent_events/TestConcurrentWatchpointWithDelayWatchpointThreads.py (1663 of 1895) PASS: lldb-unit :: Process/minidump/./LLDBMinidumpTests/MinidumpParserTest.GetMemoryRegionInfoFromMemoryList (1664 of 1895) PASS: lldb-api :: commands/command/delete/TestCommandDelete.py (1665 of 1895) PASS: lldb-api :: tools/lldb-server/TestGdbRemoteSingleStep.py (1666 of 1895) PASS: lldb-unit :: Signals/./SignalsTests/UnixSignalsTest.Iteration (1667 of 1895) PASS: lldb-api :: functionalities/data-formatter/parray/TestPrintArray.py (1668 of 1895) UNSUPPORTED: lldb-shell :: ScriptInterpreter/Lua/command_script_import.test (1669 of 1895) PASS: lldb-unit :: Utility/./UtilityTests/StringExtractorTest.DecodeHexU8_Underflow2 (1670 of 1895) PASS: lldb-api :: commands/expression/anonymous-struct/TestCallUserAnonTypedef.py (1671 of 1895) PASS: lldb-shell :: Reproducer/Functionalities/TestImageList.test (1672 of 1895) PASS: lldb-unit :: tools/lldb-server/tests/./LLDBServerTests/TestBase.LaunchModePreservesEnvironment (1673 of 1895) PASS: lldb-unit :: Utility/./UtilityTests/StringLexerTest.NextIfList (1674 of 1895) UNSUPPORTED: lldb-api :: linux/mix-dwo-and-regular-objects/TestMixedDwarfBinary.py (1675 of 1895) PASS: lldb-unit :: Utility/./UtilityTests/BinaryStreamTest.PutULEB128MaxValue (1676 of 1895) PASS: lldb-shell :: SymbolFile/NativePDB/break-by-function.cpp (1677 of 1895) PASS: lldb-unit :: Host/./HostTests/MainLoopTest.ReadObject (1678 of 1895) PASS: lldb-shell :: ScriptInterpreter/None/import_module.test (1679 of 1895) PASS: lldb-unit :: Utility/./UtilityTests/RangeTest.ClearWithStarAddress (1680 of 1895) PASS: lldb-unit :: Utility/./UtilityTests/NameMatchesTest.Contains (1681 of 1895) UNSUPPORTED: lldb-shell :: ScriptInterpreter/Lua/breakpoint_callback.test (1682 of 1895) PASS: lldb-api :: python_api/symbol-context/TestSymbolContext.py (1683 of 1895) PASS: lldb-shell :: ExecControl/StopHook/stop-hook.test (1684 of 1895) PASS: lldb-unit :: Utility/./UtilityTests/AnsiTerminal.Unknown (1685 of 1895) PASS: lldb-api :: tools/lldb-server/TestAppleSimulatorOSType.py (1686 of 1895) PASS: lldb-unit :: Utility/./UtilityTests/FileSpecTest.AppendPathComponent (1687 of 1895) PASS: lldb-shell :: SymbolFile/DWARF/DW_OP_piece-struct.s (1688 of 1895) PASS: lldb-shell :: Minidump/breakpad-symbols.test (1689 of 1895) PASS: lldb-unit :: Utility/./UtilityTests/RegisterValueTest.GetSet8 (1690 of 1895) PASS: lldb-unit :: Process/gdb-remote/./ProcessGdbRemoteTests/GDBRemoteCommunicationClientTest.GetModulesInfoInvalidResponse (1691 of 1895) PASS: lldb-unit :: Platform/./LLDBPlatformTests/PlatformDarwinTest.TestParseVersionBuildDir (1692 of 1895) PASS: lldb-api :: python_api/module_section/TestModuleAndSection.py (1693 of 1895) PASS: lldb-shell :: Minidump/Windows/Sigsegv/sigsegv.test (1694 of 1895) PASS: lldb-unit :: SymbolFile/NativePDB/./SymbolFileNativePDBTests/PDBFPOProgramToDWARFExpressionTests.MultipleDependentAssignments (1695 of 1895) PASS: lldb-unit :: UnwindAssembly/x86/./UnwindAssemblyx86Tests/Testx86AssemblyInspectionEngine.TestPushRBPWithREX (1696 of 1895) PASS: lldb-shell :: Commands/command-source.test (1697 of 1895) UNSUPPORTED: lldb-api :: commands/register/register/intel_xtended_registers/mpx_bound_violation/TestBoundViolation.py (1698 of 1895) PASS: lldb-api :: functionalities/multidebugger_commands/TestMultipleDebuggersCommands.py (1699 of 1895) PASS: lldb-unit :: Symbol/./SymbolTests/Type.CompilerContextPattern (1700 of 1895) PASS: lldb-unit :: Utility/./UtilityTests/EventTest.DumpEventDataBytes (1701 of 1895) PASS: lldb-api :: lang/objc/forward-decl/TestForwardDecl.py (1702 of 1895) UNSUPPORTED: lldb-api :: linux/add-symbols/TestTargetSymbolsAddCommand.py (1703 of 1895) UNSUPPORTED: lldb-shell :: SymbolFile/NativePDB/typedefs.cpp (1704 of 1895) PASS: lldb-api :: lang/cpp/breakpoint_in_member_func_w_non_primitive_params/TestBreakpointInMemberFuncWNonPrimitiveParams.py (1705 of 1895) PASS: lldb-api :: commands/platform/basic/TestPlatformCommand.py (1706 of 1895) PASS: lldb-unit :: Utility/./UtilityTests/UserIDResolver.GetUserName (1707 of 1895) PASS: lldb-unit :: Process/minidump/./LLDBMinidumpTests/MinidumpParserTest.GetMemoryRegionInfoLinuxMaps (1708 of 1895) PASS: lldb-unit :: Utility/./UtilityTests/UUIDTest.SetFromStringRef (1709 of 1895) PASS: lldb-unit :: debugserver/./debugserverTests/RNBSocket.LoopBackListenIPv4 (1710 of 1895) PASS: lldb-unit :: Utility/./UtilityTests/StringExtractorTest.GetHexBytes_Partial (1711 of 1895) PASS: lldb-api :: python_api/value/empty_class/TestValueAPIEmptyClass.py (1712 of 1895) PASS: lldb-api :: functionalities/ptr_refs/TestPtrRefs.py (1713 of 1895) PASS: lldb-api :: functionalities/thread/step_out/TestThreadStepOut.py (1714 of 1895) PASS: lldb-unit :: Expression/./ExpressionTests/CppModuleConfigurationTest.MissingUsrInclude (1715 of 1895) PASS: lldb-api :: lang/objc/objc-struct-argument/TestObjCStructArgument.py (1716 of 1895) PASS: lldb-api :: commands/register/register/register_command/TestRegisters.py (1717 of 1895) PASS: lldb-unit :: Utility/./UtilityTests/LogChannelEnabledTest.LogThread (1718 of 1895) PASS: lldb-api :: macosx/add-dsym/TestAddDsymMidExecutionCommand.py (1719 of 1895) PASS: lldb-api :: lang/cpp/signed_types/TestSignedTypes.py (1720 of 1895) PASS: lldb-api :: functionalities/process_group/TestChangeProcessGroup.py (1721 of 1895) PASS: lldb-unit :: Utility/./UtilityTests/ScalarTest.APIntConstructor (1722 of 1895) PASS: lldb-api :: functionalities/data-formatter/dump_dynamic/TestDumpDynamic.py (1723 of 1895) PASS: lldb-shell :: ObjectFile/ELF/short-build-id.yaml (1724 of 1895) PASS: lldb-api :: commands/platform/process/TestProcessList.py (1725 of 1895) PASS: lldb-api :: functionalities/thread/concurrent_events/TestConcurrentTwoBreakpointThreads.py (1726 of 1895) PASS: lldb-unit :: Utility/./UtilityTests/SerializationRountripTest.SerializeDeserializePodReferences (1727 of 1895) PASS: lldb-unit :: Utility/./UtilityTests/RangeTest.NotEqual (1728 of 1895) PASS: lldb-api :: python_api/lldbutil/TestSwigVersion.py (1729 of 1895) PASS: lldb-api :: functionalities/history/TestHistoryRecall.py (1730 of 1895) UNSUPPORTED: lldb-api :: tools/lldb-vscode/completions/TestVSCode_completions.py (1731 of 1895) PASS: lldb-api :: commands/breakpoint/command/list/TestBreakpointCommandList.py (1732 of 1895) PASS: lldb-api :: lang/cpp/stl/TestStdCXXDisassembly.py (1733 of 1895) PASS: lldb-api :: types/TestIntegerTypeExpr.py (1734 of 1895) PASS: lldb-api :: commands/expression/regression-access-function-template-in-record/TestRegressionAccessFunctionTemplateInRecord.py (1735 of 1895) PASS: lldb-unit :: Utility/./UtilityTests/StreamTest.PutNHex8 (1736 of 1895) PASS: lldb-shell :: Driver/TestNoUseColor.test (1737 of 1895) PASS: lldb-unit :: Process/gdb-remote/./ProcessGdbRemoteTests/GDBRemoteCommunicationClientTest.WriteRegister (1738 of 1895) PASS: lldb-unit :: Language/CPlusPlus/./LanguageCPlusPlusTests/CPlusPlusLanguage.CPlusPlusNameParser (1739 of 1895) PASS: lldb-unit :: Utility/./UtilityTests/ArgsTest.GetQuotedCommandString (1740 of 1895) FAIL: lldb-api :: functionalities/data-formatter/data-formatter-objc/TestDataFormatterObjCExpr.py (1741 of 1895) ******************** TEST 'lldb-api :: functionalities/data-formatter/data-formatter-objc/TestDataFormatterObjCExpr.py' FAILED ******************** lldb version 11.0.99 (http://labmaster3.local/git/llvm-project.git revision c1b13a1b17719aebace1b3be7a6ac7f90b1901a6) clang revision 7ce2de2ce4e7d4dd8e1e5a7a5b35c0f98e46681d llvm revision 7ce2de2ce4e7d4dd8e1e5a7a5b35c0f98e46681d LLDB library dir: /Users/buildslave/jenkins/workspace/lldb-cmake-sanitized/lldb-build/bin LLDB import library dir: /Users/buildslave/jenkins/workspace/lldb-cmake-sanitized/lldb-build/bin libstdcxx tests will not be run because: Don't know how to build with libstdcxx on macosx Skipping following debug info categories: ['dwo'] setting set target.prefer-dynamic-value no-dynamic-values AddressSanitizer report breakpoint hit. Use 'thread info -s' to get extended information about the report. AddressSanitizer report breakpoint hit. Use 'thread info -s' to get extended information about the report. AddressSanitizer report breakpoint hit. Use 'thread info -s' to get extended information about the report.

Hide Details

Session logs for test failures/errors/unexpected successes will go into directory '/Users/buildslave/jenkins/workspace/lldb-cmake-sanitized/test/logs' Command invoked: /Users/buildslave/jenkins/workspace/lldb-cmake-sanitized/llvm-project/lldb/test/API/dotest.py --arch x86_64 -s /Users/buildslave/jenkins/workspace/lldb-cmake-sanitized/lldb-build/lldb-test-traces -S nm -u CXXFLAGS -u CFLAGS --codesign-identity lldb_codesign --server /Users/buildslave/jenkins/workspace/lldb-cmake-sanitized/lldb-build/./bin/debugserver --arch x86_64 --build-dir /Users/buildslave/jenkins/workspace/lldb-cmake-sanitized/lldb-build/lldb-test-build.noindex -s=/Users/buildslave/jenkins/workspace/lldb-cmake-sanitized/test/logs -t --env TERM=vt100 --env LLVM_LIBS_DIR=/Users/buildslave/jenkins/workspace/lldb-cmake-sanitized/lldb-build/./lib --inferior-env ASAN_OPTIONS=detect_stack_use_after_return=1 --inferior-env DYLD_INSERT_LIBRARIES=/Users/buildslave/jenkins/workspace/lldb-cmake-sanitized/host-compiler/lib/clang/11.0.0/lib/darwin/libclang_rt.asan_osx_dynamic.dylib --build-dir /Users/buildslave/jenkins/workspace/lldb-cmake-sanitized/lldb-build/lldb-test-build.noindex --lldb-module-cache-dir /Users/buildslave/jenkins/workspace/lldb-cmake-sanitized/lldb-build/lldb-test-build.noindex/module-cache-lldb/lldb-api --clang-module-cache-dir /Users/buildslave/jenkins/workspace/lldb-cmake-sanitized/lldb-build/lldb-test-build.noindex/module-cache-clang/lldb-api --executable /Users/buildslave/jenkins/workspace/lldb-cmake-sanitized/lldb-build/./bin/lldb --compiler /Users/buildslave/jenkins/workspace/lldb-cmake-sanitized/lldb-build/./bin/clang --dsymutil /Users/buildslave/jenkins/workspace/lldb-cmake-sanitized/lldb-build/./bin/dsymutil --filecheck /Users/buildslave/jenkins/workspace/lldb-cmake-sanitized/lldb-build/./bin/FileCheck /Users/buildslave/jenkins/workspace/lldb-cmake-sanitized/llvm-project/lldb/packages/Python/lldbsuite/test/functionalities/data-formatter/data-formatter-objc -p TestDataFormatterObjCExpr.py Change dir to: /Users/buildslave/jenkins/workspace/lldb-cmake-sanitized/llvm-project/lldb/packages/Python/lldbsuite/test/functionalities/data-formatter/data-formatter-objc runCmd: settings set symbols.enable-external-lookup false output:

Hide Details

runCmd: settings set plugin.process.gdb-remote.packet-timeout 60 output:

Hide Details

runCmd: settings set symbols.clang-modules-cache-path "/Users/buildslave/jenkins/workspace/lldb-cmake-sanitized/lldb-build/lldb-test-build.noindex/module-cache-lldb/lldb-api" output:

Hide Details

runCmd: settings set use-color false output:

Hide Details

runCmd: settings set target.env-vars ASAN_OPTIONS=detect_stack_use_after_return=1 DYLD_INSERT_LIBRARIES=/Users/buildslave/jenkins/workspace/lldb-cmake-sanitized/host-compiler/lib/clang/11.0.0/lib/darwin/libclang_rt.asan_osx_dynamic.dylib output:

Hide Details

runCmd: settings set target.env-vars ASAN_OPTIONS=detect_stack_use_after_return=1 DYLD_INSERT_LIBRARIES=/Users/buildslave/jenkins/workspace/lldb-cmake-sanitized/host-compiler/lib/clang/11.0.0/lib/darwin/libclang_rt.asan_osx_dynamic.dylib output:

Hide Details

FAIL: LLDB (/Users/buildslave/jenkins/workspace/lldb-cmake-sanitized/lldb-build/bin/clang-10-x86_64) :: test_expr_with_run_command_dsym (TestDataFormatterObjCExpr.ObjCDataFormatterExpr) <bound method SBProcess.Kill of <lldb.SBProcess; proxy of <Swig Object of type 'lldb::SBProcess *' at 0x109141240> >>: success

Hide Details

runCmd: settings set symbols.enable-external-lookup false output:

Hide Details

runCmd: settings set plugin.process.gdb-remote.packet-timeout 60 output:

Hide Details

runCmd: settings set symbols.clang-modules-cache-path "/Users/buildslave/jenkins/workspace/lldb-cmake-sanitized/lldb-build/lldb-test-build.noindex/module-cache-lldb/lldb-api" output:

Hide Details

runCmd: settings set use-color false output:

Hide Details

runCmd: settings set target.env-vars ASAN_OPTIONS=detect_stack_use_after_return=1 DYLD_INSERT_LIBRARIES=/Users/buildslave/jenkins/workspace/lldb-cmake-sanitized/host-compiler/lib/clang/11.0.0/lib/darwin/libclang_rt.asan_osx_dynamic.dylib output:

Hide Details

runCmd: settings set target.env-vars ASAN_OPTIONS=detect_stack_use_after_return=1 DYLD_INSERT_LIBRARIES=/Users/buildslave/jenkins/workspace/lldb-cmake-sanitized/host-compiler/lib/clang/11.0.0/lib/darwin/libclang_rt.asan_osx_dynamic.dylib output:

Hide Details

FAIL: LLDB (/Users/buildslave/jenkins/workspace/lldb-cmake-sanitized/lldb-build/bin/clang-10-x86_64) :: test_expr_with_run_command_dwarf (TestDataFormatterObjCExpr.ObjCDataFormatterExpr) <bound method SBProcess.Kill of <lldb.SBProcess; proxy of <Swig Object of type 'lldb::SBProcess *' at 0x108b98630> >>: success

Hide Details

UNSUPPORTED: LLDB (/Users/buildslave/jenkins/workspace/lldb-cmake-sanitized/lldb-build/bin/clang-10-x86_64) :: test_expr_with_run_command_dwo (TestDataFormatterObjCExpr.ObjCDataFormatterExpr) (test case does not fall in any category of interest for this run) runCmd: settings set symbols.enable-external-lookup false output:

Hide Details

runCmd: settings set plugin.process.gdb-remote.packet-timeout 60 output:

Hide Details

runCmd: settings set symbols.clang-modules-cache-path "/Users/buildslave/jenkins/workspace/lldb-cmake-sanitized/lldb-build/lldb-test-build.noindex/module-cache-lldb/lldb-api" output:

Hide Details

runCmd: settings set use-color false output:

Hide Details

runCmd: settings set target.env-vars ASAN_OPTIONS=detect_stack_use_after_return=1 DYLD_INSERT_LIBRARIES=/Users/buildslave/jenkins/workspace/lldb-cmake-sanitized/host-compiler/lib/clang/11.0.0/lib/darwin/libclang_rt.asan_osx_dynamic.dylib output:

Hide Details

runCmd: settings set target.env-vars ASAN_OPTIONS=detect_stack_use_after_return=1 DYLD_INSERT_LIBRARIES=/Users/buildslave/jenkins/workspace/lldb-cmake-sanitized/host-compiler/lib/clang/11.0.0/lib/darwin/libclang_rt.asan_osx_dynamic.dylib output:

Hide Details

FAIL: LLDB (/Users/buildslave/jenkins/workspace/lldb-cmake-sanitized/lldb-build/bin/clang-10-x86_64) :: test_expr_with_run_command_gmodules (TestDataFormatterObjCExpr.ObjCDataFormatterExpr) <bound method SBProcess.Kill of <lldb.SBProcess; proxy of <Swig Object of type 'lldb::SBProcess *' at 0x109141540> >>: success

Hide Details

Restore dir to: /Users/buildslave/jenkins/workspace/lldb-cmake-sanitized/lldb-build/tools/lldb/test ====================================================================== FAIL: test_expr_with_run_command_dsym (TestDataFormatterObjCExpr.ObjCDataFormatterExpr) Test common cases of expression parser <--> formatters interaction. ---------------------------------------------------------------------- Traceback (most recent call last): File "/Users/buildslave/jenkins/workspace/lldb-cmake-sanitized/llvm-project/lldb/packages/Python/lldbsuite/test/lldbtest.py", line 1732, in test_method return attrvalue(self) File "/Users/buildslave/jenkins/workspace/lldb-cmake-sanitized/llvm-project/lldb/packages/Python/lldbsuite/test/functionalities/data-formatter/data-formatter-objc/TestDataFormatterObjCExpr.py", line 23, in test_expr_with_run_command lldb.SBFileSpec('main.m', False)) File "/Users/buildslave/jenkins/workspace/lldb-cmake-sanitized/llvm-project/lldb/packages/Python/lldbsuite/test/lldbutil.py", line 868, in run_to_source_breakpoint only_one_thread, extra_images) File "/Users/buildslave/jenkins/workspace/lldb-cmake-sanitized/llvm-project/lldb/packages/Python/lldbsuite/test/lldbutil.py", line 797, in run_to_breakpoint_do_run test.assertEqual(num_threads, 1, "Expected 1 thread to stop at breakpoint, %d did."%(num_threads)) AssertionError: 0 != 1 : Expected 1 thread to stop at breakpoint, 0 did. Config=x86_64-/Users/buildslave/jenkins/workspace/lldb-cmake-sanitized/lldb-build/bin/clang-10 ====================================================================== FAIL: test_expr_with_run_command_dwarf (TestDataFormatterObjCExpr.ObjCDataFormatterExpr) Test common cases of expression parser <--> formatters interaction. ---------------------------------------------------------------------- Traceback (most recent call last): File "/Users/buildslave/jenkins/workspace/lldb-cmake-sanitized/llvm-project/lldb/packages/Python/lldbsuite/test/lldbtest.py", line 1732, in test_method return attrvalue(self) File "/Users/buildslave/jenkins/workspace/lldb-cmake-sanitized/llvm-project/lldb/packages/Python/lldbsuite/test/functionalities/data-formatter/data-formatter-objc/TestDataFormatterObjCExpr.py", line 23, in test_expr_with_run_command lldb.SBFileSpec('main.m', False)) File "/Users/buildslave/jenkins/workspace/lldb-cmake-sanitized/llvm-project/lldb/packages/Python/lldbsuite/test/lldbutil.py", line 868, in run_to_source_breakpoint only_one_thread, extra_images) File "/Users/buildslave/jenkins/workspace/lldb-cmake-sanitized/llvm-project/lldb/packages/Python/lldbsuite/test/lldbutil.py", line 797, in run_to_breakpoint_do_run test.assertEqual(num_threads, 1, "Expected 1 thread to stop at breakpoint, %d did."%(num_threads)) AssertionError: 0 != 1 : Expected 1 thread to stop at breakpoint, 0 did. Config=x86_64-/Users/buildslave/jenkins/workspace/lldb-cmake-sanitized/lldb-build/bin/clang-10 ====================================================================== FAIL: test_expr_with_run_command_gmodules (TestDataFormatterObjCExpr.ObjCDataFormatterExpr) Test common cases of expression parser <--> formatters interaction. ---------------------------------------------------------------------- Traceback (most recent call last): File "/Users/buildslave/jenkins/workspace/lldb-cmake-sanitized/llvm-project/lldb/packages/Python/lldbsuite/test/lldbtest.py", line 1732, in test_method return attrvalue(self) File "/Users/buildslave/jenkins/workspace/lldb-cmake-sanitized/llvm-project/lldb/packages/Python/lldbsuite/test/functionalities/data-formatter/data-formatter-objc/TestDataFormatterObjCExpr.py", line 23, in test_expr_with_run_command lldb.SBFileSpec('main.m', False)) File "/Users/buildslave/jenkins/workspace/lldb-cmake-sanitized/llvm-project/lldb/packages/Python/lldbsuite/test/lldbutil.py", line 868, in run_to_source_breakpoint only_one_thread, extra_images) File "/Users/buildslave/jenkins/workspace/lldb-cmake-sanitized/llvm-project/lldb/packages/Python/lldbsuite/test/lldbutil.py", line 797, in run_to_breakpoint_do_run test.assertEqual(num_threads, 1, "Expected 1 thread to stop at breakpoint, %d did."%(num_threads)) AssertionError: 0 != 1 : Expected 1 thread to stop at breakpoint, 0 did. Config=x86_64-/Users/buildslave/jenkins/workspace/lldb-cmake-sanitized/lldb-build/bin/clang-10 ---------------------------------------------------------------------- Ran 4 tests in 38.596s

Hide Details

RESULT: FAILED (0 passes, 3 failures, 0 errors, 1 skipped, 0 expected failures, 0 unexpected successes)

Hide Details

******************** PASS: lldb-unit :: Target/./TargetTests/PathMappingListTest.AbsoluteTests (1742 of 1895) PASS: lldb-unit :: UnwindAssembly/x86/./UnwindAssemblyx86Tests/Testx86AssemblyInspectionEngine.TestMovRSPtoRBP (1743 of 1895) PASS: lldb-unit :: Utility/./UtilityTests/StringExtractorTest.GetU32BigEndian (1744 of 1895) PASS: lldb-api :: api/listeners/TestListener.py (1745 of 1895) UNSUPPORTED: lldb-shell :: SymbolFile/PDB/vbases.test (1746 of 1895) PASS: lldb-api :: lang/cpp/thread_local/TestThreadLocal.py (1747 of 1895) PASS: lldb-api :: lang/c/conflicting-symbol/TestConflictingSymbol.py (1748 of 1895) PASS: lldb-unit :: UnwindAssembly/x86/./UnwindAssemblyx86Tests/Testx86AssemblyInspectionEngine.TestStackRealignMSVC_i386 (1749 of 1895) PASS: lldb-api :: commands/target/stop-hooks/TestStopHooks.py (1750 of 1895) PASS: lldb-api :: functionalities/data-formatter/data-formatter-cpp/TestDataFormatterCpp.py (1751 of 1895) PASS: lldb-api :: lang/cpp/gmodules-templates/TestGModules.py (1752 of 1895) PASS: lldb-shell :: SymbolFile/DWARF/anon_class_w_and_wo_export_symbols.ll (1753 of 1895) PASS: lldb-api :: lang/c/tls_globals/TestTlsGlobals.py (1754 of 1895) PASS: lldb-api :: tools/lldb-server/commandline/TestStubSetSID.py (1755 of 1895) PASS: lldb-unit :: Utility/./UtilityTests/Flags.AnyClear (1756 of 1895) UNSUPPORTED: lldb-shell :: ScriptInterpreter/Lua/persistent_state.test (1757 of 1895) UNSUPPORTED: lldb-api :: macosx/macabi/TestMacABImacOSFramework.py (1758 of 1895) PASS: lldb-unit :: Utility/./UtilityTests/BinaryStreamTest.PutSLEB128NineBytes (1759 of 1895) PASS: lldb-api :: lang/cpp/unsigned_types/TestUnsignedTypes.py (1760 of 1895) PASS: lldb-shell :: Breakpoint/split-dwarf5-debug-stroffsets.test (1761 of 1895) PASS: lldb-api :: functionalities/data-formatter/poarray/TestPrintObjectArray.py (1762 of 1895) UNSUPPORTED: lldb-api :: tools/lldb-server/signal-filtering/TestGdbRemote_QPassSignals.py (1763 of 1895) UNSUPPORTED: lldb-api :: benchmarks/frame_variable/TestFrameVariableResponse.py (1764 of 1895) PASS: lldb-unit :: Process/gdb-remote/./ProcessGdbRemoteTests/GDBRemoteCommunicationServerTest.SendErrorResponse_ErrorNumber (1765 of 1895) PASS: lldb-api :: commands/expression/radar_9531204/TestPrintfAfterUp.py (1766 of 1895) PASS: lldb-unit :: Utility/./UtilityTests/StringListTest.SplitIntoLines (1767 of 1895) PASS: lldb-api :: linux/builtin_trap/TestBuiltinTrap.py (1768 of 1895) PASS: lldb-unit :: Host/./HostTests/Host.WaitStatusFormat (1769 of 1895) PASS: lldb-unit :: Host/./HostTests/SocketTest.TCPListen0ConnectAccept (1770 of 1895) PASS: lldb-unit :: Utility/./UtilityTests/FileSpecTest.EqualDotsPosix (1771 of 1895) PASS: lldb-unit :: Symbol/./SymbolTests/DWARFCallFrameInfoTest.Basic_dwarf3 (1772 of 1895) PASS: lldb-api :: functionalities/unwind/noreturn/TestNoreturnUnwind.py (1773 of 1895) PASS: lldb-api :: types/TestCharTypeExpr.py (1774 of 1895) PASS: lldb-api :: lang/objc/ptr_refs/TestPtrRefsObjC.py (1775 of 1895) PASS: lldb-unit :: Symbol/./SymbolTests/TestClangASTContext.TestFunctionTemplateInRecordConstruction (1776 of 1895) PASS: lldb-api :: functionalities/breakpoint/address_breakpoints/TestAddressBreakpoints.py (1777 of 1895) PASS: lldb-api :: functionalities/memory-region/TestMemoryRegion.py (1778 of 1895) PASS: lldb-unit :: Utility/./UtilityTests/UriParserTest.Minimal (1779 of 1895) PASS: lldb-unit :: Utility/./UtilityTests/DataExtractorTest.GetMaxU64 (1780 of 1895) PASS: lldb-unit :: Utility/./UtilityTests/LogChannelEnabledTest.LogVerboseThread (1781 of 1895) PASS: lldb-unit :: SymbolFile/NativePDB/./SymbolFileNativePDBTests/PDBFPOProgramToDWARFExpressionTests.InvalidAssignmentSingle (1782 of 1895) PASS: lldb-unit :: Utility/./UtilityTests/UriParserTest.SchemeHostSeparator3 (1783 of 1895) PASS: lldb-shell :: SymbolFile/DWARF/debug_loc.s (1784 of 1895) PASS: lldb-api :: functionalities/signal/raise/TestRaise.py (1785 of 1895) PASS: lldb-api :: lang/cpp/dynamic-value/TestCppValueCast.py (1786 of 1895) PASS: lldb-unit :: Process/gdb-remote/./ProcessGdbRemoteTests/GDBRemoteCommunicationClientTest.SendGetMetaDataPacket (1787 of 1895) PASS: lldb-api :: functionalities/data-formatter/data-formatter-stl/libcxx/queue/TestDataFormatterLibcxxQueue.py (1788 of 1895) PASS: lldb-unit :: Utility/./UtilityTests/FileSpecTest.Match (1789 of 1895) PASS: lldb-shell :: Commands/command-regex-unalias.test (1790 of 1895) PASS: lldb-unit :: SymbolFile/DWARF/./SymbolFileDWARFTests/DWARFASTParserClangTests.EnsureAllDIEsInDeclContextHaveBeenParsedParsesOnlyMatchingEntries (1791 of 1895) PASS: lldb-api :: python_api/value/linked_list/TestValueAPILinkedList.py (1792 of 1895) PASS: lldb-api :: python_api/name_lookup/TestNameLookup.py (1793 of 1895) PASS: lldb-shell :: Reproducer/TestGDBRemoteRepro.test (1794 of 1895) UNSUPPORTED: lldb-shell :: ScriptInterpreter/Lua/independent_state.test (1795 of 1895) XFAIL: lldb-shell :: Register/x86-64-write.test (1796 of 1895) UNSUPPORTED: lldb-api :: functionalities/darwin_log/source/info/TestDarwinLogSourceInfo.py (1797 of 1895) PASS: lldb-unit :: Utility/./UtilityTests/OptionsWithRawTest.ArgsButNoDelimiter (1798 of 1895) PASS: lldb-api :: lang/cpp/scope/TestCppScope.py (1799 of 1895) PASS: lldb-shell :: SymbolFile/DWARF/DW_AT_loclists_base.s (1800 of 1895) PASS: lldb-unit :: Utility/./UtilityTests/CompletionRequest.Constructor (1801 of 1895) PASS: lldb-api :: functionalities/tail_call_frames/cross_object/TestCrossObjectTailCalls.py (1802 of 1895) PASS: lldb-api :: functionalities/unwind/sigtramp/TestSigtrampUnwind.py (1803 of 1895) PASS: lldb-api :: commands/version/TestVersion.py (1804 of 1895) PASS: lldb-unit :: Utility/./UtilityTests/StatusTest.ErrorConstructor (1805 of 1895) PASS: lldb-api :: functionalities/data-formatter/data-formatter-stl/libcxx/list/TestDataFormatterLibcxxList.py (1806 of 1895) UNSUPPORTED: lldb-shell :: SymbolFile/PDB/function-nested-block.test (1807 of 1895) PASS: lldb-unit :: Utility/./UtilityTests/StreamTest.PutStringAsRawHex8 (1808 of 1895) PASS: lldb-api :: commands/expression/test/TestExprs.py (1809 of 1895) PASS: lldb-unit :: SymbolFile/NativePDB/./SymbolFileNativePDBTests/PDBFPOProgramToDWARFExpressionTests.UnresolvedRegisterAssignmentReference (1810 of 1895) PASS: lldb-unit :: Expression/./ExpressionTests/CppModuleConfigurationTest.Linux (1811 of 1895) PASS: lldb-shell :: SymbolFile/Breakpad/line-table-missing-file.test (1812 of 1895) PASS: lldb-api :: python_api/file_handle/TestFileHandle.py (1813 of 1895) PASS: lldb-unit :: Utility/./UtilityTests/StringExtractorTest.GetHexU8_Exact (1814 of 1895) PASS: lldb-shell :: SymbolFile/DWARF/debug_line-relative_path.s (1815 of 1895) PASS: lldb-unit :: Utility/./UtilityTests/StreamTest.PutRawBytesToLittleEndian (1816 of 1895) UNSUPPORTED: lldb-api :: tools/lldb-server/platform-process-connect/TestPlatformProcessConnect.py (1817 of 1895) PASS: lldb-api :: commands/expression/cast_int_to_anonymous_enum/TestCastIntToAnonymousEnum.py (1818 of 1895) PASS: lldb-shell :: Breakpoint/debug_rnglistx_rlex.test (1819 of 1895) PASS: lldb-api :: lang/objc/single-entry-dictionary/TestObjCSingleEntryDictionary.py (1820 of 1895) PASS: lldb-unit :: Language/Highlighting/./HighlighterTests/HighlighterTest.ClangTrailingBackslashMissingNewLine (1821 of 1895) PASS: lldb-unit :: Utility/./UtilityTests/FileSpecTest.IsRelative (1822 of 1895) PASS: lldb-api :: commands/reproducer/invalid-args/TestInvalidArgsReproducer.py (1823 of 1895) PASS: lldb-unit :: Process/gdb-remote/./ProcessGdbRemoteTests/GDBRemoteCommunicationClientTest.TestPacketSpeedJSON (1824 of 1895) PASS: lldb-api :: lang/cpp/bool/TestCPPBool.py (1825 of 1895) PASS: lldb-api :: functionalities/jitloader_gdb/TestJITLoaderGDB.py (1826 of 1895) PASS: lldb-unit :: Utility/./UtilityTests/StreamTest.AddressPrefixAndSuffix (1827 of 1895) PASS: lldb-shell :: Reproducer/TestDriverOptions.test (1828 of 1895) PASS: lldb-api :: functionalities/breakpoint/scripted_bkpt/TestScriptedResolver.py (1829 of 1895) PASS: lldb-unit :: Process/minidump/./LLDBMinidumpTests/MinidumpParserTest.GetPidWindows (1830 of 1895) PASS: lldb-shell :: ObjectFile/ELF/PT_LOAD.yaml (1831 of 1895) PASS: lldb-unit :: Utility/./UtilityTests/StreamTest.AddressSuffix (1832 of 1895) UNSUPPORTED: lldb-shell :: SymbolFile/dissassemble-entry-point.s (1833 of 1895) PASS: lldb-shell :: SymbolFile/DWARF/find-function-regex.cpp (1834 of 1895) PASS: lldb-api :: functionalities/data-formatter/user-format-vs-summary/TestUserFormatVsSummary.py (1835 of 1895) PASS: lldb-unit :: Utility/./UtilityTests/ArgsTest.BareSingleQuote (1836 of 1895) PASS: lldb-api :: tools/lldb-server/TestGdbRemoteExitCode.py (1837 of 1895) PASS: lldb-unit :: UnwindAssembly/x86/./UnwindAssemblyx86Tests/Testx86AssemblyInspectionEngine.TestAddESP (1838 of 1895) PASS: lldb-api :: lang/c/const_variables/TestConstVariables.py (1839 of 1895) PASS: lldb-unit :: Utility/./UtilityTests/VASprintfTest.BufferResize (1840 of 1895) PASS: lldb-unit :: Host/./HostTests/FileSystemTest.Readable (1841 of 1895) PASS: lldb-unit :: Utility/./UtilityTests/StreamTest.ChangingByteOrder (1842 of 1895) PASS: lldb-unit :: Expression/./ExpressionTests/DiagnosticManagerTest.GetStringMultiline (1843 of 1895) PASS: lldb-unit :: Process/minidump/./LLDBMinidumpTests/MinidumpParserTest.GetLinuxProcStatus_no_stream (1844 of 1895) PASS: lldb-unit :: Utility/./UtilityTests/TimerTest.CategoryTimes2 (1845 of 1895) PASS: lldb-unit :: Expression/./ExpressionTests/CppModuleConfigurationTest.MissingLibCpp (1846 of 1895) PASS: lldb-unit :: Utility/./UtilityTests/StringExtractorTest.GetHexBytesAvail_FullString (1847 of 1895) UNSUPPORTED: lldb-api :: functionalities/data-formatter/data-formatter-stl/libstdcpp/unique_ptr/TestDataFormatterStdUniquePtr.py (1848 of 1895) PASS: lldb-unit :: Symbol/./SymbolTests/TestClangASTContext.TestGetTypeClassNested (1849 of 1895) UNSUPPORTED: lldb-shell :: ScriptInterpreter/Lua/watchpoint_callback.test (1850 of 1895) PASS: lldb-api :: functionalities/recursion/TestValueObjectRecursion.py (1851 of 1895) PASS: lldb-api :: functionalities/deleted-executable/TestDeletedExecutable.py (1852 of 1895) PASS: lldb-shell :: ObjectFile/Breakpad/sections.test (1853 of 1895) PASS: lldb-unit :: Host/./HostTests/MainLoopTest.DetectsEOF (1854 of 1895) PASS: lldb-unit :: Utility/./UtilityTests/RangeTest.ContainsRange (1855 of 1895) XFAIL: lldb-shell :: SymbolFile/DWARF/find-type-in-function.cpp (1856 of 1895) PASS: lldb-api :: functionalities/data-formatter/data-formatter-disabling/TestDataFormatterDisabling.py (1857 of 1895) PASS: lldb-unit :: SymbolFile/NativePDB/./SymbolFileNativePDBTests/PDBFPOProgramToDWARFExpressionTests.MissingTargetRegister (1858 of 1895) PASS: lldb-unit :: Utility/./UtilityTests/SerializationRountripTest.SerializeDeserializeObjectPointer (1859 of 1895) UNSUPPORTED: lldb-shell :: Register/x86-64-zmm-write.test (1860 of 1895) UNSUPPORTED: lldb-api :: functionalities/darwin_log/filter/regex/message/TestDarwinLogFilterRegexMessage.py (1861 of 1895) PASS: lldb-unit :: Utility/./UtilityTests/StreamTest.PutHex64ByteOrderLittle (1862 of 1895) PASS: lldb-api :: lang/cpp/limit-debug-info/TestWithLimitDebugInfo.py (1863 of 1895) PASS: lldb-api :: functionalities/memory/find/TestMemoryFind.py (1864 of 1895) PASS: lldb-shell :: Expr/TestMultilineExpr.test (1865 of 1895) PASS: lldb-api :: lang/cpp/template-function/TestTemplateFunctions.py (1866 of 1895) PASS: lldb-shell :: SymbolFile/NativePDB/nested-types.cpp (1867 of 1895) PASS: lldb-api :: tools/lldb-server/TestLldbGdbServer.py (1868 of 1895) PASS: lldb-unit :: UnwindAssembly/x86/./UnwindAssemblyx86Tests/Testx86AssemblyInspectionEngine.Test32bitFramelessSmallStackFrame (1869 of 1895) PASS: lldb-shell :: Minidump/memory-region-from-module.yaml (1870 of 1895) PASS: lldb-api :: macosx/lc-note/kern-ver-str/TestKernVerStrLCNOTE.py (1871 of 1895) PASS: lldb-unit :: Utility/./UtilityTests/UriParserTest.PortOverflow (1872 of 1895) PASS: lldb-api :: functionalities/thread/backtrace_all/TestBacktraceAll.py (1873 of 1895) PASS: lldb-api :: functionalities/tail_call_frames/unambiguous_sequence/TestUnambiguousTailCalls.py (1874 of 1895) UNSUPPORTED: lldb-api :: lang/cpp/static_members/TestCPPStaticMembers.py (1875 of 1895) PASS: lldb-api :: lang/objc/foundation/TestObjCMethodsString.py (1876 of 1895) PASS: lldb-api :: lang/c/find_struct_type/TestFindStructTypes.py (1877 of 1895) PASS: lldb-unit :: Utility/./UtilityTests/StringListTest.Join (1878 of 1895) PASS: lldb-unit :: Utility/./UtilityTests/ReproducerTest.SetCapture (1879 of 1895) PASS: lldb-api :: lang/cpp/exceptions/TestCPPExceptionBreakpoints.py (1880 of 1895) PASS: lldb-unit :: Process/minidump/./LLDBMinidumpTests/MinidumpParserTest.GetThreadsAndGetThreadContext (1881 of 1895) PASS: lldb-unit :: Host/./HostTests/SocketTest.TCPGetConnectURI (1882 of 1895) PASS: lldb-unit :: Utility/./UtilityTests/ProcessInstanceInfo.DumpTable (1883 of 1895) PASS: lldb-api :: lang/objc/global_ptrs/TestGlobalObjects.py (1884 of 1895) UNSUPPORTED: lldb-api :: python_api/disassemble-raw-data/TestDisassemble_VST1_64.py (1885 of 1895) PASS: lldb-shell :: Minidump/Windows/broken-unwind.test (1886 of 1895) PASS: lldb-unit :: Utility/./UtilityTests/StringListTest.ShiftCString (1887 of 1895) PASS: lldb-unit :: Symbol/./SymbolTests/TestClangASTContext.TestGetBasicTypeFromEnum (1888 of 1895) UNSUPPORTED: lldb-shell :: Register/arm-gp-read.test (1889 of 1895) PASS: lldb-shell :: SymbolFile/DWARF/debug_aranges-empty-section.s (1890 of 1895) PASS: lldb-unit :: Utility/./UtilityTests/VMRange.Ordering (1891 of 1895) PASS: lldb-api :: lang/cpp/type_lookup/TestCppTypeLookup.py (1892 of 1895) PASS: lldb-api :: functionalities/data-formatter/nsdictionarysynth/TestNSDictionarySynthetic.py (1893 of 1895) PASS: lldb-api :: lang/objc/foundation/TestObjectDescriptionAPI.py (1894 of 1895) PASS: lldb-api :: lang/cpp/enum_types/TestCPP11EnumTypes.py (1895 of 1895)

Hide Details

Testing Time: 4271.91s ******************** Failing Tests (11): lldb-api :: functionalities/data-formatter/data-formatter-objc/TestDataFormatterObjNSException.py lldb-api :: functionalities/data-formatter/data-formatter-objc/TestDataFormatterObjCNSData.py lldb-api :: functionalities/data-formatter/data-formatter-objc/TestDataFormatterObjCNSDate.py lldb-api :: functionalities/data-formatter/data-formatter-objc/TestDataFormatterObjCNSBundle.py lldb-api :: functionalities/data-formatter/data-formatter-objc/TestDataFormatterObjCNSError.py lldb-api :: functionalities/data-formatter/data-formatter-objc/TestDataFormatterObjCPlain.py lldb-api :: functionalities/data-formatter/data-formatter-objc/TestDataFormatterObjCCF.py lldb-api :: functionalities/data-formatter/data-formatter-objc/TestDataFormatterObjCKVO.py lldb-api :: functionalities/data-formatter/data-formatter-objc/TestDataFormatterObjCNSContainer.py lldb-api :: functionalities/data-formatter/data-formatter-objc/TestDataFormatterObjCNSURL.py lldb-api :: functionalities/data-formatter/data-formatter-objc/TestDataFormatterObjCExpr.py

Hide Details

Hide Details

Slowest Tests: -------------------------------------------------------------------------- 90.29s: lldb-api :: functionalities/data-formatter/compactvectors/TestCompactVectors.py 93.61s: lldb-api :: lang/objc/conflicting-definition/TestConflictingDefinition.py 98.33s: lldb-api :: types/TestLongTypes.py 104.23s: lldb-api :: python_api/lldbutil/iter/TestLLDBIterator.py 112.54s: lldb-api :: lang/objc/foundation/TestObjCMethodsNSError.py 113.27s: lldb-api :: lang/objc/objc-new-syntax/TestObjCNewSyntaxDictionary.py 113.40s: lldb-api :: lang/objc/objc-new-syntax/TestObjCNewSyntaxArray.py 115.24s: lldb-api :: lang/objc/foundation/TestObjCMethodsString.py 120.01s: lldb-api :: tools/lldb-server/TestGdbRemote_qThreadStopInfo.py 133.05s: lldb-api :: types/TestLongTypesExpr.py 139.56s: lldb-api :: lang/objc/real-definition/TestRealDefinition.py 149.54s: lldb-api :: lang/objc/objc-new-syntax/TestObjCNewSyntaxLiteral.py 162.43s: lldb-api :: lang/cpp/namespace/TestNamespaceLookup.py 185.59s: lldb-api :: lang/objc/exceptions/TestObjCExceptions.py 207.37s: lldb-api :: lang/objc/hidden-ivars/TestHiddenIvars.py 214.31s: lldb-api :: lang/objc/foundation/TestObjCMethods.py 244.13s: lldb-api :: lang/cpp/enum_types/TestCPP11EnumTypes.py 247.31s: lldb-api :: tools/lldb-server/TestGdbRemoteThreadsInStopReply.py 252.55s: lldb-api :: api/multithreaded/TestMultithreaded.py 365.42s: lldb-api :: tools/lldb-server/TestLldbGdbServer.py

Hide Details

Tests Times: -------------------------------------------------------------------------- [ Range ] :: [ Percentage ] :: [ Count ] -------------------------------------------------------------------------- [ 0s, 20s) :: [********************************** ] :: [1647/1895] [ 20s, 40s) :: [** ] :: [ 121/1895] [ 40s, 60s) :: [* ] :: [ 79/1895] [ 60s, 80s) :: [ ] :: [ 24/1895] [ 80s,100s) :: [ ] :: [ 6/1895] [100s,120s) :: [ ] :: [ 6/1895] [120s,140s) :: [ ] :: [ 2/1895] [140s,160s) :: [ ] :: [ 2/1895] [160s,180s) :: [ ] :: [ 1/1895] [180s,200s) :: [ ] :: [ 1/1895] [200s,220s) :: [ ] :: [ 1/1895] [220s,240s) :: [ ] :: [ 1/1895] [240s,260s) :: [ ] :: [ 2/1895] [260s,280s) :: [ ] :: [ 1/1895] [280s,300s) :: [ ] :: [ 0/1895] [300s,320s) :: [ ] :: [ 0/1895] [320s,340s) :: [ ] :: [ 0/1895] [340s,360s) :: [ ] :: [ 0/1895] [360s,380s) :: [ ] :: [ 1/1895] Expected Passes : 1716 Expected Failures : 6 Unsupported Tests : 162 Unexpected Failures: 11 FAILED: tools/lldb/test/CMakeFiles/check-lldb-lit cd /Users/buildslave/jenkins/workspace/lldb-cmake-sanitized/lldb-build/tools/lldb/test && /usr/local/bin/python /Users/buildslave/jenkins/workspace/lldb-cmake-sanitized/lldb-build/./bin/llvm-lit -v --time-tests --shuffle --xunit-xml-output=/Users/buildslave/jenkins/workspace/lldb-cmake-sanitized/test/results.xml -v -j 4 --timeout 1200 /Users/buildslave/jenkins/workspace/lldb-cmake-sanitized/lldb-build/tools/lldb/test ninja: build stopped: subcommand failed. Command failed: Command '['/usr/bin/env', 'TERM=vt100', '/usr/local/bin/ninja', '-v', 'check-lldb']' returned non-zero exit status 1. Command: ['/usr/bin/env', 'TERM=vt100', '/usr/local/bin/ninja', '-v', 'check-lldb'] [Pipeline] } [Pipeline] // timeout [Pipeline] } [Pipeline] // stage [Pipeline] stage [Pipeline] { (Declarative: Post Actions) [Pipeline] scanForIssues No credentials specified [Clang (LLVM based)] Sleeping for 5 seconds due to JENKINS-32191... [Clang (LLVM based)] Parsing console log (workspace: '/Users/buildslave/jenkins/workspace/lldb-cmake-sanitized') [Pipeline] junit Recording test results [Pipeline] } [Pipeline] // stage [Pipeline] } [Pipeline] // withEnv [Pipeline] } [Pipeline] // node [Pipeline] End of Pipeline ERROR: script returned exit code 1 Finished: FAILURE