Failed

lldb-api.functionalities/data-formatter/data-formatter-objc.TestDataFormatterObjCNSContainer.py (from lldb-api)

Failing for the past 10 builds (Since Failed#741 )
Took 40 sec.

Stacktrace

lldb version 11.0.99 (http://labmaster3.local/git/llvm-project.git revision c1b13a1b17719aebace1b3be7a6ac7f90b1901a6)
  clang revision 7ce2de2ce4e7d4dd8e1e5a7a5b35c0f98e46681d
  llvm revision 7ce2de2ce4e7d4dd8e1e5a7a5b35c0f98e46681d
LLDB library dir: /Users/buildslave/jenkins/workspace/lldb-cmake-sanitized/lldb-build/bin
LLDB import library dir: /Users/buildslave/jenkins/workspace/lldb-cmake-sanitized/lldb-build/bin
libstdcxx tests will not be run because: Don't know how to build with libstdcxx on macosx
Skipping following debug info categories: ['dwo']
setting set target.prefer-dynamic-value no-dynamic-values
AddressSanitizer report breakpoint hit. Use 'thread info -s' to get extended information about the report.
AddressSanitizer report breakpoint hit. Use 'thread info -s' to get extended information about the report.
AddressSanitizer report breakpoint hit. Use 'thread info -s' to get extended information about the report.

Session logs for test failures/errors/unexpected successes will go into directory '/Users/buildslave/jenkins/workspace/lldb-cmake-sanitized/test/logs'
Command invoked: /Users/buildslave/jenkins/workspace/lldb-cmake-sanitized/llvm-project/lldb/test/API/dotest.py --arch x86_64 -s /Users/buildslave/jenkins/workspace/lldb-cmake-sanitized/lldb-build/lldb-test-traces -S nm -u CXXFLAGS -u CFLAGS --codesign-identity lldb_codesign --server /Users/buildslave/jenkins/workspace/lldb-cmake-sanitized/lldb-build/./bin/debugserver --arch x86_64 --build-dir /Users/buildslave/jenkins/workspace/lldb-cmake-sanitized/lldb-build/lldb-test-build.noindex -s=/Users/buildslave/jenkins/workspace/lldb-cmake-sanitized/test/logs -t --env TERM=vt100 --env LLVM_LIBS_DIR=/Users/buildslave/jenkins/workspace/lldb-cmake-sanitized/lldb-build/./lib --inferior-env ASAN_OPTIONS=detect_stack_use_after_return=1 --inferior-env DYLD_INSERT_LIBRARIES=/Users/buildslave/jenkins/workspace/lldb-cmake-sanitized/host-compiler/lib/clang/11.0.0/lib/darwin/libclang_rt.asan_osx_dynamic.dylib --build-dir /Users/buildslave/jenkins/workspace/lldb-cmake-sanitized/lldb-build/lldb-test-build.noindex --lldb-module-cache-dir /Users/buildslave/jenkins/workspace/lldb-cmake-sanitized/lldb-build/lldb-test-build.noindex/module-cache-lldb/lldb-api --clang-module-cache-dir /Users/buildslave/jenkins/workspace/lldb-cmake-sanitized/lldb-build/lldb-test-build.noindex/module-cache-clang/lldb-api --executable /Users/buildslave/jenkins/workspace/lldb-cmake-sanitized/lldb-build/./bin/lldb --compiler /Users/buildslave/jenkins/workspace/lldb-cmake-sanitized/lldb-build/./bin/clang --dsymutil /Users/buildslave/jenkins/workspace/lldb-cmake-sanitized/lldb-build/./bin/dsymutil --filecheck /Users/buildslave/jenkins/workspace/lldb-cmake-sanitized/lldb-build/./bin/FileCheck /Users/buildslave/jenkins/workspace/lldb-cmake-sanitized/llvm-project/lldb/packages/Python/lldbsuite/test/functionalities/data-formatter/data-formatter-objc -p TestDataFormatterObjCNSContainer.py
Change dir to: /Users/buildslave/jenkins/workspace/lldb-cmake-sanitized/llvm-project/lldb/packages/Python/lldbsuite/test/functionalities/data-formatter/data-formatter-objc
runCmd: settings set symbols.enable-external-lookup false
output: 

runCmd: settings set plugin.process.gdb-remote.packet-timeout 60
output: 

runCmd: settings set symbols.clang-modules-cache-path "/Users/buildslave/jenkins/workspace/lldb-cmake-sanitized/lldb-build/lldb-test-build.noindex/module-cache-lldb/lldb-api"
output: 

runCmd: settings set use-color false
output: 

runCmd: settings set target.env-vars ASAN_OPTIONS=detect_stack_use_after_return=1 DYLD_INSERT_LIBRARIES=/Users/buildslave/jenkins/workspace/lldb-cmake-sanitized/host-compiler/lib/clang/11.0.0/lib/darwin/libclang_rt.asan_osx_dynamic.dylib
output: 

runCmd: settings set target.env-vars ASAN_OPTIONS=detect_stack_use_after_return=1 DYLD_INSERT_LIBRARIES=/Users/buildslave/jenkins/workspace/lldb-cmake-sanitized/host-compiler/lib/clang/11.0.0/lib/darwin/libclang_rt.asan_osx_dynamic.dylib
output: 

FAIL: LLDB (/Users/buildslave/jenkins/workspace/lldb-cmake-sanitized/lldb-build/bin/clang-10-x86_64) :: test_nscontainers_with_run_command_dsym (TestDataFormatterObjCNSContainer.ObjCDataFormatterNSContainer)
<bound method SBProcess.Kill of <lldb.SBProcess; proxy of <Swig Object of type 'lldb::SBProcess *' at 0x127e33210> >>: success

runCmd: settings set symbols.enable-external-lookup false
output: 

runCmd: settings set plugin.process.gdb-remote.packet-timeout 60
output: 

runCmd: settings set symbols.clang-modules-cache-path "/Users/buildslave/jenkins/workspace/lldb-cmake-sanitized/lldb-build/lldb-test-build.noindex/module-cache-lldb/lldb-api"
output: 

runCmd: settings set use-color false
output: 

runCmd: settings set target.env-vars ASAN_OPTIONS=detect_stack_use_after_return=1 DYLD_INSERT_LIBRARIES=/Users/buildslave/jenkins/workspace/lldb-cmake-sanitized/host-compiler/lib/clang/11.0.0/lib/darwin/libclang_rt.asan_osx_dynamic.dylib
output: 

runCmd: settings set target.env-vars ASAN_OPTIONS=detect_stack_use_after_return=1 DYLD_INSERT_LIBRARIES=/Users/buildslave/jenkins/workspace/lldb-cmake-sanitized/host-compiler/lib/clang/11.0.0/lib/darwin/libclang_rt.asan_osx_dynamic.dylib
output: 

FAIL: LLDB (/Users/buildslave/jenkins/workspace/lldb-cmake-sanitized/lldb-build/bin/clang-10-x86_64) :: test_nscontainers_with_run_command_dwarf (TestDataFormatterObjCNSContainer.ObjCDataFormatterNSContainer)
<bound method SBProcess.Kill of <lldb.SBProcess; proxy of <Swig Object of type 'lldb::SBProcess *' at 0x10f71c630> >>: success

UNSUPPORTED: LLDB (/Users/buildslave/jenkins/workspace/lldb-cmake-sanitized/lldb-build/bin/clang-10-x86_64) :: test_nscontainers_with_run_command_dwo (TestDataFormatterObjCNSContainer.ObjCDataFormatterNSContainer) (test case does not fall in any category of interest for this run) 
runCmd: settings set symbols.enable-external-lookup false
output: 

runCmd: settings set plugin.process.gdb-remote.packet-timeout 60
output: 

runCmd: settings set symbols.clang-modules-cache-path "/Users/buildslave/jenkins/workspace/lldb-cmake-sanitized/lldb-build/lldb-test-build.noindex/module-cache-lldb/lldb-api"
output: 

runCmd: settings set use-color false
output: 

runCmd: settings set target.env-vars ASAN_OPTIONS=detect_stack_use_after_return=1 DYLD_INSERT_LIBRARIES=/Users/buildslave/jenkins/workspace/lldb-cmake-sanitized/host-compiler/lib/clang/11.0.0/lib/darwin/libclang_rt.asan_osx_dynamic.dylib
output: 

runCmd: settings set target.env-vars ASAN_OPTIONS=detect_stack_use_after_return=1 DYLD_INSERT_LIBRARIES=/Users/buildslave/jenkins/workspace/lldb-cmake-sanitized/host-compiler/lib/clang/11.0.0/lib/darwin/libclang_rt.asan_osx_dynamic.dylib
output: 

FAIL: LLDB (/Users/buildslave/jenkins/workspace/lldb-cmake-sanitized/lldb-build/bin/clang-10-x86_64) :: test_nscontainers_with_run_command_gmodules (TestDataFormatterObjCNSContainer.ObjCDataFormatterNSContainer)
<bound method SBProcess.Kill of <lldb.SBProcess; proxy of <Swig Object of type 'lldb::SBProcess *' at 0x127e33540> >>: success

Restore dir to: /Users/buildslave/jenkins/workspace/lldb-cmake-sanitized/lldb-build/tools/lldb/test
======================================================================
FAIL: test_nscontainers_with_run_command_dsym (TestDataFormatterObjCNSContainer.ObjCDataFormatterNSContainer)
   Test formatters for  NS container classes.
----------------------------------------------------------------------
Traceback (most recent call last):
  File "/Users/buildslave/jenkins/workspace/lldb-cmake-sanitized/llvm-project/lldb/packages/Python/lldbsuite/test/lldbtest.py", line 1732, in test_method
    return attrvalue(self)
  File "/Users/buildslave/jenkins/workspace/lldb-cmake-sanitized/llvm-project/lldb/packages/Python/lldbsuite/test/functionalities/data-formatter/data-formatter-objc/TestDataFormatterObjCNSContainer.py", line 20, in test_nscontainers_with_run_command
    self.appkit_tester_impl(self.nscontainers_data_formatter_commands)
  File "/Users/buildslave/jenkins/workspace/lldb-cmake-sanitized/llvm-project/lldb/packages/Python/lldbsuite/test/functionalities/data-formatter/data-formatter-objc/ObjCDataFormatterTestCase.py", line 19, in appkit_tester_impl
    self.appkit_common_data_formatters_command()
  File "/Users/buildslave/jenkins/workspace/lldb-cmake-sanitized/llvm-project/lldb/packages/Python/lldbsuite/test/functionalities/data-formatter/data-formatter-objc/ObjCDataFormatterTestCase.py", line 26, in appkit_common_data_formatters_command
    lldb.SBFileSpec('main.m', False))
  File "/Users/buildslave/jenkins/workspace/lldb-cmake-sanitized/llvm-project/lldb/packages/Python/lldbsuite/test/lldbutil.py", line 868, in run_to_source_breakpoint
    only_one_thread, extra_images)
  File "/Users/buildslave/jenkins/workspace/lldb-cmake-sanitized/llvm-project/lldb/packages/Python/lldbsuite/test/lldbutil.py", line 797, in run_to_breakpoint_do_run
    test.assertEqual(num_threads, 1, "Expected 1 thread to stop at breakpoint, %d did."%(num_threads))
AssertionError: 0 != 1 : Expected 1 thread to stop at breakpoint, 0 did.
Config=x86_64-/Users/buildslave/jenkins/workspace/lldb-cmake-sanitized/lldb-build/bin/clang-10
======================================================================
FAIL: test_nscontainers_with_run_command_dwarf (TestDataFormatterObjCNSContainer.ObjCDataFormatterNSContainer)
   Test formatters for  NS container classes.
----------------------------------------------------------------------
Traceback (most recent call last):
  File "/Users/buildslave/jenkins/workspace/lldb-cmake-sanitized/llvm-project/lldb/packages/Python/lldbsuite/test/lldbtest.py", line 1732, in test_method
    return attrvalue(self)
  File "/Users/buildslave/jenkins/workspace/lldb-cmake-sanitized/llvm-project/lldb/packages/Python/lldbsuite/test/functionalities/data-formatter/data-formatter-objc/TestDataFormatterObjCNSContainer.py", line 20, in test_nscontainers_with_run_command
    self.appkit_tester_impl(self.nscontainers_data_formatter_commands)
  File "/Users/buildslave/jenkins/workspace/lldb-cmake-sanitized/llvm-project/lldb/packages/Python/lldbsuite/test/functionalities/data-formatter/data-formatter-objc/ObjCDataFormatterTestCase.py", line 19, in appkit_tester_impl
    self.appkit_common_data_formatters_command()
  File "/Users/buildslave/jenkins/workspace/lldb-cmake-sanitized/llvm-project/lldb/packages/Python/lldbsuite/test/functionalities/data-formatter/data-formatter-objc/ObjCDataFormatterTestCase.py", line 26, in appkit_common_data_formatters_command
    lldb.SBFileSpec('main.m', False))
  File "/Users/buildslave/jenkins/workspace/lldb-cmake-sanitized/llvm-project/lldb/packages/Python/lldbsuite/test/lldbutil.py", line 868, in run_to_source_breakpoint
    only_one_thread, extra_images)
  File "/Users/buildslave/jenkins/workspace/lldb-cmake-sanitized/llvm-project/lldb/packages/Python/lldbsuite/test/lldbutil.py", line 797, in run_to_breakpoint_do_run
    test.assertEqual(num_threads, 1, "Expected 1 thread to stop at breakpoint, %d did."%(num_threads))
AssertionError: 0 != 1 : Expected 1 thread to stop at breakpoint, 0 did.
Config=x86_64-/Users/buildslave/jenkins/workspace/lldb-cmake-sanitized/lldb-build/bin/clang-10
======================================================================
FAIL: test_nscontainers_with_run_command_gmodules (TestDataFormatterObjCNSContainer.ObjCDataFormatterNSContainer)
   Test formatters for  NS container classes.
----------------------------------------------------------------------
Traceback (most recent call last):
  File "/Users/buildslave/jenkins/workspace/lldb-cmake-sanitized/llvm-project/lldb/packages/Python/lldbsuite/test/lldbtest.py", line 1732, in test_method
    return attrvalue(self)
  File "/Users/buildslave/jenkins/workspace/lldb-cmake-sanitized/llvm-project/lldb/packages/Python/lldbsuite/test/functionalities/data-formatter/data-formatter-objc/TestDataFormatterObjCNSContainer.py", line 20, in test_nscontainers_with_run_command
    self.appkit_tester_impl(self.nscontainers_data_formatter_commands)
  File "/Users/buildslave/jenkins/workspace/lldb-cmake-sanitized/llvm-project/lldb/packages/Python/lldbsuite/test/functionalities/data-formatter/data-formatter-objc/ObjCDataFormatterTestCase.py", line 19, in appkit_tester_impl
    self.appkit_common_data_formatters_command()
  File "/Users/buildslave/jenkins/workspace/lldb-cmake-sanitized/llvm-project/lldb/packages/Python/lldbsuite/test/functionalities/data-formatter/data-formatter-objc/ObjCDataFormatterTestCase.py", line 26, in appkit_common_data_formatters_command
    lldb.SBFileSpec('main.m', False))
  File "/Users/buildslave/jenkins/workspace/lldb-cmake-sanitized/llvm-project/lldb/packages/Python/lldbsuite/test/lldbutil.py", line 868, in run_to_source_breakpoint
    only_one_thread, extra_images)
  File "/Users/buildslave/jenkins/workspace/lldb-cmake-sanitized/llvm-project/lldb/packages/Python/lldbsuite/test/lldbutil.py", line 797, in run_to_breakpoint_do_run
    test.assertEqual(num_threads, 1, "Expected 1 thread to stop at breakpoint, %d did."%(num_threads))
AssertionError: 0 != 1 : Expected 1 thread to stop at breakpoint, 0 did.
Config=x86_64-/Users/buildslave/jenkins/workspace/lldb-cmake-sanitized/lldb-build/bin/clang-10
----------------------------------------------------------------------
Ran 4 tests in 38.721s

RESULT: FAILED (0 passes, 3 failures, 0 errors, 1 skipped, 0 expected failures, 0 unexpected successes)