FailedConsole Output

Skipping 15,107 KB.. Full Log
ase/InterpreterTests/CompletionTest.DirCompletionAbsolute (1341 of 2141)
PASS: lldb-unit :: Interpreter/Release/InterpreterTests/OptionArgParserTest.toBoolean (1342 of 2141)
PASS: lldb-unit :: Interpreter/Release/InterpreterTests/OptionArgParserTest.toChar (1343 of 2141)
PASS: lldb-unit :: Interpreter/Release/InterpreterTests/CompletionTest.FileCompletionAbsolute (1344 of 2141)
PASS: lldb-unit :: Interpreter/Release/InterpreterTests/OptionArgParserTest.toScriptLanguage (1345 of 2141)
PASS: lldb-unit :: Interpreter/Release/InterpreterTests/OptionValueFileColonLine.setFromString (1346 of 2141)
PASS: lldb-unit :: Language/CPlusPlus/Release/LanguageCPlusPlusTests/CPlusPlusLanguage.CPlusPlusNameParser (1347 of 2141)
PASS: lldb-unit :: Language/CLanguages/Release/LanguageCLanguagesTests/CLanguages.LookupCLanguagesByLanguageType (1348 of 2141)
PASS: lldb-unit :: Language/CPlusPlus/Release/LanguageCPlusPlusTests/CPlusPlusLanguage.ExtractContextAndIdentifier (1349 of 2141)
PASS: lldb-unit :: Language/CPlusPlus/Release/LanguageCPlusPlusTests/CPlusPlusLanguage.FindAlternateFunctionManglings (1350 of 2141)
PASS: lldb-unit :: Language/CPlusPlus/Release/LanguageCPlusPlusTests/CPlusPlusLanguage.MethodNameParsing (1351 of 2141)
PASS: lldb-unit :: Language/Highlighting/Release/HighlighterTests/HighlighterTest.ClangCommas (1352 of 2141)
PASS: lldb-unit :: Language/Highlighting/Release/HighlighterTests/HighlighterTest.ClangBraces (1353 of 2141)
PASS: lldb-unit :: Language/Highlighting/Release/HighlighterTests/HighlighterTest.ClangComments (1354 of 2141)
PASS: lldb-unit :: Language/Highlighting/Release/HighlighterTests/HighlighterTest.ClangCursorOutOfBounds (1355 of 2141)
PASS: lldb-unit :: Language/Highlighting/Release/HighlighterTests/HighlighterTest.ClangCursorPos (1356 of 2141)
PASS: lldb-unit :: Language/Highlighting/Release/HighlighterTests/HighlighterTest.ClangCursorPosAfterOtherToken (1357 of 2141)
PASS: lldb-unit :: Language/Highlighting/Release/HighlighterTests/HighlighterTest.ClangCursorPosBeforeOtherToken (1358 of 2141)
PASS: lldb-unit :: Language/Highlighting/Release/HighlighterTests/HighlighterTest.ClangCursorPosEndOfLine (1359 of 2141)
PASS: lldb-unit :: Language/Highlighting/Release/HighlighterTests/HighlighterTest.ClangCursorPosInOtherToken (1360 of 2141)
PASS: lldb-unit :: Language/Highlighting/Release/HighlighterTests/HighlighterTest.ClangEmptyInput (1361 of 2141)
PASS: lldb-unit :: Language/Highlighting/Release/HighlighterTests/HighlighterTest.ClangOperators (1362 of 2141)
PASS: lldb-unit :: Language/Highlighting/Release/HighlighterTests/HighlighterTest.ClangPPDirectives (1363 of 2141)
PASS: lldb-unit :: Language/Highlighting/Release/HighlighterTests/HighlighterTest.ClangIdentifiers (1364 of 2141)
PASS: lldb-unit :: Language/Highlighting/Release/HighlighterTests/HighlighterTest.ClangPreserveNewLine (1365 of 2141)
PASS: lldb-unit :: Language/Highlighting/Release/HighlighterTests/HighlighterTest.ClangScalarLiterals (1366 of 2141)
PASS: lldb-unit :: Language/Highlighting/Release/HighlighterTests/HighlighterTest.ClangTrailingBackslashBeforeNewline (1367 of 2141)
PASS: lldb-unit :: Language/Highlighting/Release/HighlighterTests/HighlighterTest.ClangStringLiterals (1368 of 2141)
PASS: lldb-unit :: Language/Highlighting/Release/HighlighterTests/HighlighterTest.ClangSquareBrackets (1369 of 2141)
PASS: lldb-unit :: Language/Highlighting/Release/HighlighterTests/HighlighterTest.ClangTrailingBackslashMissingNewLine (1370 of 2141)
PASS: lldb-unit :: Language/Highlighting/Release/HighlighterTests/HighlighterTest.ClangTrailingBackslashWithWhitespace (1371 of 2141)
PASS: lldb-unit :: Language/Highlighting/Release/HighlighterTests/HighlighterTest.ClangUnterminatedString (1372 of 2141)
PASS: lldb-unit :: Language/Highlighting/Release/HighlighterTests/HighlighterTest.DefaultHighlighter (1373 of 2141)
PASS: lldb-unit :: Language/Highlighting/Release/HighlighterTests/HighlighterTest.Colons (1374 of 2141)
PASS: lldb-unit :: Language/Highlighting/Release/HighlighterTests/HighlighterTest.DefaultHighlighterWithCursor (1375 of 2141)
PASS: lldb-unit :: Language/Highlighting/Release/HighlighterTests/HighlighterTest.DefaultHighlighterWithCursorOutOfBounds (1376 of 2141)
PASS: lldb-unit :: Language/Highlighting/Release/HighlighterTests/HighlighterTest.HighlighterSelectionType (1377 of 2141)
PASS: lldb-unit :: Language/Highlighting/Release/HighlighterTests/HighlighterTest.FallbackHighlighter (1378 of 2141)
PASS: lldb-unit :: Language/Highlighting/Release/HighlighterTests/HighlighterTest.HighlighterSelectionPath (1379 of 2141)
PASS: lldb-unit :: Language/Highlighting/Release/HighlighterTests/HighlighterTest.Keywords (1380 of 2141)
PASS: lldb-unit :: ObjectFile/Breakpad/Release/ObjectFileBreakpadTests/FileRecord.parse (1381 of 2141)
PASS: lldb-unit :: ObjectFile/Breakpad/Release/ObjectFileBreakpadTests/LineRecord.parse (1382 of 2141)
PASS: lldb-unit :: ObjectFile/Breakpad/Release/ObjectFileBreakpadTests/InfoRecord.parse (1383 of 2141)
PASS: lldb-unit :: ObjectFile/Breakpad/Release/ObjectFileBreakpadTests/FuncRecord.parse (1384 of 2141)
PASS: lldb-unit :: ObjectFile/Breakpad/Release/ObjectFileBreakpadTests/ModuleRecord.parse (1385 of 2141)
PASS: lldb-unit :: ObjectFile/Breakpad/Release/ObjectFileBreakpadTests/PublicRecord.parse (1386 of 2141)
PASS: lldb-unit :: ObjectFile/Breakpad/Release/ObjectFileBreakpadTests/Record.classify (1387 of 2141)
PASS: lldb-unit :: ObjectFile/Breakpad/Release/ObjectFileBreakpadTests/StackCFIRecord.parse (1388 of 2141)
PASS: lldb-unit :: ObjectFile/Breakpad/Release/ObjectFileBreakpadTests/StackWinRecord.parse (1389 of 2141)
PASS: lldb-unit :: ObjectFile/ELF/Release/ObjectFileELFTests/ObjectFileELFTest.GetModuleSpecifications_EarlySectionHeaders (1390 of 2141)
PASS: lldb-unit :: ObjectFile/ELF/Release/ObjectFileELFTests/ObjectFileELFTest.GetSymtab_NoSymEntryPointArmAddressClass (1391 of 2141)
PASS: lldb-unit :: ObjectFile/ELF/Release/ObjectFileELFTests/ObjectFileELFTest.SectionsResolveConsistently (1392 of 2141)
PASS: lldb-unit :: ObjectFile/ELF/Release/ObjectFileELFTests/ObjectFileELFTest.GetSymtab_NoSymEntryPointArmThumbAddressClass (1393 of 2141)
PASS: lldb-unit :: ObjectFile/PECOFF/Release/ObjectFilePECOFFTests/PECallFrameInfoTest.Basic_eh (1394 of 2141)
PASS: lldb-unit :: ObjectFile/MachO/Release/ObjectFileMachOTests/ObjectFileMachOTest.ModuleFromSharedCacheInfo (1395 of 2141)
PASS: lldb-unit :: ObjectFile/PECOFF/Release/ObjectFilePECOFFTests/PECallFrameInfoTest.Chained_eh (1396 of 2141)
PASS: lldb-unit :: Platform/Android/Release/AdbClientTests/AdbClientTest.CreateByDeviceId (1397 of 2141)
PASS: lldb-unit :: ObjectFile/PECOFF/Release/ObjectFilePECOFFTests/PECallFrameInfoTest.Frame_reg_eh (1398 of 2141)
PASS: lldb-unit :: Platform/Android/Release/AdbClientTests/AdbClientTest.CreateByDeviceId_ByEnvVar (1399 of 2141)
PASS: lldb-unit :: Platform/Release/LLDBPlatformTests/PlatformDarwinTest.FindComponentInPath (1400 of 2141)
PASS: lldb-unit :: Platform/Release/LLDBPlatformTests/PlatformDarwinTest.TestParseVersionBuildDir (1401 of 2141)
PASS: lldb-unit :: Process/Release/ProcessEventDataTests/ProcessEventDataTest.DoOnRemoval (1402 of 2141)
PASS: lldb-unit :: Process/Release/ProcessEventDataTests/ProcessEventDataTest.ShouldStop (1403 of 2141)
PASS: lldb-unit :: Process/gdb-remote/Release/ProcessGdbRemoteTests/GDBRemoteClientBaseTest.SendContinueAndAsyncSignal (1404 of 2141)
PASS: lldb-unit :: Process/gdb-remote/Release/ProcessGdbRemoteTests/GDBRemoteClientBaseTest.SendContinueAndAsyncPacket (1405 of 2141)
PASS: lldb-unit :: Process/gdb-remote/Release/ProcessGdbRemoteTests/GDBRemoteClientBaseTest.SendContinueAndInterrupt2PacketBug (1406 of 2141)
PASS: lldb-shell :: Watchpoint/SetErrorCases.test (1407 of 2141)
PASS: lldb-unit :: Process/gdb-remote/Release/ProcessGdbRemoteTests/GDBRemoteClientBaseTest.SendContinueAndInterrupt (1408 of 2141)
PASS: lldb-unit :: Process/gdb-remote/Release/ProcessGdbRemoteTests/GDBRemoteClientBaseTest.SendContinueAndWait (1409 of 2141)
PASS: lldb-unit :: Process/gdb-remote/Release/ProcessGdbRemoteTests/GDBRemoteClientBaseTest.SendContinueAndLateInterrupt (1410 of 2141)
PASS: lldb-unit :: Process/gdb-remote/Release/ProcessGdbRemoteTests/GDBRemoteClientBaseTest.SendContinueDelegateInterface (1411 of 2141)
PASS: lldb-unit :: Process/gdb-remote/Release/ProcessGdbRemoteTests/GDBRemoteClientBaseTest.SendContinueDelegateStructuredDataReceipt (1412 of 2141)
PASS: lldb-unit :: Process/gdb-remote/Release/ProcessGdbRemoteTests/GDBRemoteClientBaseTest.SendPacketAndReceiveResponseWithOutputSupport (1413 of 2141)
PASS: lldb-unit :: Process/gdb-remote/Release/ProcessGdbRemoteTests/GDBRemoteCommunicationClientTest.GetMemoryRegionInfo (1414 of 2141)
PASS: lldb-unit :: Process/gdb-remote/Release/ProcessGdbRemoteTests/GDBRemoteCommunicationClientTest.GetMemoryRegionInfoInvalidResponse (1415 of 2141)
PASS: lldb-unit :: Process/gdb-remote/Release/ProcessGdbRemoteTests/GDBRemoteCommunicationClientTest.GetModulesInfo (1416 of 2141)
PASS: lldb-unit :: Process/gdb-remote/Release/ProcessGdbRemoteTests/GDBRemoteCommunicationClientTest.GetModulesInfoInvalidResponse (1417 of 2141)
PASS: lldb-unit :: Process/gdb-remote/Release/ProcessGdbRemoteTests/GDBRemoteCommunicationClientTest.GetModulesInfo_UUID20 (1418 of 2141)
PASS: lldb-unit :: Process/gdb-remote/Release/ProcessGdbRemoteTests/GDBRemoteCommunicationClientTest.GetQOffsets (1419 of 2141)
PASS: lldb-unit :: Process/gdb-remote/Release/ProcessGdbRemoteTests/GDBRemoteCommunicationClientTest.ReadRegister (1420 of 2141)
PASS: lldb-unit :: Process/gdb-remote/Release/ProcessGdbRemoteTests/GDBRemoteCommunicationClientTest.SaveRestoreRegistersNoSuffix (1421 of 2141)
PASS: lldb-unit :: Process/gdb-remote/Release/ProcessGdbRemoteTests/GDBRemoteCommunicationClientTest.SendGetDataPacket (1422 of 2141)
PASS: lldb-unit :: Process/gdb-remote/Release/ProcessGdbRemoteTests/GDBRemoteCommunicationClientTest.SendGetMetaDataPacket (1423 of 2141)
PASS: lldb-unit :: Process/gdb-remote/Release/ProcessGdbRemoteTests/GDBRemoteCommunicationClientTest.SendGetTraceConfigPacket (1424 of 2141)
PASS: lldb-unit :: Process/gdb-remote/Release/ProcessGdbRemoteTests/GDBRemoteCommunicationClientTest.SendSignalsToIgnore (1425 of 2141)
PASS: lldb-unit :: Process/gdb-remote/Release/ProcessGdbRemoteTests/GDBRemoteCommunicationClientTest.SendStartTracePacket (1426 of 2141)
PASS: lldb-unit :: Process/gdb-remote/Release/ProcessGdbRemoteTests/GDBRemoteCommunicationClientTest.SendStopTracePacket (1427 of 2141)
PASS: lldb-unit :: Process/gdb-remote/Release/ProcessGdbRemoteTests/GDBRemoteCommunicationClientTest.SyncThreadState (1428 of 2141)
PASS: lldb-unit :: Process/gdb-remote/Release/ProcessGdbRemoteTests/GDBRemoteCommunicationClientTest.WriteRegister (1429 of 2141)
PASS: lldb-unit :: Process/gdb-remote/Release/ProcessGdbRemoteTests/GDBRemoteCommunicationClientTest.WriteRegisterNoSuffix (1430 of 2141)
PASS: lldb-unit :: Process/gdb-remote/Release/ProcessGdbRemoteTests/GDBRemoteCommunicationServerTest.SendErrorResponse_ErrorList (1431 of 2141)
PASS: lldb-unit :: Process/gdb-remote/Release/ProcessGdbRemoteTests/GDBRemoteCommunicationServerTest.SendErrorResponse_Status (1432 of 2141)
PASS: lldb-unit :: Process/gdb-remote/Release/ProcessGdbRemoteTests/GDBRemoteCommunicationServerTest.SendErrorResponse_ErrorNumber (1433 of 2141)
PASS: lldb-unit :: Process/gdb-remote/Release/ProcessGdbRemoteTests/GDBRemoteCommunicationClientTest.TestPacketSpeedJSON (1434 of 2141)
PASS: lldb-unit :: Process/gdb-remote/Release/ProcessGdbRemoteTests/GDBRemoteCommunicationServerTest.SendErrorResponse_UnimplementedError (1435 of 2141)
PASS: lldb-unit :: Process/gdb-remote/Release/ProcessGdbRemoteTests/GDBRemoteCommunicationServerTest.SendErrorResponse_StringError (1436 of 2141)
PASS: lldb-unit :: Process/gdb-remote/Release/ProcessGdbRemoteTests/GDBRemoteCommunicationTest.ReadPacket_checksum (1437 of 2141)
PASS: lldb-unit :: Process/minidump/Release/LLDBMinidumpTests/MinidumpParserTest.FindMemoryRange (1438 of 2141)
PASS: lldb-unit :: Process/minidump/Release/LLDBMinidumpTests/MinidumpParserTest.FindMemoryRangeWithFullMemoryMinidump (1439 of 2141)
PASS: lldb-unit :: Process/minidump/Release/LLDBMinidumpTests/MinidumpParserTest.GetArchitecture (1440 of 2141)
PASS: lldb-unit :: Process/minidump/Release/LLDBMinidumpTests/MinidumpParserTest.GetArchitectureWindows (1441 of 2141)
PASS: lldb-unit :: Process/minidump/Release/LLDBMinidumpTests/MinidumpParserTest.GetExceptionStream (1442 of 2141)
PASS: lldb-unit :: Process/minidump/Release/LLDBMinidumpTests/MinidumpParserTest.GetFilteredModuleList (1443 of 2141)
PASS: lldb-unit :: Process/minidump/Release/LLDBMinidumpTests/MinidumpParserTest.GetLinuxProcStatus (1444 of 2141)
PASS: lldb-unit :: Process/minidump/Release/LLDBMinidumpTests/MinidumpParserTest.GetLinuxProcStatus_no_stream (1445 of 2141)
PASS: lldb-unit :: Process/minidump/Release/LLDBMinidumpTests/MinidumpParserTest.GetMemory (1446 of 2141)
PASS: lldb-unit :: Process/minidump/Release/LLDBMinidumpTests/MinidumpParserTest.GetMemoryRegionInfoFromMemory64List (1447 of 2141)
PASS: lldb-unit :: Process/minidump/Release/LLDBMinidumpTests/MinidumpParserTest.GetMemoryRegionInfo (1448 of 2141)
PASS: lldb-unit :: Process/minidump/Release/LLDBMinidumpTests/MinidumpParserTest.GetMemoryRegionInfoLinuxMaps (1449 of 2141)
PASS: lldb-unit :: Process/minidump/Release/LLDBMinidumpTests/MinidumpParserTest.GetMemoryRegionInfoFromMemoryList (1450 of 2141)
PASS: lldb-unit :: Process/minidump/Release/LLDBMinidumpTests/MinidumpParserTest.GetMiscInfoWindows (1451 of 2141)
PASS: lldb-unit :: Process/minidump/Release/LLDBMinidumpTests/MinidumpParserTest.GetMiscInfo_no_stream (1452 of 2141)
PASS: lldb-unit :: Process/minidump/Release/LLDBMinidumpTests/MinidumpParserTest.GetPidWindows (1453 of 2141)
PASS: lldb-unit :: Process/minidump/Release/LLDBMinidumpTests/MinidumpParserTest.GetPid (1454 of 2141)
PASS: lldb-unit :: Process/minidump/Release/LLDBMinidumpTests/MinidumpParserTest.GetThreadContext_x86_32_wow64 (1455 of 2141)
PASS: lldb-unit :: Process/minidump/Release/LLDBMinidumpTests/MinidumpParserTest.GetThreadContext_x86_32 (1456 of 2141)
PASS: lldb-unit :: Process/minidump/Release/LLDBMinidumpTests/MinidumpParserTest.GetPidWow64 (1457 of 2141)
PASS: lldb-unit :: Process/minidump/Release/LLDBMinidumpTests/MinidumpParserTest.GetThreadsAndGetThreadContext (1458 of 2141)
PASS: lldb-unit :: Process/minidump/Release/LLDBMinidumpTests/MinidumpParserTest.InvalidMinidump (1459 of 2141)
PASS: lldb-unit :: Process/minidump/Release/LLDBMinidumpTests/MinidumpParserTest.GetThreadContext_x86_64 (1460 of 2141)
PASS: lldb-unit :: Process/minidump/Release/LLDBMinidumpTests/MinidumpParserTest.MinidumpDuplicateModuleMappedFirst (1461 of 2141)
PASS: lldb-unit :: Process/minidump/Release/LLDBMinidumpTests/MinidumpParserTest.MinidumpDuplicateModuleMappedSecond (1462 of 2141)
PASS: lldb-unit :: Process/minidump/Release/LLDBMinidumpTests/MinidumpParserTest.MinidumpDuplicateModuleMinAddress (1463 of 2141)
PASS: lldb-unit :: Process/minidump/Release/LLDBMinidumpTests/RegisterContextMinidump.CheckRegisterContextMinidump_ARM (1464 of 2141)
PASS: lldb-unit :: Process/minidump/Release/LLDBMinidumpTests/MinidumpParserTest.MinidumpDuplicateModuleSeparateCode (1465 of 2141)
PASS: lldb-unit :: Process/minidump/Release/LLDBMinidumpTests/MinidumpParserTest.MinidumpModuleOrder (1466 of 2141)
PASS: lldb-unit :: Process/minidump/Release/LLDBMinidumpTests/RegisterContextMinidump.ConvertMinidumpContext_x86_64 (1467 of 2141)
PASS: lldb-unit :: Process/minidump/Release/LLDBMinidumpTests/RegisterContextMinidump.ConvertMinidumpContext_x86_32 (1468 of 2141)
PASS: lldb-unit :: ScriptInterpreter/Python/Release/ScriptInterpreterPythonTests/PythonDataObjectsTest.TestBorrowedReferences (1469 of 2141)
PASS: lldb-unit :: ScriptInterpreter/Python/Release/ScriptInterpreterPythonTests/PythonDataObjectsTest.TestDictionaryResolutionWithDot (1470 of 2141)
PASS: lldb-unit :: ScriptInterpreter/Python/Release/ScriptInterpreterPythonTests/PythonDataObjectsTest.TestCallable (1471 of 2141)
PASS: lldb-unit :: ScriptInterpreter/Python/Release/ScriptInterpreterPythonTests/PythonDataObjectsTest.TestExceptions (1472 of 2141)
PASS: lldb-unit :: ScriptInterpreter/Python/Release/ScriptInterpreterPythonTests/PythonDataObjectsTest.TestExtractingUInt64ThroughStructuredData (1473 of 2141)
PASS: lldb-unit :: ScriptInterpreter/Python/Release/ScriptInterpreterPythonTests/PythonDataObjectsTest.TestGlobalNameResolutionNoDot (1474 of 2141)
PASS: lldb-unit :: ScriptInterpreter/Python/Release/ScriptInterpreterPythonTests/PythonDataObjectsTest.TestGlobalNameResolutionWithDot (1475 of 2141)
PASS: lldb-unit :: ScriptInterpreter/Python/Release/ScriptInterpreterPythonTests/PythonDataObjectsTest.TestInstanceNameResolutionNoDot (1476 of 2141)
PASS: lldb-unit :: ScriptInterpreter/Python/Release/ScriptInterpreterPythonTests/PythonDataObjectsTest.TestModuleNameResolutionNoDot (1477 of 2141)
PASS: lldb-unit :: ScriptInterpreter/Python/Release/ScriptInterpreterPythonTests/PythonDataObjectsTest.TestObjectAttributes (1478 of 2141)
PASS: lldb-unit :: ScriptInterpreter/Python/Release/ScriptInterpreterPythonTests/PythonDataObjectsTest.TestOwnedReferences (1479 of 2141)
PASS: lldb-unit :: ScriptInterpreter/Python/Release/ScriptInterpreterPythonTests/PythonDataObjectsTest.TestPythonBoolean (1480 of 2141)
PASS: lldb-unit :: ScriptInterpreter/Python/Release/ScriptInterpreterPythonTests/PythonDataObjectsTest.TestPythonByteArray (1481 of 2141)
PASS: lldb-unit :: ScriptInterpreter/Python/Release/ScriptInterpreterPythonTests/PythonDataObjectsTest.TestPythonBytes (1482 of 2141)
PASS: lldb-unit :: ScriptInterpreter/Python/Release/ScriptInterpreterPythonTests/PythonDataObjectsTest.TestPythonCallableCheck (1483 of 2141)
PASS: lldb-unit :: ScriptInterpreter/Python/Release/ScriptInterpreterPythonTests/PythonDataObjectsTest.TestPythonCallableInvoke (1484 of 2141)
PASS: lldb-unit :: ScriptInterpreter/Python/Release/ScriptInterpreterPythonTests/PythonDataObjectsTest.TestPythonDictionaryManipulation (1485 of 2141)
PASS: lldb-unit :: ScriptInterpreter/Python/Release/ScriptInterpreterPythonTests/PythonDataObjectsTest.TestPythonDictionaryToStructuredDictionary (1486 of 2141)
PASS: lldb-unit :: ScriptInterpreter/Python/Release/ScriptInterpreterPythonTests/PythonDataObjectsTest.TestPythonDictionaryValueEquality (1487 of 2141)
PASS: lldb-unit :: ScriptInterpreter/Python/Release/ScriptInterpreterPythonTests/PythonDataObjectsTest.TestPythonFile (1488 of 2141)
PASS: lldb-unit :: ScriptInterpreter/Python/Release/ScriptInterpreterPythonTests/PythonDataObjectsTest.TestPythonInteger (1489 of 2141)
PASS: lldb-unit :: ScriptInterpreter/Python/Release/ScriptInterpreterPythonTests/PythonDataObjectsTest.TestPythonIntegerToStr (1490 of 2141)
PASS: lldb-unit :: ScriptInterpreter/Python/Release/ScriptInterpreterPythonTests/PythonDataObjectsTest.TestPythonIntegerToStructuredInteger (1491 of 2141)
PASS: lldb-unit :: ScriptInterpreter/Python/Release/ScriptInterpreterPythonTests/PythonDataObjectsTest.TestPythonListManipulation (1492 of 2141)
PASS: lldb-unit :: ScriptInterpreter/Python/Release/ScriptInterpreterPythonTests/PythonDataObjectsTest.TestPythonListToStructuredList (1493 of 2141)
PASS: lldb-unit :: ScriptInterpreter/Python/Release/ScriptInterpreterPythonTests/PythonDataObjectsTest.TestPythonListValueEquality (1494 of 2141)
PASS: lldb-unit :: ScriptInterpreter/Python/Release/ScriptInterpreterPythonTests/PythonDataObjectsTest.TestPythonStringToStr (1495 of 2141)
PASS: lldb-unit :: ScriptInterpreter/Python/Release/ScriptInterpreterPythonTests/PythonDataObjectsTest.TestPythonString (1496 of 2141)
PASS: lldb-unit :: ScriptInterpreter/Python/Release/ScriptInterpreterPythonTests/PythonDataObjectsTest.TestPythonStringToStructuredString (1497 of 2141)
PASS: lldb-unit :: ScriptInterpreter/Python/Release/ScriptInterpreterPythonTests/PythonDataObjectsTest.TestPythonTupleInitializerList (1498 of 2141)
PASS: lldb-unit :: ScriptInterpreter/Python/Release/ScriptInterpreterPythonTests/PythonDataObjectsTest.TestPythonTupleInitializerList2 (1499 of 2141)
PASS: lldb-unit :: ScriptInterpreter/Python/Release/ScriptInterpreterPythonTests/PythonDataObjectsTest.TestPythonTupleSize (1500 of 2141)
PASS: lldb-unit :: ScriptInterpreter/Python/Release/ScriptInterpreterPythonTests/PythonDataObjectsTest.TestPythonTupleToStructuredList (1501 of 2141)
PASS: lldb-unit :: ScriptInterpreter/Python/Release/ScriptInterpreterPythonTests/PythonDataObjectsTest.TestResetting (1502 of 2141)
PASS: lldb-unit :: ScriptInterpreter/Python/Release/ScriptInterpreterPythonTests/PythonDataObjectsTest.TestPythonTupleValues (1503 of 2141)
PASS: lldb-unit :: ScriptInterpreter/Python/Release/ScriptInterpreterPythonTests/PythonDataObjectsTest.TestRun (1504 of 2141)
PASS: lldb-unit :: ScriptInterpreter/Python/Release/ScriptInterpreterPythonTests/PythonDataObjectsTest.TestScript (1505 of 2141)
PASS: lldb-unit :: Signals/Release/SignalsTests/UnixSignalsTest.GetFilteredSignals (1506 of 2141)
PASS: lldb-unit :: ScriptInterpreter/Python/Release/ScriptInterpreterPythonTests/PythonDataObjectsTest.TestTypeNameResolutionNoDot (1507 of 2141)
PASS: lldb-unit :: Signals/Release/SignalsTests/UnixSignalsTest.GetInfo (1508 of 2141)
PASS: lldb-unit :: Signals/Release/SignalsTests/UnixSignalsTest.VersionChange (1509 of 2141)
PASS: lldb-unit :: Signals/Release/SignalsTests/UnixSignalsTest.Iteration (1510 of 2141)
PASS: lldb-unit :: Symbol/Release/SymbolTests/DWARFCallFrameInfoTest.Basic_dwarf3 (1511 of 2141)
PASS: lldb-unit :: Symbol/Release/SymbolTests/DWARFCallFrameInfoTest.Basic_eh (1512 of 2141)
PASS: lldb-unit :: Symbol/Release/SymbolTests/DWARFCallFrameInfoTest.Basic_dwarf4 (1513 of 2141)
PASS: lldb-unit :: Symbol/Release/SymbolTests/LineEntryTest.GetSameLineContiguousAddressRangeNestedInline (1514 of 2141)
PASS: lldb-unit :: Symbol/Release/SymbolTests/LineEntryTest.GetSameLineContiguousAddressRangeNoInlines (1515 of 2141)
PASS: lldb-unit :: Symbol/Release/SymbolTests/LineEntryTest.GetSameLineContiguousAddressRangeOneInline (1516 of 2141)
PASS: lldb-unit :: Symbol/Release/SymbolTests/PostfixExpression.ParseOneExpression (1517 of 2141)
PASS: lldb-unit :: Symbol/Release/SymbolTests/PostfixExpression.ParseFPOProgram (1518 of 2141)
PASS: lldb-unit :: Symbol/Release/SymbolTests/PostfixExpression.ToDWARF (1519 of 2141)
PASS: lldb-unit :: Symbol/Release/SymbolTests/TestClangASTImporter.CanImportInvalidType (1520 of 2141)
PASS: lldb-unit :: Symbol/Release/SymbolTests/SymbolsTest.TerminateLocateExecutableSymbolFileForUnknownExecutableAndUnknownSymbolFile (1521 of 2141)
PASS: lldb-unit :: Symbol/Release/SymbolTests/SymbolsTest.LocateExecutableSymbolFileForUnknownExecutableAndMissingSymbolFile (1522 of 2141)
PASS: lldb-unit :: Symbol/Release/SymbolTests/TestClangASTImporter.CompleteFwdDeclWithOtherOrigin (1523 of 2141)
PASS: lldb-unit :: Symbol/Release/SymbolTests/TestClangASTImporter.CopyTypeTagDecl (1524 of 2141)
PASS: lldb-unit :: Symbol/Release/SymbolTests/TestClangASTImporter.CopyDeclTagDecl (1525 of 2141)
PASS: lldb-unit :: Symbol/Release/SymbolTests/TestClangASTImporter.ImportInvalidType (1526 of 2141)
PASS: lldb-unit :: Symbol/Release/SymbolTests/TestClangASTImporter.DeportTypeTagDecl (1527 of 2141)
PASS: lldb-unit :: Symbol/Release/SymbolTests/TestClangASTImporter.DeportDeclTagDecl (1528 of 2141)
PASS: lldb-unit :: Symbol/Release/SymbolTests/TestClangASTImporter.MetadataPropagation (1529 of 2141)
PASS: lldb-unit :: Symbol/Release/SymbolTests/TestClangASTImporter.MetadataPropagationAfterCopying (1530 of 2141)
PASS: lldb-unit :: Symbol/Release/SymbolTests/TestClangASTImporter.MetadataPropagationIndirectImport (1531 of 2141)
PASS: lldb-unit :: Symbol/Release/SymbolTests/TestTypeSystemClang.AddMethodToObjCObjectType (1532 of 2141)
PASS: lldb-unit :: Symbol/Release/SymbolTests/TestTypeSystemClang.TemplateArguments (1533 of 2141)
PASS: lldb-unit :: Symbol/Release/SymbolTests/TestClangASTImporter.RecordLayout (1534 of 2141)
PASS: lldb-unit :: Symbol/Release/SymbolTests/TestTypeSystemClang.TestBuiltinTypeForEncodingAndBitSize (1535 of 2141)
PASS: lldb-unit :: Symbol/Release/SymbolTests/TestTypeSystemClang.TestConvertAccessTypeToAccessSpecifier (1536 of 2141)
PASS: lldb-unit :: Symbol/Release/SymbolTests/TestTypeSystemClang.TestDeletingImplicitCopyCstrDueToMoveCStr (1537 of 2141)
PASS: lldb-unit :: Symbol/Release/SymbolTests/TestTypeSystemClang.TestDisplayName (1538 of 2141)
PASS: lldb-unit :: Symbol/Release/SymbolTests/TestTypeSystemClang.TestFunctionTemplateConstruction (1539 of 2141)
PASS: lldb-unit :: Symbol/Release/SymbolTests/TestTypeSystemClang.TestDisplayNameEmpty (1540 of 2141)
PASS: lldb-unit :: Symbol/Release/SymbolTests/TestTypeSystemClang.TestGetBasicTypeFromEnum (1541 of 2141)
PASS: lldb-unit :: Symbol/Release/SymbolTests/TestTypeSystemClang.TestGetBasicTypeFromName (1542 of 2141)
PASS: lldb-unit :: Symbol/Release/SymbolTests/TestTypeSystemClang.TestFunctionTemplateInRecordConstruction (1543 of 2141)
PASS: lldb-unit :: Symbol/Release/SymbolTests/TestTypeSystemClang.TestGetEnumIntegerTypeInvalid (1544 of 2141)
PASS: lldb-unit :: Symbol/Release/SymbolTests/TestTypeSystemClang.TestGetEnumIntegerTypeUnexpectedType (1545 of 2141)
PASS: lldb-unit :: Symbol/Release/SymbolTests/TestTypeSystemClang.TestGetEnumIntegerTypeBasicTypes (1546 of 2141)
PASS: lldb-unit :: Symbol/Release/SymbolTests/TestTypeSystemClang.TestGetTypeClassDeclType (1547 of 2141)
PASS: lldb-unit :: Symbol/Release/SymbolTests/TestTypeSystemClang.TestGetTypeClassTypeOf (1548 of 2141)
PASS: lldb-unit :: Symbol/Release/SymbolTests/TestTypeSystemClang.TestGetTypeClassNested (1549 of 2141)
PASS: lldb-unit :: Symbol/Release/SymbolTests/TestTypeSystemClang.TestGetTypeClassTypeOfExpr (1550 of 2141)
PASS: lldb-unit :: Symbol/Release/SymbolTests/TestTypeSystemClang.TestIsClangType (1551 of 2141)
PASS: lldb-unit :: Symbol/Release/SymbolTests/TestTypeSystemClang.TestNotDeletingUserCopyCstrDueToMoveCStr (1552 of 2141)
PASS: lldb-unit :: Symbol/Release/SymbolTests/TestTypeSystemClang.TestOwningModule (1553 of 2141)
PASS: lldb-unit :: Symbol/Release/SymbolTests/TestTypeSystemClang.TestRemoveFastQualifiers (1554 of 2141)
PASS: lldb-unit :: Symbol/Release/SymbolTests/TestTypeSystemClang.TestRecordHasFields (1555 of 2141)
PASS: lldb-unit :: Symbol/Release/SymbolTests/Type.GetTypeScopeAndBasename (1556 of 2141)
PASS: lldb-unit :: Symbol/Release/SymbolTests/Type.CompilerContextPattern (1557 of 2141)
PASS: lldb-unit :: Symbol/Release/SymbolTests/TestTypeSystemClang.TestUnifyAccessSpecifiers (1558 of 2141)
PASS: lldb-unit :: SymbolFile/DWARF/Release/SymbolFileDWARFTests/SymbolFileDWARFTests.ParseArangesNonzeroSegmentSize (1559 of 2141)
PASS: lldb-unit :: SymbolFile/DWARF/Release/SymbolFileDWARFTests/SymbolFileDWARFTests.ParseAranges (1560 of 2141)
PASS: lldb-unit :: SymbolFile/DWARF/Release/SymbolFileDWARFTests/DWARFASTParserClangTests.EnsureAllDIEsInDeclContextHaveBeenParsedParsesOnlyMatchingEntries (1561 of 2141)
PASS: lldb-unit :: SymbolFile/DWARF/Release/SymbolFileDWARFTests/SymbolFileDWARFTests.TestAbbrevInvalidNULLTag (1562 of 2141)
PASS: lldb-unit :: SymbolFile/DWARF/Release/SymbolFileDWARFTests/SymbolFileDWARFTests.TestAbbrevMissingTerminator (1563 of 2141)
PASS: lldb-unit :: SymbolFile/DWARF/Release/SymbolFileDWARFTests/SymbolFileDWARFTests.TestAbbrevNullAttrValidForm (1564 of 2141)
PASS: lldb-unit :: SymbolFile/DWARF/Release/SymbolFileDWARFTests/SymbolFileDWARFTests.TestAbbrevOrder1Start1 (1565 of 2141)
PASS: lldb-unit :: SymbolFile/DWARF/Release/SymbolFileDWARFTests/SymbolFileDWARFTests.TestAbbrevOrder1Start5 (1566 of 2141)
PASS: lldb-unit :: SymbolFile/DWARF/Release/SymbolFileDWARFTests/SymbolFileDWARFTests.TestAbbrevOutOfOrder (1567 of 2141)
PASS: lldb-unit :: SymbolFile/DWARF/Release/SymbolFileDWARFTests/SymbolFileDWARFTests.TestAbbrevValidAttrNullForm (1568 of 2141)
PASS: lldb-unit :: SymbolFile/DWARF/Release/SymbolFileDWARFTests/SymbolFileDWARFTests.TestAbilitiesForDWARF (1569 of 2141)
PASS: lldb-unit :: SymbolFile/NativePDB/Release/SymbolFileNativePDBTests/PDBFPOProgramToDWARFExpressionTests.DependencyChain (1570 of 2141)
PASS: lldb-unit :: SymbolFile/NativePDB/Release/SymbolFileNativePDBTests/PDBFPOProgramToDWARFExpressionTests.InvalidAssignmentMultiple (1571 of 2141)
PASS: lldb-unit :: SymbolFile/NativePDB/Release/SymbolFileNativePDBTests/PDBFPOProgramToDWARFExpressionTests.InvalidAssignmentSingle (1572 of 2141)
PASS: lldb-unit :: SymbolFile/NativePDB/Release/SymbolFileNativePDBTests/PDBFPOProgramToDWARFExpressionTests.InvalidOpBinary (1573 of 2141)
PASS: lldb-unit :: SymbolFile/NativePDB/Release/SymbolFileNativePDBTests/PDBFPOProgramToDWARFExpressionTests.InvalidOpUnary (1574 of 2141)
PASS: lldb-unit :: SymbolFile/NativePDB/Release/SymbolFileNativePDBTests/PDBFPOProgramToDWARFExpressionTests.MissingTargetRegister (1575 of 2141)
PASS: lldb-unit :: SymbolFile/NativePDB/Release/SymbolFileNativePDBTests/PDBFPOProgramToDWARFExpressionTests.MultipleDependentAssignments (1576 of 2141)
PASS: lldb-unit :: SymbolFile/NativePDB/Release/SymbolFileNativePDBTests/PDBFPOProgramToDWARFExpressionTests.MultipleIndependentAssignments (1577 of 2141)
PASS: lldb-unit :: SymbolFile/NativePDB/Release/SymbolFileNativePDBTests/PDBFPOProgramToDWARFExpressionTests.UnknownOp (1578 of 2141)
PASS: lldb-unit :: SymbolFile/NativePDB/Release/SymbolFileNativePDBTests/PDBFPOProgramToDWARFExpressionTests.SingleAssignmentRegisterRef (1579 of 2141)
PASS: lldb-unit :: SymbolFile/NativePDB/Release/SymbolFileNativePDBTests/PDBFPOProgramToDWARFExpressionTests.UnresolvedDependentCyclicRegisterAssignmentReference (1580 of 2141)
PASS: lldb-unit :: SymbolFile/NativePDB/Release/SymbolFileNativePDBTests/PDBFPOProgramToDWARFExpressionTests.UnresolvedCyclicRegisterAssignmentReference (1581 of 2141)
PASS: lldb-unit :: SymbolFile/NativePDB/Release/SymbolFileNativePDBTests/PDBFPOProgramToDWARFExpressionTests.UnresolvedRegisterAssignmentReference (1582 of 2141)
PASS: lldb-unit :: SymbolFile/NativePDB/Release/SymbolFileNativePDBTests/PDBFPOProgramToDWARFExpressionTests.UnresolvedRegisterReference (1583 of 2141)
PASS: lldb-unit :: SymbolFile/NativePDB/Release/SymbolFileNativePDBTests/PDBFPOProgramToDWARFExpressionTests.UnsupportedRASearch (1584 of 2141)
PASS: lldb-unit :: Target/Release/TargetTests/ExecutionContextTest.GetByteOrder (1585 of 2141)
PASS: lldb-unit :: Target/Release/TargetTests/ExecutionContextTest.GetByteOrderProcess (1586 of 2141)
PASS: lldb-unit :: Target/Release/TargetTests/ExecutionContextTest.GetByteOrderTarget (1587 of 2141)
PASS: lldb-unit :: Target/Release/TargetTests/MCBasedABI.MapRegisterName (1588 of 2141)
PASS: lldb-unit :: Target/Release/TargetTests/MemoryRegionInfoTest.Formatv (1589 of 2141)
PASS: lldb-unit :: Target/Release/TargetTests/ModuleCacheTest.GetAndPutStrangeHostname (1590 of 2141)
PASS: lldb-unit :: Target/Release/TargetTests/ModuleCacheTest.GetAndPut (1591 of 2141)
PASS: lldb-unit :: Target/Release/TargetTests/PathMappingListTest.AbsoluteTests (1592 of 2141)
PASS: lldb-unit :: Target/Release/TargetTests/ModuleCacheTest.GetAndPutUuidExists (1593 of 2141)
PASS: lldb-unit :: Target/Release/TargetTests/PathMappingListTest.RelativeTests (1594 of 2141)
PASS: lldb-unit :: Target/Release/TargetTests/PathMappingListTest.RemapRoot (1595 of 2141)
PASS: lldb-unit :: Target/Release/TargetTests/RemoteAwarePlatformTest.TestResolveExecutabelOnClientByPlatform (1596 of 2141)
PASS: lldb-unit :: Target/Release/TargetTests/StackFrameRecognizerTest.NullModuleRegex (1597 of 2141)
PASS: lldb-unit :: Thread/Release/ThreadTests/ThreadTest.GetPrivateStopInfo (1598 of 2141)
PASS: lldb-unit :: Thread/Release/ThreadTests/ThreadTest.SetStopInfo (1599 of 2141)
PASS: lldb-unit :: UnwindAssembly/x86/Release/UnwindAssemblyx86Tests/Testx86AssemblyInspectionEngine.Test32BitOnlyInstruction (1600 of 2141)
PASS: lldb-unit :: UnwindAssembly/x86/Release/UnwindAssemblyx86Tests/Testx86AssemblyInspectionEngine.Test32bitFramelessBigStackFrame (1601 of 2141)
PASS: lldb-unit :: UnwindAssembly/x86/Release/UnwindAssemblyx86Tests/Testx86AssemblyInspectionEngine.Test64bitFramelessBigStackFrame (1602 of 2141)
PASS: lldb-unit :: UnwindAssembly/x86/Release/UnwindAssemblyx86Tests/Testx86AssemblyInspectionEngine.Test32bitFramelessSmallStackFrame (1603 of 2141)
PASS: lldb-unit :: UnwindAssembly/x86/Release/UnwindAssemblyx86Tests/Testx86AssemblyInspectionEngine.Test64bitFramelessSmallStackFrame (1604 of 2141)
PASS: lldb-unit :: UnwindAssembly/x86/Release/UnwindAssemblyx86Tests/Testx86AssemblyInspectionEngine.TestAddESP (1605 of 2141)
PASS: lldb-unit :: UnwindAssembly/x86/Release/UnwindAssemblyx86Tests/Testx86AssemblyInspectionEngine.TestCALLNextInsn (1606 of 2141)
PASS: lldb-unit :: UnwindAssembly/x86/Release/UnwindAssemblyx86Tests/Testx86AssemblyInspectionEngine.TestAddRSP (1607 of 2141)
PASS: lldb-unit :: UnwindAssembly/x86/Release/UnwindAssemblyx86Tests/Testx86AssemblyInspectionEngine.TestDisassemblyMidFunctionEpilogues (1608 of 2141)
PASS: lldb-unit :: UnwindAssembly/x86/Release/UnwindAssemblyx86Tests/Testx86AssemblyInspectionEngine.TestDisassemblyJunkBytes (1609 of 2141)
PASS: lldb-unit :: UnwindAssembly/x86/Release/UnwindAssemblyx86Tests/Testx86AssemblyInspectionEngine.TestMovRSPtoRBP (1610 of 2141)
PASS: lldb-unit :: UnwindAssembly/x86/Release/UnwindAssemblyx86Tests/Testx86AssemblyInspectionEngine.TestLEAVE (1611 of 2141)
PASS: lldb-unit :: UnwindAssembly/x86/Release/UnwindAssemblyx86Tests/Testx86AssemblyInspectionEngine.TestPopEBP (1612 of 2141)
PASS: lldb-unit :: UnwindAssembly/x86/Release/UnwindAssemblyx86Tests/Testx86AssemblyInspectionEngine.TestPopEBX (1613 of 2141)
PASS: lldb-unit :: UnwindAssembly/x86/Release/UnwindAssemblyx86Tests/Testx86AssemblyInspectionEngine.TestPopESI (1614 of 2141)
PASS: lldb-unit :: UnwindAssembly/x86/Release/UnwindAssemblyx86Tests/Testx86AssemblyInspectionEngine.TestPopEDI (1615 of 2141)
PASS: lldb-unit :: UnwindAssembly/x86/Release/UnwindAssemblyx86Tests/Testx86AssemblyInspectionEngine.TestPopR12 (1616 of 2141)
PASS: lldb-unit :: UnwindAssembly/x86/Release/UnwindAssemblyx86Tests/Testx86AssemblyInspectionEngine.TestPopR13 (1617 of 2141)
PASS: lldb-unit :: UnwindAssembly/x86/Release/UnwindAssemblyx86Tests/Testx86AssemblyInspectionEngine.TestPopR14 (1618 of 2141)
PASS: lldb-unit :: UnwindAssembly/x86/Release/UnwindAssemblyx86Tests/Testx86AssemblyInspectionEngine.TestPopR15 (1619 of 2141)
PASS: lldb-unit :: Host/Release/HostTests/MainLoopTest.UnmonitoredSignal (1620 of 2141)
PASS: lldb-unit :: UnwindAssembly/x86/Release/UnwindAssemblyx86Tests/Testx86AssemblyInspectionEngine.TestPopRBPWithREX (1621 of 2141)
PASS: lldb-unit :: UnwindAssembly/x86/Release/UnwindAssemblyx86Tests/Testx86AssemblyInspectionEngine.TestPopRBP (1622 of 2141)
PASS: lldb-unit :: UnwindAssembly/x86/Release/UnwindAssemblyx86Tests/Testx86AssemblyInspectionEngine.TestPopRBX (1623 of 2141)
PASS: lldb-unit :: UnwindAssembly/x86/Release/UnwindAssemblyx86Tests/Testx86AssemblyInspectionEngine.TestPush0 (1624 of 2141)
PASS: lldb-unit :: UnwindAssembly/x86/Release/UnwindAssemblyx86Tests/Testx86AssemblyInspectionEngine.TestPushEAX (1625 of 2141)
PASS: lldb-unit :: UnwindAssembly/x86/Release/UnwindAssemblyx86Tests/Testx86AssemblyInspectionEngine.TestPushEBP (1626 of 2141)
PASS: lldb-shell :: Reproducer/TestWorkingDir.test (1627 of 2141)
PASS: lldb-unit :: UnwindAssembly/x86/Release/UnwindAssemblyx86Tests/Testx86AssemblyInspectionEngine.TestPushECX (1628 of 2141)
PASS: lldb-unit :: UnwindAssembly/x86/Release/UnwindAssemblyx86Tests/Testx86AssemblyInspectionEngine.TestPushEBX (1629 of 2141)
PASS: lldb-unit :: UnwindAssembly/x86/Release/UnwindAssemblyx86Tests/Testx86AssemblyInspectionEngine.TestPushEDI (1630 of 2141)
PASS: lldb-unit :: UnwindAssembly/x86/Release/UnwindAssemblyx86Tests/Testx86AssemblyInspectionEngine.TestPushEDX (1631 of 2141)
PASS: lldb-unit :: UnwindAssembly/x86/Release/UnwindAssemblyx86Tests/Testx86AssemblyInspectionEngine.TestPushExtended (1632 of 2141)
PASS: lldb-unit :: UnwindAssembly/x86/Release/UnwindAssemblyx86Tests/Testx86AssemblyInspectionEngine.TestPushESI (1633 of 2141)
PASS: lldb-unit :: UnwindAssembly/x86/Release/UnwindAssemblyx86Tests/Testx86AssemblyInspectionEngine.TestPushImm (1634 of 2141)
PASS: lldb-unit :: UnwindAssembly/x86/Release/UnwindAssemblyx86Tests/Testx86AssemblyInspectionEngine.TestPushR12 (1635 of 2141)
PASS: lldb-unit :: UnwindAssembly/x86/Release/UnwindAssemblyx86Tests/Testx86AssemblyInspectionEngine.TestPushR13 (1636 of 2141)
PASS: lldb-unit :: UnwindAssembly/x86/Release/UnwindAssemblyx86Tests/Testx86AssemblyInspectionEngine.TestPushR14 (1637 of 2141)
PASS: lldb-unit :: UnwindAssembly/x86/Release/UnwindAssemblyx86Tests/Testx86AssemblyInspectionEngine.TestPushR15 (1638 of 2141)
PASS: lldb-unit :: UnwindAssembly/x86/Release/UnwindAssemblyx86Tests/Testx86AssemblyInspectionEngine.TestPushRBP (1639 of 2141)
PASS: lldb-unit :: UnwindAssembly/x86/Release/UnwindAssemblyx86Tests/Testx86AssemblyInspectionEngine.TestPushRBPWithREX (1640 of 2141)
PASS: lldb-unit :: UnwindAssembly/x86/Release/UnwindAssemblyx86Tests/Testx86AssemblyInspectionEngine.TestPushRBX (1641 of 2141)
PASS: lldb-unit :: UnwindAssembly/x86/Release/UnwindAssemblyx86Tests/Testx86AssemblyInspectionEngine.TestSimple32bitFrameFunction (1642 of 2141)
PASS: lldb-unit :: UnwindAssembly/x86/Release/UnwindAssemblyx86Tests/Testx86AssemblyInspectionEngine.TestReturnDetect (1643 of 2141)
PASS: lldb-unit :: UnwindAssembly/x86/Release/UnwindAssemblyx86Tests/Testx86AssemblyInspectionEngine.TestSimple64bitFrameFunction (1644 of 2141)
PASS: lldb-unit :: UnwindAssembly/x86/Release/UnwindAssemblyx86Tests/Testx86AssemblyInspectionEngine.TestSimplei386ugmented (1645 of 2141)
PASS: lldb-unit :: UnwindAssembly/x86/Release/UnwindAssemblyx86Tests/Testx86AssemblyInspectionEngine.TestSpArithx86_64Augmented (1646 of 2141)
PASS: lldb-unit :: UnwindAssembly/x86/Release/UnwindAssemblyx86Tests/Testx86AssemblyInspectionEngine.TestSimplex86_64Augmented (1647 of 2141)
PASS: lldb-unit :: UnwindAssembly/x86/Release/UnwindAssemblyx86Tests/Testx86AssemblyInspectionEngine.TestSpillRegToStackViaMOVx86_64 (1648 of 2141)
PASS: lldb-unit :: UnwindAssembly/x86/Release/UnwindAssemblyx86Tests/Testx86AssemblyInspectionEngine.TestSpillRegToStackViaMOVi386 (1649 of 2141)
PASS: lldb-unit :: UnwindAssembly/x86/Release/UnwindAssemblyx86Tests/Testx86AssemblyInspectionEngine.TestStackRealign8BitDisp_i386 (1650 of 2141)
PASS: lldb-unit :: UnwindAssembly/x86/Release/UnwindAssemblyx86Tests/Testx86AssemblyInspectionEngine.TestStackRealign32BitDisp_x86_64 (1651 of 2141)
PASS: lldb-unit :: UnwindAssembly/x86/Release/UnwindAssemblyx86Tests/Testx86AssemblyInspectionEngine.TestStackRealignMSVC_i386 (1652 of 2141)
PASS: lldb-unit :: UnwindAssembly/x86/Release/UnwindAssemblyx86Tests/Testx86AssemblyInspectionEngine.TestSubESP (1653 of 2141)
PASS: lldb-unit :: UnwindAssembly/x86/Release/UnwindAssemblyx86Tests/Testx86AssemblyInspectionEngine.TestSubRSP (1654 of 2141)
PASS: lldb-unit :: UnwindAssembly/x86/Release/UnwindAssemblyx86Tests/Testx86AssemblyInspectionEngine.Testi386IgnoredRegisters (1655 of 2141)
PASS: lldb-unit :: Utility/Release/UtilityTests/AnsiTerminal.AtStart (1656 of 2141)
PASS: lldb-unit :: Utility/Release/UtilityTests/AnsiTerminal.AtEnd (1657 of 2141)
PASS: lldb-unit :: Utility/Release/UtilityTests/AnsiTerminal.Empty (1658 of 2141)
PASS: lldb-unit :: Utility/Release/UtilityTests/AnsiTerminal.Basic (1659 of 2141)
PASS: lldb-unit :: Utility/Release/UtilityTests/AnsiTerminal.Incomplete (1660 of 2141)
PASS: lldb-unit :: Utility/Release/UtilityTests/AnsiTerminal.KnownPrefix (1661 of 2141)
PASS: lldb-unit :: Utility/Release/UtilityTests/AnsiTerminal.Unknown (1662 of 2141)
PASS: lldb-unit :: Utility/Release/UtilityTests/AnsiTerminal.Twice (1663 of 2141)
PASS: lldb-unit :: Utility/Release/UtilityTests/AnsiTerminal.WhiteSpace (1664 of 2141)
PASS: lldb-unit :: Utility/Release/UtilityTests/ArchSpecTest.Compatibility (1665 of 2141)
PASS: lldb-unit :: Utility/Release/UtilityTests/ArchSpecTest.MergeFrom (1666 of 2141)
PASS: lldb-unit :: Utility/Release/UtilityTests/ArchSpecTest.MergeFromMachOUnknown (1667 of 2141)
PASS: lldb-unit :: Utility/Release/UtilityTests/ArchSpecTest.TestParseMachCPUDashSubtypeTripleExtra (1668 of 2141)
PASS: lldb-unit :: Utility/Release/UtilityTests/ArchSpecTest.OperatorBool (1669 of 2141)
PASS: lldb-unit :: Utility/Release/UtilityTests/ArchSpecTest.TestParseMachCPUDashSubtypeTripleSimple (1670 of 2141)
PASS: lldb-unit :: Utility/Release/UtilityTests/ArchSpecTest.TestSetTriple (1671 of 2141)
PASS: lldb-unit :: Utility/Release/UtilityTests/ArgsTest.BareSingleQuote (1672 of 2141)
PASS: lldb-unit :: Utility/Release/UtilityTests/ArchSpecTest.YAML (1673 of 2141)
PASS: lldb-unit :: Utility/Release/UtilityTests/ArchSpecTest.TripleComponentsWereSpecified (1674 of 2141)
PASS: lldb-unit :: Utility/Release/UtilityTests/ArgsTest.AppendArguments (1675 of 2141)
PASS: lldb-unit :: Utility/Release/UtilityTests/ArgsTest.EscapeLLDBCommandArgument (1676 of 2141)
PASS: lldb-unit :: Utility/Release/UtilityTests/ArgsTest.GetQuotedCommandString (1677 of 2141)
PASS: lldb-unit :: Utility/Release/UtilityTests/ArgsTest.GetArgumentArrayRef (1678 of 2141)
PASS: lldb-unit :: Utility/Release/UtilityTests/ArgsTest.DoubleQuotedItem (1679 of 2141)
PASS: lldb-unit :: Utility/Release/UtilityTests/ArgsTest.ReplaceArgumentAtIndexFarOutOfRange (1680 of 2141)
PASS: lldb-unit :: Utility/Release/UtilityTests/ArgsTest.ReplaceArgumentAtIndexLonger (1681 of 2141)
PASS: lldb-unit :: Utility/Release/UtilityTests/ArgsTest.ReplaceArgumentAtIndexEqual (1682 of 2141)
PASS: lldb-unit :: Utility/Release/UtilityTests/ArgsTest.ReplaceArgumentAtIndexOutOfRange (1683 of 2141)
PASS: lldb-unit :: Utility/Release/UtilityTests/ArgsTest.StringListConstructor (1684 of 2141)
PASS: lldb-unit :: Utility/Release/UtilityTests/ArgsTest.TestAppendArg (1685 of 2141)
PASS: lldb-unit :: Utility/Release/UtilityTests/ArgsTest.ReplaceArgumentAtIndexShort (1686 of 2141)
PASS: lldb-unit :: Utility/Release/UtilityTests/ArgsTest.TestArgv (1687 of 2141)
PASS: lldb-unit :: Utility/Release/UtilityTests/ArgsTest.TestQuotedTrailingBackslash (1688 of 2141)
PASS: lldb-unit :: Utility/Release/UtilityTests/ArgsTest.TestMultipleArgs (1689 of 2141)
PASS: lldb-unit :: Utility/Release/UtilityTests/ArgsTest.TestOverwriteArgs (1690 of 2141)
PASS: lldb-unit :: Utility/Release/UtilityTests/ArgsTest.TestInsertArg (1691 of 2141)
PASS: lldb-unit :: Utility/Release/UtilityTests/ArgsTest.TestSingleArg (1692 of 2141)
PASS: lldb-unit :: Utility/Release/UtilityTests/ArgsTest.TestQuotedUnknownEscape (1693 of 2141)
PASS: lldb-unit :: Utility/Release/UtilityTests/ArgsTest.TestSingleQuotedArgWithSpace (1694 of 2141)
PASS: lldb-unit :: Utility/Release/UtilityTests/ArgsTest.TestSingleArgWithQuotedSpace (1695 of 2141)
PASS: lldb-unit :: Utility/Release/UtilityTests/ArgsTest.TestUnknownEscape (1696 of 2141)
PASS: lldb-unit :: Utility/Release/UtilityTests/BinaryStreamTest.PutSLEB128EightBytes (1697 of 2141)
PASS: lldb-unit :: Utility/Release/UtilityTests/ArgsTest.TestTrailingBackslash (1698 of 2141)
PASS: lldb-unit :: Utility/Release/UtilityTests/ArgsTest.Yaml (1699 of 2141)
PASS: lldb-unit :: Utility/Release/UtilityTests/BinaryStreamTest.PutSLEB128FiveBytes (1700 of 2141)
PASS: lldb-unit :: Utility/Release/UtilityTests/BinaryStreamTest.PutSLEB128FourBytes (1701 of 2141)
PASS: lldb-unit :: Utility/Release/UtilityTests/BinaryStreamTest.PutSLEB128MaxValue (1702 of 2141)
PASS: lldb-unit :: Utility/Release/UtilityTests/BinaryStreamTest.PutSLEB128NineBytes (1703 of 2141)
PASS: lldb-unit :: Utility/Release/UtilityTests/BinaryStreamTest.PutSLEB128OneByte (1704 of 2141)
PASS: lldb-unit :: Utility/Release/UtilityTests/BinaryStreamTest.PutSLEB128One (1705 of 2141)
PASS: lldb-unit :: Utility/Release/UtilityTests/BinaryStreamTest.PutSLEB128SevenBytes (1706 of 2141)
PASS: lldb-unit :: Utility/Release/UtilityTests/BinaryStreamTest.PutSLEB128SixBytes (1707 of 2141)
PASS: lldb-unit :: Utility/Release/UtilityTests/BinaryStreamTest.PutSLEB128Zero (1708 of 2141)
PASS: lldb-unit :: Utility/Release/UtilityTests/BinaryStreamTest.PutSLEB128ThreeBytes (1709 of 2141)
PASS: lldb-unit :: Utility/Release/UtilityTests/BinaryStreamTest.PutULEB128EightBytes (1710 of 2141)
PASS: lldb-unit :: Utility/Release/UtilityTests/BinaryStreamTest.PutSLEB128TwoBytes (1711 of 2141)
PASS: lldb-unit :: Utility/Release/UtilityTests/BinaryStreamTest.PutULEB128FiveBytes (1712 of 2141)
PASS: lldb-unit :: Utility/Release/UtilityTests/BinaryStreamTest.PutULEB128FourBytes (1713 of 2141)
PASS: lldb-unit :: Utility/Release/UtilityTests/BinaryStreamTest.PutULEB128MaxValue (1714 of 2141)
PASS: lldb-unit :: Utility/Release/UtilityTests/BinaryStreamTest.PutULEB128NineBytes (1715 of 2141)
PASS: lldb-shell :: SymbolFile/Breakpad/unwind-via-stack-win-no-memory-info.yaml (1716 of 2141)
PASS: lldb-unit :: Utility/Release/UtilityTests/BinaryStreamTest.PutULEB128OneByte (1717 of 2141)
PASS: lldb-unit :: Utility/Release/UtilityTests/BinaryStreamTest.PutULEB128SevenBytes (1718 of 2141)
PASS: lldb-unit :: Utility/Release/UtilityTests/BinaryStreamTest.PutULEB128One (1719 of 2141)
PASS: lldb-unit :: Utility/Release/UtilityTests/BinaryStreamTest.PutULEB128SixBytes (1720 of 2141)
PASS: lldb-shell :: SymbolFile/Breakpad/unwind-via-raSearch.test (1721 of 2141)
PASS: lldb-unit :: Utility/Release/UtilityTests/BinaryStreamTest.PutULEB128ThreeBytes (1722 of 2141)
PASS: lldb-unit :: Utility/Release/UtilityTests/BinaryStreamTest.PutULEB128Zero (1723 of 2141)
PASS: lldb-unit :: Utility/Release/UtilityTests/BinaryStreamTest.PutULEB128TwoBytes (1724 of 2141)
PASS: lldb-unit :: Utility/Release/UtilityTests/BroadcasterTest.EventTypeHasListeners (1725 of 2141)
PASS: lldb-unit :: Utility/Release/UtilityTests/BroadcasterTest.BroadcastEvent (1726 of 2141)
PASS: lldb-unit :: Utility/Release/UtilityTests/CompletionRequest.Constructor (1727 of 2141)
PASS: lldb-unit :: Utility/Release/UtilityTests/CompletionRequest.DuplicateFiltering (1728 of 2141)
PASS: lldb-unit :: Utility/Release/UtilityTests/CompletionRequest.FakeLastArg (1729 of 2141)
PASS: lldb-unit :: Utility/Release/UtilityTests/CompletionRequest.DuplicateFilteringWithComments (1730 of 2141)
PASS: lldb-unit :: Utility/Release/UtilityTests/CompletionRequest.TestCompletionOwnership (1731 of 2141)
PASS: lldb-unit :: Utility/Release/UtilityTests/CompletionRequest.ShiftArguments (1732 of 2141)
PASS: lldb-shell :: SymbolFile/Breakpad/unwind-via-stack-win.test (1733 of 2141)
PASS: lldb-unit :: Utility/Release/UtilityTests/CompletionRequest.TryCompleteCurrentArgBad (1734 of 2141)
PASS: lldb-unit :: Utility/Release/UtilityTests/CompletionRequest.TryCompleteCurrentArgGood (1735 of 2141)
PASS: lldb-unit :: Utility/Release/UtilityTests/ConstStringTest.CompareStringRef (1736 of 2141)
PASS: lldb-unit :: Utility/Release/UtilityTests/ConstStringTest.CompareConstString (1737 of 2141)
PASS: lldb-unit :: Utility/Release/UtilityTests/CompletionRequest.TryCompleteCurrentArgMode (1738 of 2141)
PASS: lldb-unit :: Utility/Release/UtilityTests/ConstStringTest.FromMidOfBufferStringRef (1739 of 2141)
PASS: lldb-unit :: Utility/Release/UtilityTests/ConstStringTest.MangledCounterpart (1740 of 2141)
PASS: lldb-unit :: Utility/Release/UtilityTests/ConstStringTest.NullAndEmptyStates (1741 of 2141)
PASS: lldb-unit :: Utility/Release/UtilityTests/ConstStringTest.UpdateMangledCounterpart (1742 of 2141)
PASS: lldb-unit :: Utility/Release/UtilityTests/DataExtractorTest.GetBitfield (1743 of 2141)
PASS: lldb-unit :: Utility/Release/UtilityTests/ConstStringTest.YAML (1744 of 2141)
PASS: lldb-unit :: Utility/Release/UtilityTests/DataExtractorTest.GetCStr (1745 of 2141)
PASS: lldb-unit :: Utility/Release/UtilityTests/ConstStringTest.format_provider (1746 of 2141)
PASS: lldb-unit :: Utility/Release/UtilityTests/DataExtractorTest.GetCStrAtNullOffset (1747 of 2141)
PASS: lldb-unit :: Utility/Release/UtilityTests/DataExtractorTest.GetCStrAtEnd (1748 of 2141)
PASS: lldb-unit :: Utility/Release/UtilityTests/DataExtractorTest.GetCStrEmpty (1749 of 2141)
PASS: lldb-unit :: Utility/Release/UtilityTests/DataExtractorTest.GetDouble (1750 of 2141)
PASS: lldb-unit :: Utility/Release/UtilityTests/DataExtractorTest.GetDoubleUnaligned (1751 of 2141)
PASS: lldb-unit :: Utility/Release/UtilityTests/DataExtractorTest.GetCStrUnterminated (1752 of 2141)
PASS: lldb-unit :: Utility/Release/UtilityTests/DataExtractorTest.GetFloat (1753 of 2141)
PASS: lldb-unit :: Utility/Release/UtilityTests/DataExtractorTest.GetMaxS64 (1754 of 2141)
PASS: lldb-unit :: Utility/Release/UtilityTests/DataExtractorTest.GetFloatUnaligned (1755 of 2141)
PASS: lldb-unit :: Utility/Release/UtilityTests/DataExtractorTest.GetMaxU64 (1756 of 2141)
PASS: lldb-unit :: Utility/Release/UtilityTests/DataExtractorTest.GetSLEB128_bit63 (1757 of 2141)
PASS: lldb-unit :: Utility/Release/UtilityTests/DataExtractorTest.GetULEB128_bit63 (1758 of 2141)
PASS: lldb-unit :: Utility/Release/UtilityTests/DataExtractorTest.GetMaxU64_unchecked (1759 of 2141)
PASS: lldb-unit :: Utility/Release/UtilityTests/DataExtractorTest.PeekData (1760 of 2141)
PASS: lldb-unit :: Utility/Release/UtilityTests/DeserializerTest.HasData (1761 of 2141)
PASS: lldb-unit :: Utility/Release/UtilityTests/DataExtractorTest.UncommonAddressSize (1762 of 2141)
PASS: lldb-unit :: Utility/Release/UtilityTests/EnvironmentTest.EnvpConstruction (1763 of 2141)
PASS: lldb-unit :: Utility/Release/UtilityTests/EnvironmentTest.EnvpConversion (1764 of 2141)
PASS: lldb-unit :: Utility/Release/UtilityTests/EventTest.DumpEventDataBytes (1765 of 2141)
PASS: lldb-unit :: Utility/Release/UtilityTests/FileSpecTest.AppendPathComponent (1766 of 2141)
PASS: lldb-unit :: Utility/Release/UtilityTests/FileSpecTest.CopyByAppendingPathComponent (1767 of 2141)
PASS: lldb-unit :: Utility/Release/UtilityTests/FileSpecTest.Equal (1768 of 2141)
PASS: lldb-unit :: Utility/Release/UtilityTests/FileSpecTest.EqualDotsPosix (1769 of 2141)
PASS: lldb-unit :: Utility/Release/UtilityTests/FileSpecTest.EqualDotsPosixRoot (1770 of 2141)
PASS: lldb-unit :: Utility/Release/UtilityTests/FileSpecTest.EqualDotsWindows (1771 of 2141)
PASS: lldb-unit :: Utility/Release/UtilityTests/FileSpecTest.FileAndDirectoryComponents (1772 of 2141)
PASS: lldb-unit :: Utility/Release/UtilityTests/FileSpecTest.EqualSeparator (1773 of 2141)
PASS: lldb-unit :: Utility/Release/UtilityTests/FileSpecTest.FormatFileSpec (1774 of 2141)
PASS: lldb-unit :: Utility/Release/UtilityTests/FileSpecTest.GetPath (1775 of 2141)
PASS: lldb-unit :: Utility/Release/UtilityTests/FileSpecTest.GuessPathStyle (1776 of 2141)
PASS: lldb-unit :: Utility/Release/UtilityTests/FileSpecTest.Match (1777 of 2141)
PASS: lldb-unit :: Utility/Release/UtilityTests/FileSpecTest.IsRelative (1778 of 2141)
PASS: lldb-unit :: Utility/Release/UtilityTests/FileSpecTest.PrependPathComponent (1779 of 2141)
PASS: lldb-unit :: Utility/Release/UtilityTests/FileSpecTest.OperatorBool (1780 of 2141)
PASS: lldb-unit :: Utility/Release/UtilityTests/FileSpecTest.RemoveLastPathComponent (1781 of 2141)
PASS: lldb-unit :: Utility/Release/UtilityTests/Flags.AllClear (1782 of 2141)
PASS: lldb-unit :: Utility/Release/UtilityTests/FileSpecTest.Yaml (1783 of 2141)
PASS: lldb-unit :: Utility/Release/UtilityTests/Flags.AllSet (1784 of 2141)
PASS: lldb-unit :: Utility/Release/UtilityTests/Flags.AnyClear (1785 of 2141)
PASS: lldb-unit :: Utility/Release/UtilityTests/Flags.AnySet (1786 of 2141)
PASS: lldb-unit :: Utility/Release/UtilityTests/Flags.Clear (1787 of 2141)
PASS: lldb-unit :: Utility/Release/UtilityTests/Flags.GetBitSize (1788 of 2141)
PASS: lldb-unit :: Utility/Release/UtilityTests/Flags.IsClear (1789 of 2141)
PASS: lldb-unit :: Utility/Release/UtilityTests/Flags.Reset (1790 of 2141)
PASS: lldb-unit :: Utility/Release/UtilityTests/Flags.Test (1791 of 2141)
PASS: lldb-unit :: Utility/Release/UtilityTests/GeneratorTest.Create (1792 of 2141)
PASS: lldb-unit :: Utility/Release/UtilityTests/GeneratorTest.Get (1793 of 2141)
PASS: lldb-unit :: Utility/Release/UtilityTests/GeneratorTest.GetOrCreate (1794 of 2141)
PASS: lldb-unit :: Utility/Release/UtilityTests/GeneratorTest.YamlMultiProvider (1795 of 2141)
PASS: lldb-unit :: Utility/Release/UtilityTests/IndexToObjectTest.ObjectForIndex (1796 of 2141)
PASS: lldb-unit :: Utility/Release/UtilityTests/ListenerTest.GetEventImmediate (1797 of 2141)
PASS: lldb-unit :: Utility/Release/UtilityTests/LogChannelEnabledTest.LLDB_LOG_ERROR (1798 of 2141)
PASS: lldb-unit :: Utility/Release/UtilityTests/LogChannelEnabledTest.LogGetLogThread (1799 of 2141)
PASS: lldb-unit :: Utility/Release/UtilityTests/LogChannelEnabledTest.LogThread (1800 of 2141)
PASS: lldb-unit :: Utility/Release/UtilityTests/LogChannelEnabledTest.LogVerboseThread (1801 of 2141)
PASS: lldb-unit :: Utility/Release/UtilityTests/LogChannelEnabledTest.log_options (1802 of 2141)
PASS: lldb-unit :: Utility/Release/UtilityTests/LogChannelTest.Disable (1803 of 2141)
PASS: lldb-unit :: Utility/Release/UtilityTests/LogChannelTest.Enable (1804 of 2141)
PASS: lldb-unit :: Utility/Release/UtilityTests/LogChannelTest.EnableOptions (1805 of 2141)
PASS: lldb-unit :: Utility/Release/UtilityTests/LogChannelTest.List (1806 of 2141)
PASS: lldb-unit :: Utility/Release/UtilityTests/LogTest.LLDB_LOG_nullptr (1807 of 2141)
PASS: lldb-unit :: Utility/Release/UtilityTests/LogTest.Unregister (1808 of 2141)
PASS: lldb-unit :: Utility/Release/UtilityTests/LogTest.Register (1809 of 2141)
PASS: lldb-unit :: Utility/Release/UtilityTests/NameMatchesTest.Equals (1810 of 2141)
PASS: lldb-unit :: Utility/Release/UtilityTests/NameMatchesTest.EndsWith (1811 of 2141)
PASS: lldb-unit :: Utility/Release/UtilityTests/ListenerTest.GetEventWait (1812 of 2141)
PASS: lldb-unit :: Utility/Release/UtilityTests/NameMatchesTest.Contains (1813 of 2141)
PASS: lldb-unit :: Utility/Release/UtilityTests/NameMatchesTest.Ignore (1814 of 2141)
PASS: lldb-unit :: Utility/Release/UtilityTests/NameMatchesTest.RegularExpression (1815 of 2141)
PASS: lldb-unit :: Utility/Release/UtilityTests/NameMatchesTest.StartsWith (1816 of 2141)
PASS: lldb-unit :: Utility/Release/UtilityTests/OptionsWithRawTest.EmptyArgsOnlySuffix (1817 of 2141)
PASS: lldb-unit :: Utility/Release/UtilityTests/OptionsWithRawTest.ArgsButNoDelimiter (1818 of 2141)
PASS: lldb-unit :: Utility/Release/UtilityTests/OptionsWithRawTest.ArgsButNoLeadingDash (1819 of 2141)
PASS: lldb-unit :: Utility/Release/UtilityTests/OptionsWithRawTest.EmptyInput (1820 of 2141)
PASS: lldb-unit :: Utility/Release/UtilityTests/OptionsWithRawTest.EmptySuffix (1821 of 2141)
PASS: lldb-unit :: Utility/Release/UtilityTests/OptionsWithRawTest.EmptySuffixSingleWhitespace (1822 of 2141)
PASS: lldb-unit :: Utility/Release/UtilityTests/OptionsWithRawTest.LeadingSpaceArgs (1823 of 2141)
PASS: lldb-unit :: Utility/Release/UtilityTests/OptionsWithRawTest.QuotedSuffix (1824 of 2141)
PASS: lldb-unit :: Utility/Release/UtilityTests/OptionsWithRawTest.SingleWhitespaceInput (1825 of 2141)
PASS: lldb-unit :: Utility/Release/UtilityTests/OptionsWithRawTest.MultiWordSuffix (1826 of 2141)
PASS: lldb-unit :: Utility/Release/UtilityTests/OptionsWithRawTest.SingleWordSuffix (1827 of 2141)
PASS: lldb-unit :: Utility/Release/UtilityTests/OptionsWithRawTest.TerminatedQuote (1828 of 2141)
PASS: lldb-unit :: Utility/Release/UtilityTests/OptionsWithRawTest.UnterminatedQuote (1829 of 2141)
PASS: lldb-unit :: Utility/Release/UtilityTests/OptionsWithRawTest.WhitespaceInput (1830 of 2141)
PASS: lldb-unit :: Utility/Release/UtilityTests/OptionsWithRawTest.WhitespaceSuffix (1831 of 2141)
PASS: lldb-unit :: Utility/Release/UtilityTests/PassiveReplayTest.InstrumentedBar (1832 of 2141)
PASS: lldb-unit :: Utility/Release/UtilityTests/PassiveReplayTest.InstrumentedBarPtr (1833 of 2141)
PASS: lldb-unit :: Utility/Release/UtilityTests/PassiveReplayTest.InstrumentedFoo (1834 of 2141)
PASS: lldb-unit :: Utility/Release/UtilityTests/PassiveReplayTest.InstrumentedBarRef (1835 of 2141)
PASS: lldb-unit :: Utility/Release/UtilityTests/ProcessInfoTest.Constructor (1836 of 2141)
PASS: lldb-unit :: Utility/Release/UtilityTests/ProcessInstanceInfo.DumpTable_invalidUID (1837 of 2141)
PASS: lldb-unit :: Utility/Release/UtilityTests/ProcessInstanceInfo.DumpTable (1838 of 2141)
PASS: lldb-unit :: Utility/Release/UtilityTests/ProcessInstanceInfo.Dump (1839 of 2141)
PASS: lldb-unit :: Utility/Release/UtilityTests/Predicate.WaitForValueNotEqualTo (1840 of 2141)
PASS: lldb-unit :: Utility/Release/UtilityTests/PassiveReplayTest.InstrumentedFooInvalid (1841 of 2141)
PASS: lldb-unit :: Utility/Release/UtilityTests/RangeDataVector.CustomSort (1842 of 2141)
PASS: lldb-unit :: Utility/Release/UtilityTests/ProcessInstanceInfo.Yaml (1843 of 2141)
PASS: lldb-unit :: Utility/Release/UtilityTests/ProcessInstanceInfoMatch.Name (1844 of 2141)
PASS: lldb-unit :: Utility/Release/UtilityTests/ProcessInstanceInfoList.Yaml (1845 of 2141)
PASS: lldb-unit :: Utility/Release/UtilityTests/RangeDataVector.FindEntryIndexesThatContain_Overlap (1846 of 2141)
PASS: lldb-unit :: Utility/Release/UtilityTests/RangeDataVector.FindEntryIndexesThatContain (1847 of 2141)
PASS: lldb-unit :: Utility/Release/UtilityTests/RangeDataVector.FindEntryThatContains (1848 of 2141)
PASS: lldb-unit :: Utility/Release/UtilityTests/RangeDataVector.FindEntryThatContains_Overlap (1849 of 2141)
PASS: lldb-unit :: Utility/Release/UtilityTests/RangeTest.Clear (1850 of 2141)
PASS: lldb-unit :: Utility/Release/UtilityTests/RangeTest.ClearWithStarAddress (1851 of 2141)
PASS: lldb-unit :: Utility/Release/UtilityTests/RangeTest.Constructor (1852 of 2141)
PASS: lldb-unit :: Utility/Release/UtilityTests/RangeTest.ContainsAddr (1853 of 2141)
PASS: lldb-unit :: Utility/Release/UtilityTests/RangeTest.ContainsAddrInvalid (1854 of 2141)
PASS: lldb-unit :: Utility/Release/UtilityTests/RangeTest.ContainsEndInclusive (1855 of 2141)
PASS: lldb-unit :: Utility/Release/UtilityTests/RangeTest.ContainsEndInclusiveInvalid (1856 of 2141)
PASS: lldb-unit :: Utility/Release/UtilityTests/RangeTest.ContainsRange (1857 of 2141)
PASS: lldb-unit :: Utility/Release/UtilityTests/RangeTest.Copy (1858 of 2141)
PASS: lldb-unit :: Utility/Release/UtilityTests/RangeTest.ContainsRangeStartingFromZero (1859 of 2141)
PASS: lldb-unit :: Utility/Release/UtilityTests/RangeTest.DefaultConstructor (1860 of 2141)
PASS: lldb-unit :: Utility/Release/UtilityTests/RangeTest.DoesAdjoinOrIntersect (1861 of 2141)
PASS: lldb-unit :: Utility/Release/UtilityTests/RangeTest.DoesIntersect (1862 of 2141)
PASS: lldb-unit :: Utility/Release/UtilityTests/RangeTest.Equal (1863 of 2141)
PASS: lldb-unit :: Utility/Release/UtilityTests/RangeTest.LessThan (1864 of 2141)
PASS: lldb-unit :: Utility/Release/UtilityTests/RangeTest.EqualInvalid (1865 of 2141)
PASS: lldb-unit :: Utility/Release/UtilityTests/RangeTest.LessThanInvalid (1866 of 2141)
PASS: lldb-unit :: Utility/Release/UtilityTests/RangeTest.NotEqual (1867 of 2141)
PASS: lldb-unit :: Utility/Release/UtilityTests/RangeTest.NotEqualInvalid (1868 of 2141)
PASS: lldb-unit :: Utility/Release/UtilityTests/RangeTest.SetRangeBase (1869 of 2141)
PASS: lldb-unit :: Utility/Release/UtilityTests/RangeTest.SlideZero (1870 of 2141)
PASS: lldb-unit :: Utility/Release/UtilityTests/RangeTest.Slide (1871 of 2141)
PASS: lldb-unit :: Utility/Release/UtilityTests/RangeTest.SizeTypes (1872 of 2141)
PASS: lldb-unit :: Utility/Release/UtilityTests/RangeVector.CombineConsecutiveRanges (1873 of 2141)
PASS: lldb-unit :: Utility/Release/UtilityTests/RangeTest.Union (1874 of 2141)
PASS: lldb-unit :: Utility/Release/UtilityTests/RegisterValueTest.GetSet8 (1875 of 2141)
PASS: lldb-unit :: Utility/Release/UtilityTests/RegularExpression.CopyAssignment (1876 of 2141)
PASS: lldb-unit :: Utility/Release/UtilityTests/Predicate.WaitForValueEqualTo (1877 of 2141)
PASS: lldb-unit :: Utility/Release/UtilityTests/RegularExpression.Empty (1878 of 2141)
PASS: lldb-unit :: Utility/Release/UtilityTests/RegularExpression.Invalid (1879 of 2141)
PASS: lldb-unit :: Utility/Release/UtilityTests/RegularExpression.Valid (1880 of 2141)
PASS: lldb-unit :: Utility/Release/UtilityTests/RegularExpression.Match (1881 of 2141)
PASS: lldb-unit :: Utility/Release/UtilityTests/ReproducerTest.SetReplay (1882 of 2141)
PASS: lldb-unit :: Utility/Release/UtilityTests/ReproducerTest.SetCapture (1883 of 2141)
PASS: lldb-unit :: Utility/Release/UtilityTests/ScalarTest.APIntConstructor (1884 of 2141)
PASS: lldb-unit :: Utility/Release/UtilityTests/ScalarTest.CastOperations (1885 of 2141)
PASS: lldb-unit :: Utility/Release/UtilityTests/ScalarTest.Comparison (1886 of 2141)
PASS: lldb-unit :: Utility/Release/UtilityTests/ScalarTest.ComparisonFloat (1887 of 2141)
PASS: lldb-unit :: Utility/Release/UtilityTests/ScalarTest.Equality (1888 of 2141)
PASS: lldb-unit :: Utility/Release/UtilityTests/ScalarTest.Division (1889 of 2141)
PASS: lldb-unit :: Utility/Release/UtilityTests/ScalarTest.GetBytes (1890 of 2141)
PASS: lldb-unit :: Utility/Release/UtilityTests/ScalarTest.ExtractBitfield (1891 of 2141)
PASS: lldb-unit :: Utility/Release/UtilityTests/RecordReplayTest.InstrumentedBar (1892 of 2141)
PASS: lldb-unit :: Utility/Release/UtilityTests/RecordReplayTest.InstrumentedFoo (1893 of 2141)
PASS: lldb-unit :: Utility/Release/UtilityTests/RecordReplayTest.InstrumentedBarPtr (1894 of 2141)
PASS: lldb-unit :: Utility/Release/UtilityTests/ScalarTest.Getters (1895 of 2141)
PASS: lldb-unit :: Utility/Release/UtilityTests/ScalarTest.GetValue (1896 of 2141)
PASS: lldb-unit :: Utility/Release/UtilityTests/RecordReplayTest.InstrumentedBarRef (1897 of 2141)
PASS: lldb-unit :: Utility/Release/UtilityTests/RecordReplayTest.InstrumentedFooSameThis (1898 of 2141)
PASS: lldb-unit :: Utility/Release/UtilityTests/ScalarTest.LongLongAssigmentOperator (1899 of 2141)
PASS: lldb-unit :: Utility/Release/UtilityTests/ScalarTest.SetValueFromData (1900 of 2141)
PASS: lldb-unit :: Utility/Release/UtilityTests/ScalarTest.RightShiftOperator (1901 of 2141)
PASS: lldb-unit :: Utility/Release/UtilityTests/ScalarTest.Scalar_512 (1902 of 2141)
PASS: lldb-unit :: Utility/Release/UtilityTests/SerializationRountripTest.SerializeDeserializeCString (1903 of 2141)
PASS: lldb-unit :: Utility/Release/UtilityTests/ScalarTest.Promotion (1904 of 2141)
PASS: lldb-unit :: Utility/Release/UtilityTests/ScalarTest.SetValueFromCString (1905 of 2141)
PASS: lldb-unit :: Utility/Release/UtilityTests/ScalarTest.TruncOrExtendTo (1906 of 2141)
PASS: lldb-unit :: Utility/Release/UtilityTests/SerializationRountripTest.SerializeDeserializeCStringNull (1907 of 2141)
PASS: lldb-unit :: Utility/Release/UtilityTests/SerializationRountripTest.SerializeDeserializeCStringArrayNullptr (1908 of 2141)
PASS: lldb-unit :: Utility/Release/UtilityTests/SerializationRountripTest.SerializeDeserializeCStringArray (1909 of 2141)
PASS: lldb-unit :: Utility/Release/UtilityTests/SerializationRountripTest.SerializeDeserializeObjectPointer (1910 of 2141)
PASS: lldb-unit :: Utility/Release/UtilityTests/SerializationRountripTest.SerializeDeserializeCStringArrayNullptrElem (1911 of 2141)
PASS: lldb-unit :: Utility/Release/UtilityTests/SerializationRountripTest.SerializeDeserializeObjectReference (1912 of 2141)
PASS: lldb-unit :: Utility/Release/UtilityTests/SerializationRountripTest.SerializeDeserializePod (1913 of 2141)
PASS: lldb-unit :: Utility/Release/UtilityTests/SerializationRountripTest.SerializeDeserializePodPointers (1914 of 2141)
PASS: lldb-unit :: Utility/Release/UtilityTests/SerializationRountripTest.SerializeDeserializePodReferences (1915 of 2141)
PASS: lldb-unit :: Utility/Release/UtilityTests/StatusTest.ErrorConstructor (1916 of 2141)
PASS: lldb-unit :: Utility/Release/UtilityTests/StatusTest.ErrorCodeConstructor (1917 of 2141)
PASS: lldb-unit :: Utility/Release/UtilityTests/StatusTest.ErrorConversion (1918 of 2141)
PASS: lldb-unit :: Utility/Release/UtilityTests/SharedCluster.ClusterManager (1919 of 2141)
PASS: lldb-unit :: Utility/Release/UtilityTests/StateTest.Formatv (1920 of 2141)
PASS: lldb-unit :: Utility/Release/UtilityTests/StatusTest.Formatv (1921 of 2141)
PASS: lldb-unit :: Utility/Release/UtilityTests/StreamTeeTest.Assignment (1922 of 2141)
PASS: lldb-unit :: Utility/Release/UtilityTests/StreamTeeTest.AppendStream (1923 of 2141)
PASS: lldb-unit :: Utility/Release/UtilityTests/StreamTeeTest.Constructor2Streams (1924 of 2141)
PASS: lldb-unit :: Utility/Release/UtilityTests/StreamTeeTest.Constructor1Stream (1925 of 2141)
PASS: lldb-unit :: Utility/Release/UtilityTests/StreamTeeTest.DefaultConstructor (1926 of 2141)
PASS: lldb-unit :: Utility/Release/UtilityTests/StreamTeeTest.CopyConstructor (1927 of 2141)
PASS: lldb-unit :: Utility/Release/UtilityTests/StreamTeeTest.Flush (1928 of 2141)
PASS: lldb-unit :: Utility/Release/UtilityTests/StreamTeeTest.GetStreamAtIndexOutOfBoundsEmpty (1929 of 2141)
PASS: lldb-unit :: Utility/Release/UtilityTests/StreamTeeTest.GetStreamAtIndexOutOfBounds (1930 of 2141)
PASS: lldb-unit :: Utility/Release/UtilityTests/StreamTeeTest.SetStreamAtIndexOutOfBounds (1931 of 2141)
PASS: lldb-unit :: Utility/Release/UtilityTests/StreamTeeTest.SetStreamAtIndexOverwrite (1932 of 2141)
PASS: lldb-unit :: Utility/Release/UtilityTests/StreamTeeTest.Write (1933 of 2141)
PASS: lldb-unit :: Utility/Release/UtilityTests/StreamTest.AddressEmptyPrefix (1934 of 2141)
PASS: lldb-unit :: Utility/Release/UtilityTests/StreamTest.AddressNoSuffix (1935 of 2141)
PASS: lldb-unit :: Utility/Release/UtilityTests/StreamTest.AddressPrefixAndSuffix (1936 of 2141)
PASS: lldb-unit :: Utility/Release/UtilityTests/StreamTest.AddressRange (1937 of 2141)
PASS: lldb-unit :: Utility/Release/UtilityTests/StreamTest.AddressRangeEmptyRange (1938 of 2141)
PASS: lldb-unit :: Utility/Release/UtilityTests/StreamTest.AddressRangeInvalidRange (1939 of 2141)
PASS: lldb-unit :: Utility/Release/UtilityTests/StreamTest.AddressPrefix (1940 of 2141)
PASS: lldb-unit :: Utility/Release/UtilityTests/StreamTest.AddressRangeSize (1941 of 2141)
PASS: lldb-unit :: Utility/Release/UtilityTests/StreamTest.AddressSize (1942 of 2141)
PASS: lldb-unit :: Utility/Release/UtilityTests/StreamTest.PutBytesAsRawHex8ToBigEndian (1943 of 2141)
PASS: lldb-unit :: Utility/Release/UtilityTests/StreamTest.ChangingByteOrder (1944 of 2141)
PASS: lldb-unit :: Utility/Release/UtilityTests/StreamTest.AddressSuffix (1945 of 2141)
PASS: lldb-unit :: Utility/Release/UtilityTests/StreamTest.PutBytesAsRawHex8ToMixedEndian (1946 of 2141)
PASS: lldb-unit :: Utility/Release/UtilityTests/StreamTest.Indent (1947 of 2141)
PASS: lldb-unit :: Utility/Release/UtilityTests/StreamTest.PutBytesAsRawHex8ToLittleEndian (1948 of 2141)
PASS: lldb-unit :: Utility/Release/UtilityTests/StreamTest.PutCString (1949 of 2141)
PASS: lldb-unit :: Utility/Release/UtilityTests/StreamTest.PutCharNull (1950 of 2141)
PASS: lldb-unit :: Utility/Release/UtilityTests/StreamTest.PutChar (1951 of 2141)
PASS: lldb-unit :: Utility/Release/UtilityTests/StreamTest.PutCStringWithStringRef (1952 of 2141)
PASS: lldb-unit :: Utility/Release/UtilityTests/StreamTest.PutCharWhitespace (1953 of 2141)
PASS: lldb-unit :: Utility/Release/UtilityTests/StreamTest.PutHex16ByteOrderLittle (1954 of 2141)
PASS: lldb-unit :: Utility/Release/UtilityTests/StreamTest.PutHex16ByteOrderBig (1955 of 2141)
PASS: lldb-unit :: Utility/Release/UtilityTests/StreamTest.PutHex32ByteOrderBig (1956 of 2141)
PASS: lldb-unit :: Utility/Release/UtilityTests/StreamTest.PutMaxHex64ByteOrderBig (1957 of 2141)
PASS: lldb-unit :: Utility/Release/UtilityTests/StreamTest.PutHex8 (1958 of 2141)
PASS: lldb-unit :: Utility/Release/UtilityTests/StreamTest.PutHex64ByteOrderBig (1959 of 2141)
PASS: lldb-unit :: Utility/Release/UtilityTests/StreamTest.PutHex32ByteOrderLittle (1960 of 2141)
PASS: lldb-unit :: Utility/Release/UtilityTests/StreamTest.PutHex64ByteOrderLittle (1961 of 2141)
PASS: lldb-unit :: Utility/Release/UtilityTests/StreamTest.PutMaxHex64ByteOrderLittle (1962 of 2141)
PASS: lldb-unit :: Utility/Release/UtilityTests/StreamTest.PutRawBytesToLittleEndian (1963 of 2141)
PASS: lldb-unit :: Utility/Release/UtilityTests/StreamTest.PutRawBytesToBigEndian (1964 of 2141)
PASS: lldb-unit :: Utility/Release/UtilityTests/StreamTest.PutSLEB128 (1965 of 2141)
PASS: lldb-unit :: Utility/Release/UtilityTests/StreamTest.PutPtr (1966 of 2141)
PASS: lldb-unit :: Utility/Release/UtilityTests/StreamTest.PutNHex8 (1967 of 2141)
PASS: lldb-unit :: Utility/Release/UtilityTests/StreamTest.PutStringAsRawHex8 (1968 of 2141)
PASS: lldb-unit :: Utility/Release/UtilityTests/StreamTest.PutRawBytesToMixedEndian (1969 of 2141)
PASS: lldb-unit :: Utility/Release/UtilityTests/StreamTest.QuotedCString (1970 of 2141)
PASS: lldb-unit :: Utility/Release/UtilityTests/StreamTest.SetIndentLevel (1971 of 2141)
PASS: lldb-unit :: Utility/Release/UtilityTests/StreamTest.PutULEB128 (1972 of 2141)
PASS: lldb-unit :: Utility/Release/UtilityTests/StreamTest.ShiftOperatorPtr (1973 of 2141)
PASS: lldb-unit :: Utility/Release/UtilityTests/StringExtractorTest.DecodeHexU8_Exact (1974 of 2141)
PASS: lldb-unit :: Utility/Release/UtilityTests/StreamTest.ShiftOperatorStrings (1975 of 2141)
PASS: lldb-unit :: Utility/Release/UtilityTests/StreamTest.ShiftOperatorChars (1976 of 2141)
PASS: lldb-unit :: Utility/Release/UtilityTests/StringExtractorTest.DecodeHexU8_InvalidHex (1977 of 2141)
PASS: lldb-unit :: Utility/Release/UtilityTests/StringExtractorTest.DecodeHexU8_InvalidHex2 (1978 of 2141)
PASS: lldb-unit :: Utility/Release/UtilityTests/StringExtractorTest.GetHexBytes (1979 of 2141)
PASS: lldb-unit :: Utility/Release/UtilityTests/StringExtractorTest.DecodeHexU8_Underflow2 (1980 of 2141)
PASS: lldb-unit :: Utility/Release/UtilityTests/StringExtractorTest.DecodeHexU8_Extra (1981 of 2141)
PASS: lldb-unit :: Utility/Release/UtilityTests/StringExtractorTest.DecodeHexU8_Underflow (1982 of 2141)
PASS: lldb-unit :: Utility/Release/UtilityTests/StringExtractorTest.GetHexBytesAvail (1983 of 2141)
PASS: lldb-unit :: Utility/Release/UtilityTests/StringExtractorTest.GetHexBytesAvail_FullString (1984 of 2141)
PASS: lldb-unit :: Utility/Release/UtilityTests/StringExtractorTest.GetHexBytes_FullString (1985 of 2141)
PASS: lldb-unit :: Utility/Release/UtilityTests/StringExtractorTest.GetHexBytesAvail_OddPair2 (1986 of 2141)
PASS: lldb-unit :: Utility/Release/UtilityTests/StringExtractorTest.GetHexBytesAvail_OddPair (1987 of 2141)
PASS: lldb-unit :: Utility/Release/UtilityTests/StringExtractorTest.GetHexBytesAvail_Partial (1988 of 2141)
PASS: lldb-unit :: Utility/Release/UtilityTests/StringExtractorTest.GetHexBytesAvail_Underflow (1989 of 2141)
PASS: lldb-unit :: Utility/Release/UtilityTests/StringExtractorTest.GetHexBytes_OddPair (1990 of 2141)
PASS: lldb-unit :: Utility/Release/UtilityTests/StringExtractorTest.GetHexBytes_Partial (1991 of 2141)
PASS: lldb-unit :: Utility/Release/UtilityTests/StringExtractorTest.GetHexU8_Exact (1992 of 2141)
PASS: lldb-unit :: Utility/Release/UtilityTests/StringExtractorTest.GetHexBytes_Underflow (1993 of 2141)
PASS: lldb-unit :: Utility/Release/UtilityTests/StringExtractorTest.GetHexU8_Extra (1994 of 2141)
PASS: lldb-unit :: Utility/Release/UtilityTests/StringExtractorTest.GetHexBytes_OddPair2 (1995 of 2141)
PASS: lldb-unit :: Utility/Release/UtilityTests/StringExtractorTest.GetHexU8_Exact_NoEof (1996 of 2141)
PASS: lldb-unit :: Utility/Release/UtilityTests/StringExtractorTest.GetHexU8_Extra_NoEof (1997 of 2141)
PASS: lldb-unit :: Utility/Release/UtilityTests/StringExtractorTest.GetHexU8_Underflow (1998 of 2141)
PASS: lldb-unit :: Utility/Release/UtilityTests/StringExtractorTest.GetHexU8_InvalidHex (1999 of 2141)
PASS: lldb-unit :: Utility/Release/UtilityTests/StringExtractorTest.GetHexU8_InvalidHex_NoEof (2000 of 2141)
PASS: lldb-unit :: Utility/Release/UtilityTests/StringExtractorTest.GetHexU8_Underflow_NoEof (2001 of 2141)
PASS: lldb-unit :: Utility/Release/UtilityTests/StringExtractorTest.GetHexU8_Underflow2 (2002 of 2141)
PASS: lldb-unit :: Utility/Release/UtilityTests/StringExtractorTest.GetHexU8_Underflow2_NoEof (2003 of 2141)
PASS: lldb-unit :: Utility/Release/UtilityTests/StringExtractorTest.GetNameColonValueContainsColon (2004 of 2141)
PASS: lldb-unit :: Utility/Release/UtilityTests/StringExtractorTest.GetNameColonValueNoColon (2005 of 2141)
PASS: lldb-unit :: Utility/Release/UtilityTests/StringExtractorTest.GetNameColonValueSuccess (2006 of 2141)
PASS: lldb-unit :: Utility/Release/UtilityTests/StringExtractorTest.GetNameColonValueNoSemicolon (2007 of 2141)
PASS: lldb-unit :: Utility/Release/UtilityTests/StringExtractorTest.GetU32BigEndian (2008 of 2141)
PASS: lldb-unit :: Utility/Release/UtilityTests/StringExtractorTest.GetU32LittleEndian (2009 of 2141)
PASS: lldb-unit :: Utility/Release/UtilityTests/StringExtractorTest.GetU64BigEndian (2010 of 2141)
PASS: lldb-unit :: Utility/Release/UtilityTests/StringExtractorTest.GetU64LittleEndian (2011 of 2141)
PASS: lldb-unit :: Utility/Release/UtilityTests/StringExtractorTest.InitEmpty (2012 of 2141)
PASS: lldb-unit :: Utility/Release/UtilityTests/StringLexerTest.GetUnlexed (2013 of 2141)
PASS: lldb-unit :: Utility/Release/UtilityTests/StringLexerTest.HasAtLeast (2014 of 2141)
PASS: lldb-unit :: Utility/Release/UtilityTests/StringLexerTest.AdvanceIf (2015 of 2141)
PASS: lldb-unit :: Utility/Release/UtilityTests/StringExtractorTest.InitMisc (2016 of 2141)
PASS: lldb-unit :: Utility/Release/UtilityTests/StringLexerTest.NextIf (2017 of 2141)
PASS: lldb-unit :: Utility/Release/UtilityTests/StringLexerTest.Next (2018 of 2141)
PASS: lldb-unit :: Utility/Release/UtilityTests/StringLexerTest.NextIfList (2019 of 2141)
PASS: lldb-unit :: Utility/Release/UtilityTests/StringLexerTest.Peek (2020 of 2141)
PASS: lldb-unit :: Utility/Release/UtilityTests/StringListTest.AppendListCStringArrayEmpty (2021 of 2141)
PASS: lldb-unit :: Utility/Release/UtilityTests/StringListTest.AppendList (2022 of 2141)
PASS: lldb-unit :: Utility/Release/UtilityTests/StringListTest.AppendListCStringArray (2023 of 2141)
PASS: lldb-unit :: Utility/Release/UtilityTests/StringLexerTest.PutBack (2024 of 2141)
PASS: lldb-unit :: Utility/Release/UtilityTests/StringListTest.AppendStringCString (2025 of 2141)
PASS: lldb-unit :: Utility/Release/UtilityTests/StringListTest.AppendStringMove (2026 of 2141)
PASS: lldb-unit :: Utility/Release/UtilityTests/StringListTest.Assignment (2027 of 2141)
PASS: lldb-unit :: Utility/Release/UtilityTests/StringListTest.AppendStringStdString (2028 of 2141)
PASS: lldb-unit :: Utility/Release/UtilityTests/StringListTest.CopyList (2029 of 2141)
PASS: lldb-unit :: Utility/Release/UtilityTests/StringListTest.Clear (2030 of 2141)
PASS: lldb-unit :: Utility/Release/UtilityTests/StringListTest.CopyListEmpty (2031 of 2141)
PASS: lldb-unit :: Utility/Release/UtilityTests/StringListTest.CopyListSingle (2032 of 2141)
PASS: lldb-unit :: Utility/Release/UtilityTests/StringListTest.DefaultConstructor (2033 of 2141)
PASS: lldb-unit :: Utility/Release/UtilityTests/StringListTest.ForRange (2034 of 2141)
PASS: lldb-unit :: Utility/Release/UtilityTests/StringListTest.GetMaxStringLengthDecreasingSize (2035 of 2141)
PASS: lldb-unit :: Utility/Release/UtilityTests/StringListTest.GetMaxStringLengthEmpty (2036 of 2141)
PASS: lldb-unit :: Utility/Release/UtilityTests/StringListTest.ForRangeEmpty (2037 of 2141)
PASS: lldb-unit :: Utility/Release/UtilityTests/StringListTest.GetMaxStringLengthEqualSize (2038 of 2141)
PASS: lldb-unit :: Utility/Release/UtilityTests/StringListTest.GetMaxStringLengthIncreasingSize (2039 of 2141)
PASS: lldb-unit :: Utility/Release/UtilityTests/StringListTest.GetMaxStringLengthMixed (2040 of 2141)
PASS: lldb-unit :: Utility/Release/UtilityTests/StringListTest.InsertStringAtIndexEnd (2041 of 2141)
PASS: lldb-unit :: Utility/Release/UtilityTests/StringListTest.InsertStringAtIndexMove (2042 of 2141)
PASS: lldb-unit :: Utility/Release/UtilityTests/StringListTest.GetSize (2043 of 2141)
PASS: lldb-unit :: Utility/Release/UtilityTests/StringListTest.InsertStringAtIndexStart (2044 of 2141)
PASS: lldb-unit :: Utility/Release/UtilityTests/StringListTest.InsertStringAtIndexStdString (2045 of 2141)
PASS: lldb-unit :: Utility/Release/UtilityTests/StringListTest.InsertStringAtIndexOutOfBounds (2046 of 2141)
PASS: lldb-unit :: Utility/Release/UtilityTests/StringListTest.JoinEmpty (2047 of 2141)
PASS: lldb-unit :: Utility/Release/UtilityTests/StringListTest.Join (2048 of 2141)
PASS: lldb-unit :: Utility/Release/UtilityTests/StringListTest.JoinMultiCharSeparator (2049 of 2141)
PASS: lldb-unit :: Utility/Release/UtilityTests/StringListTest.JoinNonSpace (2050 of 2141)
PASS: lldb-unit :: Utility/Release/UtilityTests/StringListTest.JoinSingle (2051 of 2141)
PASS: lldb-unit :: Utility/Release/UtilityTests/StringListTest.JoinThree (2052 of 2141)
PASS: lldb-unit :: Utility/Release/UtilityTests/StringListTest.LongestCommonPrefix (2053 of 2141)
PASS: lldb-unit :: Utility/Release/UtilityTests/StringListTest.LongestCommonPrefixDuplicateElement (2054 of 2141)
PASS: lldb-unit :: Utility/Release/UtilityTests/StringListTest.LongestCommonPrefixNoPrefix (2055 of 2141)
PASS: lldb-unit :: Utility/Release/UtilityTests/StringListTest.LongestCommonPrefixEmpty (2056 of 2141)
PASS: lldb-unit :: Utility/Release/UtilityTests/StringListTest.PopBack (2057 of 2141)
PASS: lldb-unit :: Utility/Release/UtilityTests/StringListTest.RemoveBlankLines (2058 of 2141)
PASS: lldb-unit :: Utility/Release/UtilityTests/StringListTest.LongestCommonPrefixSingleElement (2059 of 2141)
PASS: lldb-unit :: Utility/Release/UtilityTests/StringListTest.SetSize (2060 of 2141)
PASS: lldb-unit :: Utility/Release/UtilityTests/StringListTest.ShiftStdString (2061 of 2141)
PASS: lldb-unit :: Utility/Release/UtilityTests/StringListTest.ShiftMove (2062 of 2141)
PASS: lldb-unit :: Utility/Release/UtilityTests/StringListTest.SplitIntoLines (2063 of 2141)
PASS: lldb-unit :: Utility/Release/UtilityTests/StringListTest.ShiftCString (2064 of 2141)
PASS: lldb-unit :: Utility/Release/UtilityTests/StringListTest.SplitIntoLinesEmpty (2065 of 2141)
PASS: lldb-unit :: Utility/Release/UtilityTests/StringListTest.SplitIntoLinesSingleTrailingCR (2066 of 2141)
PASS: lldb-unit :: Utility/Release/UtilityTests/StructuredDataTest.ParseJSONFromFile (2067 of 2141)
PASS: lldb-unit :: Utility/Release/UtilityTests/StructuredDataTest.StringDump (2068 of 2141)
PASS: lldb-unit :: Utility/Release/UtilityTests/SubsystemRAIITest.NormalSubsystem (2069 of 2141)
PASS: lldb-unit :: Utility/Release/UtilityTests/SubsystemRAIITest.SubsystemWithErrorSuccess (2070 of 2141)
PASS: lldb-unit :: Utility/Release/UtilityTests/TimeoutTest.Construction (2071 of 2141)
PASS: lldb-unit :: Utility/Release/UtilityTests/SubsystemRAIITest.SubsystemWithErrorFailure (2072 of 2141)
PASS: lldb-unit :: Utility/Release/UtilityTests/TildeExpressionResolver.ResolveFullPath (2073 of 2141)
PASS: lldb-unit :: Utility/Release/UtilityTests/TimeoutTest.Format (2074 of 2141)
PASS: lldb-unit :: Utility/Release/UtilityTests/UUIDTest.RelationalOperators (2075 of 2141)
PASS: lldb-unit :: Utility/Release/UtilityTests/UUIDTest.StringConverion (2076 of 2141)
PASS: lldb-unit :: Utility/Release/UtilityTests/UUIDTest.SetFromStringRef (2077 of 2141)
PASS: lldb-unit :: Utility/Release/UtilityTests/TimerTest.CategoryTimes (2078 of 2141)
PASS: lldb-unit :: Utility/Release/UtilityTests/UUIDTest.Validity (2079 of 2141)
PASS: lldb-unit :: Utility/Release/UtilityTests/UriParserTest.BadPort (2080 of 2141)
PASS: lldb-unit :: Utility/Release/UtilityTests/UriParserTest.BadPort2 (2081 of 2141)
PASS: lldb-unit :: Utility/Release/UtilityTests/TimerTest.CategoryTimesNested (2082 of 2141)
PASS: lldb-unit :: Utility/Release/UtilityTests/UriParserTest.BracketedHostname (2083 of 2141)
PASS: lldb-unit :: Utility/Release/UtilityTests/UriParserTest.BracketedHostnamePort (2084 of 2141)
PASS: lldb-unit :: Utility/Release/UtilityTests/UriParserTest.BracketedHostnameWithPortIPv4 (2085 of 2141)
PASS: lldb-unit :: Utility/Release/UtilityTests/UriParserTest.BracketedHostnameWithColon (2086 of 2141)
PASS: lldb-unit :: Utility/Release/UtilityTests/UriParserTest.BracketedHostnameWithPortIPv6 (2087 of 2141)
PASS: lldb-unit :: Utility/Release/UtilityTests/UriParserTest.Empty (2088 of 2141)
PASS: lldb-unit :: Utility/Release/UtilityTests/UriParserTest.Minimal (2089 of 2141)
PASS: lldb-unit :: Utility/Release/UtilityTests/UriParserTest.LongPath (2090 of 2141)
PASS: lldb-unit :: Utility/Release/UtilityTests/UriParserTest.MinimalPath (2091 of 2141)
PASS: lldb-unit :: SymbolFile/DWARF/Release/SymbolFileDWARFTests/XcodeSDKModuleTests.TestModuleGetXcodeSDK (2092 of 2141)
PASS: lldb-unit :: Utility/Release/UtilityTests/UriParserTest.MinimalPort (2093 of 2141)
PASS: lldb-unit :: Utility/Release/UtilityTests/UriParserTest.MinimalPortPath (2094 of 2141)
PASS: lldb-unit :: Utility/Release/UtilityTests/UriParserTest.SchemeHostSeparator (2095 of 2141)
PASS: lldb-unit :: Utility/Release/UtilityTests/UriParserTest.PortOverflow (2096 of 2141)
PASS: lldb-unit :: Utility/Release/UtilityTests/UriParserTest.SchemeHostSeparator2 (2097 of 2141)
PASS: lldb-unit :: Utility/Release/UtilityTests/UriParserTest.SchemeHostSeparator3 (2098 of 2141)
PASS: lldb-unit :: Utility/Release/UtilityTests/UriParserTest.SchemeHostSeparator4 (2099 of 2141)
PASS: lldb-unit :: Utility/Release/UtilityTests/UriParserTest.TypicalPortPathIPv4 (2100 of 2141)
PASS: lldb-unit :: Utility/Release/UtilityTests/UriParserTest.TypicalPortPathIPv6 (2101 of 2141)
PASS: lldb-unit :: Utility/Release/UtilityTests/UserIDResolver.GetGroupName (2102 of 2141)
PASS: lldb-unit :: Utility/Release/UtilityTests/UserIDResolver.GetUserName (2103 of 2141)
PASS: lldb-unit :: Utility/Release/UtilityTests/VASprintfTest.BufferResize (2104 of 2141)
PASS: lldb-unit :: Utility/Release/UtilityTests/VASprintfTest.EncodingError (2105 of 2141)
PASS: lldb-unit :: Utility/Release/UtilityTests/VASprintfTest.NoBufferResize (2106 of 2141)
PASS: lldb-unit :: Utility/Release/UtilityTests/VMRange.Clear (2107 of 2141)
PASS: lldb-unit :: Utility/Release/UtilityTests/VMRange.CollectionContains (2108 of 2141)
PASS: lldb-unit :: Utility/Release/UtilityTests/VMRange.ContainsAddr (2109 of 2141)
PASS: lldb-unit :: Utility/Release/UtilityTests/VMRange.Comparison (2110 of 2141)
PASS: lldb-unit :: Utility/Release/UtilityTests/VMRange.ContainsRange (2111 of 2141)
PASS: lldb-unit :: Utility/Release/UtilityTests/VMRange.IsValid (2112 of 2141)
PASS: lldb-unit :: Utility/Release/UtilityTests/VMRange.Ordering (2113 of 2141)
PASS: lldb-unit :: Utility/Release/UtilityTests/VMRange.SetEndAddress (2114 of 2141)
PASS: lldb-unit :: Utility/Release/UtilityTests/VMRange.Reset (2115 of 2141)
PASS: lldb-unit :: Utility/Release/UtilityTests/XcodeSDKTest.FindXcodeContentsDirectoryInPath (2116 of 2141)
PASS: lldb-unit :: Utility/Release/UtilityTests/XcodeSDKTest.GetCanonicalNameAndConstruct (2117 of 2141)
PASS: lldb-unit :: Utility/Release/UtilityTests/XcodeSDKTest.GetSDKTypeForTriple (2118 of 2141)
PASS: lldb-unit :: Utility/Release/UtilityTests/XcodeSDKTest.MergeTest (2119 of 2141)
PASS: lldb-unit :: Utility/Release/UtilityTests/XcodeSDKTest.ParseTest (2120 of 2141)
PASS: lldb-unit :: Utility/Release/UtilityTests/XcodeSDKTest.SDKSupportsModules (2121 of 2141)
PASS: lldb-unit :: Utility/Release/UtilityTests/XcodeSDKTest.SDKSupportsSwift (2122 of 2141)
PASS: lldb-unit :: debugserver/Release/debugserverTests/JSON.Parse (2123 of 2141)
PASS: lldb-unit :: debugserver/Release/debugserverTests/RNBSocket.LoopBackConnectIPv4 (2124 of 2141)
PASS: lldb-unit :: debugserver/Release/debugserverTests/RNBSocket.LoopBackConnectIPv6 (2125 of 2141)
PASS: lldb-unit :: Utility/Release/UtilityTests/TimerTest.CategoryTimes2 (2126 of 2141)
PASS: lldb-unit :: debugserver/Release/debugserverTests/RNBSocket.LoopBackListenIPv4 (2127 of 2141)
PASS: lldb-unit :: debugserver/Release/debugserverTests/RNBSocket.LoopBackListenIPv6 (2128 of 2141)
PASS: lldb-unit :: Utility/Release/UtilityTests/TimerTest.CategoryTimesStats (2129 of 2141)
PASS: lldb-unit :: debugserver/Release/debugserverTests/RNBSocket.AnyListen (2130 of 2141)
PASS: lldb-unit :: tools/lldb-server/tests/Release/LLDBServerTests/StandardStartupTest.TestStopReplyContainsThreadPcs (2131 of 2141)
PASS: lldb-unit :: tools/lldb-server/tests/Release/LLDBServerTests/TestBase.DebugserverEnv (2132 of 2141)
PASS: lldb-unit :: tools/lldb-server/tests/Release/LLDBServerTests/TestBase.LaunchModePreservesEnvironment (2133 of 2141)
PASS: lldb-unit :: Platform/Release/LLDBPlatformTests/PlatformAppleSimulatorTest.TestHostPlatformToSim (2134 of 2141)
PASS: lldb-unit :: Platform/Release/LLDBPlatformTests/PlatformAppleSimulatorTest.TestSimHasSimEnvionament (2135 of 2141)
PASS: lldb-shell :: Reproducer/TestMultipleTargets.test (2136 of 2141)
PASS: lldb-shell :: Reproducer/TestGDBRemoteRepro.test (2137 of 2141)
PASS: lldb-unit :: Process/gdb-remote/Release/ProcessGdbRemoteTests/GDBRemoteClientBaseTest.InterruptNoResponse (2138 of 2141)
PASS: lldb-shell :: Reproducer/TestReuseDirectory.test (2139 of 2141)
PASS: lldb-shell :: Reproducer/TestVersionCheck.test (2140 of 2141)
PASS: lldb-shell :: Reproducer/TestVerify.test (2141 of 2141)
********************
Failed Tests (881):
  lldb-api :: android/platform/TestDefaultCacheLineSize.py
  lldb-api :: api/check_public_api_headers/TestPublicAPIHeaders.py
  lldb-api :: api/command-return-object/TestSBCommandReturnObject.py
  lldb-api :: api/listeners/TestListener.py
  lldb-api :: api/log/TestAPILog.py
  lldb-api :: api/multiple-debuggers/TestMultipleDebuggers.py
  lldb-api :: api/multiple-targets/TestMultipleTargets.py
  lldb-api :: api/multithreaded/TestMultithreaded.py
  lldb-api :: arm/breakpoint-it/TestBreakpointIt.py
  lldb-api :: arm/breakpoint-thumb-codesection/TestBreakpointThumbCodesection.py
  lldb-api :: arm/emulation/TestEmulations.py
  lldb-api :: assert_messages_test/TestAssertMessages.py
  lldb-api :: benchmarks/continue/TestBenchmarkContinue.py
  lldb-api :: benchmarks/expression/TestExpressionCmd.py
  lldb-api :: benchmarks/expression/TestRepeatedExprs.py
  lldb-api :: benchmarks/frame_variable/TestFrameVariableResponse.py
  lldb-api :: benchmarks/libcxxlist/TestBenchmarkLibcxxList.py
  lldb-api :: benchmarks/libcxxmap/TestBenchmarkLibcxxMap.py
  lldb-api :: benchmarks/startup/TestStartupDelays.py
  lldb-api :: benchmarks/stepping/TestSteppingSpeed.py
  lldb-api :: benchmarks/turnaround/TestCompileRunToBreakpointTurnaround.py
  lldb-api :: commands/add-dsym/uuid/TestAddDsymCommand.py
  lldb-api :: commands/apropos/basic/TestApropos.py
  lldb-api :: commands/apropos/with-process/TestAproposWithProcess.py
  lldb-api :: commands/breakpoint/command/list/TestBreakpointCommandList.py
  lldb-api :: commands/breakpoint/set/func-regex/TestBreakpointRegexError.py
  lldb-api :: commands/command/delete/TestCommandDelete.py
  lldb-api :: commands/command/invalid-args/TestInvalidArgsCommand.py
  lldb-api :: commands/command/nested_alias/TestNestedAlias.py
  lldb-api :: commands/command/script/TestCommandScript.py
  lldb-api :: commands/command/script/import/TestImport.py
  lldb-api :: commands/command/script/import/rdar-12586188/TestRdar12586188.py
  lldb-api :: commands/command/script_alias/TestCommandScriptAlias.py
  lldb-api :: commands/command/source/TestCommandSource.py
  lldb-api :: commands/disassemble/basic/TestDisassembleBreakpoint.py
  lldb-api :: commands/disassemble/basic/TestFrameDisassemble.py
  lldb-api :: commands/expression/anonymous-struct/TestCallUserAnonTypedef.py
  lldb-api :: commands/expression/argument_passing_restrictions/TestArgumentPassingRestrictions.py
  lldb-api :: commands/expression/calculator_mode/TestCalculatorMode.py
  lldb-api :: commands/expression/call-function/TestCallBuiltinFunction.py
  lldb-api :: commands/expression/call-function/TestCallStdStringFunction.py
  lldb-api :: commands/expression/call-function/TestCallStopAndContinue.py
  lldb-api :: commands/expression/call-function/TestCallUserDefinedFunction.py
  lldb-api :: commands/expression/call-restarts/TestCallThatRestarts.py
  lldb-api :: commands/expression/call-throws/TestCallThatThrows.py
  lldb-api :: commands/expression/cast_int_to_anonymous_enum/TestCastIntToAnonymousEnum.py
  lldb-api :: commands/expression/char/TestExprsChar.py
  lldb-api :: commands/expression/class_template_specialization_empty_pack/TestClassTemplateSpecializationParametersHandling.py
  lldb-api :: commands/expression/codegen-crash-import-def-arraytype-element/TestImportDefinitionArrayType.py
  lldb-api :: commands/expression/codegen-crash-typedefdecl-not-in_declcontext/TestCodegenCrashTypedefDeclNotInDeclContext.py
  lldb-api :: commands/expression/completion-crash-incomplete-record/TestCompletionCrashIncompleteRecord.py
  lldb-api :: commands/expression/completion-crash-invalid-iterator/TestInvalidIteratorCompletionCrash.py
  lldb-api :: commands/expression/completion-in-lambda-and-unnamed-class/TestCompletionInLambdaAndUnnamedClass.py
  lldb-api :: commands/expression/completion/TestExprCompletion.py
  lldb-api :: commands/expression/context-object-objc/TestContextObjectObjc.py
  lldb-api :: commands/expression/context-object/TestContextObject.py
  lldb-api :: commands/expression/deleting-implicit-copy-constructor/TestDeletingImplicitCopyConstructor.py
  lldb-api :: commands/expression/diagnostics/TestExprDiagnostics.py
  lldb-api :: commands/expression/dollar-in-variable/TestDollarInVariable.py
  lldb-api :: commands/expression/dont_allow_jit/TestAllowJIT.py
  lldb-api :: commands/expression/entry-bp/TestExprEntryBP.py
  lldb-api :: commands/expression/expr-in-syscall/TestExpressionInSyscall.py
  lldb-api :: commands/expression/fixits/TestFixIts.py
  lldb-api :: commands/expression/formatters/TestFormatters.py
  lldb-api :: commands/expression/function_template_specialization_temp_args/TestFunctionTemplateSpecializationTempArgs.py
  lldb-api :: commands/expression/ignore-artificial-constructors/TestIgnoreArtificialConstructors.py
  lldb-api :: commands/expression/import-std-module/basic/TestImportStdModule.py
  lldb-api :: commands/expression/import-std-module/conflicts/TestStdModuleWithConflicts.py
  lldb-api :: commands/expression/import-std-module/deque-basic/TestDequeFromStdModule.py
  lldb-api :: commands/expression/import-std-module/deque-dbg-info-content/TestDbgInfoContentDequeFromStdModule.py
  lldb-api :: commands/expression/import-std-module/empty-module/TestEmptyStdModule.py
  lldb-api :: commands/expression/import-std-module/forward_decl_from_module/TestForwardDeclFromStdModule.py
  lldb-api :: commands/expression/import-std-module/forward_list-dbg-info-content/TestDbgInfoContentForwardListFromStdModule.py
  lldb-api :: commands/expression/import-std-module/forward_list/TestForwardListFromStdModule.py
  lldb-api :: commands/expression/import-std-module/list-dbg-info-content/TestDbgInfoContentListFromStdModule.py
  lldb-api :: commands/expression/import-std-module/list/TestListFromStdModule.py
  lldb-api :: commands/expression/import-std-module/no-std-module/TestMissingStdModule.py
  lldb-api :: commands/expression/import-std-module/pair/TestPairFromStdModule.py
  lldb-api :: commands/expression/import-std-module/queue/TestQueueFromStdModule.py
  lldb-api :: commands/expression/import-std-module/shared_ptr-dbg-info-content/TestSharedPtrDbgInfoContentFromStdModule.py
  lldb-api :: commands/expression/import-std-module/shared_ptr/TestSharedPtrFromStdModule.py
  lldb-api :: commands/expression/import-std-module/stack/TestStackFromStdModule.py
  lldb-api :: commands/expression/import-std-module/sysroot/TestStdModuleSysroot.py
  lldb-api :: commands/expression/import-std-module/unique_ptr-dbg-info-content/TestUniquePtrDbgInfoContent.py
  lldb-api :: commands/expression/import-std-module/unique_ptr/TestUniquePtrFromStdModule.py
  lldb-api :: commands/expression/import-std-module/vector-bool/TestVectorBoolFromStdModule.py
  lldb-api :: commands/expression/import-std-module/vector-dbg-info-content/TestDbgInfoContentVectorFromStdModule.py
  lldb-api :: commands/expression/import-std-module/vector-of-vectors/TestVectorOfVectorsFromStdModule.py
  lldb-api :: commands/expression/import-std-module/vector/TestVectorFromStdModule.py
  lldb-api :: commands/expression/import-std-module/weak_ptr-dbg-info-content/TestDbgInfoContentWeakPtrFromStdModule.py
  lldb-api :: commands/expression/import-std-module/weak_ptr/TestWeakPtrFromStdModule.py
  lldb-api :: commands/expression/import_base_class_when_class_has_derived_member/TestImportBaseClassWhenClassHasDerivedMember.py
  lldb-api :: commands/expression/import_builtin_fileid/TestImportBuiltinFileID.py
  lldb-api :: commands/expression/inline-namespace/TestInlineNamespace.py
  lldb-api :: commands/expression/invalid-args/TestInvalidArgsExpression.py
  lldb-api :: commands/expression/ir-interpreter-phi-nodes/TestIRInterpreterPHINodes.py
  lldb-api :: commands/expression/ir-interpreter/TestIRInterpreter.py
  lldb-api :: commands/expression/issue_11588/Test11588.py
  lldb-api :: commands/expression/macros/TestMacros.py
  lldb-api :: commands/expression/multiline-completion/TestMultilineCompletion.py
  lldb-api :: commands/expression/multiline-navigation/TestMultilineNavigation.py
  lldb-api :: commands/expression/namespace_local_var_same_name_cpp_and_c/TestNamespaceLocalVarSameNameCppAndC.py
  lldb-api :: commands/expression/namespace_local_var_same_name_obj_c/TestNamespaceLocalVarSameNameObjC.py
  lldb-api :: commands/expression/no-deadlock/TestExprDoesntBlock.py
  lldb-api :: commands/expression/options/TestExprOptions.py
  lldb-api :: commands/expression/persist_objc_pointeetype/TestPersistObjCPointeeType.py
  lldb-api :: commands/expression/persistent_ptr_update/TestPersistentPtrUpdate.py
  lldb-api :: commands/expression/persistent_types/TestNestedPersistentTypes.py
  lldb-api :: commands/expression/persistent_types/TestPersistentTypes.py
  lldb-api :: commands/expression/persistent_variables/TestPersistentVariables.py
  lldb-api :: commands/expression/po_verbosity/TestPoVerbosity.py
  lldb-api :: commands/expression/pr35310/TestExprsBug35310.py
  lldb-api :: commands/expression/radar_8638051/Test8638051.py
  lldb-api :: commands/expression/radar_9531204/TestPrintfAfterUp.py
  lldb-api :: commands/expression/radar_9673664/TestExprHelpExamples.py
  lldb-api :: commands/expression/rdar42038760/TestScalarURem.py
  lldb-api :: commands/expression/rdar44436068/Test128BitsInteger.py
  lldb-api :: commands/expression/regression-access-function-template-in-record/TestRegressionAccessFunctionTemplateInRecord.py
  lldb-api :: commands/expression/result_numbering/TestResultNumbering.py
  lldb-api :: commands/expression/save_jit_objects/TestSaveJITObjects.py
  lldb-api :: commands/expression/scoped_enums/TestScopedEnumType.py
  lldb-api :: commands/expression/static-initializers/TestStaticInitializers.py
  lldb-api :: commands/expression/test/TestExprs.py
  lldb-api :: commands/expression/test/TestExprs2.py
  lldb-api :: commands/expression/timeout/TestCallWithTimeout.py
  lldb-api :: commands/expression/top-level/TestTopLevelExprs.py
  lldb-api :: commands/expression/two-files/TestObjCTypeQueryFromOtherCompileUnit.py
  lldb-api :: commands/expression/unicode-in-variable/TestUnicodeInVariable.py
  lldb-api :: commands/expression/unwind_expression/TestUnwindExpression.py
  lldb-api :: commands/expression/vector_of_enums/TestVectorOfEnums.py
  lldb-api :: commands/expression/weak_symbols/TestWeakSymbols.py
  lldb-api :: commands/expression/xvalue/TestXValuePrinting.py
  lldb-api :: commands/frame/diagnose/array/TestArray.py
  lldb-api :: commands/frame/diagnose/bad-reference/TestBadReference.py
  lldb-api :: commands/frame/diagnose/complicated-expression/TestComplicatedExpression.py
  lldb-api :: commands/frame/diagnose/dereference-argument/TestDiagnoseDereferenceArgument.py
  lldb-api :: commands/frame/diagnose/dereference-function-return/TestDiagnoseDereferenceFunctionReturn.py
  lldb-api :: commands/frame/diagnose/dereference-this/TestDiagnoseDereferenceThis.py
  lldb-api :: commands/frame/diagnose/inheritance/TestDiagnoseInheritance.py
  lldb-api :: commands/frame/diagnose/local-variable/TestLocalVariable.py
  lldb-api :: commands/frame/diagnose/virtual-method-call/TestDiagnoseDereferenceVirtualMethodCall.py
  lldb-api :: commands/frame/language/TestGuessLanguage.py
  lldb-api :: commands/frame/recognizer/TestFrameRecognizer.py
  lldb-api :: commands/frame/select/TestFrameSelect.py
  lldb-api :: commands/frame/var-scope/TestFrameVariableScope.py
  lldb-api :: commands/frame/var/TestFrameVar.py
  lldb-api :: commands/gui/basic/TestGuiBasic.py
  lldb-api :: commands/gui/basicdebug/TestGuiBasicDebug.py
  lldb-api :: commands/gui/breakpoints/TestGuiBreakpoints.py
  lldb-api :: commands/gui/invalid-args/TestInvalidArgsGui.py
  lldb-api :: commands/gui/viewlarge/TestGuiViewLarge.py
  lldb-api :: commands/help/TestHelp.py
  lldb-api :: commands/log/basic/TestLogging.py
  lldb-api :: commands/log/invalid-args/TestInvalidArgsLog.py
  lldb-api :: commands/platform/basic/TestPlatformCommand.py
  lldb-api :: commands/platform/basic/TestPlatformPython.py
  lldb-api :: commands/platform/file/close/TestPlatformFileClose.py
  lldb-api :: commands/platform/file/read/TestPlatformFileRead.py
  lldb-api :: commands/platform/process/list/TestProcessList.py
  lldb-api :: commands/process/attach-resume/TestAttachResume.py
  lldb-api :: commands/process/attach/TestProcessAttach.py
  lldb-api :: commands/process/attach/attach_denied/TestAttachDenied.py
  lldb-api :: commands/process/launch-with-shellexpand/TestLaunchWithShellExpand.py
  lldb-api :: commands/process/launch/TestProcessLaunch.py
  lldb-api :: commands/process/signal/TestProcessSignal.py
  lldb-api :: commands/quit/TestQuit.py
  lldb-api :: commands/register/register/aarch64_sve_registers/rw_access_static_config/TestSVERegisters.py
  lldb-api :: commands/register/register/intel_xtended_registers/TestMPXRegisters.py
  lldb-api :: commands/register/register/intel_xtended_registers/mpx_bound_violation/TestBoundViolation.py
  lldb-api :: commands/register/register/intel_xtended_registers/mpx_offset_intersection/TestMPXOffsetIntersection.py
  lldb-api :: commands/register/register/register_command/TestRegisters.py
  lldb-api :: commands/reproducer/invalid-args/TestInvalidArgsReproducer.py
  lldb-api :: commands/session/history/TestSessionHistory.py
  lldb-api :: commands/session/save/TestSessionSave.py
  lldb-api :: commands/settings/TestSettings.py
  lldb-api :: commands/settings/quoting/TestQuoting.py
  lldb-api :: commands/settings/use_source_cache/TestUseSourceCache.py
  lldb-api :: commands/source/info/TestSourceInfo.py
  lldb-api :: commands/statistics/basic/TestStats.py
  lldb-api :: commands/target/auto-install-main-executable/TestAutoInstallMainExecutable.py
  lldb-api :: commands/target/basic/TestTargetCommand.py
  lldb-api :: commands/target/create-deps/TestTargetCreateDeps.py
  lldb-api :: commands/target/create-no-such-arch/TestNoSuchArch.py
  lldb-api :: commands/target/dump-symtab-demangle/TestDumpSymtabDemangle.py
  lldb-api :: commands/target/modules/search-paths/insert/TestTargetModulesSearchpathsInsert.py
  lldb-api :: commands/target/select/TestTargetSelect.py
  lldb-api :: commands/target/stop-hook/delete/TestTargetStopHookDelete.py
  lldb-api :: commands/target/stop-hook/disable/TestTargetStopHookDisable.py
  lldb-api :: commands/target/stop-hook/enable/TestTargetStopHookEnable.py
  lldb-api :: commands/target/stop-hooks/TestStopHooks.py
  lldb-api :: commands/thread/select/TestThreadSelect.py
  lldb-api :: commands/trace/TestTraceLoad.py
  lldb-api :: commands/trace/TestTraceSchema.py
  lldb-api :: commands/version/TestVersion.py
  lldb-api :: commands/watchpoints/hello_watchlocation/TestWatchLocation.py
  lldb-api :: commands/watchpoints/hello_watchpoint/TestMyFirstWatchpoint.py
  lldb-api :: commands/watchpoints/multi_watchpoint_slots/TestWatchpointMultipleSlots.py
  lldb-api :: commands/watchpoints/multiple_hits/TestMultipleHits.py
  lldb-api :: commands/watchpoints/multiple_threads/TestWatchpointMultipleThreads.py
  lldb-api :: commands/watchpoints/step_over_watchpoint/TestStepOverWatchpoint.py
  lldb-api :: commands/watchpoints/variable_out_of_scope/TestWatchedVarHitWhenInScope.py
  lldb-api :: commands/watchpoints/watchpoint_commands/TestWatchpointCommands.py
  lldb-api :: commands/watchpoints/watchpoint_commands/command/TestWatchpointCommandLLDB.py
  lldb-api :: commands/watchpoints/watchpoint_commands/command/TestWatchpointCommandPython.py
  lldb-api :: commands/watchpoints/watchpoint_commands/condition/TestWatchpointConditionCmd.py
  lldb-api :: commands/watchpoints/watchpoint_count/TestWatchpointCount.py
  lldb-api :: commands/watchpoints/watchpoint_disable/TestWatchpointDisable.py
  lldb-api :: commands/watchpoints/watchpoint_events/TestWatchpointEvents.py
  lldb-api :: commands/watchpoints/watchpoint_on_vectors/TestValueOfVectorVariable.py
  lldb-api :: commands/watchpoints/watchpoint_set_command/TestWatchLocationWithWatchSet.py
  lldb-api :: commands/watchpoints/watchpoint_size/TestWatchpointSizes.py
  lldb-api :: driver/batch_mode/TestBatchMode.py
  lldb-api :: functionalities/abbreviation/TestAbbreviations.py
  lldb-api :: functionalities/abbreviation/TestCommonShortSpellings.py
  lldb-api :: functionalities/archives/TestBSDArchives.py
  lldb-api :: functionalities/asan/TestMemoryHistory.py
  lldb-api :: functionalities/asan/TestReportData.py
  lldb-api :: functionalities/avoids-fd-leak/TestFdLeak.py
  lldb-api :: functionalities/backticks/TestBackticksWithoutATarget.py
  lldb-api :: functionalities/breakpoint/address_breakpoints/TestAddressBreakpoints.py
  lldb-api :: functionalities/breakpoint/address_breakpoints/TestBadAddressBreakpoints.py
  lldb-api :: functionalities/breakpoint/auto_continue/TestBreakpointAutoContinue.py
  lldb-api :: functionalities/breakpoint/breakpoint_by_file_colon_line/TestBreakpointByFileColonLine.py
  lldb-api :: functionalities/breakpoint/breakpoint_by_line_and_column/TestBreakpointByLineAndColumn.py
  lldb-api :: functionalities/breakpoint/breakpoint_callback_command_source/TestBreakpointCallbackCommandSource.py
  lldb-api :: functionalities/breakpoint/breakpoint_command/TestBreakpointCommand.py
  lldb-api :: functionalities/breakpoint/breakpoint_command/TestBreakpointCommandsFromPython.py
  lldb-api :: functionalities/breakpoint/breakpoint_command/TestRegexpBreakCommand.py
  lldb-api :: functionalities/breakpoint/breakpoint_conditions/TestBreakpointConditions.py
  lldb-api :: functionalities/breakpoint/breakpoint_hit_count/TestBreakpointHitCount.py
  lldb-api :: functionalities/breakpoint/breakpoint_ids/TestBreakpointIDs.py
  lldb-api :: functionalities/breakpoint/breakpoint_ignore_count/TestBreakpointIgnoreCount.py
  lldb-api :: functionalities/breakpoint/breakpoint_in_delayslot/TestAvoidBreakpointInDelaySlot.py
  lldb-api :: functionalities/breakpoint/breakpoint_language/TestBreakpointLanguage.py
  lldb-api :: functionalities/breakpoint/breakpoint_locations/TestBreakpointLocations.py
  lldb-api :: functionalities/breakpoint/breakpoint_names/TestBreakpointNames.py
  lldb-api :: functionalities/breakpoint/breakpoint_options/TestBreakpointOptions.py
  lldb-api :: functionalities/breakpoint/breakpoint_set_restart/TestBreakpointSetRestart.py
  lldb-api :: functionalities/breakpoint/comp_dir_symlink/TestCompDirSymLink.py
  lldb-api :: functionalities/breakpoint/consecutive_breakpoints/TestConsecutiveBreakpoints.py
  lldb-api :: functionalities/breakpoint/cpp/TestCPPBreakpointLocations.py
  lldb-api :: functionalities/breakpoint/cpp_exception/TestCPPExceptionBreakpoint.py
  lldb-api :: functionalities/breakpoint/debugbreak/TestDebugBreak.py
  lldb-api :: functionalities/breakpoint/dummy_target_breakpoints/TestBreakpointsWithNoTargets.py
  lldb-api :: functionalities/breakpoint/global_constructor/TestBreakpointInGlobalConstructor.py
  lldb-api :: functionalities/breakpoint/hardware_breakpoints/hardware_breakpoint_on_multiple_threads/TestHWBreakMultiThread.py
  lldb-api :: functionalities/breakpoint/hardware_breakpoints/require_hw_breakpoints/TestRequireHWBreakpoints.py
  lldb-api :: functionalities/breakpoint/hardware_breakpoints/write_memory_with_hw_breakpoint/TestWriteMemoryWithHWBreakpoint.py
  lldb-api :: functionalities/breakpoint/inlined_breakpoints/TestInlinedBreakpoints.py
  lldb-api :: functionalities/breakpoint/move_nearest/TestMoveNearest.py
  lldb-api :: functionalities/breakpoint/objc/TestObjCBreakpoints.py
  lldb-api :: functionalities/breakpoint/scripted_bkpt/TestScriptedResolver.py
  lldb-api :: functionalities/breakpoint/serialize/TestBreakpointSerialization.py
  lldb-api :: functionalities/breakpoint/source_regexp/TestSourceRegexBreakpoints.py
  lldb-api :: functionalities/breakpoint/step_over_breakpoint/TestStepOverBreakpoint.py
  lldb-api :: functionalities/completion/TestCompletion.py
  lldb-api :: functionalities/conditional_break/TestConditionalBreak.py
  lldb-api :: functionalities/darwin_log/basic/TestDarwinLogBasic.py
  lldb-api :: functionalities/darwin_log/filter/exact_match/activity-chain/TestDarwinLogFilterMatchActivityChain.py
  lldb-api :: functionalities/darwin_log/filter/exact_match/activity/TestDarwinLogFilterMatchActivity.py
  lldb-api :: functionalities/darwin_log/filter/exact_match/category/TestDarwinLogFilterMatchCategory.py
  lldb-api :: functionalities/darwin_log/filter/exact_match/message/TestDarwinLogFilterMatchMessage.py
  lldb-api :: functionalities/darwin_log/filter/exact_match/subsystem/TestDarwinLogFilterMatchSubsystem.py
  lldb-api :: functionalities/darwin_log/filter/regex/activity-chain/TestDarwinLogFilterRegexActivityChain.py
  lldb-api :: functionalities/darwin_log/filter/regex/activity/TestDarwinLogFilterRegexActivity.py
  lldb-api :: functionalities/darwin_log/filter/regex/category/TestDarwinLogFilterRegexCategory.py
  lldb-api :: functionalities/darwin_log/filter/regex/message/TestDarwinLogFilterRegexMessage.py
  lldb-api :: functionalities/darwin_log/filter/regex/subsystem/TestDarwinLogFilterRegexSubsystem.py
  lldb-api :: functionalities/darwin_log/format/TestDarwinLogMessageFormat.py
  lldb-api :: functionalities/darwin_log/source/debug/TestDarwinLogSourceDebug.py
  lldb-api :: functionalities/darwin_log/source/info/TestDarwinLogSourceInfo.py
  lldb-api :: functionalities/data-formatter/array_typedef/TestArrayTypedef.py
  lldb-api :: functionalities/data-formatter/boolreference/TestFormattersBoolRefPtr.py
  lldb-api :: functionalities/data-formatter/builtin-formats/TestBuiltinFormats.py
  lldb-api :: functionalities/data-formatter/compactvectors/TestCompactVectors.py
  lldb-api :: functionalities/data-formatter/cstring-utf8-summary/TestCstringUnicode.py
  lldb-api :: functionalities/data-formatter/data-formatter-advanced/TestDataFormatterAdv.py
  lldb-api :: functionalities/data-formatter/data-formatter-caching/TestDataFormatterCaching.py
  lldb-api :: functionalities/data-formatter/data-formatter-categories/TestDataFormatterCategories.py
  lldb-api :: functionalities/data-formatter/data-formatter-cpp/TestDataFormatterCpp.py
  lldb-api :: functionalities/data-formatter/data-formatter-disabling/TestDataFormatterDisabling.py
  lldb-api :: functionalities/data-formatter/data-formatter-enum-format/TestDataFormatterEnumFormat.py
  lldb-api :: functionalities/data-formatter/data-formatter-globals/TestDataFormatterGlobals.py
  lldb-api :: functionalities/data-formatter/data-formatter-named-summaries/TestDataFormatterNamedSummaries.py
  lldb-api :: functionalities/data-formatter/data-formatter-objc/TestDataFormatterObjCCF.py
  lldb-api :: functionalities/data-formatter/data-formatter-objc/TestDataFormatterObjCExpr.py
  lldb-api :: functionalities/data-formatter/data-formatter-objc/TestDataFormatterObjCKVO.py
  lldb-api :: functionalities/data-formatter/data-formatter-objc/TestDataFormatterObjCNSBundle.py
  lldb-api :: functionalities/data-formatter/data-formatter-objc/TestDataFormatterObjCNSContainer.py
  lldb-api :: functionalities/data-formatter/data-formatter-objc/TestDataFormatterObjCNSData.py
  lldb-api :: functionalities/data-formatter/data-formatter-objc/TestDataFormatterObjCNSDate.py
  lldb-api :: functionalities/data-formatter/data-formatter-objc/TestDataFormatterObjCNSError.py
  lldb-api :: functionalities/data-formatter/data-formatter-objc/TestDataFormatterObjCNSURL.py
  lldb-api :: functionalities/data-formatter/data-formatter-objc/TestDataFormatterObjCPlain.py
  lldb-api :: functionalities/data-formatter/data-formatter-objc/TestDataFormatterObjNSException.py
  lldb-api :: functionalities/data-formatter/data-formatter-objc/cmtime/TestDataFormatterCMTime.py
  lldb-api :: functionalities/data-formatter/data-formatter-objc/nsindexpath/TestDataFormatterNSIndexPath.py
  lldb-api :: functionalities/data-formatter/data-formatter-objc/nsstring/TestDataFormatterNSString.py
  lldb-api :: functionalities/data-formatter/data-formatter-proper-plurals/TestFormattersOneIsSingular.py
  lldb-api :: functionalities/data-formatter/data-formatter-ptr-to-array/TestPtrToArrayFormatting.py
  lldb-api :: functionalities/data-formatter/data-formatter-python-synth/TestDataFormatterPythonSynth.py
  lldb-api :: functionalities/data-formatter/data-formatter-script/TestDataFormatterScript.py
  lldb-api :: functionalities/data-formatter/data-formatter-skip-summary/TestDataFormatterSkipSummary.py
  lldb-api :: functionalities/data-formatter/data-formatter-smart-array/TestDataFormatterSmartArray.py
  lldb-api :: functionalities/data-formatter/data-formatter-stl/libcxx/atomic/TestLibCxxAtomic.py
  lldb-api :: functionalities/data-formatter/data-formatter-stl/libcxx/bitset/TestDataFormatterLibcxxBitset.py
  lldb-api :: functionalities/data-formatter/data-formatter-stl/libcxx/deque/TestDataFormatterLibcxxDeque.py
  lldb-api :: functionalities/data-formatter/data-formatter-stl/libcxx/forward_list/TestDataFormatterLibcxxForwardList.py
  lldb-api :: functionalities/data-formatter/data-formatter-stl/libcxx/function/TestLibCxxFunction.py
  lldb-api :: functionalities/data-formatter/data-formatter-stl/libcxx/initializerlist/TestInitializerList.py
  lldb-api :: functionalities/data-formatter/data-formatter-stl/libcxx/iterator/TestDataFormatterLibccIterator.py
  lldb-api :: functionalities/data-formatter/data-formatter-stl/libcxx/list/TestDataFormatterLibcxxList.py
  lldb-api :: functionalities/data-formatter/data-formatter-stl/libcxx/list/loop/TestDataFormatterLibcxxListLoop.py
  lldb-api :: functionalities/data-formatter/data-formatter-stl/libcxx/map/TestDataFormatterLibccMap.py
  lldb-api :: functionalities/data-formatter/data-formatter-stl/libcxx/multimap/TestDataFormatterLibccMultiMap.py
  lldb-api :: functionalities/data-formatter/data-formatter-stl/libcxx/multiset/TestDataFormatterLibcxxMultiSet.py
  lldb-api :: functionalities/data-formatter/data-formatter-stl/libcxx/optional/TestDataFormatterLibcxxOptional.py
  lldb-api :: functionalities/data-formatter/data-formatter-stl/libcxx/queue/TestDataFormatterLibcxxQueue.py
  lldb-api :: functionalities/data-formatter/data-formatter-stl/libcxx/set/TestDataFormatterLibcxxSet.py
  lldb-api :: functionalities/data-formatter/data-formatter-stl/libcxx/string/TestDataFormatterLibcxxString.py
  lldb-api :: functionalities/data-formatter/data-formatter-stl/libcxx/tuple/TestDataFormatterLibcxxTuple.py
  lldb-api :: functionalities/data-formatter/data-formatter-stl/libcxx/unique_ptr/TestDataFormatterLibcxxUniquePtr.py
  lldb-api :: functionalities/data-formatter/data-formatter-stl/libcxx/unordered/TestDataFormatterUnordered.py
  lldb-api :: functionalities/data-formatter/data-formatter-stl/libcxx/variant/TestDataFormatterLibcxxVariant.py
  lldb-api :: functionalities/data-formatter/data-formatter-stl/libcxx/vbool/TestDataFormatterLibcxxVBool.py
  lldb-api :: functionalities/data-formatter/data-formatter-stl/libcxx/vector/TestDataFormatterLibcxxVector.py
  lldb-api :: functionalities/data-formatter/data-formatter-stl/libstdcpp/iterator/TestDataFormatterStdIterator.py
  lldb-api :: functionalities/data-formatter/data-formatter-stl/libstdcpp/list/TestDataFormatterStdList.py
  lldb-api :: functionalities/data-formatter/data-formatter-stl/libstdcpp/map/TestDataFormatterStdMap.py
  lldb-api :: functionalities/data-formatter/data-formatter-stl/libstdcpp/smart_ptr/TestDataFormatterStdSmartPtr.py
  lldb-api :: functionalities/data-formatter/data-formatter-stl/libstdcpp/string/TestDataFormatterStdString.py
  lldb-api :: functionalities/data-formatter/data-formatter-stl/libstdcpp/tuple/TestDataFormatterStdTuple.py
  lldb-api :: functionalities/data-formatter/data-formatter-stl/libstdcpp/unique_ptr/TestDataFormatterStdUniquePtr.py
  lldb-api :: functionalities/data-formatter/data-formatter-stl/libstdcpp/unique_ptr/invalid/TestDataFormatterInvalidStdUniquePtr.py
  lldb-api :: functionalities/data-formatter/data-formatter-stl/libstdcpp/vbool/TestDataFormatterStdVBool.py
  lldb-api :: functionalities/data-formatter/data-formatter-stl/libstdcpp/vector/TestDataFormatterStdVector.py
  lldb-api :: functionalities/data-formatter/data-formatter-synth/TestDataFormatterSynth.py
  lldb-api :: functionalities/data-formatter/data-formatter-synthtype/TestDataFormatterSynthType.py
  lldb-api :: functionalities/data-formatter/data-formatter-synthval/TestDataFormatterSynthVal.py
  lldb-api :: functionalities/data-formatter/dump_dynamic/TestDumpDynamic.py
  lldb-api :: functionalities/data-formatter/format-propagation/TestFormatPropagation.py
  lldb-api :: functionalities/data-formatter/frameformat_smallstruct/TestFrameFormatSmallStruct.py
  lldb-api :: functionalities/data-formatter/hexcaps/TestDataFormatterHexCaps.py
  lldb-api :: functionalities/data-formatter/language_category_updates/TestDataFormatterLanguageCategoryUpdates.py
  lldb-api :: functionalities/data-formatter/nsarraysynth/TestNSArraySynthetic.py
  lldb-api :: functionalities/data-formatter/nsdictionarysynth/TestNSDictionarySynthetic.py
  lldb-api :: functionalities/data-formatter/nssetsynth/TestNSSetSynthetic.py
  lldb-api :: functionalities/data-formatter/ostypeformatting/TestFormattersOsType.py
  lldb-api :: functionalities/data-formatter/parray/TestPrintArray.py
  lldb-api :: functionalities/data-formatter/poarray/TestPrintObjectArray.py
  lldb-api :: functionalities/data-formatter/ptr_ref_typedef/TestPtrRef2Typedef.py
  lldb-api :: functionalities/data-formatter/pyobjsynthprovider/TestPyObjSynthProvider.py
  lldb-api :: functionalities/data-formatter/refpointer-recursion/TestDataFormatterRefPtrRecursion.py
  lldb-api :: functionalities/data-formatter/setvaluefromcstring/TestSetValueFromCString.py
  lldb-api :: functionalities/data-formatter/stringprinter/TestStringPrinter.py
  lldb-api :: functionalities/data-formatter/summary-string-onfail/Test-rdar-9974002.py
  lldb-api :: functionalities/data-formatter/synthcapping/TestSyntheticCapping.py
  lldb-api :: functionalities/data-formatter/synthupdate/TestSyntheticFilterRecompute.py
  lldb-api :: functionalities/data-formatter/type_summary_list_arg/TestTypeSummaryListArg.py
  lldb-api :: functionalities/data-formatter/type_summary_list_script/TestTypeSummaryListScript.py
  lldb-api :: functionalities/data-formatter/typedef_array/TestTypedefArray.py
  lldb-api :: functionalities/data-formatter/user-format-vs-summary/TestUserFormatVsSummary.py
  lldb-api :: functionalities/data-formatter/var-in-aggregate-misuse/TestVarInAggregateMisuse.py
  lldb-api :: functionalities/data-formatter/varscript_formatting/TestDataFormatterVarScriptFormatting.py
  lldb-api :: functionalities/data-formatter/vector-types/TestVectorTypesFormatting.py
  lldb-api :: functionalities/dead-strip/TestDeadStrip.py
  lldb-api :: functionalities/deleted-executable/TestDeletedExecutable.py
  lldb-api :: functionalities/dlopen_other_executable/TestDlopenOtherExecutable.py
  lldb-api :: functionalities/dynamic_value_child_count/TestDynamicValueChildCount.py
  lldb-api :: functionalities/exec/TestExec.py
  lldb-api :: functionalities/fat_archives/TestFatArchives.py
  lldb-api :: functionalities/float-display/TestFloatDisplay.py
  lldb-api :: functionalities/gdb_remote_client/TestArmRegisterDefinition.py
  lldb-api :: functionalities/gdb_remote_client/TestGDBRemoteClient.py
  lldb-api :: functionalities/gdb_remote_client/TestGDBRemoteDiskFileCompletion.py
  lldb-api :: functionalities/gdb_remote_client/TestGDBRemoteLoad.py
  lldb-api :: functionalities/gdb_remote_client/TestIOSSimulator.py
  lldb-api :: functionalities/gdb_remote_client/TestJLink6Armv7RegisterDefinition.py
  lldb-api :: functionalities/gdb_remote_client/TestNestedRegDefinitions.py
  lldb-api :: functionalities/gdb_remote_client/TestNoGPacketSupported.py
  lldb-api :: functionalities/gdb_remote_client/TestNoWatchpointSupportInfo.py
  lldb-api :: functionalities/gdb_remote_client/TestPlatformClient.py
  lldb-api :: functionalities/gdb_remote_client/TestProcessConnect.py
  lldb-api :: functionalities/gdb_remote_client/TestQemuAArch64TargetXml.py
  lldb-api :: functionalities/gdb_remote_client/TestRecognizeBreakpoint.py
  lldb-api :: functionalities/gdb_remote_client/TestRegDefinitionInParts.py
  lldb-api :: functionalities/gdb_remote_client/TestRestartBug.py
  lldb-api :: functionalities/gdb_remote_client/TestStopPCs.py
  lldb-api :: functionalities/gdb_remote_client/TestTargetXMLArch.py
  lldb-api :: functionalities/gdb_remote_client/TestThreadSelectionBug.py
  lldb-api :: functionalities/gdb_remote_client/TestWasm.py
  lldb-api :: functionalities/gdb_remote_client/TestWriteMemory.py
  lldb-api :: functionalities/gdb_remote_client/TestqOffsets.py
  lldb-api :: functionalities/history/TestHistoryRecall.py
  lldb-api :: functionalities/inferior-assert/TestInferiorAssert.py
  lldb-api :: functionalities/inferior-changed/TestInferiorChanged.py
  lldb-api :: functionalities/inferior-crashing/TestInferiorCrashing.py
  lldb-api :: functionalities/inferior-crashing/TestInferiorCrashingStep.py
  lldb-api :: functionalities/inferior-crashing/recursive-inferior/TestRecursiveInferior.py
  lldb-api :: functionalities/inferior-crashing/recursive-inferior/TestRecursiveInferiorStep.py
  lldb-api :: functionalities/inline-stepping/TestInlineStepping.py
  lldb-api :: functionalities/jitloader_gdb/TestJITLoaderGDB.py
  lldb-api :: functionalities/lazy-loading/TestLazyLoading.py
  lldb-api :: functionalities/limit-debug-info/TestLimitDebugInfo.py
  lldb-api :: functionalities/load_unload/TestLoadUnload.py
  lldb-api :: functionalities/load_using_paths/TestLoadUsingPaths.py
  lldb-api :: functionalities/longjmp/TestLongjmp.py
  lldb-api :: functionalities/memory-region/TestMemoryRegion.py
  lldb-api :: functionalities/memory/cache/TestMemoryCache.py
  lldb-api :: functionalities/memory/find/TestMemoryFind.py
  lldb-api :: functionalities/memory/read/TestMemoryRead.py
  lldb-api :: functionalities/mtc/simple/TestMTCSimple.py
  lldb-api :: functionalities/multidebugger_commands/TestMultipleDebuggersCommands.py
  lldb-api :: functionalities/multiword-commands/TestMultiWordCommands.py
  lldb-api :: functionalities/non-overlapping-index-variable-i/TestIndexVariable.py
  lldb-api :: functionalities/object-file/TestImageListMultiArchitecture.py
  lldb-api :: functionalities/optimized_code/TestNoASanExceptionAfterEvalOP_piece.py
  lldb-api :: functionalities/param_entry_vals/basic_entry_values/TestBasicEntryValues.py
  lldb-api :: functionalities/paths/TestPaths.py
  lldb-api :: functionalities/plugins/command_plugin/TestPluginCommands.py
  lldb-api :: functionalities/plugins/python_os_plugin/TestPythonOSPlugin.py
  lldb-api :: functionalities/plugins/python_os_plugin/stepping_plugin_threads/TestOSPluginStepping.py
  lldb-api :: functionalities/pointer_num_children/TestPointerNumChildren.py
  lldb-api :: functionalities/postmortem/elf-core/TestLinuxCore.py
  lldb-api :: functionalities/postmortem/elf-core/gcore/TestGCore.py
  lldb-api :: functionalities/postmortem/elf-core/thread_crash/TestLinuxCoreThreads.py
  lldb-api :: functionalities/postmortem/mach-core/TestMachCore.py
  lldb-api :: functionalities/postmortem/minidump-new/TestMiniDumpNew.py
  lldb-api :: functionalities/postmortem/minidump-new/TestMiniDumpUUID.py
  lldb-api :: functionalities/postmortem/minidump/TestMiniDump.py
  lldb-api :: functionalities/postmortem/netbsd-core/TestNetBSDCore.py
  lldb-api :: functionalities/postmortem/wow64_minidump/TestWow64MiniDump.py
  lldb-api :: functionalities/pre_run_dylibs/TestPreRunDylibs.py
  lldb-api :: functionalities/process_crash_info/TestProcessCrashInfo.py
  lldb-api :: functionalities/process_group/TestChangeProcessGroup.py
  lldb-api :: functionalities/process_save_core/TestProcessSaveCore.py
  lldb-api :: functionalities/ptr_refs/TestPtrRefs.py
  lldb-api :: functionalities/recursion/TestValueObjectRecursion.py
  lldb-api :: functionalities/reproducers/attach/TestReproducerAttach.py
  lldb-api :: functionalities/rerun/TestRerun.py
  lldb-api :: functionalities/return-value/TestReturnValue.py
  lldb-api :: functionalities/set-data/TestSetData.py
  lldb-api :: functionalities/show_location/TestShowLocationDwarf5.py
  lldb-api :: functionalities/signal/TestSendSignal.py
  lldb-api :: functionalities/signal/handle-abrt/TestHandleAbort.py
  lldb-api :: functionalities/signal/handle-segv/TestHandleSegv.py
  lldb-api :: functionalities/signal/raise/TestRaise.py
  lldb-api :: functionalities/source-map/TestTargetSourceMap.py
  lldb-api :: functionalities/stats_api/TestStatisticsAPI.py
  lldb-api :: functionalities/step-avoids-no-debug/TestStepNoDebug.py
  lldb-api :: functionalities/step_scripted/TestStepScripted.py
  lldb-api :: functionalities/tail_call_frames/ambiguous_tail_call_seq1/TestAmbiguousTailCallSeq1.py
  lldb-api :: functionalities/tail_call_frames/ambiguous_tail_call_seq2/TestAmbiguousTailCallSeq2.py
  lldb-api :: functionalities/tail_call_frames/cross_dso/TestCrossDSOTailCalls.py
  lldb-api :: functionalities/tail_call_frames/cross_object/TestCrossObjectTailCalls.py
  lldb-api :: functionalities/tail_call_frames/disambiguate_call_site/TestDisambiguateCallSite.py
  lldb-api :: functionalities/tail_call_frames/disambiguate_paths_to_common_sink/TestDisambiguatePathsToCommonSink.py
  lldb-api :: functionalities/tail_call_frames/disambiguate_tail_call_seq/TestDisambiguateTailCallSeq.py
  lldb-api :: functionalities/tail_call_frames/inlining_and_tail_calls/TestInliningAndTailCalls.py
  lldb-api :: functionalities/tail_call_frames/sbapi_support/TestTailCallFrameSBAPI.py
  lldb-api :: functionalities/tail_call_frames/thread_step_out_message/TestArtificialFrameStepOutMessage.py
  lldb-api :: functionalities/tail_call_frames/thread_step_out_or_return/TestSteppingOutWithArtificialFrames.py
  lldb-api :: functionalities/tail_call_frames/unambiguous_sequence/TestUnambiguousTailCalls.py
  lldb-api :: functionalities/target-new-solib-notifications/TestModuleLoadedNotifys.py
  lldb-api :: functionalities/target_var/TestTargetVar.py
  lldb-api :: functionalities/target_var/no_vars/TestTargetVarNoVars.py
  lldb-api :: functionalities/testid/TestTestId.py
  lldb-api :: functionalities/thread/backtrace_all/TestBacktraceAll.py
  lldb-api :: functionalities/thread/backtrace_limit/TestBacktraceLimit.py
  lldb-api :: functionalities/thread/break_after_join/TestBreakAfterJoin.py
  lldb-api :: functionalities/thread/concurrent_events/TestConcurrentBreakpointDelayBreakpointOneSignal.py
  lldb-api :: functionalities/thread/concurrent_events/TestConcurrentBreakpointOneDelayBreakpointThreads.py
  lldb-api :: functionalities/thread/concurrent_events/TestConcurrentBreakpointsDelayedBreakpointOneWatchpoint.py
  lldb-api :: functionalities/thread/concurrent_events/TestConcurrentCrashWithBreak.py
  lldb-api :: functionalities/thread/concurrent_events/TestConcurrentCrashWithSignal.py
  lldb-api :: functionalities/thread/concurrent_events/TestConcurrentCrashWithWatchpoint.py
  lldb-api :: functionalities/thread/concurrent_events/TestConcurrentCrashWithWatchpointBreakpointSignal.py
  lldb-api :: functionalities/thread/concurrent_events/TestConcurrentDelaySignalBreak.py
  lldb-api :: functionalities/thread/concurrent_events/TestConcurrentDelaySignalWatch.py
  lldb-api :: functionalities/thread/concurrent_events/TestConcurrentDelayWatchBreak.py
  lldb-api :: functionalities/thread/concurrent_events/TestConcurrentDelayedCrashWithBreakpointSignal.py
  lldb-api :: functionalities/thread/concurrent_events/TestConcurrentDelayedCrashWithBreakpointWatchpoint.py
  lldb-api :: functionalities/thread/concurrent_events/TestConcurrentManyBreakpoints.py
  lldb-api :: functionalities/thread/concurrent_events/TestConcurrentManyCrash.py
  lldb-api :: functionalities/thread/concurrent_events/TestConcurrentManySignals.py
  lldb-api :: functionalities/thread/concurrent_events/TestConcurrentManyWatchpoints.py
  lldb-api :: functionalities/thread/concurrent_events/TestConcurrentNWatchNBreak.py
  lldb-api :: functionalities/thread/concurrent_events/TestConcurrentSignalBreak.py
  lldb-api :: functionalities/thread/concurrent_events/TestConcurrentSignalDelayBreak.py
  lldb-api :: functionalities/thread/concurrent_events/TestConcurrentSignalDelayWatch.py
  lldb-api :: functionalities/thread/concurrent_events/TestConcurrentSignalNWatchNBreak.py
  lldb-api :: functionalities/thread/concurrent_events/TestConcurrentSignalWatch.py
  lldb-api :: functionalities/thread/concurrent_events/TestConcurrentSignalWatchBreak.py
  lldb-api :: functionalities/thread/concurrent_events/TestConcurrentTwoBreakpointThreads.py
  lldb-api :: functionalities/thread/concurrent_events/TestConcurrentTwoBreakpointsOneDelaySignal.py
  lldb-api :: functionalities/thread/concurrent_events/TestConcurrentTwoBreakpointsOneSignal.py
  lldb-api :: functionalities/thread/concurrent_events/TestConcurrentTwoBreakpointsOneWatchpoint.py
  lldb-api :: functionalities/thread/concurrent_events/TestConcurrentTwoWatchpointThreads.py
  lldb-api :: functionalities/thread/concurrent_events/TestConcurrentTwoWatchpointsOneBreakpoint.py
  lldb-api :: functionalities/thread/concurrent_events/TestConcurrentTwoWatchpointsOneDelayBreakpoint.py
  lldb-api :: functionalities/thread/concurrent_events/TestConcurrentTwoWatchpointsOneSignal.py
  lldb-api :: functionalities/thread/concurrent_events/TestConcurrentWatchBreak.py
  lldb-api :: functionalities/thread/concurrent_events/TestConcurrentWatchBreakDelay.py
  lldb-api :: functionalities/thread/concurrent_events/TestConcurrentWatchpointDelayWatchpointOneBreakpoint.py
  lldb-api :: functionalities/thread/concurrent_events/TestConcurrentWatchpointWithDelayWatchpointThreads.py
  lldb-api :: functionalities/thread/crash_during_step/TestCrashDuringStep.py
  lldb-api :: functionalities/thread/create_after_attach/TestCreateAfterAttach.py
  lldb-api :: functionalities/thread/create_during_step/TestCreateDuringStep.py
  lldb-api :: functionalities/thread/exit_during_break/TestExitDuringBreak.py
  lldb-api :: functionalities/thread/exit_during_expression/TestExitDuringExpression.py
  lldb-api :: functionalities/thread/exit_during_step/TestExitDuringStep.py
  lldb-api :: functionalities/thread/ignore_suspended/TestIgnoreSuspendedThread.py
  lldb-api :: functionalities/thread/jump/TestThreadJump.py
  lldb-api :: functionalities/thread/multi_break/TestMultipleBreakpoints.py
  lldb-api :: functionalities/thread/num_threads/TestNumThreads.py
  lldb-api :: functionalities/thread/state/TestThreadStates.py
  lldb-api :: functionalities/thread/state_after_expression/TestStateAfterExpression.py
  lldb-api :: functionalities/thread/step_out/TestThreadStepOut.py
  lldb-api :: functionalities/thread/step_until/TestStepUntil.py
  lldb-api :: functionalities/thread/thread_exit/TestThreadExit.py
  lldb-api :: functionalities/thread/thread_specific_break/TestThreadSpecificBreakpoint.py
  lldb-api :: functionalities/thread/thread_specific_break_plus_condition/TestThreadSpecificBpPlusCondition.py
  lldb-api :: functionalities/thread_plan/TestThreadPlanCommands.py
  lldb-api :: functionalities/tsan/basic/TestTsanBasic.py
  lldb-api :: functionalities/tsan/cpp_global_location/TestTsanCPPGlobalLocation.py
  lldb-api :: functionalities/tsan/global_location/TestTsanGlobalLocation.py
  lldb-api :: functionalities/tsan/multiple/TestTsanMultiple.py
  lldb-api :: functionalities/tsan/thread_leak/TestTsanThreadLeak.py
  lldb-api :: functionalities/tsan/thread_numbers/TestTsanThreadNumbers.py
  lldb-api :: functionalities/tty/TestTerminal.py
  lldb-api :: functionalities/type_completion/TestTypeCompletion.py
  lldb-api :: functionalities/type_lookup/TestTypeLookup.py
  lldb-api :: functionalities/ubsan/basic/TestUbsanBasic.py
  lldb-api :: functionalities/ubsan/user-expression/TestUbsanUserExpression.py
  lldb-api :: functionalities/unwind/ehframe/TestEhFrameUnwind.py
  lldb-api :: functionalities/unwind/noreturn/TestNoreturnUnwind.py
  lldb-api :: functionalities/unwind/noreturn/module-end/TestNoReturnModuleEnd.py
  lldb-api :: functionalities/unwind/sigtramp/TestSigtrampUnwind.py
  lldb-api :: functionalities/unwind/standard/TestStandardUnwind.py
  lldb-api :: functionalities/unwind/zeroth_frame/TestZerothFrame.py
  lldb-api :: functionalities/value_md5_crash/TestValueMD5Crash.py
  lldb-api :: functionalities/var_path/TestVarPath.py
  lldb-api :: functionalities/wrong_commands/TestWrongCommands.py
  lldb-api :: iohandler/autosuggestion/TestAutosuggestion.py
  lldb-api :: iohandler/completion/TestIOHandlerCompletion.py
  lldb-api :: iohandler/resize/TestIOHandlerResize.py
  lldb-api :: iohandler/resize/TestIOHandlerResizeNoEditline.py
  lldb-api :: iohandler/unicode/TestUnicode.py
  lldb-api :: lang/c/anonymous/TestAnonymous.py
  lldb-api :: lang/c/array_types/TestArrayTypes.py
  lldb-api :: lang/c/bitfields/TestBitfields.py
  lldb-api :: lang/c/blocks/TestBlocks.py
  lldb-api :: lang/c/complex/TestComplexC99.py
  lldb-api :: lang/c/complex_int/TestComplexInt.py
  lldb-api :: lang/c/conflicting-symbol/TestConflictingSymbol.py
  lldb-api :: lang/c/const_variables/TestConstVariables.py
  lldb-api :: lang/c/enum_types/TestEnumTypes.py
  lldb-api :: lang/c/find_struct_type/TestFindStructTypes.py
  lldb-api :: lang/c/forward/TestForwardDeclaration.py
  lldb-api :: lang/c/function_types/TestFunctionTypes.py
  lldb-api :: lang/c/global_variables/TestGlobalVariables.py
  lldb-api :: lang/c/inlines/TestRedefinitionsInInlines.py
  lldb-api :: lang/c/local_types/TestUseClosestType.py
  lldb-api :: lang/c/local_variables/TestLocalVariables.py
  lldb-api :: lang/c/modules/TestCModules.py
  lldb-api :: lang/c/offsetof/TestOffsetof.py
  lldb-api :: lang/c/record_decl_in_expr/TestRecordDeclInExpr.py
  lldb-api :: lang/c/register_variables/TestRegisterVariables.py
  lldb-api :: lang/c/set_values/TestSetValues.py
  lldb-api :: lang/c/shared_lib/TestSharedLib.py
  lldb-api :: lang/c/shared_lib_stripped_symbols/TestSharedLibStrippedSymbols.py
  lldb-api :: lang/c/step-target/TestStepTarget.py
  lldb-api :: lang/c/step_over_no_deadlock/TestStepOverDoesntBlock.py
  lldb-api :: lang/c/stepping/TestStepAndBreakpoints.py
  lldb-api :: lang/c/stepping/TestThreadStepping.py
  lldb-api :: lang/c/strings/TestCStrings.py
  lldb-api :: lang/c/struct_types/TestStructTypes.py
  lldb-api :: lang/c/tls_globals/TestTlsGlobals.py
  lldb-api :: lang/c/typedef/Testtypedef.py
  lldb-api :: lang/c/unicode/TestUnicodeSymbols.py
  lldb-api :: lang/c/unions/TestUnionMembers.py
  lldb-api :: lang/c/vla/TestVLA.py
  lldb-api :: lang/cpp/accelerator-table/TestCPPAccelerator.py
  lldb-api :: lang/cpp/alignas_base_class/TestAlignAsBaseClass.py
  lldb-api :: lang/cpp/auto/TestCPPAuto.py
  lldb-api :: lang/cpp/bitfields/TestCppBitfields.py
  lldb-api :: lang/cpp/bool/TestCPPBool.py
  lldb-api :: lang/cpp/breakpoint-commands/TestCPPBreakpointCommands.py
  lldb-api :: lang/cpp/breakpoint_in_member_func_w_non_primitive_params/TestBreakpointInMemberFuncWNonPrimitiveParams.py
  lldb-api :: lang/cpp/call-function/TestCallCPPFunction.py
  lldb-api :: lang/cpp/chained-calls/TestCppChainedCalls.py
  lldb-api :: lang/cpp/char1632_t/TestChar1632T.py
  lldb-api :: lang/cpp/char8_t/TestCxxChar8_t.py
  lldb-api :: lang/cpp/class-template-parameter-pack/TestClassTemplateParameterPack.py
  lldb-api :: lang/cpp/class_static/TestStaticVariables.py
  lldb-api :: lang/cpp/class_types/TestClassTypes.py
  lldb-api :: lang/cpp/class_types/TestClassTypesDisassembly.py
  lldb-api :: lang/cpp/const_this/TestConstThis.py
  lldb-api :: lang/cpp/constructors/TestCppConstructors.py
  lldb-api :: lang/cpp/covariant-return-types/TestCovariantReturnTypes.py
  lldb-api :: lang/cpp/diamond/TestDiamond.py
  lldb-api :: lang/cpp/dynamic-value-same-basename/TestDynamicValueSameBase.py
  lldb-api :: lang/cpp/dynamic-value/TestCppValueCast.py
  lldb-api :: lang/cpp/dynamic-value/TestDynamicValue.py
  lldb-api :: lang/cpp/elaborated-types/TestElaboratedTypes.py
  lldb-api :: lang/cpp/enum_types/TestCPP11EnumTypes.py
  lldb-api :: lang/cpp/exceptions/TestCPPExceptionBreakpoints.py
  lldb-api :: lang/cpp/extern_c/TestExternCSymbols.py
  lldb-api :: lang/cpp/frame-var-anon-unions/TestFrameVariableAnonymousUnions.py
  lldb-api :: lang/cpp/function-qualifiers/TestCppFunctionQualifiers.py
  lldb-api :: lang/cpp/function-template-parameter-pack/TestFunctionTemplateParameterPack.py
  lldb-api :: lang/cpp/function_refs/TestFunctionRefs.py
  lldb-api :: lang/cpp/global_operators/TestCppGlobalOperators.py
  lldb-api :: lang/cpp/global_variables/TestCPPGlobalVariables.py
  lldb-api :: lang/cpp/gmodules-templates/TestGModules.py
  lldb-api :: lang/cpp/gmodules/TestWithModuleDebugging.py
  lldb-api :: lang/cpp/incomplete-types/TestCppIncompleteTypes.py
  lldb-api :: lang/cpp/inlines/TestInlines.py
  lldb-api :: lang/cpp/lambdas/TestLambdas.py
  lldb-api :: lang/cpp/limit-debug-info/TestWithLimitDebugInfo.py
  lldb-api :: lang/cpp/llvm-style/TestLLVMStyle.py
  lldb-api :: lang/cpp/member-and-local-vars-with-same-name/TestMembersAndLocalsWithSameName.py
  lldb-api :: lang/cpp/modules-import/TestCXXModulesImport.py
  lldb-api :: lang/cpp/multiple-inheritance/TestCppMultipleInheritance.py
  lldb-api :: lang/cpp/namespace/TestNamespace.py
  lldb-api :: lang/cpp/namespace/TestNamespaceLookup.py
  lldb-api :: lang/cpp/namespace_conflicts/TestNamespaceConflicts.py
  lldb-api :: lang/cpp/namespace_definitions/TestNamespaceDefinitions.py
  lldb-api :: lang/cpp/nested-class-other-compilation-unit/TestNestedClassWithParentInAnotherCU.py
  lldb-api :: lang/cpp/nsimport/TestCppNsImport.py
  lldb-api :: lang/cpp/offsetof/TestOffsetofCpp.py
  lldb-api :: lang/cpp/operator-overload/TestOperatorOverload.py
  lldb-api :: lang/cpp/operators/TestCppOperators.py
  lldb-api :: lang/cpp/overloaded-functions/TestOverloadedFunctions.py
  lldb-api :: lang/cpp/printf/TestPrintf.py
  lldb-api :: lang/cpp/rvalue-references/TestRvalueReferences.py
  lldb-api :: lang/cpp/scope/TestCppScope.py
  lldb-api :: lang/cpp/signed_types/TestSignedTypes.py
  lldb-api :: lang/cpp/static_members/TestCPPStaticMembers.py
  lldb-api :: lang/cpp/static_methods/TestCPPStaticMethods.py
  lldb-api :: lang/cpp/std-function-step-into-callable/TestStdFunctionStepIntoCallable.py
  lldb-api :: lang/cpp/stl/TestSTL.py
  lldb-api :: lang/cpp/stl/TestStdCXXDisassembly.py
  lldb-api :: lang/cpp/subst_template_type_param/TestSubstTemplateTypeParam.py
  lldb-api :: lang/cpp/symbols/TestSymbols.py
  lldb-api :: lang/cpp/template-function/TestTemplateFunctions.py
  lldb-api :: lang/cpp/template-specialization-type/TestTemplateSpecializationType.py
  lldb-api :: lang/cpp/template/TestTemplateArgs.py
  lldb-api :: lang/cpp/this/TestCPPThis.py
  lldb-api :: lang/cpp/this_class_type_mixing/TestThisClassTypeMixing.py
  lldb-api :: lang/cpp/thread_local/TestThreadLocal.py
  lldb-api :: lang/cpp/trivial_abi/TestTrivialABI.py
  lldb-api :: lang/cpp/type_lookup/TestCppTypeLookup.py
  lldb-api :: lang/cpp/typedef/TestCppTypedef.py
  lldb-api :: lang/cpp/typeof/TestTypeOfDeclTypeExpr.py
  lldb-api :: lang/cpp/unicode-literals/TestUnicodeLiterals.py
  lldb-api :: lang/cpp/unique-types/TestUniqueTypes.py
  lldb-api :: lang/cpp/unsigned_types/TestUnsignedTypes.py
  lldb-api :: lang/cpp/virtual-functions/TestCppVirtualFunctions.py
  lldb-api :: lang/cpp/virtual-overload/TestVirtualOverload.py
  lldb-api :: lang/cpp/wchar_t/TestCxxWCharT.py
  lldb-api :: lang/mixed/TestMixedLanguages.py
  lldb-api :: lang/objc/bitfield_ivars/TestBitfieldIvars.py
  lldb-api :: lang/objc/blocks/TestObjCIvarsInBlocks.py
  lldb-api :: lang/objc/conflicting-definition/TestConflictingDefinition.py
  lldb-api :: lang/objc/direct-dispatch-step/TestObjCDirectDispatchStepping.py
  lldb-api :: lang/objc/exceptions/TestObjCExceptions.py
  lldb-api :: lang/objc/forward-decl/TestForwardDecl.py
  lldb-api :: lang/objc/foundation/TestConstStrings.py
  lldb-api :: lang/objc/foundation/TestFoundationDisassembly.py
  lldb-api :: lang/objc/foundation/TestObjCMethods.py
  lldb-api :: lang/objc/foundation/TestObjCMethods2.py
  lldb-api :: lang/objc/foundation/TestObjCMethodsNSArray.py
  lldb-api :: lang/objc/foundation/TestObjCMethodsNSError.py
  lldb-api :: lang/objc/foundation/TestObjCMethodsString.py
  lldb-api :: lang/objc/foundation/TestObjectDescriptionAPI.py
  lldb-api :: lang/objc/foundation/TestRuntimeTypes.py
  lldb-api :: lang/objc/foundation/TestSymbolTable.py
  lldb-api :: lang/objc/global_ptrs/TestGlobalObjects.py
  lldb-api :: lang/objc/hidden-ivars/TestHiddenIvars.py
  lldb-api :: lang/objc/ivar-IMP/TestObjCiVarIMP.py
  lldb-api :: lang/objc/modules-app-update/TestClangModulesAppUpdate.py
  lldb-api :: lang/objc/modules-auto-import/TestModulesAutoImport.py
  lldb-api :: lang/objc/modules-cache/TestClangModulesCache.py
  lldb-api :: lang/objc/modules-compile-error/TestModulesCompileError.py
  lldb-api :: lang/objc/modules-hash-mismatch/TestClangModulesHashMismatch.py
  lldb-api :: lang/objc/modules-incomplete/TestIncompleteModules.py
  lldb-api :: lang/objc/modules-inline-functions/TestModulesInlineFunctions.py
  lldb-api :: lang/objc/modules-non-objc-target/TestObjCModulesNonObjCTarget.py
  lldb-api :: lang/objc/modules-update/TestClangModulesUpdate.py
  lldb-api :: lang/objc/modules/TestObjCModules.py
  lldb-api :: lang/objc/objc++/TestObjCXX.py
  lldb-api :: lang/objc/objc-baseclass-sbtype/TestObjCBaseClassSBType.py
  lldb-api :: lang/objc/objc-builtin-types/TestObjCBuiltinTypes.py
  lldb-api :: lang/objc/objc-checker/TestObjCCheckers.py
  lldb-api :: lang/objc/objc-class-method/TestObjCClassMethod.py
  lldb-api :: lang/objc/objc-dyn-sbtype/TestObjCDynamicSBType.py
  lldb-api :: lang/objc/objc-dynamic-value/TestObjCDynamicValue.py
  lldb-api :: lang/objc/objc-foundation-dictionary-empty/TestNSDictionary0.py
  lldb-api :: lang/objc/objc-ivar-offsets/TestObjCIvarOffsets.py
  lldb-api :: lang/objc/objc-ivar-protocols/TestIvarProtocols.py
  lldb-api :: lang/objc/objc-ivar-stripped/TestObjCIvarStripped.py
  lldb-api :: lang/objc/objc-new-syntax/TestObjCNewSyntaxArray.py
  lldb-api :: lang/objc/objc-new-syntax/TestObjCNewSyntaxDictionary.py
  lldb-api :: lang/objc/objc-new-syntax/TestObjCNewSyntaxLiteral.py
  lldb-api :: lang/objc/objc-optimized/TestObjcOptimized.py
  lldb-api :: lang/objc/objc-property/TestObjCProperty.py
  lldb-api :: lang/objc/objc-runtime-ivars/TestRuntimeIvars.py
  lldb-api :: lang/objc/objc-static-method-stripped/TestObjCStaticMethodStripped.py
  lldb-api :: lang/objc/objc-static-method/TestObjCStaticMethod.py
  lldb-api :: lang/objc/objc-stepping/TestObjCStepping.py
  lldb-api :: lang/objc/objc-struct-argument/TestObjCStructArgument.py
  lldb-api :: lang/objc/objc-struct-return/TestObjCStructReturn.py
  lldb-api :: lang/objc/objc-super/TestObjCSuper.py
  lldb-api :: lang/objc/objc_direct-methods/TestObjCDirectMethods.py
  lldb-api :: lang/objc/orderedset/TestOrderedSet.py
  lldb-api :: lang/objc/print-obj/TestPrintObj.py
  lldb-api :: lang/objc/ptr_refs/TestPtrRefsObjC.py
  lldb-api :: lang/objc/radar-9691614/TestObjCMethodReturningBOOL.py
  lldb-api :: lang/objc/rdar-10967107/TestRdar10967107.py
  lldb-api :: lang/objc/rdar-11355592/TestRdar11355592.py
  lldb-api :: lang/objc/rdar-12408181/TestRdar12408181.py
  lldb-api :: lang/objc/real-definition/TestRealDefinition.py
  lldb-api :: lang/objc/self/TestObjCSelf.py
  lldb-api :: lang/objc/single-entry-dictionary/TestObjCSingleEntryDictionary.py
  lldb-api :: lang/objc/unicode-string/TestUnicodeString.py
  lldb-api :: lang/objc/variadic_methods/TestVariadicMethods.py
  lldb-api :: lang/objcxx/class-name-clash/TestNameClash.py
  lldb-api :: lang/objcxx/cxx-bridged-po/TestObjCXXBridgedPO.py
  lldb-api :: lang/objcxx/hide-runtime-values/TestObjCXXHideRuntimeValues.py
  lldb-api :: lang/objcxx/objcxx-ivar-vector/TestIvarVector.py
  lldb-api :: linux/add-symbols/TestTargetSymbolsAddCommand.py
  lldb-api :: linux/builtin_trap/TestBuiltinTrap.py
  lldb-api :: linux/mix-dwo-and-regular-objects/TestMixedDwarfBinary.py
  lldb-api :: linux/sepdebugsymlink/TestTargetSymbolsSepDebugSymlink.py
  lldb-api :: linux/thread/create_during_instruction_step/TestCreateDuringInstructionStep.py
  lldb-api :: macosx/DBGSourcePathRemapping/TestDSYMSourcePathRemapping.py
  lldb-api :: macosx/add-dsym/TestAddDsymMidExecutionCommand.py
  lldb-api :: macosx/duplicate-archive-members/TestDuplicateMembers.py
  lldb-api :: macosx/dyld-trie-symbols/TestDyldTrieSymbols.py
  lldb-api :: macosx/find-app-in-bundle/TestFindAppInBundle.py
  lldb-api :: macosx/find-dsym/bundle-with-dot-in-filename/TestBundleWithDotInFilename.py
  lldb-api :: macosx/find-dsym/deep-bundle/TestDeepBundle.py
  lldb-api :: macosx/function-starts/TestFunctionStarts.py
  lldb-api :: macosx/indirect_symbol/TestIndirectSymbols.py
  lldb-api :: macosx/lc-note/firmware-corefile/TestFirmwareCorefiles.py
  lldb-api :: macosx/lc-note/kern-ver-str/TestKernVerStrLCNOTE.py
  lldb-api :: macosx/load-kext/TestLoadKext.py
  lldb-api :: macosx/macCatalyst/TestMacCatalyst.py
  lldb-api :: macosx/macCatalystAppMacOSFramework/TestMacCatalystAppWithMacOSFramework.py
  lldb-api :: macosx/nslog/TestDarwinNSLogOutput.py
  lldb-api :: macosx/order/TestOrderFile.py
  lldb-api :: macosx/profile_vrs_detach/TestDetachVrsProfile.py
  lldb-api :: macosx/queues/TestQueues.py
  lldb-api :: macosx/safe-to-func-call/TestSafeFuncCalls.py
  lldb-api :: macosx/save_crashlog/TestSaveCrashlog.py
  lldb-api :: macosx/simulator/TestSimulatorPlatform.py
  lldb-api :: macosx/thread-names/TestInterruptThreadNames.py
  lldb-api :: macosx/thread_suspend/TestInternalThreadSuspension.py
  lldb-api :: macosx/universal/TestUniversal.py
  lldb-api :: macosx/version_zero/TestGetVersionZeroVersion.py
  lldb-api :: python_api/breakpoint/TestBreakpointAPI.py
  lldb-api :: python_api/class_members/TestSBTypeClassMembers.py
  lldb-api :: python_api/debugger/TestDebuggerAPI.py
  lldb-api :: python_api/default-constructor/TestDefaultConstructorForAPIObjects.py
  lldb-api :: python_api/disassemble-raw-data/TestDisassembleRawData.py
  lldb-api :: python_api/disassemble-raw-data/TestDisassemble_VST1_64.py
  lldb-api :: python_api/event/TestEvents.py
  lldb-api :: python_api/exprpath_synthetic/TestExprPathSynthetic.py
  lldb-api :: python_api/file_handle/TestFileHandle.py
  lldb-api :: python_api/findvalue_duplist/TestSBFrameFindValue.py
  lldb-api :: python_api/formatters/TestFormattersSBAPI.py
  lldb-api :: python_api/frame/TestFrames.py
  lldb-api :: python_api/frame/get-variables/TestGetVariables.py
  lldb-api :: python_api/frame/inlines/TestInlinedFrame.py
  lldb-api :: python_api/function_symbol/TestDisasmAPI.py
  lldb-api :: python_api/function_symbol/TestSymbolAPI.py
  lldb-api :: python_api/get-value-32bit-int/TestGetValue32BitInt.py
  lldb-api :: python_api/hello_world/TestHelloWorld.py
  lldb-api :: python_api/interpreter/TestCommandInterpreterAPI.py
  lldb-api :: python_api/interpreter/TestRunCommandInterpreterAPI.py
  lldb-api :: python_api/lldbutil/TestSwigVersion.py
  lldb-api :: python_api/lldbutil/frame/TestFrameUtils.py
  lldb-api :: python_api/lldbutil/iter/TestLLDBIterator.py
  lldb-api :: python_api/lldbutil/iter/TestRegistersIterator.py
  lldb-api :: python_api/lldbutil/process/TestPrintStackTraces.py
  lldb-api :: python_api/module_section/TestModuleAndSection.py
  lldb-api :: python_api/name_lookup/TestNameLookup.py
  lldb-api :: python_api/objc_type/TestObjCType.py
  lldb-api :: python_api/process/TestProcessAPI.py
  lldb-api :: python_api/process/io/TestProcessIO.py
  lldb-api :: python_api/process/read-mem-cstring/TestReadMemCString.py
  lldb-api :: python_api/sbdata/TestSBData.py
  lldb-api :: python_api/sbenvironment/TestSBEnvironment.py
  lldb-api :: python_api/sblaunchinfo/TestSBLaunchInfo.py
  lldb-api :: python_api/sbplatform/TestSBPlatform.py
  lldb-api :: python_api/sbstructureddata/TestStructuredDataAPI.py
  lldb-api :: python_api/sbtype_typeclass/TestSBTypeTypeClass.py
  lldb-api :: python_api/sbvalue_const_addrof/TestSBValueConstAddrOf.py
  lldb-api :: python_api/sbvalue_persist/TestSBValuePersist.py
  lldb-api :: python_api/section/TestSectionAPI.py
  lldb-api :: python_api/signals/TestSignalsAPI.py
  lldb-api :: python_api/symbol-context/TestSymbolContext.py
  lldb-api :: python_api/symbol-context/two-files/TestSymbolContextTwoFiles.py
  lldb-api :: python_api/target/TestTargetAPI.py
  lldb-api :: python_api/thread/TestThreadAPI.py
  lldb-api :: python_api/type/TestTypeList.py
  lldb-api :: python_api/value/TestValueAPI.py
  lldb-api :: python_api/value/change_values/TestChangeValueAPI.py
  lldb-api :: python_api/value/empty_class/TestValueAPIEmptyClass.py
  lldb-api :: python_api/value/linked_list/TestValueAPILinkedList.py
  lldb-api :: python_api/value_var_update/TestValueVarUpdate.py
  lldb-api :: python_api/watchpoint/TestSetWatchpoint.py
  lldb-api :: python_api/watchpoint/TestWatchpointIgnoreCount.py
  lldb-api :: python_api/watchpoint/TestWatchpointIter.py
  lldb-api :: python_api/watchpoint/condition/TestWatchpointConditionAPI.py
  lldb-api :: python_api/watchpoint/watchlocation/TestSetWatchlocation.py
  lldb-api :: python_api/watchpoint/watchlocation/TestTargetWatchAddress.py
  lldb-api :: sample_test/TestSampleInlineTest.py
  lldb-api :: sample_test/TestSampleTest.py
  lldb-api :: sanity/TestModuleCacheSanity.py
  lldb-api :: sanity/TestSettingSkipping.py
  lldb-api :: source-manager/TestSourceManager.py
  lldb-api :: terminal/TestEditline.py
  lldb-api :: terminal/TestSTTYBeforeAndAfter.py
  lldb-api :: tools/intel-features/intel-pt/test/TestIntelPTSimpleBinary.py
  lldb-api :: tools/lldb-server/TestAppleSimulatorOSType.py
  lldb-api :: tools/lldb-server/TestGdbRemoteAttach.py
  lldb-api :: tools/lldb-server/TestGdbRemoteAuxvSupport.py
  lldb-api :: tools/lldb-server/TestGdbRemoteCompletion.py
  lldb-api :: tools/lldb-server/TestGdbRemoteExitCode.py
  lldb-api :: tools/lldb-server/TestGdbRemoteExpeditedRegisters.py
  lldb-api :: tools/lldb-server/TestGdbRemoteHostInfo.py
  lldb-api :: tools/lldb-server/TestGdbRemoteKill.py
  lldb-api :: tools/lldb-server/TestGdbRemoteModuleInfo.py
  lldb-api :: tools/lldb-server/TestGdbRemoteProcessInfo.py
  lldb-api :: tools/lldb-server/TestGdbRemoteRegisterState.py
  lldb-api :: tools/lldb-server/TestGdbRemoteSingleStep.py
  lldb-api :: tools/lldb-server/TestGdbRemoteThreadsInStopReply.py
  lldb-api :: tools/lldb-server/TestGdbRemote_qThreadStopInfo.py
  lldb-api :: tools/lldb-server/TestGdbRemote_vCont.py
  lldb-api :: tools/lldb-server/TestGdbRemote_vContThreads.py
  lldb-api :: tools/lldb-server/TestLldbGdbServer.py
  lldb-api :: tools/lldb-server/commandline/TestStubReverseConnect.py
  lldb-api :: tools/lldb-server/commandline/TestStubSetSID.py
  lldb-api :: tools/lldb-server/inferior-crash/TestGdbRemoteAbort.py
  lldb-api :: tools/lldb-server/inferior-crash/TestGdbRemoteSegFault.py
  lldb-api :: tools/lldb-server/libraries-svr4/TestGdbRemoteLibrariesSvr4Support.py
  lldb-api :: tools/lldb-server/platform-process-connect/TestPlatformProcessConnect.py
  lldb-api :: tools/lldb-server/register-reading/TestGdbRemoteGPacket.py
  lldb-api :: tools/lldb-server/registers-target-xml-reading/TestGdbRemoteTargetXmlPacket.py
  lldb-api :: tools/lldb-server/signal-filtering/TestGdbRemote_QPassSignals.py
  lldb-api :: tools/lldb-server/thread-name/TestGdbRemoteThreadName.py
  lldb-api :: tools/lldb-vscode/attach/TestVSCode_attach.py
  lldb-api :: tools/lldb-vscode/breakpoint-events/TestVSCode_breakpointEvents.py
  lldb-api :: tools/lldb-vscode/breakpoint/TestVSCode_setBreakpoints.py
  lldb-api :: tools/lldb-vscode/breakpoint/TestVSCode_setExceptionBreakpoints.py
  lldb-api :: tools/lldb-vscode/breakpoint/TestVSCode_setFunctionBreakpoints.py
  lldb-api :: tools/lldb-vscode/completions/TestVSCode_completions.py
  lldb-api :: tools/lldb-vscode/console/TestVSCode_console.py
  lldb-api :: tools/lldb-vscode/coreFile/TestVSCode_coreFile.py
  lldb-api :: tools/lldb-vscode/disconnect/TestVSCode_disconnect.py
  lldb-api :: tools/lldb-vscode/launch/TestVSCode_launch.py
  lldb-api :: tools/lldb-vscode/module/TestVSCode_module.py
  lldb-api :: tools/lldb-vscode/runInTerminal/TestVSCode_runInTerminal.py
  lldb-api :: tools/lldb-vscode/stackTrace/TestVSCode_stackTrace.py
  lldb-api :: tools/lldb-vscode/step/TestVSCode_step.py
  lldb-api :: tools/lldb-vscode/variables/TestVSCode_variables.py
  lldb-api :: types/TestCharType.py
  lldb-api :: types/TestCharTypeExpr.py
  lldb-api :: types/TestDoubleTypes.py
  lldb-api :: types/TestDoubleTypesExpr.py
  lldb-api :: types/TestFloatTypes.py
  lldb-api :: types/TestFloatTypesExpr.py
  lldb-api :: types/TestIntegerType.py
  lldb-api :: types/TestIntegerTypeExpr.py
  lldb-api :: types/TestLongTypes.py
  lldb-api :: types/TestLongTypesExpr.py
  lldb-api :: types/TestRecursiveTypes.py
  lldb-api :: types/TestShortType.py
  lldb-api :: types/TestShortTypeExpr.py

Hide Details

Hide Details

Testing Time: 46.59s Unsupported : 123 Passed : 1132 Expectedly Failed: 5 Failed : 881 make: *** [/Users/buildslave/jenkins/workspace/lldb-cmake-standalone/lldb-xcode-build/test/CMakeFiles/check-lldb-lit] Error 1

Hide Details

** BUILD FAILED **

Hide Details

Hide Details

The following build commands failed: PhaseScriptExecution CMake\ Rules /Users/buildslave/jenkins/workspace/lldb-cmake-standalone/lldb-xcode-build/test/lldb.build/Release/check-lldb-lit.build/Script-30DA9BBB90C5440592F88162.sh (1 failure) Command failed: Command '['/usr/bin/env', 'TERM=vt100', '/usr/local/bin/cmake', '--build', '.', '--config', 'Release', '--target', 'check-lldb']' returned non-zero exit status 65. Command: ['/usr/bin/env', 'TERM=vt100', '/usr/local/bin/cmake', '--build', '.', '--config', 'Release', '--target', 'check-lldb'] [Pipeline] } [Pipeline] // timeout [Pipeline] } [Pipeline] // stage [Pipeline] } [Pipeline] // withEnv [Pipeline] } [Pipeline] // node [Pipeline] End of Pipeline ERROR: script returned exit code 1 Finished: FAILURE