FailedConsole Output

Skipping 416 KB.. Full Log
[382/3462] /Users/buildslave/jenkins/workspace/lldb-cmake-standalone/host-compiler/bin/clang++  -DBUILD_EXAMPLES -DNDEBUG -D_LIBCPP_BUILDING_LIBRARY -D_LIBCPP_HAS_NO_PRAGMA_SYSTEM_HEADER -D__STDC_CONSTANT_MACROS -D__STDC_FORMAT_MACROS -D__STDC_LIMIT_MACROS -Iprojects/libcxx/src -I/Users/buildslave/jenkins/workspace/lldb-cmake-standalone/llvm-project/libcxx/src -Iinclude -I/Users/buildslave/jenkins/workspace/lldb-cmake-standalone/llvm-project/llvm/include -Iprojects/libcxx/include/c++build -fPIC -fvisibility-inlines-hidden -Werror=date-time -Werror=unguarded-availability-new -Wall -Wextra -Wno-unused-parameter -Wwrite-strings -Wcast-qual -Wmissing-field-initializers  -Wno-long-long -Wimplicit-fallthrough -Wcovered-switch-default -Wno-noexcept-type -Wnon-virtual-dtor -Wdelete-non-virtual-dtor -Wsuggest-override -Wstring-conversion -fdiagnostics-color -O3  -isysroot /Applications/Xcode.app/Contents/Developer/Platforms/MacOSX.platform/Developer/SDKs/MacOSX10.15.sdk -fPIC   -DLIBCXX_BUILDING_LIBCXXABI -UNDEBUG -faligned-allocation -nostdinc++ -fvisibility-inlines-hidden -fvisibility=hidden -Wall -Wextra -W -Wwrite-strings -Wno-unused-parameter -Wno-long-long -Werror=return-type -Wextra-semi -Wno-user-defined-literals -Wno-covered-switch-default -Wno-suggest-override -Wno-ignored-attributes -Wno-error -I /Users/buildslave/jenkins/workspace/lldb-cmake-standalone/clang-build/include/c++/v1 -include /Users/buildslave/jenkins/workspace/lldb-cmake-standalone/clang-build/projects/libcxx/__config_site -std=c++17 -MD -MT projects/libcxx/src/CMakeFiles/cxx_shared.dir/iostream.cpp.o -MF projects/libcxx/src/CMakeFiles/cxx_shared.dir/iostream.cpp.o.d -o projects/libcxx/src/CMakeFiles/cxx_shared.dir/iostream.cpp.o -c /Users/buildslave/jenkins/workspace/lldb-cmake-standalone/llvm-project/libcxx/src/iostream.cpp
[383/3462] /Users/buildslave/jenkins/workspace/lldb-cmake-standalone/host-compiler/bin/clang++  -DBUILD_EXAMPLES -DNDEBUG -D_LIBCPP_BUILDING_LIBRARY -D_LIBCPP_HAS_NO_PRAGMA_SYSTEM_HEADER -D__STDC_CONSTANT_MACROS -D__STDC_FORMAT_MACROS -D__STDC_LIMIT_MACROS -Iprojects/libcxx/src -I/Users/buildslave/jenkins/workspace/lldb-cmake-standalone/llvm-project/libcxx/src -Iinclude -I/Users/buildslave/jenkins/workspace/lldb-cmake-standalone/llvm-project/llvm/include -Iprojects/libcxx/include/c++build -fPIC -fvisibility-inlines-hidden -Werror=date-time -Werror=unguarded-availability-new -Wall -Wextra -Wno-unused-parameter -Wwrite-strings -Wcast-qual -Wmissing-field-initializers  -Wno-long-long -Wimplicit-fallthrough -Wcovered-switch-default -Wno-noexcept-type -Wnon-virtual-dtor -Wdelete-non-virtual-dtor -Wsuggest-override -Wstring-conversion -fdiagnostics-color -O3  -isysroot /Applications/Xcode.app/Contents/Developer/Platforms/MacOSX.platform/Developer/SDKs/MacOSX10.15.sdk -fPIC   -DLIBCXX_BUILDING_LIBCXXABI -UNDEBUG -faligned-allocation -nostdinc++ -fvisibility-inlines-hidden -fvisibility=hidden -Wall -Wextra -W -Wwrite-strings -Wno-unused-parameter -Wno-long-long -Werror=return-type -Wextra-semi -Wno-user-defined-literals -Wno-covered-switch-default -Wno-suggest-override -Wno-ignored-attributes -Wno-error -I /Users/buildslave/jenkins/workspace/lldb-cmake-standalone/clang-build/include/c++/v1 -include /Users/buildslave/jenkins/workspace/lldb-cmake-standalone/clang-build/projects/libcxx/__config_site -std=c++17 -MD -MT projects/libcxx/src/CMakeFiles/cxx_shared.dir/typeinfo.cpp.o -MF projects/libcxx/src/CMakeFiles/cxx_shared.dir/typeinfo.cpp.o.d -o projects/libcxx/src/CMakeFiles/cxx_shared.dir/typeinfo.cpp.o -c /Users/buildslave/jenkins/workspace/lldb-cmake-standalone/llvm-project/libcxx/src/typeinfo.cpp
[384/3462] /Users/buildslave/jenkins/workspace/lldb-cmake-standalone/host-compiler/bin/clang++  -DBUILD_EXAMPLES -DNDEBUG -D_LIBCPP_BUILDING_LIBRARY -D_LIBCPP_HAS_NO_PRAGMA_SYSTEM_HEADER -D__STDC_CONSTANT_MACROS -D__STDC_FORMAT_MACROS -D__STDC_LIMIT_MACROS -Iprojects/libcxx/src -I/Users/buildslave/jenkins/workspace/lldb-cmake-standalone/llvm-project/libcxx/src -Iinclude -I/Users/buildslave/jenkins/workspace/lldb-cmake-standalone/llvm-project/llvm/include -Iprojects/libcxx/include/c++build -fPIC -fvisibility-inlines-hidden -Werror=date-time -Werror=unguarded-availability-new -Wall -Wextra -Wno-unused-parameter -Wwrite-strings -Wcast-qual -Wmissing-field-initializers  -Wno-long-long -Wimplicit-fallthrough -Wcovered-switch-default -Wno-noexcept-type -Wnon-virtual-dtor -Wdelete-non-virtual-dtor -Wsuggest-override -Wstring-conversion -fdiagnostics-color -O3  -isysroot /Applications/Xcode.app/Contents/Developer/Platforms/MacOSX.platform/Developer/SDKs/MacOSX10.15.sdk   -DLIBCXX_BUILDING_LIBCXXABI -UNDEBUG -faligned-allocation -nostdinc++ -fvisibility-inlines-hidden -fvisibility=hidden -Wall -Wextra -W -Wwrite-strings -Wno-unused-parameter -Wno-long-long -Werror=return-type -Wextra-semi -Wno-user-defined-literals -Wno-covered-switch-default -Wno-suggest-override -Wno-ignored-attributes -Wno-error -I /Users/buildslave/jenkins/workspace/lldb-cmake-standalone/clang-build/include/c++/v1 -include /Users/buildslave/jenkins/workspace/lldb-cmake-standalone/clang-build/projects/libcxx/__config_site -std=c++17 -MD -MT projects/libcxx/src/CMakeFiles/cxx_static.dir/filesystem/directory_iterator.cpp.o -MF projects/libcxx/src/CMakeFiles/cxx_static.dir/filesystem/directory_iterator.cpp.o.d -o projects/libcxx/src/CMakeFiles/cxx_static.dir/filesystem/directory_iterator.cpp.o -c /Users/buildslave/jenkins/workspace/lldb-cmake-standalone/llvm-project/libcxx/src/filesystem/directory_iterator.cpp
[385/3462] /Users/buildslave/jenkins/workspace/lldb-cmake-standalone/host-compiler/bin/clang++  -DBUILD_EXAMPLES -DNDEBUG -D_LIBCPP_BUILDING_LIBRARY -D_LIBCPP_HAS_NO_PRAGMA_SYSTEM_HEADER -D__STDC_CONSTANT_MACROS -D__STDC_FORMAT_MACROS -D__STDC_LIMIT_MACROS -Iprojects/libcxx/src -I/Users/buildslave/jenkins/workspace/lldb-cmake-standalone/llvm-project/libcxx/src -Iinclude -I/Users/buildslave/jenkins/workspace/lldb-cmake-standalone/llvm-project/llvm/include -Iprojects/libcxx/include/c++build -fPIC -fvisibility-inlines-hidden -Werror=date-time -Werror=unguarded-availability-new -Wall -Wextra -Wno-unused-parameter -Wwrite-strings -Wcast-qual -Wmissing-field-initializers  -Wno-long-long -Wimplicit-fallthrough -Wcovered-switch-default -Wno-noexcept-type -Wnon-virtual-dtor -Wdelete-non-virtual-dtor -Wsuggest-override -Wstring-conversion -fdiagnostics-color -O3  -isysroot /Applications/Xcode.app/Contents/Developer/Platforms/MacOSX.platform/Developer/SDKs/MacOSX10.15.sdk -fPIC   -DLIBCXX_BUILDING_LIBCXXABI -UNDEBUG -faligned-allocation -nostdinc++ -fvisibility-inlines-hidden -fvisibility=hidden -Wall -Wextra -W -Wwrite-strings -Wno-unused-parameter -Wno-long-long -Werror=return-type -Wextra-semi -Wno-user-defined-literals -Wno-covered-switch-default -Wno-suggest-override -Wno-ignored-attributes -Wno-error -I /Users/buildslave/jenkins/workspace/lldb-cmake-standalone/clang-build/include/c++/v1 -include /Users/buildslave/jenkins/workspace/lldb-cmake-standalone/clang-build/projects/libcxx/__config_site -std=c++17 -MD -MT projects/libcxx/src/CMakeFiles/cxx_shared.dir/shared_mutex.cpp.o -MF projects/libcxx/src/CMakeFiles/cxx_shared.dir/shared_mutex.cpp.o.d -o projects/libcxx/src/CMakeFiles/cxx_shared.dir/shared_mutex.cpp.o -c /Users/buildslave/jenkins/workspace/lldb-cmake-standalone/llvm-project/libcxx/src/shared_mutex.cpp
[386/3462] /Users/buildslave/jenkins/workspace/lldb-cmake-standalone/host-compiler/bin/clang++  -DBUILD_EXAMPLES -DNDEBUG -D_LIBCPP_BUILDING_LIBRARY -D_LIBCPP_HAS_NO_PRAGMA_SYSTEM_HEADER -D__STDC_CONSTANT_MACROS -D__STDC_FORMAT_MACROS -D__STDC_LIMIT_MACROS -Iprojects/libcxx/src -I/Users/buildslave/jenkins/workspace/lldb-cmake-standalone/llvm-project/libcxx/src -Iinclude -I/Users/buildslave/jenkins/workspace/lldb-cmake-standalone/llvm-project/llvm/include -Iprojects/libcxx/include/c++build -fPIC -fvisibility-inlines-hidden -Werror=date-time -Werror=unguarded-availability-new -Wall -Wextra -Wno-unused-parameter -Wwrite-strings -Wcast-qual -Wmissing-field-initializers  -Wno-long-long -Wimplicit-fallthrough -Wcovered-switch-default -Wno-noexcept-type -Wnon-virtual-dtor -Wdelete-non-virtual-dtor -Wsuggest-override -Wstring-conversion -fdiagnostics-color -O3  -isysroot /Applications/Xcode.app/Contents/Developer/Platforms/MacOSX.platform/Developer/SDKs/MacOSX10.15.sdk -fPIC   -DLIBCXX_BUILDING_LIBCXXABI -UNDEBUG -faligned-allocation -nostdinc++ -fvisibility-inlines-hidden -fvisibility=hidden -Wall -Wextra -W -Wwrite-strings -Wno-unused-parameter -Wno-long-long -Werror=return-type -Wextra-semi -Wno-user-defined-literals -Wno-covered-switch-default -Wno-suggest-override -Wno-ignored-attributes -Wno-error -I /Users/buildslave/jenkins/workspace/lldb-cmake-standalone/clang-build/include/c++/v1 -include /Users/buildslave/jenkins/workspace/lldb-cmake-standalone/clang-build/projects/libcxx/__config_site -std=c++17 -MD -MT projects/libcxx/src/CMakeFiles/cxx_shared.dir/utility.cpp.o -MF projects/libcxx/src/CMakeFiles/cxx_shared.dir/utility.cpp.o.d -o projects/libcxx/src/CMakeFiles/cxx_shared.dir/utility.cpp.o -c /Users/buildslave/jenkins/workspace/lldb-cmake-standalone/llvm-project/libcxx/src/utility.cpp
[387/3462] /Users/buildslave/jenkins/workspace/lldb-cmake-standalone/host-compiler/bin/clang++  -DBUILD_EXAMPLES -DNDEBUG -D_LIBCPP_BUILDING_LIBRARY -D_LIBCPP_HAS_NO_PRAGMA_SYSTEM_HEADER -D__STDC_CONSTANT_MACROS -D__STDC_FORMAT_MACROS -D__STDC_LIMIT_MACROS -Iprojects/libcxx/src -I/Users/buildslave/jenkins/workspace/lldb-cmake-standalone/llvm-project/libcxx/src -Iinclude -I/Users/buildslave/jenkins/workspace/lldb-cmake-standalone/llvm-project/llvm/include -Iprojects/libcxx/include/c++build -fPIC -fvisibility-inlines-hidden -Werror=date-time -Werror=unguarded-availability-new -Wall -Wextra -Wno-unused-parameter -Wwrite-strings -Wcast-qual -Wmissing-field-initializers  -Wno-long-long -Wimplicit-fallthrough -Wcovered-switch-default -Wno-noexcept-type -Wnon-virtual-dtor -Wdelete-non-virtual-dtor -Wsuggest-override -Wstring-conversion -fdiagnostics-color -O3  -isysroot /Applications/Xcode.app/Contents/Developer/Platforms/MacOSX.platform/Developer/SDKs/MacOSX10.15.sdk -fPIC   -DLIBCXX_BUILDING_LIBCXXABI -UNDEBUG -faligned-allocation -nostdinc++ -fvisibility-inlines-hidden -fvisibility=hidden -Wall -Wextra -W -Wwrite-strings -Wno-unused-parameter -Wno-long-long -Werror=return-type -Wextra-semi -Wno-user-defined-literals -Wno-covered-switch-default -Wno-suggest-override -Wno-ignored-attributes -Wno-error -I /Users/buildslave/jenkins/workspace/lldb-cmake-standalone/clang-build/include/c++/v1 -include /Users/buildslave/jenkins/workspace/lldb-cmake-standalone/clang-build/projects/libcxx/__config_site -std=c++17 -MD -MT projects/libcxx/src/CMakeFiles/cxx_shared.dir/random.cpp.o -MF projects/libcxx/src/CMakeFiles/cxx_shared.dir/random.cpp.o.d -o projects/libcxx/src/CMakeFiles/cxx_shared.dir/random.cpp.o -c /Users/buildslave/jenkins/workspace/lldb-cmake-standalone/llvm-project/libcxx/src/random.cpp
[388/3462] /Users/buildslave/jenkins/workspace/lldb-cmake-standalone/host-compiler/bin/clang++  -DBUILD_EXAMPLES -DNDEBUG -D_LIBCPP_BUILDING_LIBRARY -D_LIBCPP_HAS_NO_PRAGMA_SYSTEM_HEADER -D__STDC_CONSTANT_MACROS -D__STDC_FORMAT_MACROS -D__STDC_LIMIT_MACROS -Iprojects/libcxx/src -I/Users/buildslave/jenkins/workspace/lldb-cmake-standalone/llvm-project/libcxx/src -Iinclude -I/Users/buildslave/jenkins/workspace/lldb-cmake-standalone/llvm-project/llvm/include -Iprojects/libcxx/include/c++build -fPIC -fvisibility-inlines-hidden -Werror=date-time -Werror=unguarded-availability-new -Wall -Wextra -Wno-unused-parameter -Wwrite-strings -Wcast-qual -Wmissing-field-initializers  -Wno-long-long -Wimplicit-fallthrough -Wcovered-switch-default -Wno-noexcept-type -Wnon-virtual-dtor -Wdelete-non-virtual-dtor -Wsuggest-override -Wstring-conversion -fdiagnostics-color -O3  -isysroot /Applications/Xcode.app/Contents/Developer/Platforms/MacOSX.platform/Developer/SDKs/MacOSX10.15.sdk -fPIC   -DLIBCXX_BUILDING_LIBCXXABI -UNDEBUG -faligned-allocation -nostdinc++ -fvisibility-inlines-hidden -fvisibility=hidden -Wall -Wextra -W -Wwrite-strings -Wno-unused-parameter -Wno-long-long -Werror=return-type -Wextra-semi -Wno-user-defined-literals -Wno-covered-switch-default -Wno-suggest-override -Wno-ignored-attributes -Wno-error -I /Users/buildslave/jenkins/workspace/lldb-cmake-standalone/clang-build/include/c++/v1 -include /Users/buildslave/jenkins/workspace/lldb-cmake-standalone/clang-build/projects/libcxx/__config_site -std=c++17 -MD -MT projects/libcxx/src/CMakeFiles/cxx_shared.dir/stdexcept.cpp.o -MF projects/libcxx/src/CMakeFiles/cxx_shared.dir/stdexcept.cpp.o.d -o projects/libcxx/src/CMakeFiles/cxx_shared.dir/stdexcept.cpp.o -c /Users/buildslave/jenkins/workspace/lldb-cmake-standalone/llvm-project/libcxx/src/stdexcept.cpp
[389/3462] /Users/buildslave/jenkins/workspace/lldb-cmake-standalone/host-compiler/bin/clang++  -DBUILD_EXAMPLES -DNDEBUG -D_LIBCPP_BUILDING_LIBRARY -D_LIBCPP_HAS_NO_PRAGMA_SYSTEM_HEADER -D__STDC_CONSTANT_MACROS -D__STDC_FORMAT_MACROS -D__STDC_LIMIT_MACROS -Iprojects/libcxx/src -I/Users/buildslave/jenkins/workspace/lldb-cmake-standalone/llvm-project/libcxx/src -Iinclude -I/Users/buildslave/jenkins/workspace/lldb-cmake-standalone/llvm-project/llvm/include -Iprojects/libcxx/include/c++build -fPIC -fvisibility-inlines-hidden -Werror=date-time -Werror=unguarded-availability-new -Wall -Wextra -Wno-unused-parameter -Wwrite-strings -Wcast-qual -Wmissing-field-initializers  -Wno-long-long -Wimplicit-fallthrough -Wcovered-switch-default -Wno-noexcept-type -Wnon-virtual-dtor -Wdelete-non-virtual-dtor -Wsuggest-override -Wstring-conversion -fdiagnostics-color -O3  -isysroot /Applications/Xcode.app/Contents/Developer/Platforms/MacOSX.platform/Developer/SDKs/MacOSX10.15.sdk -fPIC   -DLIBCXX_BUILDING_LIBCXXABI -UNDEBUG -faligned-allocation -nostdinc++ -fvisibility-inlines-hidden -fvisibility=hidden -Wall -Wextra -W -Wwrite-strings -Wno-unused-parameter -Wno-long-long -Werror=return-type -Wextra-semi -Wno-user-defined-literals -Wno-covered-switch-default -Wno-suggest-override -Wno-ignored-attributes -Wno-error -I /Users/buildslave/jenkins/workspace/lldb-cmake-standalone/clang-build/include/c++/v1 -include /Users/buildslave/jenkins/workspace/lldb-cmake-standalone/clang-build/projects/libcxx/__config_site -std=c++17 -MD -MT projects/libcxx/src/CMakeFiles/cxx_shared.dir/regex.cpp.o -MF projects/libcxx/src/CMakeFiles/cxx_shared.dir/regex.cpp.o.d -o projects/libcxx/src/CMakeFiles/cxx_shared.dir/regex.cpp.o -c /Users/buildslave/jenkins/workspace/lldb-cmake-standalone/llvm-project/libcxx/src/regex.cpp
[390/3462] /Users/buildslave/jenkins/workspace/lldb-cmake-standalone/host-compiler/bin/clang++  -DBUILD_EXAMPLES -DNDEBUG -D_LIBCPP_BUILDING_LIBRARY -D_LIBCPP_HAS_NO_PRAGMA_SYSTEM_HEADER -D__STDC_CONSTANT_MACROS -D__STDC_FORMAT_MACROS -D__STDC_LIMIT_MACROS -Iprojects/libcxx/src -I/Users/buildslave/jenkins/workspace/lldb-cmake-standalone/llvm-project/libcxx/src -Iinclude -I/Users/buildslave/jenkins/workspace/lldb-cmake-standalone/llvm-project/llvm/include -Iprojects/libcxx/include/c++build -fPIC -fvisibility-inlines-hidden -Werror=date-time -Werror=unguarded-availability-new -Wall -Wextra -Wno-unused-parameter -Wwrite-strings -Wcast-qual -Wmissing-field-initializers  -Wno-long-long -Wimplicit-fallthrough -Wcovered-switch-default -Wno-noexcept-type -Wnon-virtual-dtor -Wdelete-non-virtual-dtor -Wsuggest-override -Wstring-conversion -fdiagnostics-color -O3  -isysroot /Applications/Xcode.app/Contents/Developer/Platforms/MacOSX.platform/Developer/SDKs/MacOSX10.15.sdk -fPIC   -DLIBCXX_BUILDING_LIBCXXABI -UNDEBUG -faligned-allocation -nostdinc++ -fvisibility-inlines-hidden -fvisibility=hidden -Wall -Wextra -W -Wwrite-strings -Wno-unused-parameter -Wno-long-long -Werror=return-type -Wextra-semi -Wno-user-defined-literals -Wno-covered-switch-default -Wno-suggest-override -Wno-ignored-attributes -Wno-error -I /Users/buildslave/jenkins/workspace/lldb-cmake-standalone/clang-build/include/c++/v1 -include /Users/buildslave/jenkins/workspace/lldb-cmake-standalone/clang-build/projects/libcxx/__config_site -std=c++17 -MD -MT projects/libcxx/src/CMakeFiles/cxx_shared.dir/random_shuffle.cpp.o -MF projects/libcxx/src/CMakeFiles/cxx_shared.dir/random_shuffle.cpp.o.d -o projects/libcxx/src/CMakeFiles/cxx_shared.dir/random_shuffle.cpp.o -c /Users/buildslave/jenkins/workspace/lldb-cmake-standalone/llvm-project/libcxx/src/random_shuffle.cpp
[391/3462] /Users/buildslave/jenkins/workspace/lldb-cmake-standalone/host-compiler/bin/clang++  -DBUILD_EXAMPLES -DNDEBUG -D_LIBCPP_BUILDING_LIBRARY -D_LIBCPP_HAS_NO_PRAGMA_SYSTEM_HEADER -D__STDC_CONSTANT_MACROS -D__STDC_FORMAT_MACROS -D__STDC_LIMIT_MACROS -Iprojects/libcxx/src -I/Users/buildslave/jenkins/workspace/lldb-cmake-standalone/llvm-project/libcxx/src -Iinclude -I/Users/buildslave/jenkins/workspace/lldb-cmake-standalone/llvm-project/llvm/include -Iprojects/libcxx/include/c++build -fPIC -fvisibility-inlines-hidden -Werror=date-time -Werror=unguarded-availability-new -Wall -Wextra -Wno-unused-parameter -Wwrite-strings -Wcast-qual -Wmissing-field-initializers  -Wno-long-long -Wimplicit-fallthrough -Wcovered-switch-default -Wno-noexcept-type -Wnon-virtual-dtor -Wdelete-non-virtual-dtor -Wsuggest-override -Wstring-conversion -fdiagnostics-color -O3  -isysroot /Applications/Xcode.app/Contents/Developer/Platforms/MacOSX.platform/Developer/SDKs/MacOSX10.15.sdk -fPIC   -DLIBCXX_BUILDING_LIBCXXABI -UNDEBUG -faligned-allocation -nostdinc++ -fvisibility-inlines-hidden -fvisibility=hidden -Wall -Wextra -W -Wwrite-strings -Wno-unused-parameter -Wno-long-long -Werror=return-type -Wextra-semi -Wno-user-defined-literals -Wno-covered-switch-default -Wno-suggest-override -Wno-ignored-attributes -Wno-error -I /Users/buildslave/jenkins/workspace/lldb-cmake-standalone/clang-build/include/c++/v1 -include /Users/buildslave/jenkins/workspace/lldb-cmake-standalone/clang-build/projects/libcxx/__config_site -std=c++17 -MD -MT projects/libcxx/src/CMakeFiles/cxx_shared.dir/filesystem/int128_builtins.cpp.o -MF projects/libcxx/src/CMakeFiles/cxx_shared.dir/filesystem/int128_builtins.cpp.o.d -o projects/libcxx/src/CMakeFiles/cxx_shared.dir/filesystem/int128_builtins.cpp.o -c /Users/buildslave/jenkins/workspace/lldb-cmake-standalone/llvm-project/libcxx/src/filesystem/int128_builtins.cpp
[392/3462] /Users/buildslave/jenkins/workspace/lldb-cmake-standalone/host-compiler/bin/clang++  -DBUILD_EXAMPLES -DNDEBUG -D_LIBCPP_BUILDING_LIBRARY -D_LIBCPP_HAS_NO_PRAGMA_SYSTEM_HEADER -D__STDC_CONSTANT_MACROS -D__STDC_FORMAT_MACROS -D__STDC_LIMIT_MACROS -Iprojects/libcxx/src -I/Users/buildslave/jenkins/workspace/lldb-cmake-standalone/llvm-project/libcxx/src -Iinclude -I/Users/buildslave/jenkins/workspace/lldb-cmake-standalone/llvm-project/llvm/include -Iprojects/libcxx/include/c++build -fPIC -fvisibility-inlines-hidden -Werror=date-time -Werror=unguarded-availability-new -Wall -Wextra -Wno-unused-parameter -Wwrite-strings -Wcast-qual -Wmissing-field-initializers  -Wno-long-long -Wimplicit-fallthrough -Wcovered-switch-default -Wno-noexcept-type -Wnon-virtual-dtor -Wdelete-non-virtual-dtor -Wsuggest-override -Wstring-conversion -fdiagnostics-color -O3  -isysroot /Applications/Xcode.app/Contents/Developer/Platforms/MacOSX.platform/Developer/SDKs/MacOSX10.15.sdk -fPIC   -DLIBCXX_BUILDING_LIBCXXABI -UNDEBUG -faligned-allocation -nostdinc++ -fvisibility-inlines-hidden -fvisibility=hidden -Wall -Wextra -W -Wwrite-strings -Wno-unused-parameter -Wno-long-long -Werror=return-type -Wextra-semi -Wno-user-defined-literals -Wno-covered-switch-default -Wno-suggest-override -Wno-ignored-attributes -Wno-error -I /Users/buildslave/jenkins/workspace/lldb-cmake-standalone/clang-build/include/c++/v1 -include /Users/buildslave/jenkins/workspace/lldb-cmake-standalone/clang-build/projects/libcxx/__config_site -std=c++17 -MD -MT projects/libcxx/src/CMakeFiles/cxx_shared.dir/system_error.cpp.o -MF projects/libcxx/src/CMakeFiles/cxx_shared.dir/system_error.cpp.o.d -o projects/libcxx/src/CMakeFiles/cxx_shared.dir/system_error.cpp.o -c /Users/buildslave/jenkins/workspace/lldb-cmake-standalone/llvm-project/libcxx/src/system_error.cpp
[393/3462] /Users/buildslave/jenkins/workspace/lldb-cmake-standalone/host-compiler/bin/clang++  -DBUILD_EXAMPLES -DNDEBUG -D_LIBCPP_BUILDING_LIBRARY -D_LIBCPP_HAS_NO_PRAGMA_SYSTEM_HEADER -D__STDC_CONSTANT_MACROS -D__STDC_FORMAT_MACROS -D__STDC_LIMIT_MACROS -Iprojects/libcxx/src -I/Users/buildslave/jenkins/workspace/lldb-cmake-standalone/llvm-project/libcxx/src -Iinclude -I/Users/buildslave/jenkins/workspace/lldb-cmake-standalone/llvm-project/llvm/include -Iprojects/libcxx/include/c++build -fPIC -fvisibility-inlines-hidden -Werror=date-time -Werror=unguarded-availability-new -Wall -Wextra -Wno-unused-parameter -Wwrite-strings -Wcast-qual -Wmissing-field-initializers  -Wno-long-long -Wimplicit-fallthrough -Wcovered-switch-default -Wno-noexcept-type -Wnon-virtual-dtor -Wdelete-non-virtual-dtor -Wsuggest-override -Wstring-conversion -fdiagnostics-color -O3  -isysroot /Applications/Xcode.app/Contents/Developer/Platforms/MacOSX.platform/Developer/SDKs/MacOSX10.15.sdk -fPIC   -DLIBCXX_BUILDING_LIBCXXABI -UNDEBUG -faligned-allocation -nostdinc++ -fvisibility-inlines-hidden -fvisibility=hidden -Wall -Wextra -W -Wwrite-strings -Wno-unused-parameter -Wno-long-long -Werror=return-type -Wextra-semi -Wno-user-defined-literals -Wno-covered-switch-default -Wno-suggest-override -Wno-ignored-attributes -Wno-error -I /Users/buildslave/jenkins/workspace/lldb-cmake-standalone/clang-build/include/c++/v1 -include /Users/buildslave/jenkins/workspace/lldb-cmake-standalone/clang-build/projects/libcxx/__config_site -std=c++17 -MD -MT projects/libcxx/src/CMakeFiles/cxx_shared.dir/variant.cpp.o -MF projects/libcxx/src/CMakeFiles/cxx_shared.dir/variant.cpp.o.d -o projects/libcxx/src/CMakeFiles/cxx_shared.dir/variant.cpp.o -c /Users/buildslave/jenkins/workspace/lldb-cmake-standalone/llvm-project/libcxx/src/variant.cpp
[394/3462] /Users/buildslave/jenkins/workspace/lldb-cmake-standalone/host-compiler/bin/clang++  -DBUILD_EXAMPLES -DNDEBUG -D_LIBCPP_BUILDING_LIBRARY -D_LIBCPP_HAS_NO_PRAGMA_SYSTEM_HEADER -D__STDC_CONSTANT_MACROS -D__STDC_FORMAT_MACROS -D__STDC_LIMIT_MACROS -Iprojects/libcxx/src -I/Users/buildslave/jenkins/workspace/lldb-cmake-standalone/llvm-project/libcxx/src -Iinclude -I/Users/buildslave/jenkins/workspace/lldb-cmake-standalone/llvm-project/llvm/include -Iprojects/libcxx/include/c++build -fPIC -fvisibility-inlines-hidden -Werror=date-time -Werror=unguarded-availability-new -Wall -Wextra -Wno-unused-parameter -Wwrite-strings -Wcast-qual -Wmissing-field-initializers  -Wno-long-long -Wimplicit-fallthrough -Wcovered-switch-default -Wno-noexcept-type -Wnon-virtual-dtor -Wdelete-non-virtual-dtor -Wsuggest-override -Wstring-conversion -fdiagnostics-color -O3  -isysroot /Applications/Xcode.app/Contents/Developer/Platforms/MacOSX.platform/Developer/SDKs/MacOSX10.15.sdk -fPIC   -DLIBCXX_BUILDING_LIBCXXABI -UNDEBUG -faligned-allocation -nostdinc++ -fvisibility-inlines-hidden -fvisibility=hidden -Wall -Wextra -W -Wwrite-strings -Wno-unused-parameter -Wno-long-long -Werror=return-type -Wextra-semi -Wno-user-defined-literals -Wno-covered-switch-default -Wno-suggest-override -Wno-ignored-attributes -Wno-error -I /Users/buildslave/jenkins/workspace/lldb-cmake-standalone/clang-build/include/c++/v1 -include /Users/buildslave/jenkins/workspace/lldb-cmake-standalone/clang-build/projects/libcxx/__config_site -std=c++17 -MD -MT projects/libcxx/src/CMakeFiles/cxx_shared.dir/vector.cpp.o -MF projects/libcxx/src/CMakeFiles/cxx_shared.dir/vector.cpp.o.d -o projects/libcxx/src/CMakeFiles/cxx_shared.dir/vector.cpp.o -c /Users/buildslave/jenkins/workspace/lldb-cmake-standalone/llvm-project/libcxx/src/vector.cpp
[395/3462] /Users/buildslave/jenkins/workspace/lldb-cmake-standalone/host-compiler/bin/clang++  -DBUILD_EXAMPLES -DNDEBUG -D_LIBCPP_BUILDING_LIBRARY -D_LIBCPP_HAS_NO_PRAGMA_SYSTEM_HEADER -D__STDC_CONSTANT_MACROS -D__STDC_FORMAT_MACROS -D__STDC_LIMIT_MACROS -Iprojects/libcxx/src -I/Users/buildslave/jenkins/workspace/lldb-cmake-standalone/llvm-project/libcxx/src -Iinclude -I/Users/buildslave/jenkins/workspace/lldb-cmake-standalone/llvm-project/llvm/include -Iprojects/libcxx/include/c++build -fPIC -fvisibility-inlines-hidden -Werror=date-time -Werror=unguarded-availability-new -Wall -Wextra -Wno-unused-parameter -Wwrite-strings -Wcast-qual -Wmissing-field-initializers  -Wno-long-long -Wimplicit-fallthrough -Wcovered-switch-default -Wno-noexcept-type -Wnon-virtual-dtor -Wdelete-non-virtual-dtor -Wsuggest-override -Wstring-conversion -fdiagnostics-color -O3  -isysroot /Applications/Xcode.app/Contents/Developer/Platforms/MacOSX.platform/Developer/SDKs/MacOSX10.15.sdk -fPIC   -DLIBCXX_BUILDING_LIBCXXABI -UNDEBUG -faligned-allocation -nostdinc++ -fvisibility-inlines-hidden -fvisibility=hidden -Wall -Wextra -W -Wwrite-strings -Wno-unused-parameter -Wno-long-long -Werror=return-type -Wextra-semi -Wno-user-defined-literals -Wno-covered-switch-default -Wno-suggest-override -Wno-ignored-attributes -Wno-error -I /Users/buildslave/jenkins/workspace/lldb-cmake-standalone/clang-build/include/c++/v1 -include /Users/buildslave/jenkins/workspace/lldb-cmake-standalone/clang-build/projects/libcxx/__config_site -std=c++17 -MD -MT projects/libcxx/src/CMakeFiles/cxx_shared.dir/strstream.cpp.o -MF projects/libcxx/src/CMakeFiles/cxx_shared.dir/strstream.cpp.o.d -o projects/libcxx/src/CMakeFiles/cxx_shared.dir/strstream.cpp.o -c /Users/buildslave/jenkins/workspace/lldb-cmake-standalone/llvm-project/libcxx/src/strstream.cpp
[396/3462] /Users/buildslave/jenkins/workspace/lldb-cmake-standalone/host-compiler/bin/clang++  -DBUILD_EXAMPLES -DNDEBUG -D_LIBCPP_BUILDING_LIBRARY -D_LIBCPP_HAS_NO_PRAGMA_SYSTEM_HEADER -D__STDC_CONSTANT_MACROS -D__STDC_FORMAT_MACROS -D__STDC_LIMIT_MACROS -Iprojects/libcxx/src -I/Users/buildslave/jenkins/workspace/lldb-cmake-standalone/llvm-project/libcxx/src -Iinclude -I/Users/buildslave/jenkins/workspace/lldb-cmake-standalone/llvm-project/llvm/include -Iprojects/libcxx/include/c++build -fPIC -fvisibility-inlines-hidden -Werror=date-time -Werror=unguarded-availability-new -Wall -Wextra -Wno-unused-parameter -Wwrite-strings -Wcast-qual -Wmissing-field-initializers  -Wno-long-long -Wimplicit-fallthrough -Wcovered-switch-default -Wno-noexcept-type -Wnon-virtual-dtor -Wdelete-non-virtual-dtor -Wsuggest-override -Wstring-conversion -fdiagnostics-color -O3  -isysroot /Applications/Xcode.app/Contents/Developer/Platforms/MacOSX.platform/Developer/SDKs/MacOSX10.15.sdk -fPIC   -DLIBCXX_BUILDING_LIBCXXABI -UNDEBUG -faligned-allocation -nostdinc++ -fvisibility-inlines-hidden -fvisibility=hidden -Wall -Wextra -W -Wwrite-strings -Wno-unused-parameter -Wno-long-long -Werror=return-type -Wextra-semi -Wno-user-defined-literals -Wno-covered-switch-default -Wno-suggest-override -Wno-ignored-attributes -Wno-error -I /Users/buildslave/jenkins/workspace/lldb-cmake-standalone/clang-build/include/c++/v1 -include /Users/buildslave/jenkins/workspace/lldb-cmake-standalone/clang-build/projects/libcxx/__config_site -std=c++17 -MD -MT projects/libcxx/src/CMakeFiles/cxx_shared.dir/valarray.cpp.o -MF projects/libcxx/src/CMakeFiles/cxx_shared.dir/valarray.cpp.o.d -o projects/libcxx/src/CMakeFiles/cxx_shared.dir/valarray.cpp.o -c /Users/buildslave/jenkins/workspace/lldb-cmake-standalone/llvm-project/libcxx/src/valarray.cpp
[397/3462] /Users/buildslave/jenkins/workspace/lldb-cmake-standalone/host-compiler/bin/clang++  -DBUILD_EXAMPLES -DNDEBUG -D_LIBCPP_BUILDING_LIBRARY -D_LIBCPP_HAS_NO_PRAGMA_SYSTEM_HEADER -D__STDC_CONSTANT_MACROS -D__STDC_FORMAT_MACROS -D__STDC_LIMIT_MACROS -Iprojects/libcxx/src -I/Users/buildslave/jenkins/workspace/lldb-cmake-standalone/llvm-project/libcxx/src -Iinclude -I/Users/buildslave/jenkins/workspace/lldb-cmake-standalone/llvm-project/llvm/include -Iprojects/libcxx/include/c++build -fPIC -fvisibility-inlines-hidden -Werror=date-time -Werror=unguarded-availability-new -Wall -Wextra -Wno-unused-parameter -Wwrite-strings -Wcast-qual -Wmissing-field-initializers  -Wno-long-long -Wimplicit-fallthrough -Wcovered-switch-default -Wno-noexcept-type -Wnon-virtual-dtor -Wdelete-non-virtual-dtor -Wsuggest-override -Wstring-conversion -fdiagnostics-color -O3  -isysroot /Applications/Xcode.app/Contents/Developer/Platforms/MacOSX.platform/Developer/SDKs/MacOSX10.15.sdk -fPIC   -DLIBCXX_BUILDING_LIBCXXABI -UNDEBUG -faligned-allocation -nostdinc++ -fvisibility-inlines-hidden -fvisibility=hidden -Wall -Wextra -W -Wwrite-strings -Wno-unused-parameter -Wno-long-long -Werror=return-type -Wextra-semi -Wno-user-defined-literals -Wno-covered-switch-default -Wno-suggest-override -Wno-ignored-attributes -Wno-error -I /Users/buildslave/jenkins/workspace/lldb-cmake-standalone/clang-build/include/c++/v1 -include /Users/buildslave/jenkins/workspace/lldb-cmake-standalone/clang-build/projects/libcxx/__config_site -std=c++17 -MD -MT projects/libcxx/src/CMakeFiles/cxx_shared.dir/thread.cpp.o -MF projects/libcxx/src/CMakeFiles/cxx_shared.dir/thread.cpp.o.d -o projects/libcxx/src/CMakeFiles/cxx_shared.dir/thread.cpp.o -c /Users/buildslave/jenkins/workspace/lldb-cmake-standalone/llvm-project/libcxx/src/thread.cpp
[398/3462] /Users/buildslave/jenkins/workspace/lldb-cmake-standalone/host-compiler/bin/clang++  -DBUILD_EXAMPLES -DNDEBUG -D_LIBCPP_BUILDING_LIBRARY -D_LIBCPP_HAS_NO_PRAGMA_SYSTEM_HEADER -D__STDC_CONSTANT_MACROS -D__STDC_FORMAT_MACROS -D__STDC_LIMIT_MACROS -Iprojects/libcxx/src -I/Users/buildslave/jenkins/workspace/lldb-cmake-standalone/llvm-project/libcxx/src -Iinclude -I/Users/buildslave/jenkins/workspace/lldb-cmake-standalone/llvm-project/llvm/include -Iprojects/libcxx/include/c++build -fPIC -fvisibility-inlines-hidden -Werror=date-time -Werror=unguarded-availability-new -Wall -Wextra -Wno-unused-parameter -Wwrite-strings -Wcast-qual -Wmissing-field-initializers  -Wno-long-long -Wimplicit-fallthrough -Wcovered-switch-default -Wno-noexcept-type -Wnon-virtual-dtor -Wdelete-non-virtual-dtor -Wsuggest-override -Wstring-conversion -fdiagnostics-color -O3  -isysroot /Applications/Xcode.app/Contents/Developer/Platforms/MacOSX.platform/Developer/SDKs/MacOSX10.15.sdk   -DLIBCXX_BUILDING_LIBCXXABI -UNDEBUG -faligned-allocation -nostdinc++ -fvisibility-inlines-hidden -fvisibility=hidden -Wall -Wextra -W -Wwrite-strings -Wno-unused-parameter -Wno-long-long -Werror=return-type -Wextra-semi -Wno-user-defined-literals -Wno-covered-switch-default -Wno-suggest-override -Wno-ignored-attributes -Wno-error -I /Users/buildslave/jenkins/workspace/lldb-cmake-standalone/clang-build/include/c++/v1 -include /Users/buildslave/jenkins/workspace/lldb-cmake-standalone/clang-build/projects/libcxx/__config_site -std=c++17 -MD -MT projects/libcxx/src/CMakeFiles/cxx_static.dir/filesystem/operations.cpp.o -MF projects/libcxx/src/CMakeFiles/cxx_static.dir/filesystem/operations.cpp.o.d -o projects/libcxx/src/CMakeFiles/cxx_static.dir/filesystem/operations.cpp.o -c /Users/buildslave/jenkins/workspace/lldb-cmake-standalone/llvm-project/libcxx/src/filesystem/operations.cpp
[399/3462] cd /Users/buildslave/jenkins/workspace/lldb-cmake-standalone/clang-build/tools/clang/lib/Analysis/plugins/SampleAnalyzer && sed -e "s/^/_/" < /Users/buildslave/jenkins/workspace/lldb-cmake-standalone/llvm-project/clang/lib/Analysis/plugins/SampleAnalyzer/SampleAnalyzerPlugin.exports > SampleAnalyzerPlugin.exports
[400/3462] cd /Users/buildslave/jenkins/workspace/lldb-cmake-standalone/clang-build/tools/clang/tools/scan-build && /usr/local/Cellar/cmake/3.17.2/bin/cmake -E make_directory /Users/buildslave/jenkins/workspace/lldb-cmake-standalone/clang-build/bin && /usr/local/Cellar/cmake/3.17.2/bin/cmake -E copy /Users/buildslave/jenkins/workspace/lldb-cmake-standalone/llvm-project/clang/tools/scan-build/bin/scan-build /Users/buildslave/jenkins/workspace/lldb-cmake-standalone/clang-build/bin/
[401/3462] cd /Users/buildslave/jenkins/workspace/lldb-cmake-standalone/clang-build/tools/clang/tools/scan-build && /usr/local/Cellar/cmake/3.17.2/bin/cmake -E make_directory /Users/buildslave/jenkins/workspace/lldb-cmake-standalone/clang-build/libexec && /usr/local/Cellar/cmake/3.17.2/bin/cmake -E copy /Users/buildslave/jenkins/workspace/lldb-cmake-standalone/llvm-project/clang/tools/scan-build/libexec/ccc-analyzer /Users/buildslave/jenkins/workspace/lldb-cmake-standalone/clang-build/libexec/
[402/3462] cd /Users/buildslave/jenkins/workspace/lldb-cmake-standalone/clang-build/tools/clang/tools/scan-build && /usr/local/Cellar/cmake/3.17.2/bin/cmake -E make_directory /Users/buildslave/jenkins/workspace/lldb-cmake-standalone/clang-build/bin && /usr/local/Cellar/cmake/3.17.2/bin/cmake -E copy /Users/buildslave/jenkins/workspace/lldb-cmake-standalone/llvm-project/clang/tools/scan-build/bin/set-xcode-analyzer /Users/buildslave/jenkins/workspace/lldb-cmake-standalone/clang-build/bin/
[403/3462] cd /Users/buildslave/jenkins/workspace/lldb-cmake-standalone/clang-build/tools/clang/tools/scan-build && /usr/local/Cellar/cmake/3.17.2/bin/cmake -E make_directory /Users/buildslave/jenkins/workspace/lldb-cmake-standalone/clang-build/libexec && /usr/local/Cellar/cmake/3.17.2/bin/cmake -E copy /Users/buildslave/jenkins/workspace/lldb-cmake-standalone/llvm-project/clang/tools/scan-build/libexec/c++-analyzer /Users/buildslave/jenkins/workspace/lldb-cmake-standalone/clang-build/libexec/
[404/3462] cd /Users/buildslave/jenkins/workspace/lldb-cmake-standalone/clang-build/tools/clang/tools/scan-build && /usr/local/Cellar/cmake/3.17.2/bin/cmake -E make_directory /Users/buildslave/jenkins/workspace/lldb-cmake-standalone/clang-build/share/man/man1 && /usr/local/Cellar/cmake/3.17.2/bin/cmake -E copy /Users/buildslave/jenkins/workspace/lldb-cmake-standalone/llvm-project/clang/tools/scan-build/man/scan-build.1 /Users/buildslave/jenkins/workspace/lldb-cmake-standalone/clang-build/share/man/man1/
[405/3462] cd /Users/buildslave/jenkins/workspace/lldb-cmake-standalone/clang-build/tools/clang/tools/scan-build && /usr/local/Cellar/cmake/3.17.2/bin/cmake -E make_directory /Users/buildslave/jenkins/workspace/lldb-cmake-standalone/clang-build/share/scan-build && /usr/local/Cellar/cmake/3.17.2/bin/cmake -E copy /Users/buildslave/jenkins/workspace/lldb-cmake-standalone/llvm-project/clang/tools/scan-build/share/scan-build/scanview.css /Users/buildslave/jenkins/workspace/lldb-cmake-standalone/clang-build/share/scan-build/
[406/3462] cd /Users/buildslave/jenkins/workspace/lldb-cmake-standalone/clang-build/tools/clang/tools/scan-build && /usr/local/Cellar/cmake/3.17.2/bin/cmake -E make_directory /Users/buildslave/jenkins/workspace/lldb-cmake-standalone/clang-build/share/scan-build && /usr/local/Cellar/cmake/3.17.2/bin/cmake -E copy /Users/buildslave/jenkins/workspace/lldb-cmake-standalone/llvm-project/clang/tools/scan-build/share/scan-build/sorttable.js /Users/buildslave/jenkins/workspace/lldb-cmake-standalone/clang-build/share/scan-build/
[407/3462] cd /Users/buildslave/jenkins/workspace/lldb-cmake-standalone/clang-build/tools/clang/tools/scan-view && /usr/local/Cellar/cmake/3.17.2/bin/cmake -E make_directory /Users/buildslave/jenkins/workspace/lldb-cmake-standalone/clang-build/bin && /usr/local/Cellar/cmake/3.17.2/bin/cmake -E copy /Users/buildslave/jenkins/workspace/lldb-cmake-standalone/llvm-project/clang/tools/scan-view/bin/scan-view /Users/buildslave/jenkins/workspace/lldb-cmake-standalone/clang-build/bin/
[408/3462] cd /Users/buildslave/jenkins/workspace/lldb-cmake-standalone/clang-build/tools/clang/tools/scan-view && /usr/local/Cellar/cmake/3.17.2/bin/cmake -E make_directory /Users/buildslave/jenkins/workspace/lldb-cmake-standalone/clang-build/share/scan-view && /usr/local/Cellar/cmake/3.17.2/bin/cmake -E copy /Users/buildslave/jenkins/workspace/lldb-cmake-standalone/llvm-project/clang/tools/scan-view/share/Reporter.py /Users/buildslave/jenkins/workspace/lldb-cmake-standalone/clang-build/share/scan-view/
[409/3462] cd /Users/buildslave/jenkins/workspace/lldb-cmake-standalone/clang-build/tools/clang/tools/scan-view && /usr/local/Cellar/cmake/3.17.2/bin/cmake -E make_directory /Users/buildslave/jenkins/workspace/lldb-cmake-standalone/clang-build/share/scan-view && /usr/local/Cellar/cmake/3.17.2/bin/cmake -E copy /Users/buildslave/jenkins/workspace/lldb-cmake-standalone/llvm-project/clang/tools/scan-view/share/ScanView.py /Users/buildslave/jenkins/workspace/lldb-cmake-standalone/clang-build/share/scan-view/
[410/3462] cd /Users/buildslave/jenkins/workspace/lldb-cmake-standalone/clang-build/tools/clang/tools/scan-view && /usr/local/Cellar/cmake/3.17.2/bin/cmake -E make_directory /Users/buildslave/jenkins/workspace/lldb-cmake-standalone/clang-build/share/scan-view && /usr/local/Cellar/cmake/3.17.2/bin/cmake -E copy /Users/buildslave/jenkins/workspace/lldb-cmake-standalone/llvm-project/clang/tools/scan-view/share/startfile.py /Users/buildslave/jenkins/workspace/lldb-cmake-standalone/clang-build/share/scan-view/
[411/3462] cd /Users/buildslave/jenkins/workspace/lldb-cmake-standalone/clang-build/tools/clang/tools/scan-view && /usr/local/Cellar/cmake/3.17.2/bin/cmake -E make_directory /Users/buildslave/jenkins/workspace/lldb-cmake-standalone/clang-build/share/scan-view && /usr/local/Cellar/cmake/3.17.2/bin/cmake -E copy /Users/buildslave/jenkins/workspace/lldb-cmake-standalone/llvm-project/clang/tools/scan-view/share/FileRadar.scpt /Users/buildslave/jenkins/workspace/lldb-cmake-standalone/clang-build/share/scan-view/
[412/3462] cd /Users/buildslave/jenkins/workspace/lldb-cmake-standalone/clang-build/tools/clang/tools/scan-view && /usr/local/Cellar/cmake/3.17.2/bin/cmake -E make_directory /Users/buildslave/jenkins/workspace/lldb-cmake-standalone/clang-build/share/scan-view && /usr/local/Cellar/cmake/3.17.2/bin/cmake -E copy /Users/buildslave/jenkins/workspace/lldb-cmake-standalone/llvm-project/clang/tools/scan-view/share/GetRadarVersion.scpt /Users/buildslave/jenkins/workspace/lldb-cmake-standalone/clang-build/share/scan-view/
[413/3462] cd /Users/buildslave/jenkins/workspace/lldb-cmake-standalone/clang-build/tools/clang/tools/scan-view && /usr/local/Cellar/cmake/3.17.2/bin/cmake -E make_directory /Users/buildslave/jenkins/workspace/lldb-cmake-standalone/clang-build/share/scan-view && /usr/local/Cellar/cmake/3.17.2/bin/cmake -E copy /Users/buildslave/jenkins/workspace/lldb-cmake-standalone/llvm-project/clang/tools/scan-view/share/bugcatcher.ico /Users/buildslave/jenkins/workspace/lldb-cmake-standalone/clang-build/share/scan-view/
[414/3462] cd /Users/buildslave/jenkins/workspace/lldb-cmake-standalone/clang-build/tools/clang/tools/libclang && sed -e "s/^/_/" < /Users/buildslave/jenkins/workspace/lldb-cmake-standalone/llvm-project/clang/tools/libclang/libclang.exports > libclang.exports
[415/3462] /Users/buildslave/jenkins/workspace/lldb-cmake-standalone/host-compiler/bin/clang++  -DBUILD_EXAMPLES -DNDEBUG -D_LIBCPP_BUILDING_LIBRARY -D_LIBCPP_HAS_NO_PRAGMA_SYSTEM_HEADER -D__STDC_CONSTANT_MACROS -D__STDC_FORMAT_MACROS -D__STDC_LIMIT_MACROS -Iprojects/libcxx/src -I/Users/buildslave/jenkins/workspace/lldb-cmake-standalone/llvm-project/libcxx/src -Iinclude -I/Users/buildslave/jenkins/workspace/lldb-cmake-standalone/llvm-project/llvm/include -Iprojects/libcxx/include/c++build -fPIC -fvisibility-inlines-hidden -Werror=date-time -Werror=unguarded-availability-new -Wall -Wextra -Wno-unused-parameter -Wwrite-strings -Wcast-qual -Wmissing-field-initializers  -Wno-long-long -Wimplicit-fallthrough -Wcovered-switch-default -Wno-noexcept-type -Wnon-virtual-dtor -Wdelete-non-virtual-dtor -Wsuggest-override -Wstring-conversion -fdiagnostics-color -O3  -isysroot /Applications/Xcode.app/Contents/Developer/Platforms/MacOSX.platform/Developer/SDKs/MacOSX10.15.sdk -fPIC   -DLIBCXX_BUILDING_LIBCXXABI -UNDEBUG -faligned-allocation -nostdinc++ -fvisibility-inlines-hidden -fvisibility=hidden -Wall -Wextra -W -Wwrite-strings -Wno-unused-parameter -Wno-long-long -Werror=return-type -Wextra-semi -Wno-user-defined-literals -Wno-covered-switch-default -Wno-suggest-override -Wno-ignored-attributes -Wno-error -I /Users/buildslave/jenkins/workspace/lldb-cmake-standalone/clang-build/include/c++/v1 -include /Users/buildslave/jenkins/workspace/lldb-cmake-standalone/clang-build/projects/libcxx/__config_site -std=c++17 -MD -MT projects/libcxx/src/CMakeFiles/cxx_shared.dir/ios.cpp.o -MF projects/libcxx/src/CMakeFiles/cxx_shared.dir/ios.cpp.o.d -o projects/libcxx/src/CMakeFiles/cxx_shared.dir/ios.cpp.o -c /Users/buildslave/jenkins/workspace/lldb-cmake-standalone/llvm-project/libcxx/src/ios.cpp
[416/3462] /Users/buildslave/jenkins/workspace/lldb-cmake-standalone/host-compiler/bin/clang++  -DBUILD_EXAMPLES -D_DEBUG -D_LIBCPP_DISABLE_EXTERN_TEMPLATE -D_LIBCPP_ENABLE_CXX17_REMOVED_UNEXPECTED_FUNCTIONS -D_LIBCXXABI_BUILDING_LIBRARY -D__STDC_CONSTANT_MACROS -D__STDC_FORMAT_MACROS -D__STDC_LIMIT_MACROS -Iprojects/libcxxabi/src -I/Users/buildslave/jenkins/workspace/lldb-cmake-standalone/llvm-project/libcxxabi/src -Iinclude -I/Users/buildslave/jenkins/workspace/lldb-cmake-standalone/llvm-project/llvm/include -I/Users/buildslave/jenkins/workspace/lldb-cmake-standalone/llvm-project/libcxxabi/include -I/Users/buildslave/jenkins/workspace/lldb-cmake-standalone/llvm-project/libcxxabi/../libcxx/include -fPIC -fvisibility-inlines-hidden -Werror=date-time -Werror=unguarded-availability-new -Wall -Wextra -Wno-unused-parameter -Wwrite-strings -Wcast-qual -Wmissing-field-initializers -pedantic -Wno-long-long -Wimplicit-fallthrough -Wcovered-switch-default -Wno-noexcept-type -Wnon-virtual-dtor -Wdelete-non-virtual-dtor -Wsuggest-override -Wstring-conversion -fdiagnostics-color  -O3  -isysroot /Applications/Xcode.app/Contents/Developer/Platforms/MacOSX.platform/Developer/SDKs/MacOSX10.15.sdk -fPIC   -nostdinc++ -Werror=return-type -W -Wall -Wchar-subscripts -Wconversion -Wmismatched-tags -Wmissing-braces -Wnewline-eof -Wunused-function -Wshadow -Wshorten-64-to-32 -Wsign-compare -Wsign-conversion -Wstrict-aliasing=2 -Wstrict-overflow=4 -Wunused-parameter -Wunused-variable -Wwrite-strings -Wundef -Wno-suggest-override -Wno-error -pedantic -fstrict-aliasing -funwind-tables -D_DEBUG -UNDEBUG -UNDEBUG -std=c++17 -MD -MT projects/libcxxabi/src/CMakeFiles/cxxabi_shared.dir/cxa_demangle.cpp.o -MF projects/libcxxabi/src/CMakeFiles/cxxabi_shared.dir/cxa_demangle.cpp.o.d -o projects/libcxxabi/src/CMakeFiles/cxxabi_shared.dir/cxa_demangle.cpp.o -c /Users/buildslave/jenkins/workspace/lldb-cmake-standalone/llvm-project/libcxxabi/src/cxa_demangle.cpp
[417/3462] : && /Users/buildslave/jenkins/workspace/lldb-cmake-standalone/host-compiler/bin/clang++ -fPIC -fvisibility-inlines-hidden -Werror=date-time -Werror=unguarded-availability-new -Wall -Wextra -Wno-unused-parameter -Wwrite-strings -Wcast-qual -Wmissing-field-initializers -pedantic -Wno-long-long -Wimplicit-fallthrough -Wcovered-switch-default -Wno-noexcept-type -Wnon-virtual-dtor -Wdelete-non-virtual-dtor -Wsuggest-override -Wstring-conversion -fdiagnostics-color  -O3 -isysroot /Applications/Xcode.app/Contents/Developer/Platforms/MacOSX.platform/Developer/SDKs/MacOSX10.15.sdk -dynamiclib -Wl,-headerpad_max_install_names -nodefaultlibs  -compatibility_version 1.0.0 -current_version 1.0.0 -o lib/libc++abi.1.0.dylib -install_name @rpath/libc++abi.1.dylib projects/libcxxabi/src/CMakeFiles/cxxabi_shared.dir/cxa_aux_runtime.cpp.o projects/libcxxabi/src/CMakeFiles/cxxabi_shared.dir/cxa_default_handlers.cpp.o projects/libcxxabi/src/CMakeFiles/cxxabi_shared.dir/cxa_demangle.cpp.o projects/libcxxabi/src/CMakeFiles/cxxabi_shared.dir/cxa_exception_storage.cpp.o projects/libcxxabi/src/CMakeFiles/cxxabi_shared.dir/cxa_guard.cpp.o projects/libcxxabi/src/CMakeFiles/cxxabi_shared.dir/cxa_handlers.cpp.o projects/libcxxabi/src/CMakeFiles/cxxabi_shared.dir/cxa_vector.cpp.o projects/libcxxabi/src/CMakeFiles/cxxabi_shared.dir/cxa_virtual.cpp.o projects/libcxxabi/src/CMakeFiles/cxxabi_shared.dir/stdlib_exception.cpp.o projects/libcxxabi/src/CMakeFiles/cxxabi_shared.dir/stdlib_stdexcept.cpp.o projects/libcxxabi/src/CMakeFiles/cxxabi_shared.dir/stdlib_typeinfo.cpp.o projects/libcxxabi/src/CMakeFiles/cxxabi_shared.dir/abort_message.cpp.o projects/libcxxabi/src/CMakeFiles/cxxabi_shared.dir/fallback_malloc.cpp.o projects/libcxxabi/src/CMakeFiles/cxxabi_shared.dir/private_typeinfo.cpp.o projects/libcxxabi/src/CMakeFiles/cxxabi_shared.dir/stdlib_new_delete.cpp.o projects/libcxxabi/src/CMakeFiles/cxxabi_shared.dir/cxa_exception.cpp.o projects/libcxxabi/src/CMakeFiles/cxxabi_shared.dir/cxa_personality.cpp.o  -Wl,-rpath,@loader_path/../lib  -lSystem  -Wl,-exported_symbols_list,/Users/buildslave/jenkins/workspace/lldb-cmake-standalone/llvm-project/libcxxabi/src/../lib/itanium-base.exp  -Wl,-exported_symbols_list,/Users/buildslave/jenkins/workspace/lldb-cmake-standalone/llvm-project/libcxxabi/src/../lib/new-delete.exp  -Wl,-exported_symbols_list,/Users/buildslave/jenkins/workspace/lldb-cmake-standalone/llvm-project/libcxxabi/src/../lib/exceptions.exp  -Wl,-exported_symbols_list,/Users/buildslave/jenkins/workspace/lldb-cmake-standalone/llvm-project/libcxxabi/src/../lib/personality-v0.exp && :
[418/3462] /usr/local/Cellar/cmake/3.17.2/bin/cmake -E cmake_symlink_library lib/libc++abi.1.0.dylib  lib/libc++abi.1.dylib lib/libc++abi.dylib && :
[419/3462] /Users/buildslave/jenkins/workspace/lldb-cmake-standalone/host-compiler/bin/clang++  -DBUILD_EXAMPLES -DNDEBUG -D_LIBCPP_BUILDING_LIBRARY -D_LIBCPP_HAS_NO_PRAGMA_SYSTEM_HEADER -D__STDC_CONSTANT_MACROS -D__STDC_FORMAT_MACROS -D__STDC_LIMIT_MACROS -Iprojects/libcxx/src -I/Users/buildslave/jenkins/workspace/lldb-cmake-standalone/llvm-project/libcxx/src -Iinclude -I/Users/buildslave/jenkins/workspace/lldb-cmake-standalone/llvm-project/llvm/include -Iprojects/libcxx/include/c++build -fPIC -fvisibility-inlines-hidden -Werror=date-time -Werror=unguarded-availability-new -Wall -Wextra -Wno-unused-parameter -Wwrite-strings -Wcast-qual -Wmissing-field-initializers  -Wno-long-long -Wimplicit-fallthrough -Wcovered-switch-default -Wno-noexcept-type -Wnon-virtual-dtor -Wdelete-non-virtual-dtor -Wsuggest-override -Wstring-conversion -fdiagnostics-color -O3  -isysroot /Applications/Xcode.app/Contents/Developer/Platforms/MacOSX.platform/Developer/SDKs/MacOSX10.15.sdk -fPIC   -DLIBCXX_BUILDING_LIBCXXABI -UNDEBUG -faligned-allocation -nostdinc++ -fvisibility-inlines-hidden -fvisibility=hidden -Wall -Wextra -W -Wwrite-strings -Wno-unused-parameter -Wno-long-long -Werror=return-type -Wextra-semi -Wno-user-defined-literals -Wno-covered-switch-default -Wno-suggest-override -Wno-ignored-attributes -Wno-error -I /Users/buildslave/jenkins/workspace/lldb-cmake-standalone/clang-build/include/c++/v1 -include /Users/buildslave/jenkins/workspace/lldb-cmake-standalone/clang-build/projects/libcxx/__config_site -std=c++17 -MD -MT projects/libcxx/src/CMakeFiles/cxx_shared.dir/string.cpp.o -MF projects/libcxx/src/CMakeFiles/cxx_shared.dir/string.cpp.o.d -o projects/libcxx/src/CMakeFiles/cxx_shared.dir/string.cpp.o -c /Users/buildslave/jenkins/workspace/lldb-cmake-standalone/llvm-project/libcxx/src/string.cpp
[420/3462] /Users/buildslave/jenkins/workspace/lldb-cmake-standalone/host-compiler/bin/clang++  -DBUILD_EXAMPLES -DGTEST_HAS_RTTI=0 -D_DEBUG -D__STDC_CONSTANT_MACROS -D__STDC_FORMAT_MACROS -D__STDC_LIMIT_MACROS -Ilib/Support -I/Users/buildslave/jenkins/workspace/lldb-cmake-standalone/llvm-project/llvm/lib/Support -Iinclude -I/Users/buildslave/jenkins/workspace/lldb-cmake-standalone/llvm-project/llvm/include -fPIC -fvisibility-inlines-hidden -Werror=date-time -Werror=unguarded-availability-new -Wall -Wextra -Wno-unused-parameter -Wwrite-strings -Wcast-qual -Wmissing-field-initializers -pedantic -Wno-long-long -Wimplicit-fallthrough -Wcovered-switch-default -Wno-noexcept-type -Wnon-virtual-dtor -Wdelete-non-virtual-dtor -Wsuggest-override -Wstring-conversion -fdiagnostics-color -O3  -isysroot /Applications/Xcode.app/Contents/Developer/Platforms/MacOSX.platform/Developer/SDKs/MacOSX10.15.sdk   -UNDEBUG -std=c++14  -fno-exceptions -fno-rtti -MD -MT lib/Support/CMakeFiles/LLVMSupport.dir/ARMBuildAttrs.cpp.o -MF lib/Support/CMakeFiles/LLVMSupport.dir/ARMBuildAttrs.cpp.o.d -o lib/Support/CMakeFiles/LLVMSupport.dir/ARMBuildAttrs.cpp.o -c /Users/buildslave/jenkins/workspace/lldb-cmake-standalone/llvm-project/llvm/lib/Support/ARMBuildAttrs.cpp
[421/3462] /Users/buildslave/jenkins/workspace/lldb-cmake-standalone/host-compiler/bin/clang++  -DBUILD_EXAMPLES -DGTEST_HAS_RTTI=0 -D_DEBUG -D_GNU_SOURCE -D__STDC_CONSTANT_MACROS -D__STDC_FORMAT_MACROS -D__STDC_LIMIT_MACROS -Itools/clang/utils/TableGen -I/Users/buildslave/jenkins/workspace/lldb-cmake-standalone/llvm-project/clang/utils/TableGen -I/Users/buildslave/jenkins/workspace/lldb-cmake-standalone/llvm-project/clang/include -Itools/clang/include -Iinclude -I/Users/buildslave/jenkins/workspace/lldb-cmake-standalone/llvm-project/llvm/include -fPIC -fvisibility-inlines-hidden -Werror=date-time -Werror=unguarded-availability-new -Wall -Wextra -Wno-unused-parameter -Wwrite-strings -Wcast-qual -Wmissing-field-initializers -pedantic -Wno-long-long -Wimplicit-fallthrough -Wcovered-switch-default -Wno-noexcept-type -Wnon-virtual-dtor -Wdelete-non-virtual-dtor -Wsuggest-override -Wstring-conversion -fdiagnostics-color -fno-common -Woverloaded-virtual -Wno-nested-anon-types -O3  -isysroot /Applications/Xcode.app/Contents/Developer/Platforms/MacOSX.platform/Developer/SDKs/MacOSX10.15.sdk    -fno-exceptions -fno-rtti -UNDEBUG -std=c++14 -MD -MT tools/clang/utils/TableGen/CMakeFiles/clang-tblgen.dir/ClangTypeNodesEmitter.cpp.o -MF tools/clang/utils/TableGen/CMakeFiles/clang-tblgen.dir/ClangTypeNodesEmitter.cpp.o.d -o tools/clang/utils/TableGen/CMakeFiles/clang-tblgen.dir/ClangTypeNodesEmitter.cpp.o -c /Users/buildslave/jenkins/workspace/lldb-cmake-standalone/llvm-project/clang/utils/TableGen/ClangTypeNodesEmitter.cpp
[422/3462] /Users/buildslave/jenkins/workspace/lldb-cmake-standalone/host-compiler/bin/clang++  -DBUILD_EXAMPLES -DGTEST_HAS_RTTI=0 -D_DEBUG -D__STDC_CONSTANT_MACROS -D__STDC_FORMAT_MACROS -D__STDC_LIMIT_MACROS -Ilib/Support -I/Users/buildslave/jenkins/workspace/lldb-cmake-standalone/llvm-project/llvm/lib/Support -Iinclude -I/Users/buildslave/jenkins/workspace/lldb-cmake-standalone/llvm-project/llvm/include -fPIC -fvisibility-inlines-hidden -Werror=date-time -Werror=unguarded-availability-new -Wall -Wextra -Wno-unused-parameter -Wwrite-strings -Wcast-qual -Wmissing-field-initializers -pedantic -Wno-long-long -Wimplicit-fallthrough -Wcovered-switch-default -Wno-noexcept-type -Wnon-virtual-dtor -Wdelete-non-virtual-dtor -Wsuggest-override -Wstring-conversion -fdiagnostics-color -O3  -isysroot /Applications/Xcode.app/Contents/Developer/Platforms/MacOSX.platform/Developer/SDKs/MacOSX10.15.sdk   -UNDEBUG -std=c++14  -fno-exceptions -fno-rtti -MD -MT lib/Support/CMakeFiles/LLVMSupport.dir/APSInt.cpp.o -MF lib/Support/CMakeFiles/LLVMSupport.dir/APSInt.cpp.o.d -o lib/Support/CMakeFiles/LLVMSupport.dir/APSInt.cpp.o -c /Users/buildslave/jenkins/workspace/lldb-cmake-standalone/llvm-project/llvm/lib/Support/APSInt.cpp
[423/3462] /Users/buildslave/jenkins/workspace/lldb-cmake-standalone/host-compiler/bin/clang++  -DBUILD_EXAMPLES -DGTEST_HAS_RTTI=0 -D_DEBUG -D_GNU_SOURCE -D__STDC_CONSTANT_MACROS -D__STDC_FORMAT_MACROS -D__STDC_LIMIT_MACROS -Itools/clang/utils/TableGen -I/Users/buildslave/jenkins/workspace/lldb-cmake-standalone/llvm-project/clang/utils/TableGen -I/Users/buildslave/jenkins/workspace/lldb-cmake-standalone/llvm-project/clang/include -Itools/clang/include -Iinclude -I/Users/buildslave/jenkins/workspace/lldb-cmake-standalone/llvm-project/llvm/include -fPIC -fvisibility-inlines-hidden -Werror=date-time -Werror=unguarded-availability-new -Wall -Wextra -Wno-unused-parameter -Wwrite-strings -Wcast-qual -Wmissing-field-initializers -pedantic -Wno-long-long -Wimplicit-fallthrough -Wcovered-switch-default -Wno-noexcept-type -Wnon-virtual-dtor -Wdelete-non-virtual-dtor -Wsuggest-override -Wstring-conversion -fdiagnostics-color -fno-common -Woverloaded-virtual -Wno-nested-anon-types -O3  -isysroot /Applications/Xcode.app/Contents/Developer/Platforms/MacOSX.platform/Developer/SDKs/MacOSX10.15.sdk    -fno-exceptions -fno-rtti -UNDEBUG -std=c++14 -MD -MT tools/clang/utils/TableGen/CMakeFiles/clang-tblgen.dir/ClangSACheckersEmitter.cpp.o -MF tools/clang/utils/TableGen/CMakeFiles/clang-tblgen.dir/ClangSACheckersEmitter.cpp.o.d -o tools/clang/utils/TableGen/CMakeFiles/clang-tblgen.dir/ClangSACheckersEmitter.cpp.o -c /Users/buildslave/jenkins/workspace/lldb-cmake-standalone/llvm-project/clang/utils/TableGen/ClangSACheckersEmitter.cpp
[424/3462] /Users/buildslave/jenkins/workspace/lldb-cmake-standalone/host-compiler/bin/clang++  -DBUILD_EXAMPLES -DNDEBUG -D_LIBCPP_BUILDING_LIBRARY -D_LIBCPP_HAS_NO_PRAGMA_SYSTEM_HEADER -D__STDC_CONSTANT_MACROS -D__STDC_FORMAT_MACROS -D__STDC_LIMIT_MACROS -Iprojects/libcxx/src -I/Users/buildslave/jenkins/workspace/lldb-cmake-standalone/llvm-project/libcxx/src -Iinclude -I/Users/buildslave/jenkins/workspace/lldb-cmake-standalone/llvm-project/llvm/include -Iprojects/libcxx/include/c++build -fPIC -fvisibility-inlines-hidden -Werror=date-time -Werror=unguarded-availability-new -Wall -Wextra -Wno-unused-parameter -Wwrite-strings -Wcast-qual -Wmissing-field-initializers  -Wno-long-long -Wimplicit-fallthrough -Wcovered-switch-default -Wno-noexcept-type -Wnon-virtual-dtor -Wdelete-non-virtual-dtor -Wsuggest-override -Wstring-conversion -fdiagnostics-color -O3  -isysroot /Applications/Xcode.app/Contents/Developer/Platforms/MacOSX.platform/Developer/SDKs/MacOSX10.15.sdk -fPIC   -DLIBCXX_BUILDING_LIBCXXABI -UNDEBUG -faligned-allocation -nostdinc++ -fvisibility-inlines-hidden -fvisibility=hidden -Wall -Wextra -W -Wwrite-strings -Wno-unused-parameter -Wno-long-long -Werror=return-type -Wextra-semi -Wno-user-defined-literals -Wno-covered-switch-default -Wno-suggest-override -Wno-ignored-attributes -Wno-error -I /Users/buildslave/jenkins/workspace/lldb-cmake-standalone/clang-build/include/c++/v1 -include /Users/buildslave/jenkins/workspace/lldb-cmake-standalone/clang-build/projects/libcxx/__config_site -std=c++17 -MD -MT projects/libcxx/src/CMakeFiles/cxx_shared.dir/filesystem/directory_iterator.cpp.o -MF projects/libcxx/src/CMakeFiles/cxx_shared.dir/filesystem/directory_iterator.cpp.o.d -o projects/libcxx/src/CMakeFiles/cxx_shared.dir/filesystem/directory_iterator.cpp.o -c /Users/buildslave/jenkins/workspace/lldb-cmake-standalone/llvm-project/libcxx/src/filesystem/directory_iterator.cpp
[425/3462] /Users/buildslave/jenkins/workspace/lldb-cmake-standalone/host-compiler/bin/clang++  -DBUILD_EXAMPLES -DGTEST_HAS_RTTI=0 -D_DEBUG -D_GNU_SOURCE -D__STDC_CONSTANT_MACROS -D__STDC_FORMAT_MACROS -D__STDC_LIMIT_MACROS -Itools/clang/utils/TableGen -I/Users/buildslave/jenkins/workspace/lldb-cmake-standalone/llvm-project/clang/utils/TableGen -I/Users/buildslave/jenkins/workspace/lldb-cmake-standalone/llvm-project/clang/include -Itools/clang/include -Iinclude -I/Users/buildslave/jenkins/workspace/lldb-cmake-standalone/llvm-project/llvm/include -fPIC -fvisibility-inlines-hidden -Werror=date-time -Werror=unguarded-availability-new -Wall -Wextra -Wno-unused-parameter -Wwrite-strings -Wcast-qual -Wmissing-field-initializers -pedantic -Wno-long-long -Wimplicit-fallthrough -Wcovered-switch-default -Wno-noexcept-type -Wnon-virtual-dtor -Wdelete-non-virtual-dtor -Wsuggest-override -Wstring-conversion -fdiagnostics-color -fno-common -Woverloaded-virtual -Wno-nested-anon-types -O3  -isysroot /Applications/Xcode.app/Contents/Developer/Platforms/MacOSX.platform/Developer/SDKs/MacOSX10.15.sdk    -fno-exceptions -fno-rtti -UNDEBUG -std=c++14 -MD -MT tools/clang/utils/TableGen/CMakeFiles/clang-tblgen.dir/ClangDiagnosticsEmitter.cpp.o -MF tools/clang/utils/TableGen/CMakeFiles/clang-tblgen.dir/ClangDiagnosticsEmitter.cpp.o.d -o tools/clang/utils/TableGen/CMakeFiles/clang-tblgen.dir/ClangDiagnosticsEmitter.cpp.o -c /Users/buildslave/jenkins/workspace/lldb-cmake-standalone/llvm-project/clang/utils/TableGen/ClangDiagnosticsEmitter.cpp
[426/3462] /Users/buildslave/jenkins/workspace/lldb-cmake-standalone/host-compiler/bin/clang++  -DBUILD_EXAMPLES -DGTEST_HAS_RTTI=0 -D_DEBUG -D__STDC_CONSTANT_MACROS -D__STDC_FORMAT_MACROS -D__STDC_LIMIT_MACROS -Ilib/Demangle -I/Users/buildslave/jenkins/workspace/lldb-cmake-standalone/llvm-project/llvm/lib/Demangle -Iinclude -I/Users/buildslave/jenkins/workspace/lldb-cmake-standalone/llvm-project/llvm/include -fPIC -fvisibility-inlines-hidden -Werror=date-time -Werror=unguarded-availability-new -Wall -Wextra -Wno-unused-parameter -Wwrite-strings -Wcast-qual -Wmissing-field-initializers -pedantic -Wno-long-long -Wimplicit-fallthrough -Wcovered-switch-default -Wno-noexcept-type -Wnon-virtual-dtor -Wdelete-non-virtual-dtor -Wsuggest-override -Wstring-conversion -fdiagnostics-color -O3  -isysroot /Applications/Xcode.app/Contents/Developer/Platforms/MacOSX.platform/Developer/SDKs/MacOSX10.15.sdk    -fno-exceptions -fno-rtti -UNDEBUG -std=c++14 -MD -MT lib/Demangle/CMakeFiles/LLVMDemangle.dir/Demangle.cpp.o -MF lib/Demangle/CMakeFiles/LLVMDemangle.dir/Demangle.cpp.o.d -o lib/Demangle/CMakeFiles/LLVMDemangle.dir/Demangle.cpp.o -c /Users/buildslave/jenkins/workspace/lldb-cmake-standalone/llvm-project/llvm/lib/Demangle/Demangle.cpp
[427/3462] /Users/buildslave/jenkins/workspace/lldb-cmake-standalone/host-compiler/bin/clang++  -DBUILD_EXAMPLES -DGTEST_HAS_RTTI=0 -D_DEBUG -D__STDC_CONSTANT_MACROS -D__STDC_FORMAT_MACROS -D__STDC_LIMIT_MACROS -Ilib/Support -I/Users/buildslave/jenkins/workspace/lldb-cmake-standalone/llvm-project/llvm/lib/Support -Iinclude -I/Users/buildslave/jenkins/workspace/lldb-cmake-standalone/llvm-project/llvm/include -fPIC -fvisibility-inlines-hidden -Werror=date-time -Werror=unguarded-availability-new -Wall -Wextra -Wno-unused-parameter -Wwrite-strings -Wcast-qual -Wmissing-field-initializers -pedantic -Wno-long-long -Wimplicit-fallthrough -Wcovered-switch-default -Wno-noexcept-type -Wnon-virtual-dtor -Wdelete-non-virtual-dtor -Wsuggest-override -Wstring-conversion -fdiagnostics-color -O3  -isysroot /Applications/Xcode.app/Contents/Developer/Platforms/MacOSX.platform/Developer/SDKs/MacOSX10.15.sdk   -UNDEBUG -std=c++14  -fno-exceptions -fno-rtti -MD -MT lib/Support/CMakeFiles/LLVMSupport.dir/ARMTargetParser.cpp.o -MF lib/Support/CMakeFiles/LLVMSupport.dir/ARMTargetParser.cpp.o.d -o lib/Support/CMakeFiles/LLVMSupport.dir/ARMTargetParser.cpp.o -c /Users/buildslave/jenkins/workspace/lldb-cmake-standalone/llvm-project/llvm/lib/Support/ARMTargetParser.cpp
[428/3462] /Users/buildslave/jenkins/workspace/lldb-cmake-standalone/host-compiler/bin/clang++  -DBUILD_EXAMPLES -DGTEST_HAS_RTTI=0 -D_DEBUG -D__STDC_CONSTANT_MACROS -D__STDC_FORMAT_MACROS -D__STDC_LIMIT_MACROS -Ilib/Support -I/Users/buildslave/jenkins/workspace/lldb-cmake-standalone/llvm-project/llvm/lib/Support -Iinclude -I/Users/buildslave/jenkins/workspace/lldb-cmake-standalone/llvm-project/llvm/include -fPIC -fvisibility-inlines-hidden -Werror=date-time -Werror=unguarded-availability-new -Wall -Wextra -Wno-unused-parameter -Wwrite-strings -Wcast-qual -Wmissing-field-initializers -pedantic -Wno-long-long -Wimplicit-fallthrough -Wcovered-switch-default -Wno-noexcept-type -Wnon-virtual-dtor -Wdelete-non-virtual-dtor -Wsuggest-override -Wstring-conversion -fdiagnostics-color -O3  -isysroot /Applications/Xcode.app/Contents/Developer/Platforms/MacOSX.platform/Developer/SDKs/MacOSX10.15.sdk   -UNDEBUG -std=c++14  -fno-exceptions -fno-rtti -MD -MT lib/Support/CMakeFiles/LLVMSupport.dir/APFixedPoint.cpp.o -MF lib/Support/CMakeFiles/LLVMSupport.dir/APFixedPoint.cpp.o.d -o lib/Support/CMakeFiles/LLVMSupport.dir/APFixedPoint.cpp.o -c /Users/buildslave/jenkins/workspace/lldb-cmake-standalone/llvm-project/llvm/lib/Support/APFixedPoint.cpp
[429/3462] /Users/buildslave/jenkins/workspace/lldb-cmake-standalone/host-compiler/bin/clang++  -DBUILD_EXAMPLES -DNDEBUG -D_LIBCPP_BUILDING_LIBRARY -D_LIBCPP_HAS_NO_PRAGMA_SYSTEM_HEADER -D__STDC_CONSTANT_MACROS -D__STDC_FORMAT_MACROS -D__STDC_LIMIT_MACROS -Iprojects/libcxx/src -I/Users/buildslave/jenkins/workspace/lldb-cmake-standalone/llvm-project/libcxx/src -Iinclude -I/Users/buildslave/jenkins/workspace/lldb-cmake-standalone/llvm-project/llvm/include -Iprojects/libcxx/include/c++build -fPIC -fvisibility-inlines-hidden -Werror=date-time -Werror=unguarded-availability-new -Wall -Wextra -Wno-unused-parameter -Wwrite-strings -Wcast-qual -Wmissing-field-initializers  -Wno-long-long -Wimplicit-fallthrough -Wcovered-switch-default -Wno-noexcept-type -Wnon-virtual-dtor -Wdelete-non-virtual-dtor -Wsuggest-override -Wstring-conversion -fdiagnostics-color -O3  -isysroot /Applications/Xcode.app/Contents/Developer/Platforms/MacOSX.platform/Developer/SDKs/MacOSX10.15.sdk -fPIC   -DLIBCXX_BUILDING_LIBCXXABI -UNDEBUG -faligned-allocation -nostdinc++ -fvisibility-inlines-hidden -fvisibility=hidden -Wall -Wextra -W -Wwrite-strings -Wno-unused-parameter -Wno-long-long -Werror=return-type -Wextra-semi -Wno-user-defined-literals -Wno-covered-switch-default -Wno-suggest-override -Wno-ignored-attributes -Wno-error -I /Users/buildslave/jenkins/workspace/lldb-cmake-standalone/clang-build/include/c++/v1 -include /Users/buildslave/jenkins/workspace/lldb-cmake-standalone/clang-build/projects/libcxx/__config_site -std=c++17 -MD -MT projects/libcxx/src/CMakeFiles/cxx_shared.dir/filesystem/operations.cpp.o -MF projects/libcxx/src/CMakeFiles/cxx_shared.dir/filesystem/operations.cpp.o.d -o projects/libcxx/src/CMakeFiles/cxx_shared.dir/filesystem/operations.cpp.o -c /Users/buildslave/jenkins/workspace/lldb-cmake-standalone/llvm-project/libcxx/src/filesystem/operations.cpp
[430/3462] /Users/buildslave/jenkins/workspace/lldb-cmake-standalone/host-compiler/bin/clang++  -DBUILD_EXAMPLES -DGTEST_HAS_RTTI=0 -D_DEBUG -D__STDC_CONSTANT_MACROS -D__STDC_FORMAT_MACROS -D__STDC_LIMIT_MACROS -Ilib/Support -I/Users/buildslave/jenkins/workspace/lldb-cmake-standalone/llvm-project/llvm/lib/Support -Iinclude -I/Users/buildslave/jenkins/workspace/lldb-cmake-standalone/llvm-project/llvm/include -fPIC -fvisibility-inlines-hidden -Werror=date-time -Werror=unguarded-availability-new -Wall -Wextra -Wno-unused-parameter -Wwrite-strings -Wcast-qual -Wmissing-field-initializers -pedantic -Wno-long-long -Wimplicit-fallthrough -Wcovered-switch-default -Wno-noexcept-type -Wnon-virtual-dtor -Wdelete-non-virtual-dtor -Wsuggest-override -Wstring-conversion -fdiagnostics-color -O3  -isysroot /Applications/Xcode.app/Contents/Developer/Platforms/MacOSX.platform/Developer/SDKs/MacOSX10.15.sdk   -UNDEBUG -std=c++14  -fno-exceptions -fno-rtti -MD -MT lib/Support/CMakeFiles/LLVMSupport.dir/ABIBreak.cpp.o -MF lib/Support/CMakeFiles/LLVMSupport.dir/ABIBreak.cpp.o.d -o lib/Support/CMakeFiles/LLVMSupport.dir/ABIBreak.cpp.o -c /Users/buildslave/jenkins/workspace/lldb-cmake-standalone/llvm-project/llvm/lib/Support/ABIBreak.cpp
[431/3462] /Users/buildslave/jenkins/workspace/lldb-cmake-standalone/host-compiler/bin/clang++  -DBUILD_EXAMPLES -DGTEST_HAS_RTTI=0 -D_DEBUG -D_GNU_SOURCE -D__STDC_CONSTANT_MACROS -D__STDC_FORMAT_MACROS -D__STDC_LIMIT_MACROS -Itools/clang/utils/TableGen -I/Users/buildslave/jenkins/workspace/lldb-cmake-standalone/llvm-project/clang/utils/TableGen -I/Users/buildslave/jenkins/workspace/lldb-cmake-standalone/llvm-project/clang/include -Itools/clang/include -Iinclude -I/Users/buildslave/jenkins/workspace/lldb-cmake-standalone/llvm-project/llvm/include -fPIC -fvisibility-inlines-hidden -Werror=date-time -Werror=unguarded-availability-new -Wall -Wextra -Wno-unused-parameter -Wwrite-strings -Wcast-qual -Wmissing-field-initializers -pedantic -Wno-long-long -Wimplicit-fallthrough -Wcovered-switch-default -Wno-noexcept-type -Wnon-virtual-dtor -Wdelete-non-virtual-dtor -Wsuggest-override -Wstring-conversion -fdiagnostics-color -fno-common -Woverloaded-virtual -Wno-nested-anon-types -O3  -isysroot /Applications/Xcode.app/Contents/Developer/Platforms/MacOSX.platform/Developer/SDKs/MacOSX10.15.sdk    -fno-exceptions -fno-rtti -UNDEBUG -std=c++14 -MD -MT tools/clang/utils/TableGen/CMakeFiles/clang-tblgen.dir/TableGen.cpp.o -MF tools/clang/utils/TableGen/CMakeFiles/clang-tblgen.dir/TableGen.cpp.o.d -o tools/clang/utils/TableGen/CMakeFiles/clang-tblgen.dir/TableGen.cpp.o -c /Users/buildslave/jenkins/workspace/lldb-cmake-standalone/llvm-project/clang/utils/TableGen/TableGen.cpp
[432/3462] /Users/buildslave/jenkins/workspace/lldb-cmake-standalone/host-compiler/bin/clang++  -DBUILD_EXAMPLES -DGTEST_HAS_RTTI=0 -D_DEBUG -D__STDC_CONSTANT_MACROS -D__STDC_FORMAT_MACROS -D__STDC_LIMIT_MACROS -Ilib/Support -I/Users/buildslave/jenkins/workspace/lldb-cmake-standalone/llvm-project/llvm/lib/Support -Iinclude -I/Users/buildslave/jenkins/workspace/lldb-cmake-standalone/llvm-project/llvm/include -fPIC -fvisibility-inlines-hidden -Werror=date-time -Werror=unguarded-availability-new -Wall -Wextra -Wno-unused-parameter -Wwrite-strings -Wcast-qual -Wmissing-field-initializers -pedantic -Wno-long-long -Wimplicit-fallthrough -Wcovered-switch-default -Wno-noexcept-type -Wnon-virtual-dtor -Wdelete-non-virtual-dtor -Wsuggest-override -Wstring-conversion -fdiagnostics-color -O3  -isysroot /Applications/Xcode.app/Contents/Developer/Platforms/MacOSX.platform/Developer/SDKs/MacOSX10.15.sdk   -UNDEBUG -std=c++14  -fno-exceptions -fno-rtti -MD -MT lib/Support/CMakeFiles/LLVMSupport.dir/AMDGPUMetadata.cpp.o -MF lib/Support/CMakeFiles/LLVMSupport.dir/AMDGPUMetadata.cpp.o.d -o lib/Support/CMakeFiles/LLVMSupport.dir/AMDGPUMetadata.cpp.o -c /Users/buildslave/jenkins/workspace/lldb-cmake-standalone/llvm-project/llvm/lib/Support/AMDGPUMetadata.cpp
[433/3462] /Users/buildslave/jenkins/workspace/lldb-cmake-standalone/host-compiler/bin/clang++  -DBUILD_EXAMPLES -DGTEST_HAS_RTTI=0 -D_DEBUG -D_GNU_SOURCE -D__STDC_CONSTANT_MACROS -D__STDC_FORMAT_MACROS -D__STDC_LIMIT_MACROS -Itools/clang/utils/TableGen -I/Users/buildslave/jenkins/workspace/lldb-cmake-standalone/llvm-project/clang/utils/TableGen -I/Users/buildslave/jenkins/workspace/lldb-cmake-standalone/llvm-project/clang/include -Itools/clang/include -Iinclude -I/Users/buildslave/jenkins/workspace/lldb-cmake-standalone/llvm-project/llvm/include -fPIC -fvisibility-inlines-hidden -Werror=date-time -Werror=unguarded-availability-new -Wall -Wextra -Wno-unused-parameter -Wwrite-strings -Wcast-qual -Wmissing-field-initializers -pedantic -Wno-long-long -Wimplicit-fallthrough -Wcovered-switch-default -Wno-noexcept-type -Wnon-virtual-dtor -Wdelete-non-virtual-dtor -Wsuggest-override -Wstring-conversion -fdiagnostics-color -fno-common -Woverloaded-virtual -Wno-nested-anon-types -O3  -isysroot /Applications/Xcode.app/Contents/Developer/Platforms/MacOSX.platform/Developer/SDKs/MacOSX10.15.sdk    -fno-exceptions -fno-rtti -UNDEBUG -std=c++14 -MD -MT tools/clang/utils/TableGen/CMakeFiles/clang-tblgen.dir/ClangOptionDocEmitter.cpp.o -MF tools/clang/utils/TableGen/CMakeFiles/clang-tblgen.dir/ClangOptionDocEmitter.cpp.o.d -o tools/clang/utils/TableGen/CMakeFiles/clang-tblgen.dir/ClangOptionDocEmitter.cpp.o -c /Users/buildslave/jenkins/workspace/lldb-cmake-standalone/llvm-project/clang/utils/TableGen/ClangOptionDocEmitter.cpp
[434/3462] /Users/buildslave/jenkins/workspace/lldb-cmake-standalone/host-compiler/bin/clang++  -DBUILD_EXAMPLES -DGTEST_HAS_RTTI=0 -D_DEBUG -D__STDC_CONSTANT_MACROS -D__STDC_FORMAT_MACROS -D__STDC_LIMIT_MACROS -Ilib/Demangle -I/Users/buildslave/jenkins/workspace/lldb-cmake-standalone/llvm-project/llvm/lib/Demangle -Iinclude -I/Users/buildslave/jenkins/workspace/lldb-cmake-standalone/llvm-project/llvm/include -fPIC -fvisibility-inlines-hidden -Werror=date-time -Werror=unguarded-availability-new -Wall -Wextra -Wno-unused-parameter -Wwrite-strings -Wcast-qual -Wmissing-field-initializers -pedantic -Wno-long-long -Wimplicit-fallthrough -Wcovered-switch-default -Wno-noexcept-type -Wnon-virtual-dtor -Wdelete-non-virtual-dtor -Wsuggest-override -Wstring-conversion -fdiagnostics-color -O3  -isysroot /Applications/Xcode.app/Contents/Developer/Platforms/MacOSX.platform/Developer/SDKs/MacOSX10.15.sdk    -fno-exceptions -fno-rtti -UNDEBUG -std=c++14 -MD -MT lib/Demangle/CMakeFiles/LLVMDemangle.dir/MicrosoftDemangleNodes.cpp.o -MF lib/Demangle/CMakeFiles/LLVMDemangle.dir/MicrosoftDemangleNodes.cpp.o.d -o lib/Demangle/CMakeFiles/LLVMDemangle.dir/MicrosoftDemangleNodes.cpp.o -c /Users/buildslave/jenkins/workspace/lldb-cmake-standalone/llvm-project/llvm/lib/Demangle/MicrosoftDemangleNodes.cpp
[435/3462] /Users/buildslave/jenkins/workspace/lldb-cmake-standalone/host-compiler/bin/clang++  -DBUILD_EXAMPLES -DGTEST_HAS_RTTI=0 -D_DEBUG -D__STDC_CONSTANT_MACROS -D__STDC_FORMAT_MACROS -D__STDC_LIMIT_MACROS -Ilib/Support -I/Users/buildslave/jenkins/workspace/lldb-cmake-standalone/llvm-project/llvm/lib/Support -Iinclude -I/Users/buildslave/jenkins/workspace/lldb-cmake-standalone/llvm-project/llvm/include -fPIC -fvisibility-inlines-hidden -Werror=date-time -Werror=unguarded-availability-new -Wall -Wextra -Wno-unused-parameter -Wwrite-strings -Wcast-qual -Wmissing-field-initializers -pedantic -Wno-long-long -Wimplicit-fallthrough -Wcovered-switch-default -Wno-noexcept-type -Wnon-virtual-dtor -Wdelete-non-virtual-dtor -Wsuggest-override -Wstring-conversion -fdiagnostics-color -O3  -isysroot /Applications/Xcode.app/Contents/Developer/Platforms/MacOSX.platform/Developer/SDKs/MacOSX10.15.sdk   -UNDEBUG -std=c++14  -fno-exceptions -fno-rtti -MD -MT lib/Support/CMakeFiles/LLVMSupport.dir/ARMWinEH.cpp.o -MF lib/Support/CMakeFiles/LLVMSupport.dir/ARMWinEH.cpp.o.d -o lib/Support/CMakeFiles/LLVMSupport.dir/ARMWinEH.cpp.o -c /Users/buildslave/jenkins/workspace/lldb-cmake-standalone/llvm-project/llvm/lib/Support/ARMWinEH.cpp
[436/3462] /Users/buildslave/jenkins/workspace/lldb-cmake-standalone/host-compiler/bin/clang++  -DBUILD_EXAMPLES -DGTEST_HAS_RTTI=0 -D_DEBUG -D__STDC_CONSTANT_MACROS -D__STDC_FORMAT_MACROS -D__STDC_LIMIT_MACROS -Ilib/Support -I/Users/buildslave/jenkins/workspace/lldb-cmake-standalone/llvm-project/llvm/lib/Support -Iinclude -I/Users/buildslave/jenkins/workspace/lldb-cmake-standalone/llvm-project/llvm/include -fPIC -fvisibility-inlines-hidden -Werror=date-time -Werror=unguarded-availability-new -Wall -Wextra -Wno-unused-parameter -Wwrite-strings -Wcast-qual -Wmissing-field-initializers -pedantic -Wno-long-long -Wimplicit-fallthrough -Wcovered-switch-default -Wno-noexcept-type -Wnon-virtual-dtor -Wdelete-non-virtual-dtor -Wsuggest-override -Wstring-conversion -fdiagnostics-color -O3  -isysroot /Applications/Xcode.app/Contents/Developer/Platforms/MacOSX.platform/Developer/SDKs/MacOSX10.15.sdk   -UNDEBUG -std=c++14  -fno-exceptions -fno-rtti -MD -MT lib/Support/CMakeFiles/LLVMSupport.dir/Allocator.cpp.o -MF lib/Support/CMakeFiles/LLVMSupport.dir/Allocator.cpp.o.d -o lib/Support/CMakeFiles/LLVMSupport.dir/Allocator.cpp.o -c /Users/buildslave/jenkins/workspace/lldb-cmake-standalone/llvm-project/llvm/lib/Support/Allocator.cpp
[437/3462] /Users/buildslave/jenkins/workspace/lldb-cmake-standalone/host-compiler/bin/clang++  -DBUILD_EXAMPLES -DGTEST_HAS_RTTI=0 -D_DEBUG -D_GNU_SOURCE -D__STDC_CONSTANT_MACROS -D__STDC_FORMAT_MACROS -D__STDC_LIMIT_MACROS -Itools/clang/utils/TableGen -I/Users/buildslave/jenkins/workspace/lldb-cmake-standalone/llvm-project/clang/utils/TableGen -I/Users/buildslave/jenkins/workspace/lldb-cmake-standalone/llvm-project/clang/include -Itools/clang/include -Iinclude -I/Users/buildslave/jenkins/workspace/lldb-cmake-standalone/llvm-project/llvm/include -fPIC -fvisibility-inlines-hidden -Werror=date-time -Werror=unguarded-availability-new -Wall -Wextra -Wno-unused-parameter -Wwrite-strings -Wcast-qual -Wmissing-field-initializers -pedantic -Wno-long-long -Wimplicit-fallthrough -Wcovered-switch-default -Wno-noexcept-type -Wnon-virtual-dtor -Wdelete-non-virtual-dtor -Wsuggest-override -Wstring-conversion -fdiagnostics-color -fno-common -Woverloaded-virtual -Wno-nested-anon-types -O3  -isysroot /Applications/Xcode.app/Contents/Developer/Platforms/MacOSX.platform/Developer/SDKs/MacOSX10.15.sdk    -fno-exceptions -fno-rtti -UNDEBUG -std=c++14 -MD -MT tools/clang/utils/TableGen/CMakeFiles/clang-tblgen.dir/ClangOpenCLBuiltinEmitter.cpp.o -MF tools/clang/utils/TableGen/CMakeFiles/clang-tblgen.dir/ClangOpenCLBuiltinEmitter.cpp.o.d -o tools/clang/utils/TableGen/CMakeFiles/clang-tblgen.dir/ClangOpenCLBuiltinEmitter.cpp.o -c /Users/buildslave/jenkins/workspace/lldb-cmake-standalone/llvm-project/clang/utils/TableGen/ClangOpenCLBuiltinEmitter.cpp
[438/3462] /Users/buildslave/jenkins/workspace/lldb-cmake-standalone/host-compiler/bin/clang++  -DBUILD_EXAMPLES -DGTEST_HAS_RTTI=0 -D_DEBUG -D__STDC_CONSTANT_MACROS -D__STDC_FORMAT_MACROS -D__STDC_LIMIT_MACROS -Ilib/Support -I/Users/buildslave/jenkins/workspace/lldb-cmake-standalone/llvm-project/llvm/lib/Support -Iinclude -I/Users/buildslave/jenkins/workspace/lldb-cmake-standalone/llvm-project/llvm/include -fPIC -fvisibility-inlines-hidden -Werror=date-time -Werror=unguarded-availability-new -Wall -Wextra -Wno-unused-parameter -Wwrite-strings -Wcast-qual -Wmissing-field-initializers -pedantic -Wno-long-long -Wimplicit-fallthrough -Wcovered-switch-default -Wno-noexcept-type -Wnon-virtual-dtor -Wdelete-non-virtual-dtor -Wsuggest-override -Wstring-conversion -fdiagnostics-color -O3  -isysroot /Applications/Xcode.app/Contents/Developer/Platforms/MacOSX.platform/Developer/SDKs/MacOSX10.15.sdk   -UNDEBUG -std=c++14  -fno-exceptions -fno-rtti -MD -MT lib/Support/CMakeFiles/LLVMSupport.dir/AArch64TargetParser.cpp.o -MF lib/Support/CMakeFiles/LLVMSupport.dir/AArch64TargetParser.cpp.o.d -o lib/Support/CMakeFiles/LLVMSupport.dir/AArch64TargetParser.cpp.o -c /Users/buildslave/jenkins/workspace/lldb-cmake-standalone/llvm-project/llvm/lib/Support/AArch64TargetParser.cpp
[439/3462] /Users/buildslave/jenkins/workspace/lldb-cmake-standalone/host-compiler/bin/clang++  -DBUILD_EXAMPLES -DGTEST_HAS_RTTI=0 -D_DEBUG -D__STDC_CONSTANT_MACROS -D__STDC_FORMAT_MACROS -D__STDC_LIMIT_MACROS -Ilib/Support -I/Users/buildslave/jenkins/workspace/lldb-cmake-standalone/llvm-project/llvm/lib/Support -Iinclude -I/Users/buildslave/jenkins/workspace/lldb-cmake-standalone/llvm-project/llvm/include -fPIC -fvisibility-inlines-hidden -Werror=date-time -Werror=unguarded-availability-new -Wall -Wextra -Wno-unused-parameter -Wwrite-strings -Wcast-qual -Wmissing-field-initializers -pedantic -Wno-long-long -Wimplicit-fallthrough -Wcovered-switch-default -Wno-noexcept-type -Wnon-virtual-dtor -Wdelete-non-virtual-dtor -Wsuggest-override -Wstring-conversion -fdiagnostics-color -O3  -isysroot /Applications/Xcode.app/Contents/Developer/Platforms/MacOSX.platform/Developer/SDKs/MacOSX10.15.sdk   -UNDEBUG -std=c++14  -fno-exceptions -fno-rtti -MD -MT lib/Support/CMakeFiles/LLVMSupport.dir/BlockFrequency.cpp.o -MF lib/Support/CMakeFiles/LLVMSupport.dir/BlockFrequency.cpp.o.d -o lib/Support/CMakeFiles/LLVMSupport.dir/BlockFrequency.cpp.o -c /Users/buildslave/jenkins/workspace/lldb-cmake-standalone/llvm-project/llvm/lib/Support/BlockFrequency.cpp
[440/3462] /Users/buildslave/jenkins/workspace/lldb-cmake-standalone/host-compiler/bin/clang++  -DBUILD_EXAMPLES -DGTEST_HAS_RTTI=0 -D_DEBUG -D__STDC_CONSTANT_MACROS -D__STDC_FORMAT_MACROS -D__STDC_LIMIT_MACROS -Ilib/Support -I/Users/buildslave/jenkins/workspace/lldb-cmake-standalone/llvm-project/llvm/lib/Support -Iinclude -I/Users/buildslave/jenkins/workspace/lldb-cmake-standalone/llvm-project/llvm/include -fPIC -fvisibility-inlines-hidden -Werror=date-time -Werror=unguarded-availability-new -Wall -Wextra -Wno-unused-parameter -Wwrite-strings -Wcast-qual -Wmissing-field-initializers -pedantic -Wno-long-long -Wimplicit-fallthrough -Wcovered-switch-default -Wno-noexcept-type -Wnon-virtual-dtor -Wdelete-non-virtual-dtor -Wsuggest-override -Wstring-conversion -fdiagnostics-color -O3  -isysroot /Applications/Xcode.app/Contents/Developer/Platforms/MacOSX.platform/Developer/SDKs/MacOSX10.15.sdk   -UNDEBUG -std=c++14  -fno-exceptions -fno-rtti -MD -MT lib/Support/CMakeFiles/LLVMSupport.dir/BuryPointer.cpp.o -MF lib/Support/CMakeFiles/LLVMSupport.dir/BuryPointer.cpp.o.d -o lib/Support/CMakeFiles/LLVMSupport.dir/BuryPointer.cpp.o -c /Users/buildslave/jenkins/workspace/lldb-cmake-standalone/llvm-project/llvm/lib/Support/BuryPointer.cpp
[441/3462] /Users/buildslave/jenkins/workspace/lldb-cmake-standalone/host-compiler/bin/clang++  -DBUILD_EXAMPLES -DGTEST_HAS_RTTI=0 -D_DEBUG -D__STDC_CONSTANT_MACROS -D__STDC_FORMAT_MACROS -D__STDC_LIMIT_MACROS -Ilib/Demangle -I/Users/buildslave/jenkins/workspace/lldb-cmake-standalone/llvm-project/llvm/lib/Demangle -Iinclude -I/Users/buildslave/jenkins/workspace/lldb-cmake-standalone/llvm-project/llvm/include -fPIC -fvisibility-inlines-hidden -Werror=date-time -Werror=unguarded-availability-new -Wall -Wextra -Wno-unused-parameter -Wwrite-strings -Wcast-qual -Wmissing-field-initializers -pedantic -Wno-long-long -Wimplicit-fallthrough -Wcovered-switch-default -Wno-noexcept-type -Wnon-virtual-dtor -Wdelete-non-virtual-dtor -Wsuggest-override -Wstring-conversion -fdiagnostics-color -O3  -isysroot /Applications/Xcode.app/Contents/Developer/Platforms/MacOSX.platform/Developer/SDKs/MacOSX10.15.sdk    -fno-exceptions -fno-rtti -UNDEBUG -std=c++14 -MD -MT lib/Demangle/CMakeFiles/LLVMDemangle.dir/MicrosoftDemangle.cpp.o -MF lib/Demangle/CMakeFiles/LLVMDemangle.dir/MicrosoftDemangle.cpp.o.d -o lib/Demangle/CMakeFiles/LLVMDemangle.dir/MicrosoftDemangle.cpp.o -c /Users/buildslave/jenkins/workspace/lldb-cmake-standalone/llvm-project/llvm/lib/Demangle/MicrosoftDemangle.cpp
[442/3462] /Users/buildslave/jenkins/workspace/lldb-cmake-standalone/host-compiler/bin/clang++  -DBUILD_EXAMPLES -DGTEST_HAS_RTTI=0 -D_DEBUG -D__STDC_CONSTANT_MACROS -D__STDC_FORMAT_MACROS -D__STDC_LIMIT_MACROS -Ilib/Support -I/Users/buildslave/jenkins/workspace/lldb-cmake-standalone/llvm-project/llvm/lib/Support -Iinclude -I/Users/buildslave/jenkins/workspace/lldb-cmake-standalone/llvm-project/llvm/include -fPIC -fvisibility-inlines-hidden -Werror=date-time -Werror=unguarded-availability-new -Wall -Wextra -Wno-unused-parameter -Wwrite-strings -Wcast-qual -Wmissing-field-initializers -pedantic -Wno-long-long -Wimplicit-fallthrough -Wcovered-switch-default -Wno-noexcept-type -Wnon-virtual-dtor -Wdelete-non-virtual-dtor -Wsuggest-override -Wstring-conversion -fdiagnostics-color -O3  -isysroot /Applications/Xcode.app/Contents/Developer/Platforms/MacOSX.platform/Developer/SDKs/MacOSX10.15.sdk   -UNDEBUG -std=c++14  -fno-exceptions -fno-rtti -MD -MT lib/Support/CMakeFiles/LLVMSupport.dir/ARMAttributeParser.cpp.o -MF lib/Support/CMakeFiles/LLVMSupport.dir/ARMAttributeParser.cpp.o.d -o lib/Support/CMakeFiles/LLVMSupport.dir/ARMAttributeParser.cpp.o -c /Users/buildslave/jenkins/workspace/lldb-cmake-standalone/llvm-project/llvm/lib/Support/ARMAttributeParser.cpp
[443/3462] /Users/buildslave/jenkins/workspace/lldb-cmake-standalone/host-compiler/bin/clang++  -DBUILD_EXAMPLES -DGTEST_HAS_RTTI=0 -D_DEBUG -D__STDC_CONSTANT_MACROS -D__STDC_FORMAT_MACROS -D__STDC_LIMIT_MACROS -Ilib/Support -I/Users/buildslave/jenkins/workspace/lldb-cmake-standalone/llvm-project/llvm/lib/Support -Iinclude -I/Users/buildslave/jenkins/workspace/lldb-cmake-standalone/llvm-project/llvm/include -fPIC -fvisibility-inlines-hidden -Werror=date-time -Werror=unguarded-availability-new -Wall -Wextra -Wno-unused-parameter -Wwrite-strings -Wcast-qual -Wmissing-field-initializers -pedantic -Wno-long-long -Wimplicit-fallthrough -Wcovered-switch-default -Wno-noexcept-type -Wnon-virtual-dtor -Wdelete-non-virtual-dtor -Wsuggest-override -Wstring-conversion -fdiagnostics-color -O3  -isysroot /Applications/Xcode.app/Contents/Developer/Platforms/MacOSX.platform/Developer/SDKs/MacOSX10.15.sdk   -UNDEBUG -std=c++14  -fno-exceptions -fno-rtti -MD -MT lib/Support/CMakeFiles/LLVMSupport.dir/COM.cpp.o -MF lib/Support/CMakeFiles/LLVMSupport.dir/COM.cpp.o.d -o lib/Support/CMakeFiles/LLVMSupport.dir/COM.cpp.o -c /Users/buildslave/jenkins/workspace/lldb-cmake-standalone/llvm-project/llvm/lib/Support/COM.cpp
[444/3462] /Users/buildslave/jenkins/workspace/lldb-cmake-standalone/host-compiler/bin/clang++  -DBUILD_EXAMPLES -DGTEST_HAS_RTTI=0 -D_DEBUG -D__STDC_CONSTANT_MACROS -D__STDC_FORMAT_MACROS -D__STDC_LIMIT_MACROS -Ilib/Support -I/Users/buildslave/jenkins/workspace/lldb-cmake-standalone/llvm-project/llvm/lib/Support -Iinclude -I/Users/buildslave/jenkins/workspace/lldb-cmake-standalone/llvm-project/llvm/include -fPIC -fvisibility-inlines-hidden -Werror=date-time -Werror=unguarded-availability-new -Wall -Wextra -Wno-unused-parameter -Wwrite-strings -Wcast-qual -Wmissing-field-initializers -pedantic -Wno-long-long -Wimplicit-fallthrough -Wcovered-switch-default -Wno-noexcept-type -Wnon-virtual-dtor -Wdelete-non-virtual-dtor -Wsuggest-override -Wstring-conversion -fdiagnostics-color -O3  -isysroot /Applications/Xcode.app/Contents/Developer/Platforms/MacOSX.platform/Developer/SDKs/MacOSX10.15.sdk   -UNDEBUG -std=c++14  -fno-exceptions -fno-rtti -MD -MT lib/Support/CMakeFiles/LLVMSupport.dir/BinaryStreamError.cpp.o -MF lib/Support/CMakeFiles/LLVMSupport.dir/BinaryStreamError.cpp.o.d -o lib/Support/CMakeFiles/LLVMSupport.dir/BinaryStreamError.cpp.o -c /Users/buildslave/jenkins/workspace/lldb-cmake-standalone/llvm-project/llvm/lib/Support/BinaryStreamError.cpp
[445/3462] /Users/buildslave/jenkins/workspace/lldb-cmake-standalone/host-compiler/bin/clang++  -DBUILD_EXAMPLES -DNDEBUG -D_LIBCPP_BUILDING_LIBRARY -D_LIBCPP_HAS_NO_PRAGMA_SYSTEM_HEADER -D__STDC_CONSTANT_MACROS -D__STDC_FORMAT_MACROS -D__STDC_LIMIT_MACROS -Iprojects/libcxx/src -I/Users/buildslave/jenkins/workspace/lldb-cmake-standalone/llvm-project/libcxx/src -Iinclude -I/Users/buildslave/jenkins/workspace/lldb-cmake-standalone/llvm-project/llvm/include -Iprojects/libcxx/include/c++build -fPIC -fvisibility-inlines-hidden -Werror=date-time -Werror=unguarded-availability-new -Wall -Wextra -Wno-unused-parameter -Wwrite-strings -Wcast-qual -Wmissing-field-initializers  -Wno-long-long -Wimplicit-fallthrough -Wcovered-switch-default -Wno-noexcept-type -Wnon-virtual-dtor -Wdelete-non-virtual-dtor -Wsuggest-override -Wstring-conversion -fdiagnostics-color -O3  -isysroot /Applications/Xcode.app/Contents/Developer/Platforms/MacOSX.platform/Developer/SDKs/MacOSX10.15.sdk   -DLIBCXX_BUILDING_LIBCXXABI -UNDEBUG -faligned-allocation -nostdinc++ -fvisibility-inlines-hidden -fvisibility=hidden -Wall -Wextra -W -Wwrite-strings -Wno-unused-parameter -Wno-long-long -Werror=return-type -Wextra-semi -Wno-user-defined-literals -Wno-covered-switch-default -Wno-suggest-override -Wno-ignored-attributes -Wno-error -I /Users/buildslave/jenkins/workspace/lldb-cmake-standalone/clang-build/include/c++/v1 -include /Users/buildslave/jenkins/workspace/lldb-cmake-standalone/clang-build/projects/libcxx/__config_site -std=c++17 -MD -MT projects/libcxx/src/CMakeFiles/cxx_static.dir/locale.cpp.o -MF projects/libcxx/src/CMakeFiles/cxx_static.dir/locale.cpp.o.d -o projects/libcxx/src/CMakeFiles/cxx_static.dir/locale.cpp.o -c /Users/buildslave/jenkins/workspace/lldb-cmake-standalone/llvm-project/libcxx/src/locale.cpp
[446/3462] : && "/Applications/Xcode.app/Contents/Developer/Toolchains/XcodeDefault.xctoolchain/usr/bin/libtool" -static -no_warning_for_no_symbols -o lib/libc++.a  projects/libcxx/src/CMakeFiles/cxx_static.dir/algorithm.cpp.o projects/libcxx/src/CMakeFiles/cxx_static.dir/any.cpp.o projects/libcxx/src/CMakeFiles/cxx_static.dir/atomic.cpp.o projects/libcxx/src/CMakeFiles/cxx_static.dir/barrier.cpp.o projects/libcxx/src/CMakeFiles/cxx_static.dir/bind.cpp.o projects/libcxx/src/CMakeFiles/cxx_static.dir/charconv.cpp.o projects/libcxx/src/CMakeFiles/cxx_static.dir/chrono.cpp.o projects/libcxx/src/CMakeFiles/cxx_static.dir/condition_variable.cpp.o projects/libcxx/src/CMakeFiles/cxx_static.dir/condition_variable_destructor.cpp.o projects/libcxx/src/CMakeFiles/cxx_static.dir/debug.cpp.o projects/libcxx/src/CMakeFiles/cxx_static.dir/exception.cpp.o projects/libcxx/src/CMakeFiles/cxx_static.dir/functional.cpp.o projects/libcxx/src/CMakeFiles/cxx_static.dir/future.cpp.o projects/libcxx/src/CMakeFiles/cxx_static.dir/hash.cpp.o projects/libcxx/src/CMakeFiles/cxx_static.dir/ios.cpp.o projects/libcxx/src/CMakeFiles/cxx_static.dir/iostream.cpp.o projects/libcxx/src/CMakeFiles/cxx_static.dir/locale.cpp.o projects/libcxx/src/CMakeFiles/cxx_static.dir/memory.cpp.o projects/libcxx/src/CMakeFiles/cxx_static.dir/mutex.cpp.o projects/libcxx/src/CMakeFiles/cxx_static.dir/mutex_destructor.cpp.o projects/libcxx/src/CMakeFiles/cxx_static.dir/new.cpp.o projects/libcxx/src/CMakeFiles/cxx_static.dir/optional.cpp.o projects/libcxx/src/CMakeFiles/cxx_static.dir/random.cpp.o projects/libcxx/src/CMakeFiles/cxx_static.dir/random_shuffle.cpp.o projects/libcxx/src/CMakeFiles/cxx_static.dir/regex.cpp.o projects/libcxx/src/CMakeFiles/cxx_static.dir/shared_mutex.cpp.o projects/libcxx/src/CMakeFiles/cxx_static.dir/stdexcept.cpp.o projects/libcxx/src/CMakeFiles/cxx_static.dir/string.cpp.o projects/libcxx/src/CMakeFiles/cxx_static.dir/strstream.cpp.o projects/libcxx/src/CMakeFiles/cxx_static.dir/system_error.cpp.o projects/libcxx/src/CMakeFiles/cxx_static.dir/thread.cpp.o projects/libcxx/src/CMakeFiles/cxx_static.dir/typeinfo.cpp.o projects/libcxx/src/CMakeFiles/cxx_static.dir/utility.cpp.o projects/libcxx/src/CMakeFiles/cxx_static.dir/valarray.cpp.o projects/libcxx/src/CMakeFiles/cxx_static.dir/variant.cpp.o projects/libcxx/src/CMakeFiles/cxx_static.dir/vector.cpp.o projects/libcxx/src/CMakeFiles/cxx_static.dir/filesystem/operations.cpp.o projects/libcxx/src/CMakeFiles/cxx_static.dir/filesystem/directory_iterator.cpp.o projects/libcxx/src/CMakeFiles/cxx_static.dir/filesystem/int128_builtins.cpp.o && :
[447/3462] /Users/buildslave/jenkins/workspace/lldb-cmake-standalone/host-compiler/bin/clang++  -DBUILD_EXAMPLES -DGTEST_HAS_RTTI=0 -D_DEBUG -D__STDC_CONSTANT_MACROS -D__STDC_FORMAT_MACROS -D__STDC_LIMIT_MACROS -Ilib/Support -I/Users/buildslave/jenkins/workspace/lldb-cmake-standalone/llvm-project/llvm/lib/Support -Iinclude -I/Users/buildslave/jenkins/workspace/lldb-cmake-standalone/llvm-project/llvm/include -fPIC -fvisibility-inlines-hidden -Werror=date-time -Werror=unguarded-availability-new -Wall -Wextra -Wno-unused-parameter -Wwrite-strings -Wcast-qual -Wmissing-field-initializers -pedantic -Wno-long-long -Wimplicit-fallthrough -Wcovered-switch-default -Wno-noexcept-type -Wnon-virtual-dtor -Wdelete-non-virtual-dtor -Wsuggest-override -Wstring-conversion -fdiagnostics-color -O3  -isysroot /Applications/Xcode.app/Contents/Developer/Platforms/MacOSX.platform/Developer/SDKs/MacOSX10.15.sdk   -UNDEBUG -std=c++14  -fno-exceptions -fno-rtti -MD -MT lib/Support/CMakeFiles/LLVMSupport.dir/BranchProbability.cpp.o -MF lib/Support/CMakeFiles/LLVMSupport.dir/BranchProbability.cpp.o.d -o lib/Support/CMakeFiles/LLVMSupport.dir/BranchProbability.cpp.o -c /Users/buildslave/jenkins/workspace/lldb-cmake-standalone/llvm-project/llvm/lib/Support/BranchProbability.cpp
[448/3462] /Users/buildslave/jenkins/workspace/lldb-cmake-standalone/host-compiler/bin/clang++  -DBUILD_EXAMPLES -DGTEST_HAS_RTTI=0 -D_DEBUG -D_GNU_SOURCE -D__STDC_CONSTANT_MACROS -D__STDC_FORMAT_MACROS -D__STDC_LIMIT_MACROS -Itools/clang/utils/TableGen -I/Users/buildslave/jenkins/workspace/lldb-cmake-standalone/llvm-project/clang/utils/TableGen -I/Users/buildslave/jenkins/workspace/lldb-cmake-standalone/llvm-project/clang/include -Itools/clang/include -Iinclude -I/Users/buildslave/jenkins/workspace/lldb-cmake-standalone/llvm-project/llvm/include -fPIC -fvisibility-inlines-hidden -Werror=date-time -Werror=unguarded-availability-new -Wall -Wextra -Wno-unused-parameter -Wwrite-strings -Wcast-qual -Wmissing-field-initializers -pedantic -Wno-long-long -Wimplicit-fallthrough -Wcovered-switch-default -Wno-noexcept-type -Wnon-virtual-dtor -Wdelete-non-virtual-dtor -Wsuggest-override -Wstring-conversion -fdiagnostics-color -fno-common -Woverloaded-virtual -Wno-nested-anon-types -O3  -isysroot /Applications/Xcode.app/Contents/Developer/Platforms/MacOSX.platform/Developer/SDKs/MacOSX10.15.sdk    -fno-exceptions -fno-rtti -UNDEBUG -std=c++14 -MD -MT tools/clang/utils/TableGen/CMakeFiles/clang-tblgen.dir/SveEmitter.cpp.o -MF tools/clang/utils/TableGen/CMakeFiles/clang-tblgen.dir/SveEmitter.cpp.o.d -o tools/clang/utils/TableGen/CMakeFiles/clang-tblgen.dir/SveEmitter.cpp.o -c /Users/buildslave/jenkins/workspace/lldb-cmake-standalone/llvm-project/clang/utils/TableGen/SveEmitter.cpp
[449/3462] /Users/buildslave/jenkins/workspace/lldb-cmake-standalone/host-compiler/bin/clang++  -DBUILD_EXAMPLES -DGTEST_HAS_RTTI=0 -D_DEBUG -D__STDC_CONSTANT_MACROS -D__STDC_FORMAT_MACROS -D__STDC_LIMIT_MACROS -Ilib/Support -I/Users/buildslave/jenkins/workspace/lldb-cmake-standalone/llvm-project/llvm/lib/Support -Iinclude -I/Users/buildslave/jenkins/workspace/lldb-cmake-standalone/llvm-project/llvm/include -fPIC -fvisibility-inlines-hidden -Werror=date-time -Werror=unguarded-availability-new -Wall -Wextra -Wno-unused-parameter -Wwrite-strings -Wcast-qual -Wmissing-field-initializers -pedantic -Wno-long-long -Wimplicit-fallthrough -Wcovered-switch-default -Wno-noexcept-type -Wnon-virtual-dtor -Wdelete-non-virtual-dtor -Wsuggest-override -Wstring-conversion -fdiagnostics-color -O3  -isysroot /Applications/Xcode.app/Contents/Developer/Platforms/MacOSX.platform/Developer/SDKs/MacOSX10.15.sdk   -UNDEBUG -std=c++14  -fno-exceptions -fno-rtti -MD -MT lib/Support/CMakeFiles/LLVMSupport.dir/BinaryStreamWriter.cpp.o -MF lib/Support/CMakeFiles/LLVMSupport.dir/BinaryStreamWriter.cpp.o.d -o lib/Support/CMakeFiles/LLVMSupport.dir/BinaryStreamWriter.cpp.o -c /Users/buildslave/jenkins/workspace/lldb-cmake-standalone/llvm-project/llvm/lib/Support/BinaryStreamWriter.cpp
[450/3462] /Users/buildslave/jenkins/workspace/lldb-cmake-standalone/host-compiler/bin/clang++  -DBUILD_EXAMPLES -DGTEST_HAS_RTTI=0 -D_DEBUG -D__STDC_CONSTANT_MACROS -D__STDC_FORMAT_MACROS -D__STDC_LIMIT_MACROS -Ilib/Support -I/Users/buildslave/jenkins/workspace/lldb-cmake-standalone/llvm-project/llvm/lib/Support -Iinclude -I/Users/buildslave/jenkins/workspace/lldb-cmake-standalone/llvm-project/llvm/include -fPIC -fvisibility-inlines-hidden -Werror=date-time -Werror=unguarded-availability-new -Wall -Wextra -Wno-unused-parameter -Wwrite-strings -Wcast-qual -Wmissing-field-initializers -pedantic -Wno-long-long -Wimplicit-fallthrough -Wcovered-switch-default -Wno-noexcept-type -Wnon-virtual-dtor -Wdelete-non-virtual-dtor -Wsuggest-override -Wstring-conversion -fdiagnostics-color -O3  -isysroot /Applications/Xcode.app/Contents/Developer/Platforms/MacOSX.platform/Developer/SDKs/MacOSX10.15.sdk   -UNDEBUG -std=c++14  -fno-exceptions -fno-rtti -MD -MT lib/Support/CMakeFiles/LLVMSupport.dir/circular_raw_ostream.cpp.o -MF lib/Support/CMakeFiles/LLVMSupport.dir/circular_raw_ostream.cpp.o.d -o lib/Support/CMakeFiles/LLVMSupport.dir/circular_raw_ostream.cpp.o -c /Users/buildslave/jenkins/workspace/lldb-cmake-standalone/llvm-project/llvm/lib/Support/circular_raw_ostream.cpp
[451/3462] /Users/buildslave/jenkins/workspace/lldb-cmake-standalone/host-compiler/bin/clang++  -DBUILD_EXAMPLES -DGTEST_HAS_RTTI=0 -D_DEBUG -D__STDC_CONSTANT_MACROS -D__STDC_FORMAT_MACROS -D__STDC_LIMIT_MACROS -Ilib/Support -I/Users/buildslave/jenkins/workspace/lldb-cmake-standalone/llvm-project/llvm/lib/Support -Iinclude -I/Users/buildslave/jenkins/workspace/lldb-cmake-standalone/llvm-project/llvm/include -fPIC -fvisibility-inlines-hidden -Werror=date-time -Werror=unguarded-availability-new -Wall -Wextra -Wno-unused-parameter -Wwrite-strings -Wcast-qual -Wmissing-field-initializers -pedantic -Wno-long-long -Wimplicit-fallthrough -Wcovered-switch-default -Wno-noexcept-type -Wnon-virtual-dtor -Wdelete-non-virtual-dtor -Wsuggest-override -Wstring-conversion -fdiagnostics-color -O3  -isysroot /Applications/Xcode.app/Contents/Developer/Platforms/MacOSX.platform/Developer/SDKs/MacOSX10.15.sdk   -UNDEBUG -std=c++14  -fno-exceptions -fno-rtti -MD -MT lib/Support/CMakeFiles/LLVMSupport.dir/BinaryStreamRef.cpp.o -MF lib/Support/CMakeFiles/LLVMSupport.dir/BinaryStreamRef.cpp.o.d -o lib/Support/CMakeFiles/LLVMSupport.dir/BinaryStreamRef.cpp.o -c /Users/buildslave/jenkins/workspace/lldb-cmake-standalone/llvm-project/llvm/lib/Support/BinaryStreamRef.cpp
[452/3462] /Users/buildslave/jenkins/workspace/lldb-cmake-standalone/host-compiler/bin/clang++  -DBUILD_EXAMPLES -DGTEST_HAS_RTTI=0 -D_DEBUG -D__STDC_CONSTANT_MACROS -D__STDC_FORMAT_MACROS -D__STDC_LIMIT_MACROS -Ilib/Support -I/Users/buildslave/jenkins/workspace/lldb-cmake-standalone/llvm-project/llvm/lib/Support -Iinclude -I/Users/buildslave/jenkins/workspace/lldb-cmake-standalone/llvm-project/llvm/include -fPIC -fvisibility-inlines-hidden -Werror=date-time -Werror=unguarded-availability-new -Wall -Wextra -Wno-unused-parameter -Wwrite-strings -Wcast-qual -Wmissing-field-initializers -pedantic -Wno-long-long -Wimplicit-fallthrough -Wcovered-switch-default -Wno-noexcept-type -Wnon-virtual-dtor -Wdelete-non-virtual-dtor -Wsuggest-override -Wstring-conversion -fdiagnostics-color -O3  -isysroot /Applications/Xcode.app/Contents/Developer/Platforms/MacOSX.platform/Developer/SDKs/MacOSX10.15.sdk   -UNDEBUG -std=c++14  -fno-exceptions -fno-rtti -MD -MT lib/Support/CMakeFiles/LLVMSupport.dir/Chrono.cpp.o -MF lib/Support/CMakeFiles/LLVMSupport.dir/Chrono.cpp.o.d -o lib/Support/CMakeFiles/LLVMSupport.dir/Chrono.cpp.o -c /Users/buildslave/jenkins/workspace/lldb-cmake-standalone/llvm-project/llvm/lib/Support/Chrono.cpp
[453/3462] /Users/buildslave/jenkins/workspace/lldb-cmake-standalone/host-compiler/bin/clang++  -DBUILD_EXAMPLES -DGTEST_HAS_RTTI=0 -D_DEBUG -D__STDC_CONSTANT_MACROS -D__STDC_FORMAT_MACROS -D__STDC_LIMIT_MACROS -Ilib/Support -I/Users/buildslave/jenkins/workspace/lldb-cmake-standalone/llvm-project/llvm/lib/Support -Iinclude -I/Users/buildslave/jenkins/workspace/lldb-cmake-standalone/llvm-project/llvm/include -fPIC -fvisibility-inlines-hidden -Werror=date-time -Werror=unguarded-availability-new -Wall -Wextra -Wno-unused-parameter -Wwrite-strings -Wcast-qual -Wmissing-field-initializers -pedantic -Wno-long-long -Wimplicit-fallthrough -Wcovered-switch-default -Wno-noexcept-type -Wnon-virtual-dtor -Wdelete-non-virtual-dtor -Wsuggest-override -Wstring-conversion -fdiagnostics-color -O3  -isysroot /Applications/Xcode.app/Contents/Developer/Platforms/MacOSX.platform/Developer/SDKs/MacOSX10.15.sdk   -UNDEBUG -std=c++14  -fno-exceptions -fno-rtti -MD -MT lib/Support/CMakeFiles/LLVMSupport.dir/BinaryStreamReader.cpp.o -MF lib/Support/CMakeFiles/LLVMSupport.dir/BinaryStreamReader.cpp.o.d -o lib/Support/CMakeFiles/LLVMSupport.dir/BinaryStreamReader.cpp.o -c /Users/buildslave/jenkins/workspace/lldb-cmake-standalone/llvm-project/llvm/lib/Support/BinaryStreamReader.cpp
[454/3462] /Users/buildslave/jenkins/workspace/lldb-cmake-standalone/host-compiler/bin/clang++  -DBUILD_EXAMPLES -DGTEST_HAS_RTTI=0 -D_DEBUG -D__STDC_CONSTANT_MACROS -D__STDC_FORMAT_MACROS -D__STDC_LIMIT_MACROS -Ilib/Support -I/Users/buildslave/jenkins/workspace/lldb-cmake-standalone/llvm-project/llvm/lib/Support -Iinclude -I/Users/buildslave/jenkins/workspace/lldb-cmake-standalone/llvm-project/llvm/include -fPIC -fvisibility-inlines-hidden -Werror=date-time -Werror=unguarded-availability-new -Wall -Wextra -Wno-unused-parameter -Wwrite-strings -Wcast-qual -Wmissing-field-initializers -pedantic -Wno-long-long -Wimplicit-fallthrough -Wcovered-switch-default -Wno-noexcept-type -Wnon-virtual-dtor -Wdelete-non-virtual-dtor -Wsuggest-override -Wstring-conversion -fdiagnostics-color -O3  -isysroot /Applications/Xcode.app/Contents/Developer/Platforms/MacOSX.platform/Developer/SDKs/MacOSX10.15.sdk   -UNDEBUG -std=c++14  -fno-exceptions -fno-rtti -MD -MT lib/Support/CMakeFiles/LLVMSupport.dir/CRC.cpp.o -MF lib/Support/CMakeFiles/LLVMSupport.dir/CRC.cpp.o.d -o lib/Support/CMakeFiles/LLVMSupport.dir/CRC.cpp.o -c /Users/buildslave/jenkins/workspace/lldb-cmake-standalone/llvm-project/llvm/lib/Support/CRC.cpp
[455/3462] /Users/buildslave/jenkins/workspace/lldb-cmake-standalone/host-compiler/bin/clang++  -DBUILD_EXAMPLES -DGTEST_HAS_RTTI=0 -D_DEBUG -D__STDC_CONSTANT_MACROS -D__STDC_FORMAT_MACROS -D__STDC_LIMIT_MACROS -Ilib/Support -I/Users/buildslave/jenkins/workspace/lldb-cmake-standalone/llvm-project/llvm/lib/Support -Iinclude -I/Users/buildslave/jenkins/workspace/lldb-cmake-standalone/llvm-project/llvm/include -fPIC -fvisibility-inlines-hidden -Werror=date-time -Werror=unguarded-availability-new -Wall -Wextra -Wno-unused-parameter -Wwrite-strings -Wcast-qual -Wmissing-field-initializers -pedantic -Wno-long-long -Wimplicit-fallthrough -Wcovered-switch-default -Wno-noexcept-type -Wnon-virtual-dtor -Wdelete-non-virtual-dtor -Wsuggest-override -Wstring-conversion -fdiagnostics-color -O3  -isysroot /Applications/Xcode.app/Contents/Developer/Platforms/MacOSX.platform/Developer/SDKs/MacOSX10.15.sdk   -UNDEBUG -std=c++14  -fno-exceptions -fno-rtti -MD -MT lib/Support/CMakeFiles/LLVMSupport.dir/ConvertUTF.cpp.o -MF lib/Support/CMakeFiles/LLVMSupport.dir/ConvertUTF.cpp.o.d -o lib/Support/CMakeFiles/LLVMSupport.dir/ConvertUTF.cpp.o -c /Users/buildslave/jenkins/workspace/lldb-cmake-standalone/llvm-project/llvm/lib/Support/ConvertUTF.cpp
[456/3462] /Users/buildslave/jenkins/workspace/lldb-cmake-standalone/host-compiler/bin/clang++  -DBUILD_EXAMPLES -DGTEST_HAS_RTTI=0 -D_DEBUG -D__STDC_CONSTANT_MACROS -D__STDC_FORMAT_MACROS -D__STDC_LIMIT_MACROS -Ilib/Support -I/Users/buildslave/jenkins/workspace/lldb-cmake-standalone/llvm-project/llvm/lib/Support -Iinclude -I/Users/buildslave/jenkins/workspace/lldb-cmake-standalone/llvm-project/llvm/include -fPIC -fvisibility-inlines-hidden -Werror=date-time -Werror=unguarded-availability-new -Wall -Wextra -Wno-unused-parameter -Wwrite-strings -Wcast-qual -Wmissing-field-initializers -pedantic -Wno-long-long -Wimplicit-fallthrough -Wcovered-switch-default -Wno-noexcept-type -Wnon-virtual-dtor -Wdelete-non-virtual-dtor -Wsuggest-override -Wstring-conversion -fdiagnostics-color -O3  -isysroot /Applications/Xcode.app/Contents/Developer/Platforms/MacOSX.platform/Developer/SDKs/MacOSX10.15.sdk   -UNDEBUG -std=c++14  -fno-exceptions -fno-rtti -MD -MT lib/Support/CMakeFiles/LLVMSupport.dir/Compression.cpp.o -MF lib/Support/CMakeFiles/LLVMSupport.dir/Compression.cpp.o.d -o lib/Support/CMakeFiles/LLVMSupport.dir/Compression.cpp.o -c /Users/buildslave/jenkins/workspace/lldb-cmake-standalone/llvm-project/llvm/lib/Support/Compression.cpp
[457/3462] /Users/buildslave/jenkins/workspace/lldb-cmake-standalone/host-compiler/bin/clang++  -DBUILD_EXAMPLES -DGTEST_HAS_RTTI=0 -D_DEBUG -D__STDC_CONSTANT_MACROS -D__STDC_FORMAT_MACROS -D__STDC_LIMIT_MACROS -Ilib/Support -I/Users/buildslave/jenkins/workspace/lldb-cmake-standalone/llvm-project/llvm/lib/Support -Iinclude -I/Users/buildslave/jenkins/workspace/lldb-cmake-standalone/llvm-project/llvm/include -fPIC -fvisibility-inlines-hidden -Werror=date-time -Werror=unguarded-availability-new -Wall -Wextra -Wno-unused-parameter -Wwrite-strings -Wcast-qual -Wmissing-field-initializers -pedantic -Wno-long-long -Wimplicit-fallthrough -Wcovered-switch-default -Wno-noexcept-type -Wnon-virtual-dtor -Wdelete-non-virtual-dtor -Wsuggest-override -Wstring-conversion -fdiagnostics-color -O3  -isysroot /Applications/Xcode.app/Contents/Developer/Platforms/MacOSX.platform/Developer/SDKs/MacOSX10.15.sdk   -UNDEBUG -std=c++14  -fno-exceptions -fno-rtti -MD -MT lib/Support/CMakeFiles/LLVMSupport.dir/CrashRecoveryContext.cpp.o -MF lib/Support/CMakeFiles/LLVMSupport.dir/CrashRecoveryContext.cpp.o.d -o lib/Support/CMakeFiles/LLVMSupport.dir/CrashRecoveryContext.cpp.o -c /Users/buildslave/jenkins/workspace/lldb-cmake-standalone/llvm-project/llvm/lib/Support/CrashRecoveryContext.cpp
[458/3462] /Users/buildslave/jenkins/workspace/lldb-cmake-standalone/host-compiler/bin/clang++  -DBUILD_EXAMPLES -DGTEST_HAS_RTTI=0 -D_DEBUG -D__STDC_CONSTANT_MACROS -D__STDC_FORMAT_MACROS -D__STDC_LIMIT_MACROS -Ilib/Support -I/Users/buildslave/jenkins/workspace/lldb-cmake-standalone/llvm-project/llvm/lib/Support -Iinclude -I/Users/buildslave/jenkins/workspace/lldb-cmake-standalone/llvm-project/llvm/include -fPIC -fvisibility-inlines-hidden -Werror=date-time -Werror=unguarded-availability-new -Wall -Wextra -Wno-unused-parameter -Wwrite-strings -Wcast-qual -Wmissing-field-initializers -pedantic -Wno-long-long -Wimplicit-fallthrough -Wcovered-switch-default -Wno-noexcept-type -Wnon-virtual-dtor -Wdelete-non-virtual-dtor -Wsuggest-override -Wstring-conversion -fdiagnostics-color -O3  -isysroot /Applications/Xcode.app/Contents/Developer/Platforms/MacOSX.platform/Developer/SDKs/MacOSX10.15.sdk   -UNDEBUG -std=c++14  -fno-exceptions -fno-rtti -MD -MT lib/Support/CMakeFiles/LLVMSupport.dir/ConvertUTFWrapper.cpp.o -MF lib/Support/CMakeFiles/LLVMSupport.dir/ConvertUTFWrapper.cpp.o.d -o lib/Support/CMakeFiles/LLVMSupport.dir/ConvertUTFWrapper.cpp.o -c /Users/buildslave/jenkins/workspace/lldb-cmake-standalone/llvm-project/llvm/lib/Support/ConvertUTFWrapper.cpp
[459/3462] /Users/buildslave/jenkins/workspace/lldb-cmake-standalone/host-compiler/bin/clang++  -DBUILD_EXAMPLES -DGTEST_HAS_RTTI=0 -D_DEBUG -D__STDC_CONSTANT_MACROS -D__STDC_FORMAT_MACROS -D__STDC_LIMIT_MACROS -Ilib/Support -I/Users/buildslave/jenkins/workspace/lldb-cmake-standalone/llvm-project/llvm/lib/Support -Iinclude -I/Users/buildslave/jenkins/workspace/lldb-cmake-standalone/llvm-project/llvm/include -fPIC -fvisibility-inlines-hidden -Werror=date-time -Werror=unguarded-availability-new -Wall -Wextra -Wno-unused-parameter -Wwrite-strings -Wcast-qual -Wmissing-field-initializers -pedantic -Wno-long-long -Wimplicit-fallthrough -Wcovered-switch-default -Wno-noexcept-type -Wnon-virtual-dtor -Wdelete-non-virtual-dtor -Wsuggest-override -Wstring-conversion -fdiagnostics-color -O3  -isysroot /Applications/Xcode.app/Contents/Developer/Platforms/MacOSX.platform/Developer/SDKs/MacOSX10.15.sdk   -UNDEBUG -std=c++14  -fno-exceptions -fno-rtti -MD -MT lib/Support/CMakeFiles/LLVMSupport.dir/APFloat.cpp.o -MF lib/Support/CMakeFiles/LLVMSupport.dir/APFloat.cpp.o.d -o lib/Support/CMakeFiles/LLVMSupport.dir/APFloat.cpp.o -c /Users/buildslave/jenkins/workspace/lldb-cmake-standalone/llvm-project/llvm/lib/Support/APFloat.cpp
[460/3462] /Users/buildslave/jenkins/workspace/lldb-cmake-standalone/host-compiler/bin/clang++  -DBUILD_EXAMPLES -DGTEST_HAS_RTTI=0 -D_DEBUG -D__STDC_CONSTANT_MACROS -D__STDC_FORMAT_MACROS -D__STDC_LIMIT_MACROS -Ilib/Support -I/Users/buildslave/jenkins/workspace/lldb-cmake-standalone/llvm-project/llvm/lib/Support -Iinclude -I/Users/buildslave/jenkins/workspace/lldb-cmake-standalone/llvm-project/llvm/include -fPIC -fvisibility-inlines-hidden -Werror=date-time -Werror=unguarded-availability-new -Wall -Wextra -Wno-unused-parameter -Wwrite-strings -Wcast-qual -Wmissing-field-initializers -pedantic -Wno-long-long -Wimplicit-fallthrough -Wcovered-switch-default -Wno-noexcept-type -Wnon-virtual-dtor -Wdelete-non-virtual-dtor -Wsuggest-override -Wstring-conversion -fdiagnostics-color -O3  -isysroot /Applications/Xcode.app/Contents/Developer/Platforms/MacOSX.platform/Developer/SDKs/MacOSX10.15.sdk   -UNDEBUG -std=c++14  -fno-exceptions -fno-rtti -MD -MT lib/Support/CMakeFiles/LLVMSupport.dir/CodeGenCoverage.cpp.o -MF lib/Support/CMakeFiles/LLVMSupport.dir/CodeGenCoverage.cpp.o.d -o lib/Support/CMakeFiles/LLVMSupport.dir/CodeGenCoverage.cpp.o -c /Users/buildslave/jenkins/workspace/lldb-cmake-standalone/llvm-project/llvm/lib/Support/CodeGenCoverage.cpp
[461/3462] /Users/buildslave/jenkins/workspace/lldb-cmake-standalone/host-compiler/bin/clang++  -DBUILD_EXAMPLES -DGTEST_HAS_RTTI=0 -D_DEBUG -D__STDC_CONSTANT_MACROS -D__STDC_FORMAT_MACROS -D__STDC_LIMIT_MACROS -Ilib/Support -I/Users/buildslave/jenkins/workspace/lldb-cmake-standalone/llvm-project/llvm/lib/Support -Iinclude -I/Users/buildslave/jenkins/workspace/lldb-cmake-standalone/llvm-project/llvm/include -fPIC -fvisibility-inlines-hidden -Werror=date-time -Werror=unguarded-availability-new -Wall -Wextra -Wno-unused-parameter -Wwrite-strings -Wcast-qual -Wmissing-field-initializers -pedantic -Wno-long-long -Wimplicit-fallthrough -Wcovered-switch-default -Wno-noexcept-type -Wnon-virtual-dtor -Wdelete-non-virtual-dtor -Wsuggest-override -Wstring-conversion -fdiagnostics-color -O3  -isysroot /Applications/Xcode.app/Contents/Developer/Platforms/MacOSX.platform/Developer/SDKs/MacOSX10.15.sdk   -UNDEBUG -std=c++14  -fno-exceptions -fno-rtti -MD -MT lib/Support/CMakeFiles/LLVMSupport.dir/CachePruning.cpp.o -MF lib/Support/CMakeFiles/LLVMSupport.dir/CachePruning.cpp.o.d -o lib/Support/CMakeFiles/LLVMSupport.dir/CachePruning.cpp.o -c /Users/buildslave/jenkins/workspace/lldb-cmake-standalone/llvm-project/llvm/lib/Support/CachePruning.cpp
[462/3462] /Users/buildslave/jenkins/workspace/lldb-cmake-standalone/host-compiler/bin/clang++  -DBUILD_EXAMPLES -DGTEST_HAS_RTTI=0 -D_DEBUG -D__STDC_CONSTANT_MACROS -D__STDC_FORMAT_MACROS -D__STDC_LIMIT_MACROS -Ilib/Support -I/Users/buildslave/jenkins/workspace/lldb-cmake-standalone/llvm-project/llvm/lib/Support -Iinclude -I/Users/buildslave/jenkins/workspace/lldb-cmake-standalone/llvm-project/llvm/include -fPIC -fvisibility-inlines-hidden -Werror=date-time -Werror=unguarded-availability-new -Wall -Wextra -Wno-unused-parameter -Wwrite-strings -Wcast-qual -Wmissing-field-initializers -pedantic -Wno-long-long -Wimplicit-fallthrough -Wcovered-switch-default -Wno-noexcept-type -Wnon-virtual-dtor -Wdelete-non-virtual-dtor -Wsuggest-override -Wstring-conversion -fdiagnostics-color -O3  -isysroot /Applications/Xcode.app/Contents/Developer/Platforms/MacOSX.platform/Developer/SDKs/MacOSX10.15.sdk   -UNDEBUG -std=c++14  -fno-exceptions -fno-rtti -MD -MT lib/Support/CMakeFiles/LLVMSupport.dir/ExtensibleRTTI.cpp.o -MF lib/Support/CMakeFiles/LLVMSupport.dir/ExtensibleRTTI.cpp.o.d -o lib/Support/CMakeFiles/LLVMSupport.dir/ExtensibleRTTI.cpp.o -c /Users/buildslave/jenkins/workspace/lldb-cmake-standalone/llvm-project/llvm/lib/Support/ExtensibleRTTI.cpp
[463/3462] /Users/buildslave/jenkins/workspace/lldb-cmake-standalone/host-compiler/bin/clang++  -DBUILD_EXAMPLES -DGTEST_HAS_RTTI=0 -D_DEBUG -D__STDC_CONSTANT_MACROS -D__STDC_FORMAT_MACROS -D__STDC_LIMIT_MACROS -Ilib/Support -I/Users/buildslave/jenkins/workspace/lldb-cmake-standalone/llvm-project/llvm/lib/Support -Iinclude -I/Users/buildslave/jenkins/workspace/lldb-cmake-standalone/llvm-project/llvm/include -fPIC -fvisibility-inlines-hidden -Werror=date-time -Werror=unguarded-availability-new -Wall -Wextra -Wno-unused-parameter -Wwrite-strings -Wcast-qual -Wmissing-field-initializers -pedantic -Wno-long-long -Wimplicit-fallthrough -Wcovered-switch-default -Wno-noexcept-type -Wnon-virtual-dtor -Wdelete-non-virtual-dtor -Wsuggest-override -Wstring-conversion -fdiagnostics-color -O3  -isysroot /Applications/Xcode.app/Contents/Developer/Platforms/MacOSX.platform/Developer/SDKs/MacOSX10.15.sdk   -UNDEBUG -std=c++14  -fno-exceptions -fno-rtti -MD -MT lib/Support/CMakeFiles/LLVMSupport.dir/DJB.cpp.o -MF lib/Support/CMakeFiles/LLVMSupport.dir/DJB.cpp.o.d -o lib/Support/CMakeFiles/LLVMSupport.dir/DJB.cpp.o -c /Users/buildslave/jenkins/workspace/lldb-cmake-standalone/llvm-project/llvm/lib/Support/DJB.cpp
[464/3462] /Users/buildslave/jenkins/workspace/lldb-cmake-standalone/host-compiler/bin/clang++  -DBUILD_EXAMPLES -DGTEST_HAS_RTTI=0 -D_DEBUG -D__STDC_CONSTANT_MACROS -D__STDC_FORMAT_MACROS -D__STDC_LIMIT_MACROS -Ilib/Support -I/Users/buildslave/jenkins/workspace/lldb-cmake-standalone/llvm-project/llvm/lib/Support -Iinclude -I/Users/buildslave/jenkins/workspace/lldb-cmake-standalone/llvm-project/llvm/include -fPIC -fvisibility-inlines-hidden -Werror=date-time -Werror=unguarded-availability-new -Wall -Wextra -Wno-unused-parameter -Wwrite-strings -Wcast-qual -Wmissing-field-initializers -pedantic -Wno-long-long -Wimplicit-fallthrough -Wcovered-switch-default -Wno-noexcept-type -Wnon-virtual-dtor -Wdelete-non-virtual-dtor -Wsuggest-override -Wstring-conversion -fdiagnostics-color -O3  -isysroot /Applications/Xcode.app/Contents/Developer/Platforms/MacOSX.platform/Developer/SDKs/MacOSX10.15.sdk   -UNDEBUG -std=c++14  -fno-exceptions -fno-rtti -MD -MT lib/Support/CMakeFiles/LLVMSupport.dir/DataExtractor.cpp.o -MF lib/Support/CMakeFiles/LLVMSupport.dir/DataExtractor.cpp.o.d -o lib/Support/CMakeFiles/LLVMSupport.dir/DataExtractor.cpp.o -c /Users/buildslave/jenkins/workspace/lldb-cmake-standalone/llvm-project/llvm/lib/Support/DataExtractor.cpp
[465/3462] /Users/buildslave/jenkins/workspace/lldb-cmake-standalone/host-compiler/bin/clang++  -DBUILD_EXAMPLES -DGTEST_HAS_RTTI=0 -D_DEBUG -D__STDC_CONSTANT_MACROS -D__STDC_FORMAT_MACROS -D__STDC_LIMIT_MACROS -Ilib/Support -I/Users/buildslave/jenkins/workspace/lldb-cmake-standalone/llvm-project/llvm/lib/Support -Iinclude -I/Users/buildslave/jenkins/workspace/lldb-cmake-standalone/llvm-project/llvm/include -fPIC -fvisibility-inlines-hidden -Werror=date-time -Werror=unguarded-availability-new -Wall -Wextra -Wno-unused-parameter -Wwrite-strings -Wcast-qual -Wmissing-field-initializers -pedantic -Wno-long-long -Wimplicit-fallthrough -Wcovered-switch-default -Wno-noexcept-type -Wnon-virtual-dtor -Wdelete-non-virtual-dtor -Wsuggest-override -Wstring-conversion -fdiagnostics-color -O3  -isysroot /Applications/Xcode.app/Contents/Developer/Platforms/MacOSX.platform/Developer/SDKs/MacOSX10.15.sdk   -UNDEBUG -std=c++14  -fno-exceptions -fno-rtti -MD -MT lib/Support/CMakeFiles/LLVMSupport.dir/DeltaAlgorithm.cpp.o -MF lib/Support/CMakeFiles/LLVMSupport.dir/DeltaAlgorithm.cpp.o.d -o lib/Support/CMakeFiles/LLVMSupport.dir/DeltaAlgorithm.cpp.o -c /Users/buildslave/jenkins/workspace/lldb-cmake-standalone/llvm-project/llvm/lib/Support/DeltaAlgorithm.cpp
[466/3462] /Users/buildslave/jenkins/workspace/lldb-cmake-standalone/host-compiler/bin/clang++  -DBUILD_EXAMPLES -DGTEST_HAS_RTTI=0 -D_DEBUG -D__STDC_CONSTANT_MACROS -D__STDC_FORMAT_MACROS -D__STDC_LIMIT_MACROS -Ilib/Support -I/Users/buildslave/jenkins/workspace/lldb-cmake-standalone/llvm-project/llvm/lib/Support -Iinclude -I/Users/buildslave/jenkins/workspace/lldb-cmake-standalone/llvm-project/llvm/include -fPIC -fvisibility-inlines-hidden -Werror=date-time -Werror=unguarded-availability-new -Wall -Wextra -Wno-unused-parameter -Wwrite-strings -Wcast-qual -Wmissing-field-initializers -pedantic -Wno-long-long -Wimplicit-fallthrough -Wcovered-switch-default -Wno-noexcept-type -Wnon-virtual-dtor -Wdelete-non-virtual-dtor -Wsuggest-override -Wstring-conversion -fdiagnostics-color -O3  -isysroot /Applications/Xcode.app/Contents/Developer/Platforms/MacOSX.platform/Developer/SDKs/MacOSX10.15.sdk   -UNDEBUG -std=c++14  -fno-exceptions -fno-rtti -MD -MT lib/Support/CMakeFiles/LLVMSupport.dir/APInt.cpp.o -MF lib/Support/CMakeFiles/LLVMSupport.dir/APInt.cpp.o.d -o lib/Support/CMakeFiles/LLVMSupport.dir/APInt.cpp.o -c /Users/buildslave/jenkins/workspace/lldb-cmake-standalone/llvm-project/llvm/lib/Support/APInt.cpp
[467/3462] /Users/buildslave/jenkins/workspace/lldb-cmake-standalone/host-compiler/bin/clang++  -DBUILD_EXAMPLES -DGTEST_HAS_RTTI=0 -D_DEBUG -D__STDC_CONSTANT_MACROS -D__STDC_FORMAT_MACROS -D__STDC_LIMIT_MACROS -Ilib/Support -I/Users/buildslave/jenkins/workspace/lldb-cmake-standalone/llvm-project/llvm/lib/Support -Iinclude -I/Users/buildslave/jenkins/workspace/lldb-cmake-standalone/llvm-project/llvm/include -fPIC -fvisibility-inlines-hidden -Werror=date-time -Werror=unguarded-availability-new -Wall -Wextra -Wno-unused-parameter -Wwrite-strings -Wcast-qual -Wmissing-field-initializers -pedantic -Wno-long-long -Wimplicit-fallthrough -Wcovered-switch-default -Wno-noexcept-type -Wnon-virtual-dtor -Wdelete-non-virtual-dtor -Wsuggest-override -Wstring-conversion -fdiagnostics-color -O3  -isysroot /Applications/Xcode.app/Contents/Developer/Platforms/MacOSX.platform/Developer/SDKs/MacOSX10.15.sdk   -UNDEBUG -std=c++14  -fno-exceptions -fno-rtti -MD -MT lib/Support/CMakeFiles/LLVMSupport.dir/ELFAttributes.cpp.o -MF lib/Support/CMakeFiles/LLVMSupport.dir/ELFAttributes.cpp.o.d -o lib/Support/CMakeFiles/LLVMSupport.dir/ELFAttributes.cpp.o -c /Users/buildslave/jenkins/workspace/lldb-cmake-standalone/llvm-project/llvm/lib/Support/ELFAttributes.cpp
[468/3462] /Users/buildslave/jenkins/workspace/lldb-cmake-standalone/host-compiler/bin/clang++  -DBUILD_EXAMPLES -DNDEBUG -D_LIBCPP_BUILDING_LIBRARY -D_LIBCPP_HAS_NO_PRAGMA_SYSTEM_HEADER -D__STDC_CONSTANT_MACROS -D__STDC_FORMAT_MACROS -D__STDC_LIMIT_MACROS -Iprojects/libcxx/src -I/Users/buildslave/jenkins/workspace/lldb-cmake-standalone/llvm-project/libcxx/src -Iinclude -I/Users/buildslave/jenkins/workspace/lldb-cmake-standalone/llvm-project/llvm/include -Iprojects/libcxx/include/c++build -fPIC -fvisibility-inlines-hidden -Werror=date-time -Werror=unguarded-availability-new -Wall -Wextra -Wno-unused-parameter -Wwrite-strings -Wcast-qual -Wmissing-field-initializers  -Wno-long-long -Wimplicit-fallthrough -Wcovered-switch-default -Wno-noexcept-type -Wnon-virtual-dtor -Wdelete-non-virtual-dtor -Wsuggest-override -Wstring-conversion -fdiagnostics-color -O3  -isysroot /Applications/Xcode.app/Contents/Developer/Platforms/MacOSX.platform/Developer/SDKs/MacOSX10.15.sdk -fPIC   -DLIBCXX_BUILDING_LIBCXXABI -UNDEBUG -faligned-allocation -nostdinc++ -fvisibility-inlines-hidden -fvisibility=hidden -Wall -Wextra -W -Wwrite-strings -Wno-unused-parameter -Wno-long-long -Werror=return-type -Wextra-semi -Wno-user-defined-literals -Wno-covered-switch-default -Wno-suggest-override -Wno-ignored-attributes -Wno-error -I /Users/buildslave/jenkins/workspace/lldb-cmake-standalone/clang-build/include/c++/v1 -include /Users/buildslave/jenkins/workspace/lldb-cmake-standalone/clang-build/projects/libcxx/__config_site -std=c++17 -MD -MT projects/libcxx/src/CMakeFiles/cxx_shared.dir/locale.cpp.o -MF projects/libcxx/src/CMakeFiles/cxx_shared.dir/locale.cpp.o.d -o projects/libcxx/src/CMakeFiles/cxx_shared.dir/locale.cpp.o -c /Users/buildslave/jenkins/workspace/lldb-cmake-standalone/llvm-project/libcxx/src/locale.cpp
[469/3462] : && /Users/buildslave/jenkins/workspace/lldb-cmake-standalone/host-compiler/bin/clang++ -fPIC -fvisibility-inlines-hidden -Werror=date-time -Werror=unguarded-availability-new -Wall -Wextra -Wno-unused-parameter -Wwrite-strings -Wcast-qual -Wmissing-field-initializers  -Wno-long-long -Wimplicit-fallthrough -Wcovered-switch-default -Wno-noexcept-type -Wnon-virtual-dtor -Wdelete-non-virtual-dtor -Wsuggest-override -Wstring-conversion -fdiagnostics-color -O3 -isysroot /Applications/Xcode.app/Contents/Developer/Platforms/MacOSX.platform/Developer/SDKs/MacOSX10.15.sdk -dynamiclib -Wl,-headerpad_max_install_names -compatibility_version 1.0.0 -current_version 1.0.0 -o lib/libc++.1.0.dylib -install_name @rpath/libc++.1.dylib projects/libcxx/src/CMakeFiles/cxx_shared.dir/algorithm.cpp.o projects/libcxx/src/CMakeFiles/cxx_shared.dir/any.cpp.o projects/libcxx/src/CMakeFiles/cxx_shared.dir/atomic.cpp.o projects/libcxx/src/CMakeFiles/cxx_shared.dir/barrier.cpp.o projects/libcxx/src/CMakeFiles/cxx_shared.dir/bind.cpp.o projects/libcxx/src/CMakeFiles/cxx_shared.dir/charconv.cpp.o projects/libcxx/src/CMakeFiles/cxx_shared.dir/chrono.cpp.o projects/libcxx/src/CMakeFiles/cxx_shared.dir/condition_variable.cpp.o projects/libcxx/src/CMakeFiles/cxx_shared.dir/condition_variable_destructor.cpp.o projects/libcxx/src/CMakeFiles/cxx_shared.dir/debug.cpp.o projects/libcxx/src/CMakeFiles/cxx_shared.dir/exception.cpp.o projects/libcxx/src/CMakeFiles/cxx_shared.dir/functional.cpp.o projects/libcxx/src/CMakeFiles/cxx_shared.dir/future.cpp.o projects/libcxx/src/CMakeFiles/cxx_shared.dir/hash.cpp.o projects/libcxx/src/CMakeFiles/cxx_shared.dir/ios.cpp.o projects/libcxx/src/CMakeFiles/cxx_shared.dir/iostream.cpp.o projects/libcxx/src/CMakeFiles/cxx_shared.dir/locale.cpp.o projects/libcxx/src/CMakeFiles/cxx_shared.dir/memory.cpp.o projects/libcxx/src/CMakeFiles/cxx_shared.dir/mutex.cpp.o projects/libcxx/src/CMakeFiles/cxx_shared.dir/mutex_destructor.cpp.o projects/libcxx/src/CMakeFiles/cxx_shared.dir/new.cpp.o projects/libcxx/src/CMakeFiles/cxx_shared.dir/optional.cpp.o projects/libcxx/src/CMakeFiles/cxx_shared.dir/random.cpp.o projects/libcxx/src/CMakeFiles/cxx_shared.dir/random_shuffle.cpp.o projects/libcxx/src/CMakeFiles/cxx_shared.dir/regex.cpp.o projects/libcxx/src/CMakeFiles/cxx_shared.dir/shared_mutex.cpp.o projects/libcxx/src/CMakeFiles/cxx_shared.dir/stdexcept.cpp.o projects/libcxx/src/CMakeFiles/cxx_shared.dir/string.cpp.o projects/libcxx/src/CMakeFiles/cxx_shared.dir/strstream.cpp.o projects/libcxx/src/CMakeFiles/cxx_shared.dir/system_error.cpp.o projects/libcxx/src/CMakeFiles/cxx_shared.dir/thread.cpp.o projects/libcxx/src/CMakeFiles/cxx_shared.dir/typeinfo.cpp.o projects/libcxx/src/CMakeFiles/cxx_shared.dir/utility.cpp.o projects/libcxx/src/CMakeFiles/cxx_shared.dir/valarray.cpp.o projects/libcxx/src/CMakeFiles/cxx_shared.dir/variant.cpp.o projects/libcxx/src/CMakeFiles/cxx_shared.dir/vector.cpp.o projects/libcxx/src/CMakeFiles/cxx_shared.dir/filesystem/operations.cpp.o projects/libcxx/src/CMakeFiles/cxx_shared.dir/filesystem/directory_iterator.cpp.o projects/libcxx/src/CMakeFiles/cxx_shared.dir/filesystem/int128_builtins.cpp.o  -Wl,-rpath,@loader_path/../lib  -nodefaultlibs  -lSystem  -lc  lib/libc++abi.1.0.dylib  -Wl,-unexported_symbols_list,/Users/buildslave/jenkins/workspace/lldb-cmake-standalone/llvm-project/libcxx/src/../lib/libc++unexp.exp  -Wl,-reexported_symbols_list,/Users/buildslave/jenkins/workspace/lldb-cmake-standalone/llvm-project/libcxx/src/../lib/libc++abi.v2.exp  -Wl,-force_symbols_not_weak_list,/Users/buildslave/jenkins/workspace/lldb-cmake-standalone/llvm-project/libcxx/src/../lib/notweak.exp  -Wl,-force_symbols_weak_list,/Users/buildslave/jenkins/workspace/lldb-cmake-standalone/llvm-project/libcxx/src/../lib/weak.exp  -Wl,-reexported_symbols_list,/Users/buildslave/jenkins/workspace/lldb-cmake-standalone/llvm-project/libcxxabi/src/../lib/new-delete.exp  -Wl,-reexported_symbols_list,/Users/buildslave/jenkins/workspace/lldb-cmake-standalone/llvm-project/libcxxabi/src/../lib/exceptions.exp  -Wl,-reexported_symbols_list,/Users/buildslave/jenkins/workspace/lldb-cmake-standalone/llvm-project/libcxxabi/src/../lib/personality-v0.exp && :
FAILED: lib/libc++.1.0.dylib 
: && /Users/buildslave/jenkins/workspace/lldb-cmake-standalone/host-compiler/bin/clang++ -fPIC -fvisibility-inlines-hidden -Werror=date-time -Werror=unguarded-availability-new -Wall -Wextra -Wno-unused-parameter -Wwrite-strings -Wcast-qual -Wmissing-field-initializers  -Wno-long-long -Wimplicit-fallthrough -Wcovered-switch-default -Wno-noexcept-type -Wnon-virtual-dtor -Wdelete-non-virtual-dtor -Wsuggest-override -Wstring-conversion -fdiagnostics-color -O3 -isysroot /Applications/Xcode.app/Contents/Developer/Platforms/MacOSX.platform/Developer/SDKs/MacOSX10.15.sdk -dynamiclib -Wl,-headerpad_max_install_names -compatibility_version 1.0.0 -current_version 1.0.0 -o lib/libc++.1.0.dylib -install_name @rpath/libc++.1.dylib projects/libcxx/src/CMakeFiles/cxx_shared.dir/algorithm.cpp.o projects/libcxx/src/CMakeFiles/cxx_shared.dir/any.cpp.o projects/libcxx/src/CMakeFiles/cxx_shared.dir/atomic.cpp.o projects/libcxx/src/CMakeFiles/cxx_shared.dir/barrier.cpp.o projects/libcxx/src/CMakeFiles/cxx_shared.dir/bind.cpp.o projects/libcxx/src/CMakeFiles/cxx_shared.dir/charconv.cpp.o projects/libcxx/src/CMakeFiles/cxx_shared.dir/chrono.cpp.o projects/libcxx/src/CMakeFiles/cxx_shared.dir/condition_variable.cpp.o projects/libcxx/src/CMakeFiles/cxx_shared.dir/condition_variable_destructor.cpp.o projects/libcxx/src/CMakeFiles/cxx_shared.dir/debug.cpp.o projects/libcxx/src/CMakeFiles/cxx_shared.dir/exception.cpp.o projects/libcxx/src/CMakeFiles/cxx_shared.dir/functional.cpp.o projects/libcxx/src/CMakeFiles/cxx_shared.dir/future.cpp.o projects/libcxx/src/CMakeFiles/cxx_shared.dir/hash.cpp.o projects/libcxx/src/CMakeFiles/cxx_shared.dir/ios.cpp.o projects/libcxx/src/CMakeFiles/cxx_shared.dir/iostream.cpp.o projects/libcxx/src/CMakeFiles/cxx_shared.dir/locale.cpp.o projects/libcxx/src/CMakeFiles/cxx_shared.dir/memory.cpp.o projects/libcxx/src/CMakeFiles/cxx_shared.dir/mutex.cpp.o projects/libcxx/src/CMakeFiles/cxx_shared.dir/mutex_destructor.cpp.o projects/libcxx/src/CMakeFiles/cxx_shared.dir/new.cpp.o projects/libcxx/src/CMakeFiles/cxx_shared.dir/optional.cpp.o projects/libcxx/src/CMakeFiles/cxx_shared.dir/random.cpp.o projects/libcxx/src/CMakeFiles/cxx_shared.dir/random_shuffle.cpp.o projects/libcxx/src/CMakeFiles/cxx_shared.dir/regex.cpp.o projects/libcxx/src/CMakeFiles/cxx_shared.dir/shared_mutex.cpp.o projects/libcxx/src/CMakeFiles/cxx_shared.dir/stdexcept.cpp.o projects/libcxx/src/CMakeFiles/cxx_shared.dir/string.cpp.o projects/libcxx/src/CMakeFiles/cxx_shared.dir/strstream.cpp.o projects/libcxx/src/CMakeFiles/cxx_shared.dir/system_error.cpp.o projects/libcxx/src/CMakeFiles/cxx_shared.dir/thread.cpp.o projects/libcxx/src/CMakeFiles/cxx_shared.dir/typeinfo.cpp.o projects/libcxx/src/CMakeFiles/cxx_shared.dir/utility.cpp.o projects/libcxx/src/CMakeFiles/cxx_shared.dir/valarray.cpp.o projects/libcxx/src/CMakeFiles/cxx_shared.dir/variant.cpp.o projects/libcxx/src/CMakeFiles/cxx_shared.dir/vector.cpp.o projects/libcxx/src/CMakeFiles/cxx_shared.dir/filesystem/operations.cpp.o projects/libcxx/src/CMakeFiles/cxx_shared.dir/filesystem/directory_iterator.cpp.o projects/libcxx/src/CMakeFiles/cxx_shared.dir/filesystem/int128_builtins.cpp.o  -Wl,-rpath,@loader_path/../lib  -nodefaultlibs  -lSystem  -lc  lib/libc++abi.1.0.dylib  -Wl,-unexported_symbols_list,/Users/buildslave/jenkins/workspace/lldb-cmake-standalone/llvm-project/libcxx/src/../lib/libc++unexp.exp  -Wl,-reexported_symbols_list,/Users/buildslave/jenkins/workspace/lldb-cmake-standalone/llvm-project/libcxx/src/../lib/libc++abi.v2.exp  -Wl,-force_symbols_not_weak_list,/Users/buildslave/jenkins/workspace/lldb-cmake-standalone/llvm-project/libcxx/src/../lib/notweak.exp  -Wl,-force_symbols_weak_list,/Users/buildslave/jenkins/workspace/lldb-cmake-standalone/llvm-project/libcxx/src/../lib/weak.exp  -Wl,-reexported_symbols_list,/Users/buildslave/jenkins/workspace/lldb-cmake-standalone/llvm-project/libcxxabi/src/../lib/new-delete.exp  -Wl,-reexported_symbols_list,/Users/buildslave/jenkins/workspace/lldb-cmake-standalone/llvm-project/libcxxabi/src/../lib/exceptions.exp  -Wl,-reexported_symbols_list,/Users/buildslave/jenkins/workspace/lldb-cmake-standalone/llvm-project/libcxxabi/src/../lib/personality-v0.exp && :
ld: requested re-export symbol operator new(unsigned long) is not from a dylib, but from projects/libcxx/src/CMakeFiles/cxx_shared.dir/new.cpp.o
 file 'projects/libcxx/src/CMakeFiles/cxx_shared.dir/new.cpp.o' for architecture x86_64
clang-12: error: linker command failed with exit code 1 (use -v to see invocation)
[470/3462] /Users/buildslave/jenkins/workspace/lldb-cmake-standalone/host-compiler/bin/clang++  -DBUILD_EXAMPLES -DGTEST_HAS_RTTI=0 -D_DEBUG -D__STDC_CONSTANT_MACROS -D__STDC_FORMAT_MACROS -D__STDC_LIMIT_MACROS -Ilib/Support -I/Users/buildslave/jenkins/workspace/lldb-cmake-standalone/llvm-project/llvm/lib/Support -Iinclude -I/Users/buildslave/jenkins/workspace/lldb-cmake-standalone/llvm-project/llvm/include -fPIC -fvisibility-inlines-hidden -Werror=date-time -Werror=unguarded-availability-new -Wall -Wextra -Wno-unused-parameter -Wwrite-strings -Wcast-qual -Wmissing-field-initializers -pedantic -Wno-long-long -Wimplicit-fallthrough -Wcovered-switch-default -Wno-noexcept-type -Wnon-virtual-dtor -Wdelete-non-virtual-dtor -Wsuggest-override -Wstring-conversion -fdiagnostics-color -O3  -isysroot /Applications/Xcode.app/Contents/Developer/Platforms/MacOSX.platform/Developer/SDKs/MacOSX10.15.sdk   -UNDEBUG -std=c++14  -fno-exceptions -fno-rtti -MD -MT lib/Support/CMakeFiles/LLVMSupport.dir/ErrorHandling.cpp.o -MF lib/Support/CMakeFiles/LLVMSupport.dir/ErrorHandling.cpp.o.d -o lib/Support/CMakeFiles/LLVMSupport.dir/ErrorHandling.cpp.o -c /Users/buildslave/jenkins/workspace/lldb-cmake-standalone/llvm-project/llvm/lib/Support/ErrorHandling.cpp
[471/3462] /Users/buildslave/jenkins/workspace/lldb-cmake-standalone/host-compiler/bin/clang++  -DBUILD_EXAMPLES -DGTEST_HAS_RTTI=0 -D_DEBUG -D__STDC_CONSTANT_MACROS -D__STDC_FORMAT_MACROS -D__STDC_LIMIT_MACROS -Ilib/Support -I/Users/buildslave/jenkins/workspace/lldb-cmake-standalone/llvm-project/llvm/lib/Support -Iinclude -I/Users/buildslave/jenkins/workspace/lldb-cmake-standalone/llvm-project/llvm/include -fPIC -fvisibility-inlines-hidden -Werror=date-time -Werror=unguarded-availability-new -Wall -Wextra -Wno-unused-parameter -Wwrite-strings -Wcast-qual -Wmissing-field-initializers -pedantic -Wno-long-long -Wimplicit-fallthrough -Wcovered-switch-default -Wno-noexcept-type -Wnon-virtual-dtor -Wdelete-non-virtual-dtor -Wsuggest-override -Wstring-conversion -fdiagnostics-color -O3  -isysroot /Applications/Xcode.app/Contents/Developer/Platforms/MacOSX.platform/Developer/SDKs/MacOSX10.15.sdk   -UNDEBUG -std=c++14  -fno-exceptions -fno-rtti -MD -MT lib/Support/CMakeFiles/LLVMSupport.dir/FormattedStream.cpp.o -MF lib/Support/CMakeFiles/LLVMSupport.dir/FormattedStream.cpp.o.d -o lib/Support/CMakeFiles/LLVMSupport.dir/FormattedStream.cpp.o -c /Users/buildslave/jenkins/workspace/lldb-cmake-standalone/llvm-project/llvm/lib/Support/FormattedStream.cpp
[472/3462] /Users/buildslave/jenkins/workspace/lldb-cmake-standalone/host-compiler/bin/clang++  -DBUILD_EXAMPLES -DGTEST_HAS_RTTI=0 -D_DEBUG -D__STDC_CONSTANT_MACROS -D__STDC_FORMAT_MACROS -D__STDC_LIMIT_MACROS -Ilib/Support -I/Users/buildslave/jenkins/workspace/lldb-cmake-standalone/llvm-project/llvm/lib/Support -Iinclude -I/Users/buildslave/jenkins/workspace/lldb-cmake-standalone/llvm-project/llvm/include -fPIC -fvisibility-inlines-hidden -Werror=date-time -Werror=unguarded-availability-new -Wall -Wextra -Wno-unused-parameter -Wwrite-strings -Wcast-qual -Wmissing-field-initializers -pedantic -Wno-long-long -Wimplicit-fallthrough -Wcovered-switch-default -Wno-noexcept-type -Wnon-virtual-dtor -Wdelete-non-virtual-dtor -Wsuggest-override -Wstring-conversion -fdiagnostics-color -O3  -isysroot /Applications/Xcode.app/Contents/Developer/Platforms/MacOSX.platform/Developer/SDKs/MacOSX10.15.sdk   -UNDEBUG -std=c++14  -fno-exceptions -fno-rtti -MD -MT lib/Support/CMakeFiles/LLVMSupport.dir/Debug.cpp.o -MF lib/Support/CMakeFiles/LLVMSupport.dir/Debug.cpp.o.d -o lib/Support/CMakeFiles/LLVMSupport.dir/Debug.cpp.o -c /Users/buildslave/jenkins/workspace/lldb-cmake-standalone/llvm-project/llvm/lib/Support/Debug.cpp
[473/3462] /Users/buildslave/jenkins/workspace/lldb-cmake-standalone/host-compiler/bin/clang++  -DBUILD_EXAMPLES -DGTEST_HAS_RTTI=0 -D_DEBUG -D__STDC_CONSTANT_MACROS -D__STDC_FORMAT_MACROS -D__STDC_LIMIT_MACROS -Ilib/Support -I/Users/buildslave/jenkins/workspace/lldb-cmake-standalone/llvm-project/llvm/lib/Support -Iinclude -I/Users/buildslave/jenkins/workspace/lldb-cmake-standalone/llvm-project/llvm/include -fPIC -fvisibility-inlines-hidden -Werror=date-time -Werror=unguarded-availability-new -Wall -Wextra -Wno-unused-parameter -Wwrite-strings -Wcast-qual -Wmissing-field-initializers -pedantic -Wno-long-long -Wimplicit-fallthrough -Wcovered-switch-default -Wno-noexcept-type -Wnon-virtual-dtor -Wdelete-non-virtual-dtor -Wsuggest-override -Wstring-conversion -fdiagnostics-color -O3  -isysroot /Applications/Xcode.app/Contents/Developer/Platforms/MacOSX.platform/Developer/SDKs/MacOSX10.15.sdk   -UNDEBUG -std=c++14  -fno-exceptions -fno-rtti -MD -MT lib/Support/CMakeFiles/LLVMSupport.dir/Error.cpp.o -MF lib/Support/CMakeFiles/LLVMSupport.dir/Error.cpp.o.d -o lib/Support/CMakeFiles/LLVMSupport.dir/Error.cpp.o -c /Users/buildslave/jenkins/workspace/lldb-cmake-standalone/llvm-project/llvm/lib/Support/Error.cpp
[474/3462] /Users/buildslave/jenkins/workspace/lldb-cmake-standalone/host-compiler/bin/clang++  -DBUILD_EXAMPLES -DGTEST_HAS_RTTI=0 -D_DEBUG -D__STDC_CONSTANT_MACROS -D__STDC_FORMAT_MACROS -D__STDC_LIMIT_MACROS -Ilib/Support -I/Users/buildslave/jenkins/workspace/lldb-cmake-standalone/llvm-project/llvm/lib/Support -Iinclude -I/Users/buildslave/jenkins/workspace/lldb-cmake-standalone/llvm-project/llvm/include -fPIC -fvisibility-inlines-hidden -Werror=date-time -Werror=unguarded-availability-new -Wall -Wextra -Wno-unused-parameter -Wwrite-strings -Wcast-qual -Wmissing-field-initializers -pedantic -Wno-long-long -Wimplicit-fallthrough -Wcovered-switch-default -Wno-noexcept-type -Wnon-virtual-dtor -Wdelete-non-virtual-dtor -Wsuggest-override -Wstring-conversion -fdiagnostics-color -O3  -isysroot /Applications/Xcode.app/Contents/Developer/Platforms/MacOSX.platform/Developer/SDKs/MacOSX10.15.sdk   -UNDEBUG -std=c++14  -fno-exceptions -fno-rtti -MD -MT lib/Support/CMakeFiles/LLVMSupport.dir/FoldingSet.cpp.o -MF lib/Support/CMakeFiles/LLVMSupport.dir/FoldingSet.cpp.o.d -o lib/Support/CMakeFiles/LLVMSupport.dir/FoldingSet.cpp.o -c /Users/buildslave/jenkins/workspace/lldb-cmake-standalone/llvm-project/llvm/lib/Support/FoldingSet.cpp
[475/3462] /Users/buildslave/jenkins/workspace/lldb-cmake-standalone/host-compiler/bin/clang++  -DBUILD_EXAMPLES -DGTEST_HAS_RTTI=0 -D_DEBUG -D__STDC_CONSTANT_MACROS -D__STDC_FORMAT_MACROS -D__STDC_LIMIT_MACROS -Ilib/Support -I/Users/buildslave/jenkins/workspace/lldb-cmake-standalone/llvm-project/llvm/lib/Support -Iinclude -I/Users/buildslave/jenkins/workspace/lldb-cmake-standalone/llvm-project/llvm/include -fPIC -fvisibility-inlines-hidden -Werror=date-time -Werror=unguarded-availability-new -Wall -Wextra -Wno-unused-parameter -Wwrite-strings -Wcast-qual -Wmissing-field-initializers -pedantic -Wno-long-long -Wimplicit-fallthrough -Wcovered-switch-default -Wno-noexcept-type -Wnon-virtual-dtor -Wdelete-non-virtual-dtor -Wsuggest-override -Wstring-conversion -fdiagnostics-color -O3  -isysroot /Applications/Xcode.app/Contents/Developer/Platforms/MacOSX.platform/Developer/SDKs/MacOSX10.15.sdk   -UNDEBUG -std=c++14  -fno-exceptions -fno-rtti -MD -MT lib/Support/CMakeFiles/LLVMSupport.dir/FormatVariadic.cpp.o -MF lib/Support/CMakeFiles/LLVMSupport.dir/FormatVariadic.cpp.o.d -o lib/Support/CMakeFiles/LLVMSupport.dir/FormatVariadic.cpp.o -c /Users/buildslave/jenkins/workspace/lldb-cmake-standalone/llvm-project/llvm/lib/Support/FormatVariadic.cpp
[476/3462] /Users/buildslave/jenkins/workspace/lldb-cmake-standalone/host-compiler/bin/clang++  -DBUILD_EXAMPLES -DGTEST_HAS_RTTI=0 -D_DEBUG -D_GNU_SOURCE -D__STDC_CONSTANT_MACROS -D__STDC_FORMAT_MACROS -D__STDC_LIMIT_MACROS -Itools/clang/utils/TableGen -I/Users/buildslave/jenkins/workspace/lldb-cmake-standalone/llvm-project/clang/utils/TableGen -I/Users/buildslave/jenkins/workspace/lldb-cmake-standalone/llvm-project/clang/include -Itools/clang/include -Iinclude -I/Users/buildslave/jenkins/workspace/lldb-cmake-standalone/llvm-project/llvm/include -fPIC -fvisibility-inlines-hidden -Werror=date-time -Werror=unguarded-availability-new -Wall -Wextra -Wno-unused-parameter -Wwrite-strings -Wcast-qual -Wmissing-field-initializers -pedantic -Wno-long-long -Wimplicit-fallthrough -Wcovered-switch-default -Wno-noexcept-type -Wnon-virtual-dtor -Wdelete-non-virtual-dtor -Wsuggest-override -Wstring-conversion -fdiagnostics-color -fno-common -Woverloaded-virtual -Wno-nested-anon-types -O3  -isysroot /Applications/Xcode.app/Contents/Developer/Platforms/MacOSX.platform/Developer/SDKs/MacOSX10.15.sdk    -fno-exceptions -fno-rtti -UNDEBUG -std=c++14 -MD -MT tools/clang/utils/TableGen/CMakeFiles/clang-tblgen.dir/ClangAttrEmitter.cpp.o -MF tools/clang/utils/TableGen/CMakeFiles/clang-tblgen.dir/ClangAttrEmitter.cpp.o.d -o tools/clang/utils/TableGen/CMakeFiles/clang-tblgen.dir/ClangAttrEmitter.cpp.o -c /Users/buildslave/jenkins/workspace/lldb-cmake-standalone/llvm-project/clang/utils/TableGen/ClangAttrEmitter.cpp
[477/3462] /Users/buildslave/jenkins/workspace/lldb-cmake-standalone/host-compiler/bin/clang++  -DBUILD_EXAMPLES -DGTEST_HAS_RTTI=0 -D_DEBUG -D__STDC_CONSTANT_MACROS -D__STDC_FORMAT_MACROS -D__STDC_LIMIT_MACROS -Ilib/Support -I/Users/buildslave/jenkins/workspace/lldb-cmake-standalone/llvm-project/llvm/lib/Support -Iinclude -I/Users/buildslave/jenkins/workspace/lldb-cmake-standalone/llvm-project/llvm/include -fPIC -fvisibility-inlines-hidden -Werror=date-time -Werror=unguarded-availability-new -Wall -Wextra -Wno-unused-parameter -Wwrite-strings -Wcast-qual -Wmissing-field-initializers -pedantic -Wno-long-long -Wimplicit-fallthrough -Wcovered-switch-default -Wno-noexcept-type -Wnon-virtual-dtor -Wdelete-non-virtual-dtor -Wsuggest-override -Wstring-conversion -fdiagnostics-color -O3  -isysroot /Applications/Xcode.app/Contents/Developer/Platforms/MacOSX.platform/Developer/SDKs/MacOSX10.15.sdk   -UNDEBUG -std=c++14  -fno-exceptions -fno-rtti -MD -MT lib/Support/CMakeFiles/LLVMSupport.dir/DebugCounter.cpp.o -MF lib/Support/CMakeFiles/LLVMSupport.dir/DebugCounter.cpp.o.d -o lib/Support/CMakeFiles/LLVMSupport.dir/DebugCounter.cpp.o -c /Users/buildslave/jenkins/workspace/lldb-cmake-standalone/llvm-project/llvm/lib/Support/DebugCounter.cpp
[478/3462] /Users/buildslave/jenkins/workspace/lldb-cmake-standalone/host-compiler/bin/clang++  -DBUILD_EXAMPLES -DGTEST_HAS_RTTI=0 -D_DEBUG -D__STDC_CONSTANT_MACROS -D__STDC_FORMAT_MACROS -D__STDC_LIMIT_MACROS -Ilib/Support -I/Users/buildslave/jenkins/workspace/lldb-cmake-standalone/llvm-project/llvm/lib/Support -Iinclude -I/Users/buildslave/jenkins/workspace/lldb-cmake-standalone/llvm-project/llvm/include -fPIC -fvisibility-inlines-hidden -Werror=date-time -Werror=unguarded-availability-new -Wall -Wextra -Wno-unused-parameter -Wwrite-strings -Wcast-qual -Wmissing-field-initializers -pedantic -Wno-long-long -Wimplicit-fallthrough -Wcovered-switch-default -Wno-noexcept-type -Wnon-virtual-dtor -Wdelete-non-virtual-dtor -Wsuggest-override -Wstring-conversion -fdiagnostics-color -O3  -isysroot /Applications/Xcode.app/Contents/Developer/Platforms/MacOSX.platform/Developer/SDKs/MacOSX10.15.sdk   -UNDEBUG -std=c++14  -fno-exceptions -fno-rtti -MD -MT lib/Support/CMakeFiles/LLVMSupport.dir/DAGDeltaAlgorithm.cpp.o -MF lib/Support/CMakeFiles/LLVMSupport.dir/DAGDeltaAlgorithm.cpp.o.d -o lib/Support/CMakeFiles/LLVMSupport.dir/DAGDeltaAlgorithm.cpp.o -c /Users/buildslave/jenkins/workspace/lldb-cmake-standalone/llvm-project/llvm/lib/Support/DAGDeltaAlgorithm.cpp
[479/3462] /Users/buildslave/jenkins/workspace/lldb-cmake-standalone/host-compiler/bin/clang++  -DBUILD_EXAMPLES -DGTEST_HAS_RTTI=0 -D_DEBUG -D__STDC_CONSTANT_MACROS -D__STDC_FORMAT_MACROS -D__STDC_LIMIT_MACROS -Ilib/Support -I/Users/buildslave/jenkins/workspace/lldb-cmake-standalone/llvm-project/llvm/lib/Support -Iinclude -I/Users/buildslave/jenkins/workspace/lldb-cmake-standalone/llvm-project/llvm/include -fPIC -fvisibility-inlines-hidden -Werror=date-time -Werror=unguarded-availability-new -Wall -Wextra -Wno-unused-parameter -Wwrite-strings -Wcast-qual -Wmissing-field-initializers -pedantic -Wno-long-long -Wimplicit-fallthrough -Wcovered-switch-default -Wno-noexcept-type -Wnon-virtual-dtor -Wdelete-non-virtual-dtor -Wsuggest-override -Wstring-conversion -fdiagnostics-color -O3  -isysroot /Applications/Xcode.app/Contents/Developer/Platforms/MacOSX.platform/Developer/SDKs/MacOSX10.15.sdk   -UNDEBUG -std=c++14  -fno-exceptions -fno-rtti -MD -MT lib/Support/CMakeFiles/LLVMSupport.dir/FileUtilities.cpp.o -MF lib/Support/CMakeFiles/LLVMSupport.dir/FileUtilities.cpp.o.d -o lib/Support/CMakeFiles/LLVMSupport.dir/FileUtilities.cpp.o -c /Users/buildslave/jenkins/workspace/lldb-cmake-standalone/llvm-project/llvm/lib/Support/FileUtilities.cpp
[480/3462] /Users/buildslave/jenkins/workspace/lldb-cmake-standalone/host-compiler/bin/clang++  -DBUILD_EXAMPLES -DGTEST_HAS_RTTI=0 -D_DEBUG -D__STDC_CONSTANT_MACROS -D__STDC_FORMAT_MACROS -D__STDC_LIMIT_MACROS -Ilib/Support -I/Users/buildslave/jenkins/workspace/lldb-cmake-standalone/llvm-project/llvm/lib/Support -Iinclude -I/Users/buildslave/jenkins/workspace/lldb-cmake-standalone/llvm-project/llvm/include -fPIC -fvisibility-inlines-hidden -Werror=date-time -Werror=unguarded-availability-new -Wall -Wextra -Wno-unused-parameter -Wwrite-strings -Wcast-qual -Wmissing-field-initializers -pedantic -Wno-long-long -Wimplicit-fallthrough -Wcovered-switch-default -Wno-noexcept-type -Wnon-virtual-dtor -Wdelete-non-virtual-dtor -Wsuggest-override -Wstring-conversion -fdiagnostics-color -O3  -isysroot /Applications/Xcode.app/Contents/Developer/Platforms/MacOSX.platform/Developer/SDKs/MacOSX10.15.sdk   -UNDEBUG -std=c++14  -fno-exceptions -fno-rtti -MD -MT lib/Support/CMakeFiles/LLVMSupport.dir/ELFAttributeParser.cpp.o -MF lib/Support/CMakeFiles/LLVMSupport.dir/ELFAttributeParser.cpp.o.d -o lib/Support/CMakeFiles/LLVMSupport.dir/ELFAttributeParser.cpp.o -c /Users/buildslave/jenkins/workspace/lldb-cmake-standalone/llvm-project/llvm/lib/Support/ELFAttributeParser.cpp
[481/3462] /Users/buildslave/jenkins/workspace/lldb-cmake-standalone/host-compiler/bin/clang++  -DBUILD_EXAMPLES -DGTEST_HAS_RTTI=0 -D_DEBUG -D__STDC_CONSTANT_MACROS -D__STDC_FORMAT_MACROS -D__STDC_LIMIT_MACROS -Ilib/Support -I/Users/buildslave/jenkins/workspace/lldb-cmake-standalone/llvm-project/llvm/lib/Support -Iinclude -I/Users/buildslave/jenkins/workspace/lldb-cmake-standalone/llvm-project/llvm/include -fPIC -fvisibility-inlines-hidden -Werror=date-time -Werror=unguarded-availability-new -Wall -Wextra -Wno-unused-parameter -Wwrite-strings -Wcast-qual -Wmissing-field-initializers -pedantic -Wno-long-long -Wimplicit-fallthrough -Wcovered-switch-default -Wno-noexcept-type -Wnon-virtual-dtor -Wdelete-non-virtual-dtor -Wsuggest-override -Wstring-conversion -fdiagnostics-color -O3  -isysroot /Applications/Xcode.app/Contents/Developer/Platforms/MacOSX.platform/Developer/SDKs/MacOSX10.15.sdk   -UNDEBUG -std=c++14  -fno-exceptions -fno-rtti -MD -MT lib/Support/CMakeFiles/LLVMSupport.dir/FileCollector.cpp.o -MF lib/Support/CMakeFiles/LLVMSupport.dir/FileCollector.cpp.o.d -o lib/Support/CMakeFiles/LLVMSupport.dir/FileCollector.cpp.o -c /Users/buildslave/jenkins/workspace/lldb-cmake-standalone/llvm-project/llvm/lib/Support/FileCollector.cpp
[482/3462] /Users/buildslave/jenkins/workspace/lldb-cmake-standalone/host-compiler/bin/clang++  -DBUILD_EXAMPLES -DGTEST_HAS_RTTI=0 -D_DEBUG -D__STDC_CONSTANT_MACROS -D__STDC_FORMAT_MACROS -D__STDC_LIMIT_MACROS -Ilib/Support -I/Users/buildslave/jenkins/workspace/lldb-cmake-standalone/llvm-project/llvm/lib/Support -Iinclude -I/Users/buildslave/jenkins/workspace/lldb-cmake-standalone/llvm-project/llvm/include -fPIC -fvisibility-inlines-hidden -Werror=date-time -Werror=unguarded-availability-new -Wall -Wextra -Wno-unused-parameter -Wwrite-strings -Wcast-qual -Wmissing-field-initializers -pedantic -Wno-long-long -Wimplicit-fallthrough -Wcovered-switch-default -Wno-noexcept-type -Wnon-virtual-dtor -Wdelete-non-virtual-dtor -Wsuggest-override -Wstring-conversion -fdiagnostics-color -O3  -isysroot /Applications/Xcode.app/Contents/Developer/Platforms/MacOSX.platform/Developer/SDKs/MacOSX10.15.sdk   -UNDEBUG -std=c++14  -fno-exceptions -fno-rtti -MD -MT lib/Support/CMakeFiles/LLVMSupport.dir/FileOutputBuffer.cpp.o -MF lib/Support/CMakeFiles/LLVMSupport.dir/FileOutputBuffer.cpp.o.d -o lib/Support/CMakeFiles/LLVMSupport.dir/FileOutputBuffer.cpp.o -c /Users/buildslave/jenkins/workspace/lldb-cmake-standalone/llvm-project/llvm/lib/Support/FileOutputBuffer.cpp
[483/3462] /Users/buildslave/jenkins/workspace/lldb-cmake-standalone/host-compiler/bin/clang++  -DBUILD_EXAMPLES -DGTEST_HAS_RTTI=0 -D_DEBUG -D__STDC_CONSTANT_MACROS -D__STDC_FORMAT_MACROS -D__STDC_LIMIT_MACROS -Ilib/Demangle -I/Users/buildslave/jenkins/workspace/lldb-cmake-standalone/llvm-project/llvm/lib/Demangle -Iinclude -I/Users/buildslave/jenkins/workspace/lldb-cmake-standalone/llvm-project/llvm/include -fPIC -fvisibility-inlines-hidden -Werror=date-time -Werror=unguarded-availability-new -Wall -Wextra -Wno-unused-parameter -Wwrite-strings -Wcast-qual -Wmissing-field-initializers -pedantic -Wno-long-long -Wimplicit-fallthrough -Wcovered-switch-default -Wno-noexcept-type -Wnon-virtual-dtor -Wdelete-non-virtual-dtor -Wsuggest-override -Wstring-conversion -fdiagnostics-color -O3  -isysroot /Applications/Xcode.app/Contents/Developer/Platforms/MacOSX.platform/Developer/SDKs/MacOSX10.15.sdk    -fno-exceptions -fno-rtti -UNDEBUG -std=c++14 -MD -MT lib/Demangle/CMakeFiles/LLVMDemangle.dir/ItaniumDemangle.cpp.o -MF lib/Demangle/CMakeFiles/LLVMDemangle.dir/ItaniumDemangle.cpp.o.d -o lib/Demangle/CMakeFiles/LLVMDemangle.dir/ItaniumDemangle.cpp.o -c /Users/buildslave/jenkins/workspace/lldb-cmake-standalone/llvm-project/llvm/lib/Demangle/ItaniumDemangle.cpp
[484/3462] /Users/buildslave/jenkins/workspace/lldb-cmake-standalone/host-compiler/bin/clang++  -DBUILD_EXAMPLES -DGTEST_HAS_RTTI=0 -D_DEBUG -D_GNU_SOURCE -D__STDC_CONSTANT_MACROS -D__STDC_FORMAT_MACROS -D__STDC_LIMIT_MACROS -Itools/clang/utils/TableGen -I/Users/buildslave/jenkins/workspace/lldb-cmake-standalone/llvm-project/clang/utils/TableGen -I/Users/buildslave/jenkins/workspace/lldb-cmake-standalone/llvm-project/clang/include -Itools/clang/include -Iinclude -I/Users/buildslave/jenkins/workspace/lldb-cmake-standalone/llvm-project/llvm/include -fPIC -fvisibility-inlines-hidden -Werror=date-time -Werror=unguarded-availability-new -Wall -Wextra -Wno-unused-parameter -Wwrite-strings -Wcast-qual -Wmissing-field-initializers -pedantic -Wno-long-long -Wimplicit-fallthrough -Wcovered-switch-default -Wno-noexcept-type -Wnon-virtual-dtor -Wdelete-non-virtual-dtor -Wsuggest-override -Wstring-conversion -fdiagnostics-color -fno-common -Woverloaded-virtual -Wno-nested-anon-types -O3  -isysroot /Applications/Xcode.app/Contents/Developer/Platforms/MacOSX.platform/Developer/SDKs/MacOSX10.15.sdk    -fno-exceptions -fno-rtti -UNDEBUG -std=c++14 -MD -MT tools/clang/utils/TableGen/CMakeFiles/clang-tblgen.dir/NeonEmitter.cpp.o -MF tools/clang/utils/TableGen/CMakeFiles/clang-tblgen.dir/NeonEmitter.cpp.o.d -o tools/clang/utils/TableGen/CMakeFiles/clang-tblgen.dir/NeonEmitter.cpp.o -c /Users/buildslave/jenkins/workspace/lldb-cmake-standalone/llvm-project/clang/utils/TableGen/NeonEmitter.cpp
[485/3462] /Users/buildslave/jenkins/workspace/lldb-cmake-standalone/host-compiler/bin/clang++  -DBUILD_EXAMPLES -DGTEST_HAS_RTTI=0 -D_DEBUG -D_GNU_SOURCE -D__STDC_CONSTANT_MACROS -D__STDC_FORMAT_MACROS -D__STDC_LIMIT_MACROS -Itools/clang/utils/TableGen -I/Users/buildslave/jenkins/workspace/lldb-cmake-standalone/llvm-project/clang/utils/TableGen -I/Users/buildslave/jenkins/workspace/lldb-cmake-standalone/llvm-project/clang/include -Itools/clang/include -Iinclude -I/Users/buildslave/jenkins/workspace/lldb-cmake-standalone/llvm-project/llvm/include -fPIC -fvisibility-inlines-hidden -Werror=date-time -Werror=unguarded-availability-new -Wall -Wextra -Wno-unused-parameter -Wwrite-strings -Wcast-qual -Wmissing-field-initializers -pedantic -Wno-long-long -Wimplicit-fallthrough -Wcovered-switch-default -Wno-noexcept-type -Wnon-virtual-dtor -Wdelete-non-virtual-dtor -Wsuggest-override -Wstring-conversion -fdiagnostics-color -fno-common -Woverloaded-virtual -Wno-nested-anon-types -O3  -isysroot /Applications/Xcode.app/Contents/Developer/Platforms/MacOSX.platform/Developer/SDKs/MacOSX10.15.sdk    -fno-exceptions -fno-rtti -UNDEBUG -std=c++14 -MD -MT tools/clang/utils/TableGen/CMakeFiles/clang-tblgen.dir/MveEmitter.cpp.o -MF tools/clang/utils/TableGen/CMakeFiles/clang-tblgen.dir/MveEmitter.cpp.o.d -o tools/clang/utils/TableGen/CMakeFiles/clang-tblgen.dir/MveEmitter.cpp.o -c /Users/buildslave/jenkins/workspace/lldb-cmake-standalone/llvm-project/clang/utils/TableGen/MveEmitter.cpp
[486/3462] /Users/buildslave/jenkins/workspace/lldb-cmake-standalone/host-compiler/bin/clang++  -DBUILD_EXAMPLES -DGTEST_HAS_RTTI=0 -D_DEBUG -D__STDC_CONSTANT_MACROS -D__STDC_FORMAT_MACROS -D__STDC_LIMIT_MACROS -Ilib/Support -I/Users/buildslave/jenkins/workspace/lldb-cmake-standalone/llvm-project/llvm/lib/Support -Iinclude -I/Users/buildslave/jenkins/workspace/lldb-cmake-standalone/llvm-project/llvm/include -fPIC -fvisibility-inlines-hidden -Werror=date-time -Werror=unguarded-availability-new -Wall -Wextra -Wno-unused-parameter -Wwrite-strings -Wcast-qual -Wmissing-field-initializers -pedantic -Wno-long-long -Wimplicit-fallthrough -Wcovered-switch-default -Wno-noexcept-type -Wnon-virtual-dtor -Wdelete-non-virtual-dtor -Wsuggest-override -Wstring-conversion -fdiagnostics-color -O3  -isysroot /Applications/Xcode.app/Contents/Developer/Platforms/MacOSX.platform/Developer/SDKs/MacOSX10.15.sdk   -UNDEBUG -std=c++14  -fno-exceptions -fno-rtti -MD -MT lib/Support/CMakeFiles/LLVMSupport.dir/CommandLine.cpp.o -MF lib/Support/CMakeFiles/LLVMSupport.dir/CommandLine.cpp.o.d -o lib/Support/CMakeFiles/LLVMSupport.dir/CommandLine.cpp.o -c /Users/buildslave/jenkins/workspace/lldb-cmake-standalone/llvm-project/llvm/lib/Support/CommandLine.cpp
ninja: build stopped: subcommand failed.
Command failed: Command '['/usr/local/bin/ninja', '-v', 'all']' returned non-zero exit status 1.
Command: ['/usr/local/bin/ninja', '-v', 'all']
[Pipeline] }
[Pipeline] // timeout
[Pipeline] }
[Pipeline] // stage
[Pipeline] stage
[Pipeline] { (Ninja Standalone Build (build tree))
Stage "Ninja Standalone Build (build tree)" skipped due to earlier failure(s)
[Pipeline] }
[Pipeline] // stage
[Pipeline] stage
[Pipeline] { (Ninja Standalone Build (install tree))
Stage "Ninja Standalone Build (install tree)" skipped due to earlier failure(s)
[Pipeline] }
[Pipeline] // stage
[Pipeline] stage
[Pipeline] { (Xcode Standalone Build (build tree))
Stage "Xcode Standalone Build (build tree)" skipped due to earlier failure(s)
[Pipeline] }
[Pipeline] // stage
[Pipeline] stage
[Pipeline] { (Xcode Standalone Test (build tree))
Stage "Xcode Standalone Test (build tree)" skipped due to earlier failure(s)
[Pipeline] }
[Pipeline] // stage
[Pipeline] }
[Pipeline] // withEnv
[Pipeline] }
[Pipeline] // node
[Pipeline] End of Pipeline
ERROR: script returned exit code 1
Finished: FAILURE