FailedConsole Output

Skipping 3,133 KB.. Full Log
ir/include-all.c.o tools/llvm-c-test/CMakeFiles/llvm-c-test.dir/main.c.o tools/llvm-c-test/CMakeFiles/llvm-c-test.dir/module.c.o tools/llvm-c-test/CMakeFiles/llvm-c-test.dir/metadata.c.o tools/llvm-c-test/CMakeFiles/llvm-c-test.dir/object.c.o tools/llvm-c-test/CMakeFiles/llvm-c-test.dir/targets.c.o  -o bin/llvm-c-test  -Wl,-rpath,@loader_path/../lib lib/libLLVMAArch64AsmParser.a lib/libLLVMAMDGPUAsmParser.a lib/libLLVMARMAsmParser.a lib/libLLVMBPFAsmParser.a lib/libLLVMHexagonAsmParser.a lib/libLLVMLanaiAsmParser.a lib/libLLVMMipsAsmParser.a lib/libLLVMMSP430AsmParser.a lib/libLLVMPowerPCAsmParser.a lib/libLLVMRISCVAsmParser.a lib/libLLVMSparcAsmParser.a lib/libLLVMSystemZAsmParser.a lib/libLLVMWebAssemblyAsmParser.a lib/libLLVMX86AsmParser.a lib/libLLVMAArch64CodeGen.a lib/libLLVMAMDGPUCodeGen.a lib/libLLVMARMCodeGen.a lib/libLLVMBPFCodeGen.a lib/libLLVMHexagonCodeGen.a lib/libLLVMLanaiCodeGen.a lib/libLLVMMipsCodeGen.a lib/libLLVMMSP430CodeGen.a lib/libLLVMNVPTXCodeGen.a lib/libLLVMPowerPCCodeGen.a lib/libLLVMRISCVCodeGen.a lib/libLLVMSparcCodeGen.a lib/libLLVMSystemZCodeGen.a lib/libLLVMWebAssemblyCodeGen.a lib/libLLVMX86CodeGen.a lib/libLLVMXCoreCodeGen.a lib/libLLVMAArch64Desc.a lib/libLLVMAMDGPUDesc.a lib/libLLVMARMDesc.a lib/libLLVMBPFDesc.a lib/libLLVMHexagonDesc.a lib/libLLVMLanaiDesc.a lib/libLLVMMipsDesc.a lib/libLLVMMSP430Desc.a lib/libLLVMNVPTXDesc.a lib/libLLVMPowerPCDesc.a lib/libLLVMRISCVDesc.a lib/libLLVMSparcDesc.a lib/libLLVMSystemZDesc.a lib/libLLVMWebAssemblyDesc.a lib/libLLVMX86Desc.a lib/libLLVMXCoreDesc.a lib/libLLVMAArch64Disassembler.a lib/libLLVMAMDGPUDisassembler.a lib/libLLVMARMDisassembler.a lib/libLLVMBPFDisassembler.a lib/libLLVMHexagonDisassembler.a lib/libLLVMLanaiDisassembler.a lib/libLLVMMipsDisassembler.a lib/libLLVMMSP430Disassembler.a lib/libLLVMPowerPCDisassembler.a lib/libLLVMRISCVDisassembler.a lib/libLLVMSparcDisassembler.a lib/libLLVMSystemZDisassembler.a lib/libLLVMWebAssemblyDisassembler.a lib/libLLVMX86Disassembler.a lib/libLLVMXCoreDisassembler.a lib/libLLVMAArch64Info.a lib/libLLVMAMDGPUInfo.a lib/libLLVMARMInfo.a lib/libLLVMBPFInfo.a lib/libLLVMHexagonInfo.a lib/libLLVMLanaiInfo.a lib/libLLVMMipsInfo.a lib/libLLVMMSP430Info.a lib/libLLVMNVPTXInfo.a lib/libLLVMPowerPCInfo.a lib/libLLVMRISCVInfo.a lib/libLLVMSparcInfo.a lib/libLLVMSystemZInfo.a lib/libLLVMWebAssemblyInfo.a lib/libLLVMX86Info.a lib/libLLVMXCoreInfo.a lib/libLLVMBitReader.a lib/libLLVMCore.a lib/libLLVMMCDisassembler.a lib/libLLVMObject.a lib/libLLVMSupport.a lib/libLLVMTarget.a lib/libLLVMMIRParser.a lib/libLLVMHexagonAsmParser.a lib/libLLVMLanaiAsmParser.a lib/libLLVMipo.a lib/libLLVMVectorize.a lib/libLLVMIRReader.a lib/libLLVMAsmParser.a lib/libLLVMInstrumentation.a lib/libLLVMLinker.a lib/libLLVMRISCVUtils.a lib/libLLVMGlobalISel.a lib/libLLVMX86Utils.a lib/libLLVMAsmPrinter.a lib/libLLVMDebugInfoDWARF.a lib/libLLVMSelectionDAG.a lib/libLLVMCodeGen.a lib/libLLVMTarget.a lib/libLLVMScalarOpts.a lib/libLLVMAggressiveInstCombine.a lib/libLLVMInstCombine.a lib/libLLVMBitWriter.a lib/libLLVMTransformUtils.a lib/libLLVMAnalysis.a lib/libLLVMObject.a lib/libLLVMBitReader.a lib/libLLVMMCParser.a lib/libLLVMTextAPI.a lib/libLLVMProfileData.a lib/libLLVMAArch64Desc.a lib/libLLVMAArch64Info.a lib/libLLVMAArch64Utils.a lib/libLLVMAMDGPUDesc.a lib/libLLVMAMDGPUInfo.a lib/libLLVMAMDGPUUtils.a lib/libLLVMCore.a lib/libLLVMRemarks.a lib/libLLVMBitstreamReader.a lib/libLLVMARMDesc.a lib/libLLVMARMInfo.a lib/libLLVMARMUtils.a lib/libLLVMHexagonDesc.a lib/libLLVMHexagonInfo.a lib/libLLVMLanaiDesc.a lib/libLLVMLanaiInfo.a lib/libLLVMSystemZDesc.a lib/libLLVMSystemZInfo.a lib/libLLVMWebAssemblyDesc.a lib/libLLVMWebAssemblyInfo.a lib/libLLVMMCDisassembler.a lib/libLLVMMC.a lib/libLLVMBinaryFormat.a lib/libLLVMDebugInfoCodeView.a lib/libLLVMDebugInfoMSF.a lib/libLLVMSupport.a -lz -lcurses -lm lib/libLLVMDemangle.a && :
[1192/1230] : && /Users/buildslave/jenkins/workspace/lldb-cmake/host-compiler/bin/clang++  -Wdocumentation -fPIC -fvisibility-inlines-hidden -Werror=date-time -Werror=unguarded-availability-new -std=c++14 -fmodules -fmodules-cache-path=/Users/buildslave/jenkins/workspace/lldb-cmake/lldb-build/module.cache -fcxx-modules -Wall -Wextra -Wno-unused-parameter -Wwrite-strings -Wcast-qual -Wmissing-field-initializers -pedantic -Wno-long-long -Wimplicit-fallthrough -Wcovered-switch-default -Wno-noexcept-type -Wnon-virtual-dtor -Wdelete-non-virtual-dtor -Wstring-conversion -fdiagnostics-color -O3  -isysroot /Applications/Xcode.app/Contents/Developer/Platforms/MacOSX.platform/Developer/SDKs/MacOSX10.14.sdk -Wl,-search_paths_first -Wl,-headerpad_max_install_names -Wl,-dead_strip -rdynamic tools/llvm-stress/CMakeFiles/llvm-stress.dir/llvm-stress.cpp.o  -o bin/llvm-stress  -Wl,-rpath,@loader_path/../lib lib/libLLVMAnalysis.a lib/libLLVMCore.a lib/libLLVMSupport.a lib/libLLVMObject.a lib/libLLVMBitReader.a lib/libLLVMMCParser.a lib/libLLVMMC.a lib/libLLVMDebugInfoCodeView.a lib/libLLVMDebugInfoMSF.a lib/libLLVMTextAPI.a lib/libLLVMProfileData.a lib/libLLVMCore.a lib/libLLVMBinaryFormat.a lib/libLLVMRemarks.a lib/libLLVMBitstreamReader.a lib/libLLVMSupport.a -lz -lcurses -lm lib/libLLVMDemangle.a && :
[1193/1230] : && /Users/buildslave/jenkins/workspace/lldb-cmake/host-compiler/bin/clang++  -Wdocumentation -fPIC -fvisibility-inlines-hidden -Werror=date-time -Werror=unguarded-availability-new -std=c++14 -fmodules -fmodules-cache-path=/Users/buildslave/jenkins/workspace/lldb-cmake/lldb-build/module.cache -fcxx-modules -Wall -Wextra -Wno-unused-parameter -Wwrite-strings -Wcast-qual -Wmissing-field-initializers -pedantic -Wno-long-long -Wimplicit-fallthrough -Wcovered-switch-default -Wno-noexcept-type -Wnon-virtual-dtor -Wdelete-non-virtual-dtor -Wstring-conversion -fdiagnostics-color -O3  -isysroot /Applications/Xcode.app/Contents/Developer/Platforms/MacOSX.platform/Developer/SDKs/MacOSX10.14.sdk -Wl,-search_paths_first -Wl,-headerpad_max_install_names -rdynamic tools/llvm-reduce/CMakeFiles/llvm-reduce.dir/llvm-reduce.cpp.o tools/llvm-reduce/CMakeFiles/llvm-reduce.dir/TestRunner.cpp.o tools/llvm-reduce/CMakeFiles/llvm-reduce.dir/deltas/Delta.cpp.o tools/llvm-reduce/CMakeFiles/llvm-reduce.dir/deltas/ReduceFunctions.cpp.o tools/llvm-reduce/CMakeFiles/llvm-reduce.dir/deltas/ReduceGlobalVars.cpp.o  -o bin/llvm-reduce  -Wl,-rpath,@loader_path/../lib lib/libLLVMAArch64AsmParser.a lib/libLLVMAMDGPUAsmParser.a lib/libLLVMARMAsmParser.a lib/libLLVMBPFAsmParser.a lib/libLLVMHexagonAsmParser.a lib/libLLVMLanaiAsmParser.a lib/libLLVMMipsAsmParser.a lib/libLLVMMSP430AsmParser.a lib/libLLVMPowerPCAsmParser.a lib/libLLVMRISCVAsmParser.a lib/libLLVMSparcAsmParser.a lib/libLLVMSystemZAsmParser.a lib/libLLVMWebAssemblyAsmParser.a lib/libLLVMX86AsmParser.a lib/libLLVMAArch64CodeGen.a lib/libLLVMAMDGPUCodeGen.a lib/libLLVMARMCodeGen.a lib/libLLVMBPFCodeGen.a lib/libLLVMHexagonCodeGen.a lib/libLLVMLanaiCodeGen.a lib/libLLVMMipsCodeGen.a lib/libLLVMMSP430CodeGen.a lib/libLLVMNVPTXCodeGen.a lib/libLLVMPowerPCCodeGen.a lib/libLLVMRISCVCodeGen.a lib/libLLVMSparcCodeGen.a lib/libLLVMSystemZCodeGen.a lib/libLLVMWebAssemblyCodeGen.a lib/libLLVMX86CodeGen.a lib/libLLVMXCoreCodeGen.a lib/libLLVMAArch64Desc.a lib/libLLVMAMDGPUDesc.a lib/libLLVMARMDesc.a lib/libLLVMBPFDesc.a lib/libLLVMHexagonDesc.a lib/libLLVMLanaiDesc.a lib/libLLVMMipsDesc.a lib/libLLVMMSP430Desc.a lib/libLLVMNVPTXDesc.a lib/libLLVMPowerPCDesc.a lib/libLLVMRISCVDesc.a lib/libLLVMSparcDesc.a lib/libLLVMSystemZDesc.a lib/libLLVMWebAssemblyDesc.a lib/libLLVMX86Desc.a lib/libLLVMXCoreDesc.a lib/libLLVMAArch64Info.a lib/libLLVMAMDGPUInfo.a lib/libLLVMARMInfo.a lib/libLLVMBPFInfo.a lib/libLLVMHexagonInfo.a lib/libLLVMLanaiInfo.a lib/libLLVMMipsInfo.a lib/libLLVMMSP430Info.a lib/libLLVMNVPTXInfo.a lib/libLLVMPowerPCInfo.a lib/libLLVMRISCVInfo.a lib/libLLVMSparcInfo.a lib/libLLVMSystemZInfo.a lib/libLLVMWebAssemblyInfo.a lib/libLLVMX86Info.a lib/libLLVMXCoreInfo.a lib/libLLVMCore.a lib/libLLVMIRReader.a lib/libLLVMSupport.a lib/libLLVMTarget.a lib/libLLVMTransformUtils.a lib/libLLVMAArch64Utils.a lib/libLLVMAMDGPUUtils.a lib/libLLVMMIRParser.a lib/libLLVMARMUtils.a lib/libLLVMHexagonAsmParser.a lib/libLLVMHexagonDesc.a lib/libLLVMHexagonInfo.a lib/libLLVMLanaiAsmParser.a lib/libLLVMLanaiDesc.a lib/libLLVMLanaiInfo.a lib/libLLVMipo.a lib/libLLVMIRReader.a lib/libLLVMAsmParser.a lib/libLLVMVectorize.a lib/libLLVMInstrumentation.a lib/libLLVMLinker.a lib/libLLVMRISCVUtils.a lib/libLLVMMCDisassembler.a lib/libLLVMGlobalISel.a lib/libLLVMX86Utils.a lib/libLLVMAsmPrinter.a lib/libLLVMDebugInfoDWARF.a lib/libLLVMSelectionDAG.a lib/libLLVMCodeGen.a lib/libLLVMTarget.a lib/libLLVMScalarOpts.a lib/libLLVMAggressiveInstCombine.a lib/libLLVMInstCombine.a lib/libLLVMTransformUtils.a lib/libLLVMBitWriter.a lib/libLLVMAnalysis.a lib/libLLVMProfileData.a lib/libLLVMObject.a lib/libLLVMMCParser.a lib/libLLVMMC.a lib/libLLVMDebugInfoCodeView.a lib/libLLVMDebugInfoMSF.a lib/libLLVMBitReader.a lib/libLLVMCore.a lib/libLLVMRemarks.a lib/libLLVMBitstreamReader.a lib/libLLVMTextAPI.a lib/libLLVMBinaryFormat.a lib/libLLVMSupport.a -lz -lcurses -lm lib/libLLVMDemangle.a && :
[1194/1230] /Users/buildslave/jenkins/workspace/lldb-cmake/host-compiler/bin/clang++  -DGTEST_HAS_RTTI=0 -DHAVE_ROUND -DLIBXML2_DEFINED -DLLDB_CONFIGURATION_RELEASE -DLLDB_USE_OS_LOG -D_DEBUG -D__STDC_CONSTANT_MACROS -D__STDC_FORMAT_MACROS -D__STDC_LIMIT_MACROS -Itools/lldb/source/API -I/Users/buildslave/jenkins/workspace/lldb-cmake/llvm-project/lldb/source/API -Itools/lldb/source -I/Users/buildslave/jenkins/workspace/lldb-cmake/llvm-project/lldb/include -Itools/lldb/include -I/Applications/Xcode.app/Contents/Developer/Platforms/MacOSX.platform/Developer/SDKs/MacOSX10.14.sdk/usr/include/libxml2 -Iinclude -I/Users/buildslave/jenkins/workspace/lldb-cmake/llvm-project/llvm/include -I/usr/local/Cellar/python/3.7.0/Frameworks/Python.framework/Versions/3.7/include/python3.7m -I/Users/buildslave/jenkins/workspace/lldb-cmake/llvm-project/llvm/../clang/include -Itools/lldb/../clang/include -I/Users/buildslave/jenkins/workspace/lldb-cmake/llvm-project/lldb/source/. -Wdocumentation -fPIC -fvisibility-inlines-hidden -Werror=date-time -Werror=unguarded-availability-new -std=c++14 -fmodules -fmodules-cache-path=/Users/buildslave/jenkins/workspace/lldb-cmake/lldb-build/module.cache -fcxx-modules -Wall -Wextra -Wno-unused-parameter -Wwrite-strings -Wcast-qual -Wmissing-field-initializers -pedantic -Wno-long-long -Wimplicit-fallthrough -Wcovered-switch-default -Wno-noexcept-type -Wnon-virtual-dtor -Wdelete-non-virtual-dtor -Wstring-conversion -fdiagnostics-color -Wno-deprecated-declarations -Wno-unknown-pragmas -Wno-strict-aliasing -Wno-deprecated-register -Wno-vla-extension -O3  -isysroot /Applications/Xcode.app/Contents/Developer/Platforms/MacOSX.platform/Developer/SDKs/MacOSX10.14.sdk -fPIC   -UNDEBUG  -fno-exceptions -fno-rtti -MD -MT tools/lldb/source/API/CMakeFiles/liblldb.dir/SBVariablesOptions.cpp.o -MF tools/lldb/source/API/CMakeFiles/liblldb.dir/SBVariablesOptions.cpp.o.d -o tools/lldb/source/API/CMakeFiles/liblldb.dir/SBVariablesOptions.cpp.o -c /Users/buildslave/jenkins/workspace/lldb-cmake/llvm-project/lldb/source/API/SBVariablesOptions.cpp
[1195/1230] : && /Users/buildslave/jenkins/workspace/lldb-cmake/host-compiler/bin/clang++  -Wdocumentation -fPIC -fvisibility-inlines-hidden -Werror=date-time -Werror=unguarded-availability-new -std=c++14 -fmodules -fmodules-cache-path=/Users/buildslave/jenkins/workspace/lldb-cmake/lldb-build/module.cache -fcxx-modules -Wall -Wextra -Wno-unused-parameter -Wwrite-strings -Wcast-qual -Wmissing-field-initializers -pedantic -Wno-long-long -Wimplicit-fallthrough -Wcovered-switch-default -Wno-noexcept-type -Wnon-virtual-dtor -Wdelete-non-virtual-dtor -Wstring-conversion -fdiagnostics-color -O3  -isysroot /Applications/Xcode.app/Contents/Developer/Platforms/MacOSX.platform/Developer/SDKs/MacOSX10.14.sdk -Wl,-search_paths_first -Wl,-headerpad_max_install_names -Wl,-dead_strip tools/llvm-split/CMakeFiles/llvm-split.dir/llvm-split.cpp.o  -o bin/llvm-split  -Wl,-rpath,@loader_path/../lib lib/libLLVMTransformUtils.a lib/libLLVMBitWriter.a lib/libLLVMCore.a lib/libLLVMIRReader.a lib/libLLVMSupport.a lib/libLLVMAnalysis.a lib/libLLVMProfileData.a lib/libLLVMObject.a lib/libLLVMMCParser.a lib/libLLVMMC.a lib/libLLVMDebugInfoCodeView.a lib/libLLVMDebugInfoMSF.a lib/libLLVMTextAPI.a lib/libLLVMAsmParser.a lib/libLLVMBitReader.a lib/libLLVMCore.a lib/libLLVMBinaryFormat.a lib/libLLVMRemarks.a lib/libLLVMBitstreamReader.a lib/libLLVMSupport.a -lz -lcurses -lm lib/libLLVMDemangle.a && :
[1196/1230] : && /Users/buildslave/jenkins/workspace/lldb-cmake/host-compiler/bin/clang++  -Wdocumentation -fPIC -fvisibility-inlines-hidden -Werror=date-time -Werror=unguarded-availability-new -std=c++14 -fmodules -fmodules-cache-path=/Users/buildslave/jenkins/workspace/lldb-cmake/lldb-build/module.cache -fcxx-modules -Wall -Wextra -Wno-unused-parameter -Wwrite-strings -Wcast-qual -Wmissing-field-initializers -pedantic -Wno-long-long -Wimplicit-fallthrough -Wcovered-switch-default -Wno-noexcept-type -Wnon-virtual-dtor -Wdelete-non-virtual-dtor -Wstring-conversion -fdiagnostics-color -O3  -isysroot /Applications/Xcode.app/Contents/Developer/Platforms/MacOSX.platform/Developer/SDKs/MacOSX10.14.sdk -Wl,-search_paths_first -Wl,-headerpad_max_install_names -Wl,-dead_strip tools/llvm-readobj/CMakeFiles/llvm-readobj.dir/ARMWinEHPrinter.cpp.o tools/llvm-readobj/CMakeFiles/llvm-readobj.dir/COFFDumper.cpp.o tools/llvm-readobj/CMakeFiles/llvm-readobj.dir/COFFImportDumper.cpp.o tools/llvm-readobj/CMakeFiles/llvm-readobj.dir/ELFDumper.cpp.o tools/llvm-readobj/CMakeFiles/llvm-readobj.dir/Error.cpp.o tools/llvm-readobj/CMakeFiles/llvm-readobj.dir/llvm-readobj.cpp.o tools/llvm-readobj/CMakeFiles/llvm-readobj.dir/MachODumper.cpp.o tools/llvm-readobj/CMakeFiles/llvm-readobj.dir/ObjDumper.cpp.o tools/llvm-readobj/CMakeFiles/llvm-readobj.dir/WasmDumper.cpp.o tools/llvm-readobj/CMakeFiles/llvm-readobj.dir/Win64EHDumper.cpp.o tools/llvm-readobj/CMakeFiles/llvm-readobj.dir/WindowsResourceDumper.cpp.o tools/llvm-readobj/CMakeFiles/llvm-readobj.dir/XCOFFDumper.cpp.o  -o bin/llvm-readobj  -Wl,-rpath,@loader_path/../lib lib/libLLVMDebugInfoCodeView.a lib/libLLVMDebugInfoDWARF.a lib/libLLVMDemangle.a lib/libLLVMObject.a lib/libLLVMBinaryFormat.a lib/libLLVMSupport.a lib/libLLVMDebugInfoCodeView.a lib/libLLVMDebugInfoMSF.a lib/libLLVMDebugInfoPDB.a lib/libLLVMObject.a lib/libLLVMBitReader.a lib/libLLVMCore.a lib/libLLVMRemarks.a lib/libLLVMBitstreamReader.a lib/libLLVMMCParser.a lib/libLLVMMC.a lib/libLLVMDebugInfoCodeView.a lib/libLLVMTextAPI.a lib/libLLVMBinaryFormat.a lib/libLLVMDebugInfoMSF.a lib/libLLVMSupport.a lib/libLLVMDemangle.a -lz -lcurses -lm && :
[1197/1230] : && /Users/buildslave/jenkins/workspace/lldb-cmake/host-compiler/bin/clang++  -Wdocumentation -fPIC -fvisibility-inlines-hidden -Werror=date-time -Werror=unguarded-availability-new -std=c++14 -fmodules -fmodules-cache-path=/Users/buildslave/jenkins/workspace/lldb-cmake/lldb-build/module.cache -fcxx-modules -Wall -Wextra -Wno-unused-parameter -Wwrite-strings -Wcast-qual -Wmissing-field-initializers -pedantic -Wno-long-long -Wimplicit-fallthrough -Wcovered-switch-default -Wno-noexcept-type -Wnon-virtual-dtor -Wdelete-non-virtual-dtor -Wstring-conversion -fdiagnostics-color -O3  -isysroot /Applications/Xcode.app/Contents/Developer/Platforms/MacOSX.platform/Developer/SDKs/MacOSX10.14.sdk -Wl,-search_paths_first -Wl,-headerpad_max_install_names -Wl,-dead_strip tools/llvm-pdbutil/CMakeFiles/llvm-pdbutil.dir/BytesOutputStyle.cpp.o tools/llvm-pdbutil/CMakeFiles/llvm-pdbutil.dir/DumpOutputStyle.cpp.o tools/llvm-pdbutil/CMakeFiles/llvm-pdbutil.dir/ExplainOutputStyle.cpp.o tools/llvm-pdbutil/CMakeFiles/llvm-pdbutil.dir/InputFile.cpp.o tools/llvm-pdbutil/CMakeFiles/llvm-pdbutil.dir/llvm-pdbutil.cpp.o tools/llvm-pdbutil/CMakeFiles/llvm-pdbutil.dir/FormatUtil.cpp.o tools/llvm-pdbutil/CMakeFiles/llvm-pdbutil.dir/LinePrinter.cpp.o tools/llvm-pdbutil/CMakeFiles/llvm-pdbutil.dir/MinimalSymbolDumper.cpp.o tools/llvm-pdbutil/CMakeFiles/llvm-pdbutil.dir/MinimalTypeDumper.cpp.o tools/llvm-pdbutil/CMakeFiles/llvm-pdbutil.dir/PdbYaml.cpp.o tools/llvm-pdbutil/CMakeFiles/llvm-pdbutil.dir/PrettyBuiltinDumper.cpp.o tools/llvm-pdbutil/CMakeFiles/llvm-pdbutil.dir/PrettyClassDefinitionDumper.cpp.o tools/llvm-pdbutil/CMakeFiles/llvm-pdbutil.dir/PrettyClassLayoutGraphicalDumper.cpp.o tools/llvm-pdbutil/CMakeFiles/llvm-pdbutil.dir/PrettyCompilandDumper.cpp.o tools/llvm-pdbutil/CMakeFiles/llvm-pdbutil.dir/PrettyEnumDumper.cpp.o tools/llvm-pdbutil/CMakeFiles/llvm-pdbutil.dir/PrettyExternalSymbolDumper.cpp.o tools/llvm-pdbutil/CMakeFiles/llvm-pdbutil.dir/PrettyFunctionDumper.cpp.o tools/llvm-pdbutil/CMakeFiles/llvm-pdbutil.dir/PrettyTypeDumper.cpp.o tools/llvm-pdbutil/CMakeFiles/llvm-pdbutil.dir/PrettyTypedefDumper.cpp.o tools/llvm-pdbutil/CMakeFiles/llvm-pdbutil.dir/PrettyVariableDumper.cpp.o tools/llvm-pdbutil/CMakeFiles/llvm-pdbutil.dir/StreamUtil.cpp.o tools/llvm-pdbutil/CMakeFiles/llvm-pdbutil.dir/TypeReferenceTracker.cpp.o tools/llvm-pdbutil/CMakeFiles/llvm-pdbutil.dir/YAMLOutputStyle.cpp.o  -o bin/llvm-pdbutil  -Wl,-rpath,@loader_path/../lib lib/libLLVMBinaryFormat.a lib/libLLVMDebugInfoCodeView.a lib/libLLVMDebugInfoMSF.a lib/libLLVMDebugInfoPDB.a lib/libLLVMObject.a lib/libLLVMObjectYAML.a lib/libLLVMSupport.a lib/libLLVMObject.a lib/libLLVMBitReader.a lib/libLLVMCore.a lib/libLLVMRemarks.a lib/libLLVMBitstreamReader.a lib/libLLVMMCParser.a lib/libLLVMTextAPI.a lib/libLLVMMC.a lib/libLLVMBinaryFormat.a lib/libLLVMDebugInfoCodeView.a lib/libLLVMDebugInfoMSF.a lib/libLLVMSupport.a -lz -lcurses -lm lib/libLLVMDemangle.a && :
[1198/1230] cd /Users/buildslave/jenkins/workspace/lldb-cmake/lldb-build/tools/llvm-readobj && /usr/local/Cellar/cmake/3.12.3/bin/cmake -E create_symlink llvm-readobj /Users/buildslave/jenkins/workspace/lldb-cmake/lldb-build/./bin/llvm-readelf
[1199/1230] : && /Users/buildslave/jenkins/workspace/lldb-cmake/host-compiler/bin/clang++  -Wdocumentation -fPIC -fvisibility-inlines-hidden -Werror=date-time -Werror=unguarded-availability-new -std=c++14 -fmodules -fmodules-cache-path=/Users/buildslave/jenkins/workspace/lldb-cmake/lldb-build/module.cache -fcxx-modules -Wall -Wextra -Wno-unused-parameter -Wwrite-strings -Wcast-qual -Wmissing-field-initializers -pedantic -Wno-long-long -Wimplicit-fallthrough -Wcovered-switch-default -Wno-noexcept-type -Wnon-virtual-dtor -Wdelete-non-virtual-dtor -Wstring-conversion -fdiagnostics-color -O3  -isysroot /Applications/Xcode.app/Contents/Developer/Platforms/MacOSX.platform/Developer/SDKs/MacOSX10.14.sdk -Wl,-search_paths_first -Wl,-headerpad_max_install_names -Wl,-dead_strip tools/llvm-objdump/CMakeFiles/llvm-objdump.dir/llvm-objdump.cpp.o tools/llvm-objdump/CMakeFiles/llvm-objdump.dir/COFFDump.cpp.o tools/llvm-objdump/CMakeFiles/llvm-objdump.dir/ELFDump.cpp.o tools/llvm-objdump/CMakeFiles/llvm-objdump.dir/MachODump.cpp.o tools/llvm-objdump/CMakeFiles/llvm-objdump.dir/WasmDump.cpp.o  -o bin/llvm-objdump  -Wl,-rpath,@loader_path/../lib lib/libLLVMAArch64Desc.a lib/libLLVMAMDGPUDesc.a lib/libLLVMARMDesc.a lib/libLLVMBPFDesc.a lib/libLLVMHexagonDesc.a lib/libLLVMLanaiDesc.a lib/libLLVMMipsDesc.a lib/libLLVMMSP430Desc.a lib/libLLVMNVPTXDesc.a lib/libLLVMPowerPCDesc.a lib/libLLVMRISCVDesc.a lib/libLLVMSparcDesc.a lib/libLLVMSystemZDesc.a lib/libLLVMWebAssemblyDesc.a lib/libLLVMX86Desc.a lib/libLLVMXCoreDesc.a lib/libLLVMAArch64Disassembler.a lib/libLLVMAMDGPUDisassembler.a lib/libLLVMARMDisassembler.a lib/libLLVMBPFDisassembler.a lib/libLLVMHexagonDisassembler.a lib/libLLVMLanaiDisassembler.a lib/libLLVMMipsDisassembler.a lib/libLLVMMSP430Disassembler.a lib/libLLVMPowerPCDisassembler.a lib/libLLVMRISCVDisassembler.a lib/libLLVMSparcDisassembler.a lib/libLLVMSystemZDisassembler.a lib/libLLVMWebAssemblyDisassembler.a lib/libLLVMX86Disassembler.a lib/libLLVMXCoreDisassembler.a lib/libLLVMAArch64Info.a lib/libLLVMAMDGPUInfo.a lib/libLLVMARMInfo.a lib/libLLVMBPFInfo.a lib/libLLVMHexagonInfo.a lib/libLLVMLanaiInfo.a lib/libLLVMMipsInfo.a lib/libLLVMMSP430Info.a lib/libLLVMNVPTXInfo.a lib/libLLVMPowerPCInfo.a lib/libLLVMRISCVInfo.a lib/libLLVMSparcInfo.a lib/libLLVMSystemZInfo.a lib/libLLVMWebAssemblyInfo.a lib/libLLVMX86Info.a lib/libLLVMXCoreInfo.a lib/libLLVMBinaryFormat.a lib/libLLVMCodeGen.a lib/libLLVMDebugInfoDWARF.a lib/libLLVMDebugInfoPDB.a lib/libLLVMDemangle.a lib/libLLVMMC.a lib/libLLVMMCDisassembler.a lib/libLLVMObject.a lib/libLLVMSupport.a lib/libLLVMSymbolize.a -lxar lib/libLLVMRISCVUtils.a lib/libLLVMX86Utils.a lib/libLLVMAArch64Desc.a lib/libLLVMAArch64Info.a lib/libLLVMAArch64Utils.a lib/libLLVMAMDGPUDesc.a lib/libLLVMAMDGPUInfo.a lib/libLLVMAMDGPUUtils.a lib/libLLVMARMDesc.a lib/libLLVMARMInfo.a lib/libLLVMARMUtils.a lib/libLLVMHexagonDesc.a lib/libLLVMHexagonInfo.a lib/libLLVMLanaiDesc.a lib/libLLVMLanaiInfo.a lib/libLLVMSystemZDesc.a lib/libLLVMSystemZInfo.a lib/libLLVMWebAssemblyDesc.a lib/libLLVMWebAssemblyInfo.a lib/libLLVMMCDisassembler.a lib/libLLVMBitWriter.a lib/libLLVMScalarOpts.a lib/libLLVMAggressiveInstCombine.a lib/libLLVMInstCombine.a lib/libLLVMTarget.a lib/libLLVMTransformUtils.a lib/libLLVMAnalysis.a lib/libLLVMProfileData.a lib/libLLVMDebugInfoDWARF.a lib/libLLVMDebugInfoPDB.a lib/libLLVMObject.a lib/libLLVMBitReader.a lib/libLLVMCore.a lib/libLLVMRemarks.a lib/libLLVMBitstreamReader.a lib/libLLVMMCParser.a lib/libLLVMMC.a lib/libLLVMDebugInfoCodeView.a lib/libLLVMDebugInfoMSF.a lib/libLLVMTextAPI.a lib/libLLVMBinaryFormat.a lib/libLLVMSupport.a lib/libLLVMDemangle.a -lz -lcurses -lm && :
[1200/1230] : && /Users/buildslave/jenkins/workspace/lldb-cmake/host-compiler/bin/clang++  -Wdocumentation -fPIC -fvisibility-inlines-hidden -Werror=date-time -Werror=unguarded-availability-new -std=c++14 -fmodules -fmodules-cache-path=/Users/buildslave/jenkins/workspace/lldb-cmake/lldb-build/module.cache -fcxx-modules -Wall -Wextra -Wno-unused-parameter -Wwrite-strings -Wcast-qual -Wmissing-field-initializers -pedantic -Wno-long-long -Wimplicit-fallthrough -Wcovered-switch-default -Wno-noexcept-type -Wnon-virtual-dtor -Wdelete-non-virtual-dtor -Wstring-conversion -fdiagnostics-color -O3  -isysroot /Applications/Xcode.app/Contents/Developer/Platforms/MacOSX.platform/Developer/SDKs/MacOSX10.14.sdk -Wl,-search_paths_first -Wl,-headerpad_max_install_names -Wl,-dead_strip tools/llvm-symbolizer/CMakeFiles/llvm-symbolizer.dir/llvm-symbolizer.cpp.o  -o bin/llvm-symbolizer  -Wl,-rpath,@loader_path/../lib lib/libLLVMDebugInfoDWARF.a lib/libLLVMDebugInfoPDB.a lib/libLLVMDemangle.a lib/libLLVMObject.a lib/libLLVMSupport.a lib/libLLVMSymbolize.a lib/libLLVMDebugInfoDWARF.a lib/libLLVMDebugInfoPDB.a lib/libLLVMObject.a lib/libLLVMBitReader.a lib/libLLVMCore.a lib/libLLVMRemarks.a lib/libLLVMBitstreamReader.a lib/libLLVMMCParser.a lib/libLLVMMC.a lib/libLLVMDebugInfoCodeView.a lib/libLLVMDebugInfoMSF.a lib/libLLVMTextAPI.a lib/libLLVMBinaryFormat.a lib/libLLVMSupport.a lib/libLLVMDemangle.a -lz -lcurses -lm && :
[1201/1230] : && /Users/buildslave/jenkins/workspace/lldb-cmake/host-compiler/bin/clang++  -Wdocumentation -fPIC -fvisibility-inlines-hidden -Werror=date-time -Werror=unguarded-availability-new -std=c++14 -fmodules -fmodules-cache-path=/Users/buildslave/jenkins/workspace/lldb-cmake/lldb-build/module.cache -fcxx-modules -Wall -Wextra -Wno-unused-parameter -Wwrite-strings -Wcast-qual -Wmissing-field-initializers -pedantic -Wno-long-long -Wimplicit-fallthrough -Wcovered-switch-default -Wno-noexcept-type -Wnon-virtual-dtor -Wdelete-non-virtual-dtor -Wstring-conversion -fdiagnostics-color -O3  -isysroot /Applications/Xcode.app/Contents/Developer/Platforms/MacOSX.platform/Developer/SDKs/MacOSX10.14.sdk -Wl,-search_paths_first -Wl,-headerpad_max_install_names -Wl,-dead_strip tools/llvm-rtdyld/CMakeFiles/llvm-rtdyld.dir/llvm-rtdyld.cpp.o  -o bin/llvm-rtdyld  -Wl,-rpath,@loader_path/../lib lib/libLLVMAArch64Disassembler.a lib/libLLVMAMDGPUDisassembler.a lib/libLLVMARMDisassembler.a lib/libLLVMBPFDisassembler.a lib/libLLVMHexagonDisassembler.a lib/libLLVMLanaiDisassembler.a lib/libLLVMMipsDisassembler.a lib/libLLVMMSP430Disassembler.a lib/libLLVMPowerPCDisassembler.a lib/libLLVMRISCVDisassembler.a lib/libLLVMSparcDisassembler.a lib/libLLVMSystemZDisassembler.a lib/libLLVMWebAssemblyDisassembler.a lib/libLLVMX86Disassembler.a lib/libLLVMXCoreDisassembler.a lib/libLLVMAArch64Desc.a lib/libLLVMAMDGPUDesc.a lib/libLLVMARMDesc.a lib/libLLVMBPFDesc.a lib/libLLVMHexagonDesc.a lib/libLLVMLanaiDesc.a lib/libLLVMMipsDesc.a lib/libLLVMMSP430Desc.a lib/libLLVMNVPTXDesc.a lib/libLLVMPowerPCDesc.a lib/libLLVMRISCVDesc.a lib/libLLVMSparcDesc.a lib/libLLVMSystemZDesc.a lib/libLLVMWebAssemblyDesc.a lib/libLLVMX86Desc.a lib/libLLVMXCoreDesc.a lib/libLLVMAArch64Info.a lib/libLLVMAMDGPUInfo.a lib/libLLVMARMInfo.a lib/libLLVMBPFInfo.a lib/libLLVMHexagonInfo.a lib/libLLVMLanaiInfo.a lib/libLLVMMipsInfo.a lib/libLLVMMSP430Info.a lib/libLLVMNVPTXInfo.a lib/libLLVMPowerPCInfo.a lib/libLLVMRISCVInfo.a lib/libLLVMSparcInfo.a lib/libLLVMSystemZInfo.a lib/libLLVMWebAssemblyInfo.a lib/libLLVMX86Info.a lib/libLLVMXCoreInfo.a lib/libLLVMDebugInfoDWARF.a lib/libLLVMExecutionEngine.a lib/libLLVMMC.a lib/libLLVMObject.a lib/libLLVMRuntimeDyld.a lib/libLLVMSupport.a lib/libLLVMAArch64Utils.a lib/libLLVMAMDGPUUtils.a lib/libLLVMARMUtils.a lib/libLLVMRISCVUtils.a lib/libLLVMMCDisassembler.a lib/libLLVMX86Utils.a lib/libLLVMTarget.a lib/libLLVMAnalysis.a lib/libLLVMObject.a lib/libLLVMBitReader.a lib/libLLVMMCParser.a lib/libLLVMMC.a lib/libLLVMDebugInfoCodeView.a lib/libLLVMDebugInfoMSF.a lib/libLLVMTextAPI.a lib/libLLVMProfileData.a lib/libLLVMCore.a lib/libLLVMBinaryFormat.a lib/libLLVMRemarks.a lib/libLLVMBitstreamReader.a lib/libLLVMSupport.a -lz -lcurses -lm lib/libLLVMDemangle.a && :
[1202/1230] cd /Users/buildslave/jenkins/workspace/lldb-cmake/lldb-build/tools/llvm-symbolizer && /usr/local/Cellar/cmake/3.12.3/bin/cmake -E create_symlink llvm-symbolizer /Users/buildslave/jenkins/workspace/lldb-cmake/lldb-build/./bin/llvm-addr2line
[1203/1230] : && /Users/buildslave/jenkins/workspace/lldb-cmake/host-compiler/bin/clang++  -Wdocumentation -fPIC -fvisibility-inlines-hidden -Werror=date-time -Werror=unguarded-availability-new -std=c++14 -fmodules -fmodules-cache-path=/Users/buildslave/jenkins/workspace/lldb-cmake/lldb-build/module.cache -fcxx-modules -Wall -Wextra -Wno-unused-parameter -Wwrite-strings -Wcast-qual -Wmissing-field-initializers -pedantic -Wno-long-long -Wimplicit-fallthrough -Wcovered-switch-default -Wno-noexcept-type -Wnon-virtual-dtor -Wdelete-non-virtual-dtor -Wstring-conversion -fdiagnostics-color -O3  -isysroot /Applications/Xcode.app/Contents/Developer/Platforms/MacOSX.platform/Developer/SDKs/MacOSX10.14.sdk -Wl,-search_paths_first -Wl,-headerpad_max_install_names -Wl,-dead_strip tools/llvm-yaml-numeric-parser-fuzzer/CMakeFiles/llvm-yaml-numeric-parser-fuzzer.dir/DummyYAMLNumericParserFuzzer.cpp.o tools/llvm-yaml-numeric-parser-fuzzer/CMakeFiles/llvm-yaml-numeric-parser-fuzzer.dir/yaml-numeric-parser-fuzzer.cpp.o  -o bin/llvm-yaml-numeric-parser-fuzzer  -Wl,-rpath,@loader_path/../lib lib/libLLVMSupport.a lib/libLLVMFuzzMutate.a lib/libLLVMBitWriter.a lib/libLLVMScalarOpts.a lib/libLLVMAggressiveInstCombine.a lib/libLLVMInstCombine.a lib/libLLVMTransformUtils.a lib/libLLVMTarget.a lib/libLLVMAnalysis.a lib/libLLVMObject.a lib/libLLVMBitReader.a lib/libLLVMMCParser.a lib/libLLVMTextAPI.a lib/libLLVMProfileData.a lib/libLLVMCore.a lib/libLLVMRemarks.a lib/libLLVMBitstreamReader.a lib/libLLVMMC.a lib/libLLVMBinaryFormat.a lib/libLLVMDebugInfoCodeView.a lib/libLLVMDebugInfoMSF.a lib/libLLVMSupport.a -lz -lcurses -lm lib/libLLVMDemangle.a && :
[1204/1230] : && /Users/buildslave/jenkins/workspace/lldb-cmake/host-compiler/bin/clang++  -Wdocumentation -fPIC -fvisibility-inlines-hidden -Werror=date-time -Werror=unguarded-availability-new -std=c++14 -fmodules -fmodules-cache-path=/Users/buildslave/jenkins/workspace/lldb-cmake/lldb-build/module.cache -fcxx-modules -Wall -Wextra -Wno-unused-parameter -Wwrite-strings -Wcast-qual -Wmissing-field-initializers -pedantic -Wno-long-long -Wimplicit-fallthrough -Wcovered-switch-default -Wno-noexcept-type -Wnon-virtual-dtor -Wdelete-non-virtual-dtor -Wstring-conversion -fdiagnostics-color -O3  -isysroot /Applications/Xcode.app/Contents/Developer/Platforms/MacOSX.platform/Developer/SDKs/MacOSX10.14.sdk -Wl,-search_paths_first -Wl,-headerpad_max_install_names -Wl,-dead_strip tools/yaml2obj/CMakeFiles/yaml2obj.dir/yaml2obj.cpp.o  -o bin/yaml2obj  -Wl,-rpath,@loader_path/../lib lib/libLLVMObjectYAML.a lib/libLLVMSupport.a lib/libLLVMObject.a lib/libLLVMBitReader.a lib/libLLVMCore.a lib/libLLVMRemarks.a lib/libLLVMBitstreamReader.a lib/libLLVMMCParser.a lib/libLLVMMC.a lib/libLLVMDebugInfoCodeView.a lib/libLLVMDebugInfoMSF.a lib/libLLVMTextAPI.a lib/libLLVMBinaryFormat.a lib/libLLVMSupport.a -lz -lcurses -lm lib/libLLVMDemangle.a && :
[1205/1230] : && /Users/buildslave/jenkins/workspace/lldb-cmake/host-compiler/bin/clang++  -Wdocumentation -fPIC -fvisibility-inlines-hidden -Werror=date-time -Werror=unguarded-availability-new -std=c++14 -fmodules -fmodules-cache-path=/Users/buildslave/jenkins/workspace/lldb-cmake/lldb-build/module.cache -fcxx-modules -Wall -Wextra -Wno-unused-parameter -Wwrite-strings -Wcast-qual -Wmissing-field-initializers -pedantic -Wno-long-long -Wimplicit-fallthrough -Wcovered-switch-default -Wno-noexcept-type -Wnon-virtual-dtor -Wdelete-non-virtual-dtor -Wstring-conversion -fdiagnostics-color -O3  -isysroot /Applications/Xcode.app/Contents/Developer/Platforms/MacOSX.platform/Developer/SDKs/MacOSX10.14.sdk -Wl,-search_paths_first -Wl,-headerpad_max_install_names -Wl,-dead_strip tools/verify-uselistorder/CMakeFiles/verify-uselistorder.dir/verify-uselistorder.cpp.o  -o bin/verify-uselistorder  -Wl,-rpath,@loader_path/../lib lib/libLLVMAsmParser.a lib/libLLVMBitReader.a lib/libLLVMBitWriter.a lib/libLLVMCore.a lib/libLLVMIRReader.a lib/libLLVMSupport.a lib/libLLVMAnalysis.a lib/libLLVMProfileData.a lib/libLLVMObject.a lib/libLLVMMCParser.a lib/libLLVMMC.a lib/libLLVMDebugInfoCodeView.a lib/libLLVMDebugInfoMSF.a lib/libLLVMTextAPI.a lib/libLLVMAsmParser.a lib/libLLVMBitReader.a lib/libLLVMCore.a lib/libLLVMBinaryFormat.a lib/libLLVMRemarks.a lib/libLLVMBitstreamReader.a lib/libLLVMSupport.a -lz -lcurses -lm lib/libLLVMDemangle.a && :
[1206/1230] : && /Users/buildslave/jenkins/workspace/lldb-cmake/host-compiler/bin/clang++  -Wdocumentation -fPIC -fvisibility-inlines-hidden -Werror=date-time -Werror=unguarded-availability-new -std=c++14 -fmodules -fmodules-cache-path=/Users/buildslave/jenkins/workspace/lldb-cmake/lldb-build/module.cache -fcxx-modules -Wall -Wextra -Wno-unused-parameter -Wwrite-strings -Wcast-qual -Wmissing-field-initializers -pedantic -Wno-long-long -Wimplicit-fallthrough -Wcovered-switch-default -Wno-noexcept-type -Wnon-virtual-dtor -Wdelete-non-virtual-dtor -Wstring-conversion -fdiagnostics-color -O3  -isysroot /Applications/Xcode.app/Contents/Developer/Platforms/MacOSX.platform/Developer/SDKs/MacOSX10.14.sdk -Wl,-search_paths_first -Wl,-headerpad_max_install_names -Wl,-dead_strip tools/sanstats/CMakeFiles/sanstats.dir/sanstats.cpp.o  -o bin/sanstats  -Wl,-rpath,@loader_path/../lib lib/libLLVMSupport.a lib/libLLVMSymbolize.a lib/libLLVMDebugInfoDWARF.a lib/libLLVMDebugInfoPDB.a lib/libLLVMObject.a lib/libLLVMBitReader.a lib/libLLVMCore.a lib/libLLVMRemarks.a lib/libLLVMBitstreamReader.a lib/libLLVMMCParser.a lib/libLLVMMC.a lib/libLLVMDebugInfoCodeView.a lib/libLLVMDebugInfoMSF.a lib/libLLVMTextAPI.a lib/libLLVMBinaryFormat.a lib/libLLVMSupport.a -lz -lcurses -lm lib/libLLVMDemangle.a && :
[1207/1230] : && /Users/buildslave/jenkins/workspace/lldb-cmake/host-compiler/bin/clang++  -Wdocumentation -fPIC -fvisibility-inlines-hidden -Werror=date-time -Werror=unguarded-availability-new -std=c++14 -fmodules -fmodules-cache-path=/Users/buildslave/jenkins/workspace/lldb-cmake/lldb-build/module.cache -fcxx-modules -Wall -Wextra -Wno-unused-parameter -Wwrite-strings -Wcast-qual -Wmissing-field-initializers -pedantic -Wno-long-long -Wimplicit-fallthrough -Wcovered-switch-default -Wno-noexcept-type -Wnon-virtual-dtor -Wdelete-non-virtual-dtor -Wstring-conversion -fdiagnostics-color -O3  -isysroot /Applications/Xcode.app/Contents/Developer/Platforms/MacOSX.platform/Developer/SDKs/MacOSX10.14.sdk -Wl,-search_paths_first -Wl,-headerpad_max_install_names -Wl,-dead_strip tools/llvm-xray/CMakeFiles/llvm-xray.dir/func-id-helper.cpp.o tools/llvm-xray/CMakeFiles/llvm-xray.dir/llvm-xray.cpp.o tools/llvm-xray/CMakeFiles/llvm-xray.dir/xray-account.cpp.o tools/llvm-xray/CMakeFiles/llvm-xray.dir/xray-color-helper.cpp.o tools/llvm-xray/CMakeFiles/llvm-xray.dir/xray-converter.cpp.o tools/llvm-xray/CMakeFiles/llvm-xray.dir/xray-extract.cpp.o tools/llvm-xray/CMakeFiles/llvm-xray.dir/xray-fdr-dump.cpp.o tools/llvm-xray/CMakeFiles/llvm-xray.dir/xray-graph-diff.cpp.o tools/llvm-xray/CMakeFiles/llvm-xray.dir/xray-graph.cpp.o tools/llvm-xray/CMakeFiles/llvm-xray.dir/xray-registry.cpp.o tools/llvm-xray/CMakeFiles/llvm-xray.dir/xray-stacks.cpp.o  -o bin/llvm-xray  -Wl,-rpath,@loader_path/../lib lib/libLLVMDebugInfoDWARF.a lib/libLLVMObject.a lib/libLLVMSupport.a lib/libLLVMSymbolize.a lib/libLLVMXRay.a lib/libLLVMDebugInfoDWARF.a lib/libLLVMDebugInfoPDB.a lib/libLLVMObject.a lib/libLLVMBitReader.a lib/libLLVMCore.a lib/libLLVMRemarks.a lib/libLLVMBitstreamReader.a lib/libLLVMMCParser.a lib/libLLVMMC.a lib/libLLVMDebugInfoCodeView.a lib/libLLVMDebugInfoMSF.a lib/libLLVMTextAPI.a lib/libLLVMBinaryFormat.a lib/libLLVMSupport.a -lz -lcurses -lm lib/libLLVMDemangle.a && :
[1208/1230] : && /Users/buildslave/jenkins/workspace/lldb-cmake/host-compiler/bin/clang++  -Wdocumentation -fPIC -fvisibility-inlines-hidden -Werror=date-time -Werror=unguarded-availability-new -std=c++14 -fmodules -fmodules-cache-path=/Users/buildslave/jenkins/workspace/lldb-cmake/lldb-build/module.cache -fcxx-modules -Wall -Wextra -Wno-unused-parameter -Wwrite-strings -Wcast-qual -Wmissing-field-initializers -pedantic -Wno-long-long -Wimplicit-fallthrough -Wcovered-switch-default -Wno-noexcept-type -Wnon-virtual-dtor -Wdelete-non-virtual-dtor -Wstring-conversion -fdiagnostics-color -O3  -isysroot /Applications/Xcode.app/Contents/Developer/Platforms/MacOSX.platform/Developer/SDKs/MacOSX10.14.sdk -Wl,-search_paths_first -Wl,-headerpad_max_install_names -Wl,-dead_strip tools/obj2yaml/CMakeFiles/obj2yaml.dir/obj2yaml.cpp.o tools/obj2yaml/CMakeFiles/obj2yaml.dir/coff2yaml.cpp.o tools/obj2yaml/CMakeFiles/obj2yaml.dir/dwarf2yaml.cpp.o tools/obj2yaml/CMakeFiles/obj2yaml.dir/elf2yaml.cpp.o tools/obj2yaml/CMakeFiles/obj2yaml.dir/macho2yaml.cpp.o tools/obj2yaml/CMakeFiles/obj2yaml.dir/minidump2yaml.cpp.o tools/obj2yaml/CMakeFiles/obj2yaml.dir/xcoff2yaml.cpp.o tools/obj2yaml/CMakeFiles/obj2yaml.dir/wasm2yaml.cpp.o tools/obj2yaml/CMakeFiles/obj2yaml.dir/Error.cpp.o  -o bin/obj2yaml  -Wl,-rpath,@loader_path/../lib lib/libLLVMBinaryFormat.a lib/libLLVMDebugInfoCodeView.a lib/libLLVMDebugInfoDWARF.a lib/libLLVMObject.a lib/libLLVMObjectYAML.a lib/libLLVMSupport.a lib/libLLVMObject.a lib/libLLVMBitReader.a lib/libLLVMCore.a lib/libLLVMRemarks.a lib/libLLVMBitstreamReader.a lib/libLLVMMCParser.a lib/libLLVMTextAPI.a lib/libLLVMMC.a lib/libLLVMBinaryFormat.a lib/libLLVMDebugInfoCodeView.a lib/libLLVMDebugInfoMSF.a lib/libLLVMSupport.a -lz -lcurses -lm lib/libLLVMDemangle.a && :
[1209/1230] : && /Users/buildslave/jenkins/workspace/lldb-cmake/host-compiler/bin/clang++  -Wdocumentation -fPIC -fvisibility-inlines-hidden -Werror=date-time -Werror=unguarded-availability-new -std=c++14 -fmodules -fmodules-cache-path=/Users/buildslave/jenkins/workspace/lldb-cmake/lldb-build/module.cache -fcxx-modules -Wall -Wextra -Wno-unused-parameter -Wwrite-strings -Wcast-qual -Wmissing-field-initializers -pedantic -Wno-long-long -Wimplicit-fallthrough -Wcovered-switch-default -Wno-noexcept-type -Wnon-virtual-dtor -Wdelete-non-virtual-dtor -Wstring-conversion -fdiagnostics-color -O3  -isysroot /Applications/Xcode.app/Contents/Developer/Platforms/MacOSX.platform/Developer/SDKs/MacOSX10.14.sdk -Wl,-search_paths_first -Wl,-headerpad_max_install_names -Wl,-dead_strip tools/llvm-dwp/CMakeFiles/llvm-dwp.dir/llvm-dwp.cpp.o tools/llvm-dwp/CMakeFiles/llvm-dwp.dir/DWPError.cpp.o  -o bin/llvm-dwp  -Wl,-rpath,@loader_path/../lib lib/libLLVMAArch64AsmParser.a lib/libLLVMAMDGPUAsmParser.a lib/libLLVMARMAsmParser.a lib/libLLVMBPFAsmParser.a lib/libLLVMHexagonAsmParser.a lib/libLLVMLanaiAsmParser.a lib/libLLVMMipsAsmParser.a lib/libLLVMMSP430AsmParser.a lib/libLLVMPowerPCAsmParser.a lib/libLLVMRISCVAsmParser.a lib/libLLVMSparcAsmParser.a lib/libLLVMSystemZAsmParser.a lib/libLLVMWebAssemblyAsmParser.a lib/libLLVMX86AsmParser.a lib/libLLVMAArch64CodeGen.a lib/libLLVMAMDGPUCodeGen.a lib/libLLVMARMCodeGen.a lib/libLLVMBPFCodeGen.a lib/libLLVMHexagonCodeGen.a lib/libLLVMLanaiCodeGen.a lib/libLLVMMipsCodeGen.a lib/libLLVMMSP430CodeGen.a lib/libLLVMNVPTXCodeGen.a lib/libLLVMPowerPCCodeGen.a lib/libLLVMRISCVCodeGen.a lib/libLLVMSparcCodeGen.a lib/libLLVMSystemZCodeGen.a lib/libLLVMWebAssemblyCodeGen.a lib/libLLVMX86CodeGen.a lib/libLLVMXCoreCodeGen.a lib/libLLVMAArch64Desc.a lib/libLLVMAMDGPUDesc.a lib/libLLVMARMDesc.a lib/libLLVMBPFDesc.a lib/libLLVMHexagonDesc.a lib/libLLVMLanaiDesc.a lib/libLLVMMipsDesc.a lib/libLLVMMSP430Desc.a lib/libLLVMNVPTXDesc.a lib/libLLVMPowerPCDesc.a lib/libLLVMRISCVDesc.a lib/libLLVMSparcDesc.a lib/libLLVMSystemZDesc.a lib/libLLVMWebAssemblyDesc.a lib/libLLVMX86Desc.a lib/libLLVMXCoreDesc.a lib/libLLVMAArch64Info.a lib/libLLVMAMDGPUInfo.a lib/libLLVMARMInfo.a lib/libLLVMBPFInfo.a lib/libLLVMHexagonInfo.a lib/libLLVMLanaiInfo.a lib/libLLVMMipsInfo.a lib/libLLVMMSP430Info.a lib/libLLVMNVPTXInfo.a lib/libLLVMPowerPCInfo.a lib/libLLVMRISCVInfo.a lib/libLLVMSparcInfo.a lib/libLLVMSystemZInfo.a lib/libLLVMWebAssemblyInfo.a lib/libLLVMX86Info.a lib/libLLVMXCoreInfo.a lib/libLLVMAsmPrinter.a lib/libLLVMDebugInfoDWARF.a lib/libLLVMMC.a lib/libLLVMObject.a lib/libLLVMSupport.a lib/libLLVMTarget.a lib/libLLVMAArch64Utils.a lib/libLLVMAMDGPUUtils.a lib/libLLVMMIRParser.a lib/libLLVMARMUtils.a lib/libLLVMHexagonAsmParser.a lib/libLLVMHexagonDesc.a lib/libLLVMHexagonInfo.a lib/libLLVMLanaiAsmParser.a lib/libLLVMLanaiDesc.a lib/libLLVMLanaiInfo.a lib/libLLVMipo.a lib/libLLVMVectorize.a lib/libLLVMIRReader.a lib/libLLVMAsmParser.a lib/libLLVMInstrumentation.a lib/libLLVMLinker.a lib/libLLVMRISCVUtils.a lib/libLLVMMCDisassembler.a lib/libLLVMGlobalISel.a lib/libLLVMX86Utils.a lib/libLLVMSelectionDAG.a lib/libLLVMCodeGen.a lib/libLLVMTarget.a lib/libLLVMScalarOpts.a lib/libLLVMAggressiveInstCombine.a lib/libLLVMInstCombine.a lib/libLLVMBitWriter.a lib/libLLVMTransformUtils.a lib/libLLVMAnalysis.a lib/libLLVMObject.a lib/libLLVMMCParser.a lib/libLLVMMC.a lib/libLLVMDebugInfoCodeView.a lib/libLLVMDebugInfoMSF.a lib/libLLVMBitReader.a lib/libLLVMTextAPI.a lib/libLLVMProfileData.a lib/libLLVMCore.a lib/libLLVMBinaryFormat.a lib/libLLVMRemarks.a lib/libLLVMBitstreamReader.a lib/libLLVMSupport.a -lz -lcurses -lm lib/libLLVMDemangle.a && :
[1210/1230] /Users/buildslave/jenkins/workspace/lldb-cmake/host-compiler/bin/clang++  -DGTEST_HAS_RTTI=0 -DHAVE_ROUND -DLIBXML2_DEFINED -DLLDB_CONFIGURATION_RELEASE -DLLDB_USE_OS_LOG -D_DEBUG -D__STDC_CONSTANT_MACROS -D__STDC_FORMAT_MACROS -D__STDC_LIMIT_MACROS -Itools/lldb/source/API -I/Users/buildslave/jenkins/workspace/lldb-cmake/llvm-project/lldb/source/API -Itools/lldb/source -I/Users/buildslave/jenkins/workspace/lldb-cmake/llvm-project/lldb/include -Itools/lldb/include -I/Applications/Xcode.app/Contents/Developer/Platforms/MacOSX.platform/Developer/SDKs/MacOSX10.14.sdk/usr/include/libxml2 -Iinclude -I/Users/buildslave/jenkins/workspace/lldb-cmake/llvm-project/llvm/include -I/usr/local/Cellar/python/3.7.0/Frameworks/Python.framework/Versions/3.7/include/python3.7m -I/Users/buildslave/jenkins/workspace/lldb-cmake/llvm-project/llvm/../clang/include -Itools/lldb/../clang/include -I/Users/buildslave/jenkins/workspace/lldb-cmake/llvm-project/lldb/source/. -Wdocumentation -fPIC -fvisibility-inlines-hidden -Werror=date-time -Werror=unguarded-availability-new -std=c++14 -fmodules -fmodules-cache-path=/Users/buildslave/jenkins/workspace/lldb-cmake/lldb-build/module.cache -fcxx-modules -Wall -Wextra -Wno-unused-parameter -Wwrite-strings -Wcast-qual -Wmissing-field-initializers -pedantic -Wno-long-long -Wimplicit-fallthrough -Wcovered-switch-default -Wno-noexcept-type -Wnon-virtual-dtor -Wdelete-non-virtual-dtor -Wstring-conversion -fdiagnostics-color -Wno-deprecated-declarations -Wno-unknown-pragmas -Wno-strict-aliasing -Wno-deprecated-register -Wno-vla-extension -O3  -isysroot /Applications/Xcode.app/Contents/Developer/Platforms/MacOSX.platform/Developer/SDKs/MacOSX10.14.sdk -fPIC   -UNDEBUG  -fno-exceptions -fno-rtti -MD -MT tools/lldb/source/API/CMakeFiles/liblldb.dir/SBTypeSummary.cpp.o -MF tools/lldb/source/API/CMakeFiles/liblldb.dir/SBTypeSummary.cpp.o.d -o tools/lldb/source/API/CMakeFiles/liblldb.dir/SBTypeSummary.cpp.o -c /Users/buildslave/jenkins/workspace/lldb-cmake/llvm-project/lldb/source/API/SBTypeSummary.cpp
[1211/1230] : && /Users/buildslave/jenkins/workspace/lldb-cmake/host-compiler/bin/clang++  -Wdocumentation -fPIC -fvisibility-inlines-hidden -Werror=date-time -Werror=unguarded-availability-new -std=c++14 -fmodules -fmodules-cache-path=/Users/buildslave/jenkins/workspace/lldb-cmake/lldb-build/module.cache -fcxx-modules -Wall -Wextra -Wno-unused-parameter -Wwrite-strings -Wcast-qual -Wmissing-field-initializers -pedantic -Wno-long-long -Wimplicit-fallthrough -Wcovered-switch-default -Wno-noexcept-type -Wnon-virtual-dtor -Wdelete-non-virtual-dtor -Wstring-conversion -fdiagnostics-color -O3  -isysroot /Applications/Xcode.app/Contents/Developer/Platforms/MacOSX.platform/Developer/SDKs/MacOSX10.14.sdk -Wl,-search_paths_first -Wl,-headerpad_max_install_names -Wl,-dead_strip tools/sancov/CMakeFiles/sancov.dir/sancov.cpp.o  -o bin/sancov  -Wl,-rpath,@loader_path/../lib lib/libLLVMAArch64Desc.a lib/libLLVMAMDGPUDesc.a lib/libLLVMARMDesc.a lib/libLLVMBPFDesc.a lib/libLLVMHexagonDesc.a lib/libLLVMLanaiDesc.a lib/libLLVMMipsDesc.a lib/libLLVMMSP430Desc.a lib/libLLVMNVPTXDesc.a lib/libLLVMPowerPCDesc.a lib/libLLVMRISCVDesc.a lib/libLLVMSparcDesc.a lib/libLLVMSystemZDesc.a lib/libLLVMWebAssemblyDesc.a lib/libLLVMX86Desc.a lib/libLLVMXCoreDesc.a lib/libLLVMAArch64Disassembler.a lib/libLLVMAMDGPUDisassembler.a lib/libLLVMARMDisassembler.a lib/libLLVMBPFDisassembler.a lib/libLLVMHexagonDisassembler.a lib/libLLVMLanaiDisassembler.a lib/libLLVMMipsDisassembler.a lib/libLLVMMSP430Disassembler.a lib/libLLVMPowerPCDisassembler.a lib/libLLVMRISCVDisassembler.a lib/libLLVMSparcDisassembler.a lib/libLLVMSystemZDisassembler.a lib/libLLVMWebAssemblyDisassembler.a lib/libLLVMX86Disassembler.a lib/libLLVMXCoreDisassembler.a lib/libLLVMAArch64Info.a lib/libLLVMAMDGPUInfo.a lib/libLLVMARMInfo.a lib/libLLVMBPFInfo.a lib/libLLVMHexagonInfo.a lib/libLLVMLanaiInfo.a lib/libLLVMMipsInfo.a lib/libLLVMMSP430Info.a lib/libLLVMNVPTXInfo.a lib/libLLVMPowerPCInfo.a lib/libLLVMRISCVInfo.a lib/libLLVMSparcInfo.a lib/libLLVMSystemZInfo.a lib/libLLVMWebAssemblyInfo.a lib/libLLVMX86Info.a lib/libLLVMXCoreInfo.a lib/libLLVMDebugInfoDWARF.a lib/libLLVMDebugInfoPDB.a lib/libLLVMMC.a lib/libLLVMMCDisassembler.a lib/libLLVMObject.a lib/libLLVMSupport.a lib/libLLVMSymbolize.a lib/libLLVMRISCVUtils.a lib/libLLVMX86Utils.a lib/libLLVMAArch64Desc.a lib/libLLVMAArch64Info.a lib/libLLVMAArch64Utils.a lib/libLLVMAMDGPUDesc.a lib/libLLVMAMDGPUInfo.a lib/libLLVMAMDGPUUtils.a lib/libLLVMARMDesc.a lib/libLLVMARMInfo.a lib/libLLVMARMUtils.a lib/libLLVMHexagonDesc.a lib/libLLVMHexagonInfo.a lib/libLLVMLanaiDesc.a lib/libLLVMLanaiInfo.a lib/libLLVMSystemZDesc.a lib/libLLVMSystemZInfo.a lib/libLLVMWebAssemblyDesc.a lib/libLLVMWebAssemblyInfo.a lib/libLLVMMCDisassembler.a lib/libLLVMDebugInfoDWARF.a lib/libLLVMDebugInfoPDB.a lib/libLLVMObject.a lib/libLLVMBitReader.a lib/libLLVMCore.a lib/libLLVMRemarks.a lib/libLLVMBitstreamReader.a lib/libLLVMMCParser.a lib/libLLVMMC.a lib/libLLVMDebugInfoCodeView.a lib/libLLVMDebugInfoMSF.a lib/libLLVMTextAPI.a lib/libLLVMBinaryFormat.a lib/libLLVMSupport.a -lz -lcurses -lm lib/libLLVMDemangle.a && :
[1212/1230] /Users/buildslave/jenkins/workspace/lldb-cmake/host-compiler/bin/clang++  -DGTEST_HAS_RTTI=0 -DHAVE_ROUND -DLIBXML2_DEFINED -DLLDB_CONFIGURATION_RELEASE -DLLDB_USE_OS_LOG -D_DEBUG -D__STDC_CONSTANT_MACROS -D__STDC_FORMAT_MACROS -D__STDC_LIMIT_MACROS -Itools/lldb/source/API -I/Users/buildslave/jenkins/workspace/lldb-cmake/llvm-project/lldb/source/API -Itools/lldb/source -I/Users/buildslave/jenkins/workspace/lldb-cmake/llvm-project/lldb/include -Itools/lldb/include -I/Applications/Xcode.app/Contents/Developer/Platforms/MacOSX.platform/Developer/SDKs/MacOSX10.14.sdk/usr/include/libxml2 -Iinclude -I/Users/buildslave/jenkins/workspace/lldb-cmake/llvm-project/llvm/include -I/usr/local/Cellar/python/3.7.0/Frameworks/Python.framework/Versions/3.7/include/python3.7m -I/Users/buildslave/jenkins/workspace/lldb-cmake/llvm-project/llvm/../clang/include -Itools/lldb/../clang/include -I/Users/buildslave/jenkins/workspace/lldb-cmake/llvm-project/lldb/source/. -Wdocumentation -fPIC -fvisibility-inlines-hidden -Werror=date-time -Werror=unguarded-availability-new -std=c++14 -fmodules -fmodules-cache-path=/Users/buildslave/jenkins/workspace/lldb-cmake/lldb-build/module.cache -fcxx-modules -Wall -Wextra -Wno-unused-parameter -Wwrite-strings -Wcast-qual -Wmissing-field-initializers -pedantic -Wno-long-long -Wimplicit-fallthrough -Wcovered-switch-default -Wno-noexcept-type -Wnon-virtual-dtor -Wdelete-non-virtual-dtor -Wstring-conversion -fdiagnostics-color -Wno-deprecated-declarations -Wno-unknown-pragmas -Wno-strict-aliasing -Wno-deprecated-register -Wno-vla-extension -O3  -isysroot /Applications/Xcode.app/Contents/Developer/Platforms/MacOSX.platform/Developer/SDKs/MacOSX10.14.sdk -fPIC   -UNDEBUG  -fno-exceptions -fno-rtti -MD -MT tools/lldb/source/API/CMakeFiles/liblldb.dir/SBValueList.cpp.o -MF tools/lldb/source/API/CMakeFiles/liblldb.dir/SBValueList.cpp.o.d -o tools/lldb/source/API/CMakeFiles/liblldb.dir/SBValueList.cpp.o -c /Users/buildslave/jenkins/workspace/lldb-cmake/llvm-project/lldb/source/API/SBValueList.cpp
[1213/1230] : && /Users/buildslave/jenkins/workspace/lldb-cmake/host-compiler/bin/clang++  -Wdocumentation -fPIC -fvisibility-inlines-hidden -Werror=date-time -Werror=unguarded-availability-new -std=c++14 -fmodules -fmodules-cache-path=/Users/buildslave/jenkins/workspace/lldb-cmake/lldb-build/module.cache -fcxx-modules -Wall -Wextra -Wno-unused-parameter -Wwrite-strings -Wcast-qual -Wmissing-field-initializers -pedantic -Wno-long-long -Wimplicit-fallthrough -Wcovered-switch-default -Wno-noexcept-type -Wnon-virtual-dtor -Wdelete-non-virtual-dtor -Wstring-conversion -fdiagnostics-color -O3  -isysroot /Applications/Xcode.app/Contents/Developer/Platforms/MacOSX.platform/Developer/SDKs/MacOSX10.14.sdk -Wl,-search_paths_first -Wl,-headerpad_max_install_names -Wl,-dead_strip tools/llvm-isel-fuzzer/CMakeFiles/llvm-isel-fuzzer.dir/DummyISelFuzzer.cpp.o tools/llvm-isel-fuzzer/CMakeFiles/llvm-isel-fuzzer.dir/llvm-isel-fuzzer.cpp.o  -o bin/llvm-isel-fuzzer  -Wl,-rpath,@loader_path/../lib lib/libLLVMAArch64AsmParser.a lib/libLLVMAMDGPUAsmParser.a lib/libLLVMARMAsmParser.a lib/libLLVMBPFAsmParser.a lib/libLLVMHexagonAsmParser.a lib/libLLVMLanaiAsmParser.a lib/libLLVMMipsAsmParser.a lib/libLLVMMSP430AsmParser.a lib/libLLVMPowerPCAsmParser.a lib/libLLVMRISCVAsmParser.a lib/libLLVMSparcAsmParser.a lib/libLLVMSystemZAsmParser.a lib/libLLVMWebAssemblyAsmParser.a lib/libLLVMX86AsmParser.a lib/libLLVMAArch64CodeGen.a lib/libLLVMAMDGPUCodeGen.a lib/libLLVMARMCodeGen.a lib/libLLVMBPFCodeGen.a lib/libLLVMHexagonCodeGen.a lib/libLLVMLanaiCodeGen.a lib/libLLVMMipsCodeGen.a lib/libLLVMMSP430CodeGen.a lib/libLLVMNVPTXCodeGen.a lib/libLLVMPowerPCCodeGen.a lib/libLLVMRISCVCodeGen.a lib/libLLVMSparcCodeGen.a lib/libLLVMSystemZCodeGen.a lib/libLLVMWebAssemblyCodeGen.a lib/libLLVMX86CodeGen.a lib/libLLVMXCoreCodeGen.a lib/libLLVMAArch64Desc.a lib/libLLVMAMDGPUDesc.a lib/libLLVMARMDesc.a lib/libLLVMBPFDesc.a lib/libLLVMHexagonDesc.a lib/libLLVMLanaiDesc.a lib/libLLVMMipsDesc.a lib/libLLVMMSP430Desc.a lib/libLLVMNVPTXDesc.a lib/libLLVMPowerPCDesc.a lib/libLLVMRISCVDesc.a lib/libLLVMSparcDesc.a lib/libLLVMSystemZDesc.a lib/libLLVMWebAssemblyDesc.a lib/libLLVMX86Desc.a lib/libLLVMXCoreDesc.a lib/libLLVMAArch64Info.a lib/libLLVMAMDGPUInfo.a lib/libLLVMARMInfo.a lib/libLLVMBPFInfo.a lib/libLLVMHexagonInfo.a lib/libLLVMLanaiInfo.a lib/libLLVMMipsInfo.a lib/libLLVMMSP430Info.a lib/libLLVMNVPTXInfo.a lib/libLLVMPowerPCInfo.a lib/libLLVMRISCVInfo.a lib/libLLVMSparcInfo.a lib/libLLVMSystemZInfo.a lib/libLLVMWebAssemblyInfo.a lib/libLLVMX86Info.a lib/libLLVMXCoreInfo.a lib/libLLVMAnalysis.a lib/libLLVMAsmPrinter.a lib/libLLVMBitReader.a lib/libLLVMBitWriter.a lib/libLLVMCodeGen.a lib/libLLVMCore.a lib/libLLVMFuzzMutate.a lib/libLLVMIRReader.a lib/libLLVMMC.a lib/libLLVMScalarOpts.a lib/libLLVMSelectionDAG.a lib/libLLVMSupport.a lib/libLLVMTarget.a lib/libLLVMAArch64Utils.a lib/libLLVMAMDGPUUtils.a lib/libLLVMMIRParser.a lib/libLLVMARMUtils.a lib/libLLVMHexagonAsmParser.a lib/libLLVMHexagonDesc.a lib/libLLVMHexagonInfo.a lib/libLLVMLanaiAsmParser.a lib/libLLVMLanaiDesc.a lib/libLLVMLanaiInfo.a lib/libLLVMipo.a lib/libLLVMIRReader.a lib/libLLVMAsmParser.a lib/libLLVMVectorize.a lib/libLLVMInstrumentation.a lib/libLLVMLinker.a lib/libLLVMRISCVUtils.a lib/libLLVMMCDisassembler.a lib/libLLVMGlobalISel.a lib/libLLVMX86Utils.a lib/libLLVMDebugInfoDWARF.a lib/libLLVMSelectionDAG.a lib/libLLVMCodeGen.a lib/libLLVMBitWriter.a lib/libLLVMScalarOpts.a lib/libLLVMAggressiveInstCombine.a lib/libLLVMInstCombine.a lib/libLLVMTransformUtils.a lib/libLLVMTarget.a lib/libLLVMAnalysis.a lib/libLLVMProfileData.a lib/libLLVMObject.a lib/libLLVMBitReader.a lib/libLLVMMCParser.a lib/libLLVMTextAPI.a lib/libLLVMCore.a lib/libLLVMRemarks.a lib/libLLVMBitstreamReader.a lib/libLLVMMC.a lib/libLLVMBinaryFormat.a lib/libLLVMDebugInfoCodeView.a lib/libLLVMDebugInfoMSF.a lib/libLLVMSupport.a -lz -lcurses -lm lib/libLLVMDemangle.a && :
[1214/1230] /Users/buildslave/jenkins/workspace/lldb-cmake/host-compiler/bin/clang++  -DGTEST_HAS_RTTI=0 -DHAVE_ROUND -DLIBXML2_DEFINED -DLLDB_CONFIGURATION_RELEASE -DLLDB_USE_OS_LOG -D_DEBUG -D__STDC_CONSTANT_MACROS -D__STDC_FORMAT_MACROS -D__STDC_LIMIT_MACROS -Itools/lldb/source/API -I/Users/buildslave/jenkins/workspace/lldb-cmake/llvm-project/lldb/source/API -Itools/lldb/source -I/Users/buildslave/jenkins/workspace/lldb-cmake/llvm-project/lldb/include -Itools/lldb/include -I/Applications/Xcode.app/Contents/Developer/Platforms/MacOSX.platform/Developer/SDKs/MacOSX10.14.sdk/usr/include/libxml2 -Iinclude -I/Users/buildslave/jenkins/workspace/lldb-cmake/llvm-project/llvm/include -I/usr/local/Cellar/python/3.7.0/Frameworks/Python.framework/Versions/3.7/include/python3.7m -I/Users/buildslave/jenkins/workspace/lldb-cmake/llvm-project/llvm/../clang/include -Itools/lldb/../clang/include -I/Users/buildslave/jenkins/workspace/lldb-cmake/llvm-project/lldb/source/. -Wdocumentation -fPIC -fvisibility-inlines-hidden -Werror=date-time -Werror=unguarded-availability-new -std=c++14 -fmodules -fmodules-cache-path=/Users/buildslave/jenkins/workspace/lldb-cmake/lldb-build/module.cache -fcxx-modules -Wall -Wextra -Wno-unused-parameter -Wwrite-strings -Wcast-qual -Wmissing-field-initializers -pedantic -Wno-long-long -Wimplicit-fallthrough -Wcovered-switch-default -Wno-noexcept-type -Wnon-virtual-dtor -Wdelete-non-virtual-dtor -Wstring-conversion -fdiagnostics-color -Wno-deprecated-declarations -Wno-unknown-pragmas -Wno-strict-aliasing -Wno-deprecated-register -Wno-vla-extension -O3  -isysroot /Applications/Xcode.app/Contents/Developer/Platforms/MacOSX.platform/Developer/SDKs/MacOSX10.14.sdk -fPIC   -UNDEBUG  -fno-exceptions -fno-rtti -MD -MT tools/lldb/source/API/CMakeFiles/liblldb.dir/SBThread.cpp.o -MF tools/lldb/source/API/CMakeFiles/liblldb.dir/SBThread.cpp.o.d -o tools/lldb/source/API/CMakeFiles/liblldb.dir/SBThread.cpp.o -c /Users/buildslave/jenkins/workspace/lldb-cmake/llvm-project/lldb/source/API/SBThread.cpp
[1215/1230] /Users/buildslave/jenkins/workspace/lldb-cmake/host-compiler/bin/clang++  -DGTEST_HAS_RTTI=0 -DHAVE_ROUND -DLIBXML2_DEFINED -DLLDB_CONFIGURATION_RELEASE -DLLDB_USE_OS_LOG -D_DEBUG -D__STDC_CONSTANT_MACROS -D__STDC_FORMAT_MACROS -D__STDC_LIMIT_MACROS -Itools/lldb/source/API -I/Users/buildslave/jenkins/workspace/lldb-cmake/llvm-project/lldb/source/API -Itools/lldb/source -I/Users/buildslave/jenkins/workspace/lldb-cmake/llvm-project/lldb/include -Itools/lldb/include -I/Applications/Xcode.app/Contents/Developer/Platforms/MacOSX.platform/Developer/SDKs/MacOSX10.14.sdk/usr/include/libxml2 -Iinclude -I/Users/buildslave/jenkins/workspace/lldb-cmake/llvm-project/llvm/include -I/usr/local/Cellar/python/3.7.0/Frameworks/Python.framework/Versions/3.7/include/python3.7m -I/Users/buildslave/jenkins/workspace/lldb-cmake/llvm-project/llvm/../clang/include -Itools/lldb/../clang/include -I/Users/buildslave/jenkins/workspace/lldb-cmake/llvm-project/lldb/source/. -Wdocumentation -fPIC -fvisibility-inlines-hidden -Werror=date-time -Werror=unguarded-availability-new -std=c++14 -fmodules -fmodules-cache-path=/Users/buildslave/jenkins/workspace/lldb-cmake/lldb-build/module.cache -fcxx-modules -Wall -Wextra -Wno-unused-parameter -Wwrite-strings -Wcast-qual -Wmissing-field-initializers -pedantic -Wno-long-long -Wimplicit-fallthrough -Wcovered-switch-default -Wno-noexcept-type -Wnon-virtual-dtor -Wdelete-non-virtual-dtor -Wstring-conversion -fdiagnostics-color -Wno-deprecated-declarations -Wno-unknown-pragmas -Wno-strict-aliasing -Wno-deprecated-register -Wno-vla-extension -O3  -isysroot /Applications/Xcode.app/Contents/Developer/Platforms/MacOSX.platform/Developer/SDKs/MacOSX10.14.sdk -fPIC   -UNDEBUG  -fno-exceptions -fno-rtti -MD -MT tools/lldb/source/API/CMakeFiles/liblldb.dir/SBTypeCategory.cpp.o -MF tools/lldb/source/API/CMakeFiles/liblldb.dir/SBTypeCategory.cpp.o.d -o tools/lldb/source/API/CMakeFiles/liblldb.dir/SBTypeCategory.cpp.o -c /Users/buildslave/jenkins/workspace/lldb-cmake/llvm-project/lldb/source/API/SBTypeCategory.cpp
[1216/1230] /Users/buildslave/jenkins/workspace/lldb-cmake/host-compiler/bin/clang++  -DGTEST_HAS_RTTI=0 -DHAVE_ROUND -DLIBXML2_DEFINED -DLLDB_CONFIGURATION_RELEASE -DLLDB_USE_OS_LOG -D_DEBUG -D__STDC_CONSTANT_MACROS -D__STDC_FORMAT_MACROS -D__STDC_LIMIT_MACROS -Itools/lldb/source/API -I/Users/buildslave/jenkins/workspace/lldb-cmake/llvm-project/lldb/source/API -Itools/lldb/source -I/Users/buildslave/jenkins/workspace/lldb-cmake/llvm-project/lldb/include -Itools/lldb/include -I/Applications/Xcode.app/Contents/Developer/Platforms/MacOSX.platform/Developer/SDKs/MacOSX10.14.sdk/usr/include/libxml2 -Iinclude -I/Users/buildslave/jenkins/workspace/lldb-cmake/llvm-project/llvm/include -I/usr/local/Cellar/python/3.7.0/Frameworks/Python.framework/Versions/3.7/include/python3.7m -I/Users/buildslave/jenkins/workspace/lldb-cmake/llvm-project/llvm/../clang/include -Itools/lldb/../clang/include -I/Users/buildslave/jenkins/workspace/lldb-cmake/llvm-project/lldb/source/. -Wdocumentation -fPIC -fvisibility-inlines-hidden -Werror=date-time -Werror=unguarded-availability-new -std=c++14 -fmodules -fmodules-cache-path=/Users/buildslave/jenkins/workspace/lldb-cmake/lldb-build/module.cache -fcxx-modules -Wall -Wextra -Wno-unused-parameter -Wwrite-strings -Wcast-qual -Wmissing-field-initializers -pedantic -Wno-long-long -Wimplicit-fallthrough -Wcovered-switch-default -Wno-noexcept-type -Wnon-virtual-dtor -Wdelete-non-virtual-dtor -Wstring-conversion -fdiagnostics-color -Wno-deprecated-declarations -Wno-unknown-pragmas -Wno-strict-aliasing -Wno-deprecated-register -Wno-vla-extension -O3  -isysroot /Applications/Xcode.app/Contents/Developer/Platforms/MacOSX.platform/Developer/SDKs/MacOSX10.14.sdk -fPIC   -UNDEBUG  -fno-exceptions -fno-rtti -MD -MT tools/lldb/source/API/CMakeFiles/liblldb.dir/SBWatchpoint.cpp.o -MF tools/lldb/source/API/CMakeFiles/liblldb.dir/SBWatchpoint.cpp.o.d -o tools/lldb/source/API/CMakeFiles/liblldb.dir/SBWatchpoint.cpp.o -c /Users/buildslave/jenkins/workspace/lldb-cmake/llvm-project/lldb/source/API/SBWatchpoint.cpp
[1217/1230] : && /Users/buildslave/jenkins/workspace/lldb-cmake/host-compiler/bin/clang++  -Wdocumentation -fPIC -fvisibility-inlines-hidden -Werror=date-time -Werror=unguarded-availability-new -std=c++14 -fmodules -fmodules-cache-path=/Users/buildslave/jenkins/workspace/lldb-cmake/lldb-build/module.cache -fcxx-modules -Wall -Wextra -Wno-unused-parameter -Wwrite-strings -Wcast-qual -Wmissing-field-initializers -pedantic -Wno-long-long -Wimplicit-fallthrough -Wcovered-switch-default -Wno-noexcept-type -Wnon-virtual-dtor -Wdelete-non-virtual-dtor -Wstring-conversion -fdiagnostics-color -O3  -isysroot /Applications/Xcode.app/Contents/Developer/Platforms/MacOSX.platform/Developer/SDKs/MacOSX10.14.sdk -Wl,-search_paths_first -Wl,-headerpad_max_install_names -Wl,-dead_strip tools/llvm-opt-fuzzer/CMakeFiles/llvm-opt-fuzzer.dir/DummyOptFuzzer.cpp.o tools/llvm-opt-fuzzer/CMakeFiles/llvm-opt-fuzzer.dir/llvm-opt-fuzzer.cpp.o  -o bin/llvm-opt-fuzzer  -Wl,-rpath,@loader_path/../lib lib/libLLVMAArch64AsmParser.a lib/libLLVMAMDGPUAsmParser.a lib/libLLVMARMAsmParser.a lib/libLLVMBPFAsmParser.a lib/libLLVMHexagonAsmParser.a lib/libLLVMLanaiAsmParser.a lib/libLLVMMipsAsmParser.a lib/libLLVMMSP430AsmParser.a lib/libLLVMPowerPCAsmParser.a lib/libLLVMRISCVAsmParser.a lib/libLLVMSparcAsmParser.a lib/libLLVMSystemZAsmParser.a lib/libLLVMWebAssemblyAsmParser.a lib/libLLVMX86AsmParser.a lib/libLLVMAArch64CodeGen.a lib/libLLVMAMDGPUCodeGen.a lib/libLLVMARMCodeGen.a lib/libLLVMBPFCodeGen.a lib/libLLVMHexagonCodeGen.a lib/libLLVMLanaiCodeGen.a lib/libLLVMMipsCodeGen.a lib/libLLVMMSP430CodeGen.a lib/libLLVMNVPTXCodeGen.a lib/libLLVMPowerPCCodeGen.a lib/libLLVMRISCVCodeGen.a lib/libLLVMSparcCodeGen.a lib/libLLVMSystemZCodeGen.a lib/libLLVMWebAssemblyCodeGen.a lib/libLLVMX86CodeGen.a lib/libLLVMXCoreCodeGen.a lib/libLLVMAArch64Desc.a lib/libLLVMAMDGPUDesc.a lib/libLLVMARMDesc.a lib/libLLVMBPFDesc.a lib/libLLVMHexagonDesc.a lib/libLLVMLanaiDesc.a lib/libLLVMMipsDesc.a lib/libLLVMMSP430Desc.a lib/libLLVMNVPTXDesc.a lib/libLLVMPowerPCDesc.a lib/libLLVMRISCVDesc.a lib/libLLVMSparcDesc.a lib/libLLVMSystemZDesc.a lib/libLLVMWebAssemblyDesc.a lib/libLLVMX86Desc.a lib/libLLVMXCoreDesc.a lib/libLLVMAArch64Info.a lib/libLLVMAMDGPUInfo.a lib/libLLVMARMInfo.a lib/libLLVMBPFInfo.a lib/libLLVMHexagonInfo.a lib/libLLVMLanaiInfo.a lib/libLLVMMipsInfo.a lib/libLLVMMSP430Info.a lib/libLLVMNVPTXInfo.a lib/libLLVMPowerPCInfo.a lib/libLLVMRISCVInfo.a lib/libLLVMSparcInfo.a lib/libLLVMSystemZInfo.a lib/libLLVMWebAssemblyInfo.a lib/libLLVMX86Info.a lib/libLLVMXCoreInfo.a lib/libLLVMAnalysis.a lib/libLLVMBitReader.a lib/libLLVMBitWriter.a lib/libLLVMCodeGen.a lib/libLLVMCore.a lib/libLLVMCoroutines.a lib/libLLVMipo.a lib/libLLVMIRReader.a lib/libLLVMAggressiveInstCombine.a lib/libLLVMInstCombine.a lib/libLLVMInstrumentation.a lib/libLLVMFuzzMutate.a lib/libLLVMMC.a lib/libLLVMObjCARCOpts.a lib/libLLVMScalarOpts.a lib/libLLVMSupport.a lib/libLLVMTarget.a lib/libLLVMTransformUtils.a lib/libLLVMVectorize.a lib/libLLVMPasses.a lib/libLLVMAArch64Utils.a lib/libLLVMAMDGPUUtils.a lib/libLLVMMIRParser.a lib/libLLVMARMUtils.a lib/libLLVMHexagonAsmParser.a lib/libLLVMHexagonDesc.a lib/libLLVMHexagonInfo.a lib/libLLVMLanaiAsmParser.a lib/libLLVMLanaiDesc.a lib/libLLVMLanaiInfo.a lib/libLLVMRISCVUtils.a lib/libLLVMMCDisassembler.a lib/libLLVMGlobalISel.a lib/libLLVMX86Utils.a lib/libLLVMAsmPrinter.a lib/libLLVMDebugInfoDWARF.a lib/libLLVMSelectionDAG.a lib/libLLVMCodeGen.a lib/libLLVMipo.a lib/libLLVMBitWriter.a lib/libLLVMIRReader.a lib/libLLVMAsmParser.a lib/libLLVMLinker.a lib/libLLVMInstrumentation.a lib/libLLVMScalarOpts.a lib/libLLVMAggressiveInstCombine.a lib/libLLVMInstCombine.a lib/libLLVMTarget.a lib/libLLVMVectorize.a lib/libLLVMTransformUtils.a lib/libLLVMAnalysis.a lib/libLLVMProfileData.a lib/libLLVMObject.a lib/libLLVMBitReader.a lib/libLLVMMCParser.a lib/libLLVMMC.a lib/libLLVMDebugInfoCodeView.a lib/libLLVMDebugInfoMSF.a lib/libLLVMTextAPI.a lib/libLLVMCore.a lib/libLLVMBinaryFormat.a lib/libLLVMRemarks.a lib/libLLVMBitstreamReader.a lib/libLLVMSupport.a -lz -lcurses -lm lib/libLLVMDemangle.a && :
[1218/1230] /Users/buildslave/jenkins/workspace/lldb-cmake/host-compiler/bin/clang++  -DGTEST_HAS_RTTI=0 -DHAVE_ROUND -DLIBXML2_DEFINED -DLLDB_CONFIGURATION_RELEASE -DLLDB_USE_OS_LOG -D_DEBUG -D__STDC_CONSTANT_MACROS -D__STDC_FORMAT_MACROS -D__STDC_LIMIT_MACROS -Itools/lldb/tools/lldb-server -I/Users/buildslave/jenkins/workspace/lldb-cmake/llvm-project/lldb/tools/lldb-server -I/Users/buildslave/jenkins/workspace/lldb-cmake/llvm-project/lldb/include -Itools/lldb/include -I/Applications/Xcode.app/Contents/Developer/Platforms/MacOSX.platform/Developer/SDKs/MacOSX10.14.sdk/usr/include/libxml2 -Iinclude -I/Users/buildslave/jenkins/workspace/lldb-cmake/llvm-project/llvm/include -I/usr/local/Cellar/python/3.7.0/Frameworks/Python.framework/Versions/3.7/include/python3.7m -I/Users/buildslave/jenkins/workspace/lldb-cmake/llvm-project/llvm/../clang/include -Itools/lldb/../clang/include -I/Users/buildslave/jenkins/workspace/lldb-cmake/llvm-project/lldb/tools/lldb-server/../../source -Wdocumentation -fPIC -fvisibility-inlines-hidden -Werror=date-time -Werror=unguarded-availability-new -std=c++14 -fmodules -fmodules-cache-path=/Users/buildslave/jenkins/workspace/lldb-cmake/lldb-build/module.cache -fcxx-modules -Wall -Wextra -Wno-unused-parameter -Wwrite-strings -Wcast-qual -Wmissing-field-initializers -pedantic -Wno-long-long -Wimplicit-fallthrough -Wcovered-switch-default -Wno-noexcept-type -Wnon-virtual-dtor -Wdelete-non-virtual-dtor -Wstring-conversion -fdiagnostics-color -Wno-deprecated-declarations -Wno-unknown-pragmas -Wno-strict-aliasing -Wno-deprecated-register -Wno-vla-extension -O3  -isysroot /Applications/Xcode.app/Contents/Developer/Platforms/MacOSX.platform/Developer/SDKs/MacOSX10.14.sdk   -UNDEBUG  -fno-exceptions -fno-rtti -MD -MT tools/lldb/tools/lldb-server/CMakeFiles/lldb-server.dir/lldb-platform.cpp.o -MF tools/lldb/tools/lldb-server/CMakeFiles/lldb-server.dir/lldb-platform.cpp.o.d -o tools/lldb/tools/lldb-server/CMakeFiles/lldb-server.dir/lldb-platform.cpp.o -c /Users/buildslave/jenkins/workspace/lldb-cmake/llvm-project/lldb/tools/lldb-server/lldb-platform.cpp
[1219/1230] : && /Users/buildslave/jenkins/workspace/lldb-cmake/host-compiler/bin/clang++  -Wdocumentation -fPIC -fvisibility-inlines-hidden -Werror=date-time -Werror=unguarded-availability-new -std=c++14 -fmodules -fmodules-cache-path=/Users/buildslave/jenkins/workspace/lldb-cmake/lldb-build/module.cache -fcxx-modules -Wall -Wextra -Wno-unused-parameter -Wwrite-strings -Wcast-qual -Wmissing-field-initializers -pedantic -Wno-long-long -Wimplicit-fallthrough -Wcovered-switch-default -Wno-noexcept-type -Wnon-virtual-dtor -Wdelete-non-virtual-dtor -Wstring-conversion -fdiagnostics-color -O3  -isysroot /Applications/Xcode.app/Contents/Developer/Platforms/MacOSX.platform/Developer/SDKs/MacOSX10.14.sdk -Wl,-search_paths_first -Wl,-headerpad_max_install_names -rdynamic tools/opt/CMakeFiles/opt.dir/AnalysisWrappers.cpp.o tools/opt/CMakeFiles/opt.dir/BreakpointPrinter.cpp.o tools/opt/CMakeFiles/opt.dir/Debugify.cpp.o tools/opt/CMakeFiles/opt.dir/GraphPrinters.cpp.o tools/opt/CMakeFiles/opt.dir/NewPMDriver.cpp.o tools/opt/CMakeFiles/opt.dir/PassPrinters.cpp.o tools/opt/CMakeFiles/opt.dir/PrintSCC.cpp.o tools/opt/CMakeFiles/opt.dir/opt.cpp.o  -o bin/opt  -Wl,-rpath,@loader_path/../lib lib/libLLVMAArch64AsmParser.a lib/libLLVMAMDGPUAsmParser.a lib/libLLVMARMAsmParser.a lib/libLLVMBPFAsmParser.a lib/libLLVMHexagonAsmParser.a lib/libLLVMLanaiAsmParser.a lib/libLLVMMipsAsmParser.a lib/libLLVMMSP430AsmParser.a lib/libLLVMPowerPCAsmParser.a lib/libLLVMRISCVAsmParser.a lib/libLLVMSparcAsmParser.a lib/libLLVMSystemZAsmParser.a lib/libLLVMWebAssemblyAsmParser.a lib/libLLVMX86AsmParser.a lib/libLLVMAArch64CodeGen.a lib/libLLVMAMDGPUCodeGen.a lib/libLLVMARMCodeGen.a lib/libLLVMBPFCodeGen.a lib/libLLVMHexagonCodeGen.a lib/libLLVMLanaiCodeGen.a lib/libLLVMMipsCodeGen.a lib/libLLVMMSP430CodeGen.a lib/libLLVMNVPTXCodeGen.a lib/libLLVMPowerPCCodeGen.a lib/libLLVMRISCVCodeGen.a lib/libLLVMSparcCodeGen.a lib/libLLVMSystemZCodeGen.a lib/libLLVMWebAssemblyCodeGen.a lib/libLLVMX86CodeGen.a lib/libLLVMXCoreCodeGen.a lib/libLLVMAArch64Desc.a lib/libLLVMAMDGPUDesc.a lib/libLLVMARMDesc.a lib/libLLVMBPFDesc.a lib/libLLVMHexagonDesc.a lib/libLLVMLanaiDesc.a lib/libLLVMMipsDesc.a lib/libLLVMMSP430Desc.a lib/libLLVMNVPTXDesc.a lib/libLLVMPowerPCDesc.a lib/libLLVMRISCVDesc.a lib/libLLVMSparcDesc.a lib/libLLVMSystemZDesc.a lib/libLLVMWebAssemblyDesc.a lib/libLLVMX86Desc.a lib/libLLVMXCoreDesc.a lib/libLLVMAArch64Info.a lib/libLLVMAMDGPUInfo.a lib/libLLVMARMInfo.a lib/libLLVMBPFInfo.a lib/libLLVMHexagonInfo.a lib/libLLVMLanaiInfo.a lib/libLLVMMipsInfo.a lib/libLLVMMSP430Info.a lib/libLLVMNVPTXInfo.a lib/libLLVMPowerPCInfo.a lib/libLLVMRISCVInfo.a lib/libLLVMSparcInfo.a lib/libLLVMSystemZInfo.a lib/libLLVMWebAssemblyInfo.a lib/libLLVMX86Info.a lib/libLLVMXCoreInfo.a lib/libLLVMAggressiveInstCombine.a lib/libLLVMAnalysis.a lib/libLLVMBitWriter.a lib/libLLVMCodeGen.a lib/libLLVMCore.a lib/libLLVMCoroutines.a lib/libLLVMipo.a lib/libLLVMIRReader.a lib/libLLVMInstCombine.a lib/libLLVMInstrumentation.a lib/libLLVMMC.a lib/libLLVMObjCARCOpts.a lib/libLLVMRemarks.a lib/libLLVMScalarOpts.a lib/libLLVMSupport.a lib/libLLVMTarget.a lib/libLLVMTransformUtils.a lib/libLLVMVectorize.a lib/libLLVMPasses.a lib/libLLVMAArch64Utils.a lib/libLLVMAMDGPUUtils.a lib/libLLVMMIRParser.a lib/libLLVMARMUtils.a lib/libLLVMHexagonAsmParser.a lib/libLLVMHexagonDesc.a lib/libLLVMHexagonInfo.a lib/libLLVMLanaiAsmParser.a lib/libLLVMLanaiDesc.a lib/libLLVMLanaiInfo.a lib/libLLVMRISCVUtils.a lib/libLLVMMCDisassembler.a lib/libLLVMGlobalISel.a lib/libLLVMX86Utils.a lib/libLLVMAsmPrinter.a lib/libLLVMDebugInfoDWARF.a lib/libLLVMSelectionDAG.a lib/libLLVMCodeGen.a lib/libLLVMipo.a lib/libLLVMBitWriter.a lib/libLLVMIRReader.a lib/libLLVMAsmParser.a lib/libLLVMLinker.a lib/libLLVMInstrumentation.a lib/libLLVMScalarOpts.a lib/libLLVMAggressiveInstCombine.a lib/libLLVMInstCombine.a lib/libLLVMTarget.a lib/libLLVMVectorize.a lib/libLLVMTransformUtils.a lib/libLLVMAnalysis.a lib/libLLVMProfileData.a lib/libLLVMObject.a lib/libLLVMMCParser.a lib/libLLVMMC.a lib/libLLVMDebugInfoCodeView.a lib/libLLVMDebugInfoMSF.a lib/libLLVMBitReader.a lib/libLLVMTextAPI.a lib/libLLVMCore.a lib/libLLVMRemarks.a lib/libLLVMBitstreamReader.a lib/libLLVMBinaryFormat.a lib/libLLVMSupport.a -lz -lcurses -lm lib/libLLVMDemangle.a && :
[1220/1230] /Users/buildslave/jenkins/workspace/lldb-cmake/host-compiler/bin/clang++  -DGTEST_HAS_RTTI=0 -DHAVE_ROUND -DLIBXML2_DEFINED -DLLDB_CONFIGURATION_RELEASE -DLLDB_USE_OS_LOG -D_DEBUG -D__STDC_CONSTANT_MACROS -D__STDC_FORMAT_MACROS -D__STDC_LIMIT_MACROS -Itools/lldb/tools/lldb-server -I/Users/buildslave/jenkins/workspace/lldb-cmake/llvm-project/lldb/tools/lldb-server -I/Users/buildslave/jenkins/workspace/lldb-cmake/llvm-project/lldb/include -Itools/lldb/include -I/Applications/Xcode.app/Contents/Developer/Platforms/MacOSX.platform/Developer/SDKs/MacOSX10.14.sdk/usr/include/libxml2 -Iinclude -I/Users/buildslave/jenkins/workspace/lldb-cmake/llvm-project/llvm/include -I/usr/local/Cellar/python/3.7.0/Frameworks/Python.framework/Versions/3.7/include/python3.7m -I/Users/buildslave/jenkins/workspace/lldb-cmake/llvm-project/llvm/../clang/include -Itools/lldb/../clang/include -I/Users/buildslave/jenkins/workspace/lldb-cmake/llvm-project/lldb/tools/lldb-server/../../source -Wdocumentation -fPIC -fvisibility-inlines-hidden -Werror=date-time -Werror=unguarded-availability-new -std=c++14 -fmodules -fmodules-cache-path=/Users/buildslave/jenkins/workspace/lldb-cmake/lldb-build/module.cache -fcxx-modules -Wall -Wextra -Wno-unused-parameter -Wwrite-strings -Wcast-qual -Wmissing-field-initializers -pedantic -Wno-long-long -Wimplicit-fallthrough -Wcovered-switch-default -Wno-noexcept-type -Wnon-virtual-dtor -Wdelete-non-virtual-dtor -Wstring-conversion -fdiagnostics-color -Wno-deprecated-declarations -Wno-unknown-pragmas -Wno-strict-aliasing -Wno-deprecated-register -Wno-vla-extension -O3  -isysroot /Applications/Xcode.app/Contents/Developer/Platforms/MacOSX.platform/Developer/SDKs/MacOSX10.14.sdk   -UNDEBUG  -fno-exceptions -fno-rtti -MD -MT tools/lldb/tools/lldb-server/CMakeFiles/lldb-server.dir/lldb-gdbserver.cpp.o -MF tools/lldb/tools/lldb-server/CMakeFiles/lldb-server.dir/lldb-gdbserver.cpp.o.d -o tools/lldb/tools/lldb-server/CMakeFiles/lldb-server.dir/lldb-gdbserver.cpp.o -c /Users/buildslave/jenkins/workspace/lldb-cmake/llvm-project/lldb/tools/lldb-server/lldb-gdbserver.cpp
In file included from /Users/buildslave/jenkins/workspace/lldb-cmake/llvm-project/lldb/tools/lldb-server/lldb-gdbserver.cpp:23:
In file included from /Users/buildslave/jenkins/workspace/lldb-cmake/llvm-project/lldb/tools/lldb-server/../../source/Plugins/Process/gdb-remote/GDBRemoteCommunicationServerLLGS.h:17:
/Users/buildslave/jenkins/workspace/lldb-cmake/llvm-project/lldb/include/lldb/Host/common/NativeProcessProtocol.h:390:19: warning: parameter 'config' is already documented [-Wdocumentation]
  /// \param[out] config
                  ^~~~~~
/Users/buildslave/jenkins/workspace/lldb-cmake/llvm-project/lldb/include/lldb/Host/common/NativeProcessProtocol.h:382:8: note: previous documentation
  /// \param[in] config
       ^         ~~~~~~
/Users/buildslave/jenkins/workspace/lldb-cmake/llvm-project/lldb/include/lldb/Host/common/NativeProcessProtocol.h:387:19: warning: parameter 'error' not found in the function declaration [-Wdocumentation]
  /// \param[out] error
                  ^~~~~
2 warnings generated.
[1221/1230] /Users/buildslave/jenkins/workspace/lldb-cmake/host-compiler/bin/clang++  -DGTEST_HAS_RTTI=0 -DHAVE_ROUND -DLIBXML2_DEFINED -DLLDB_CONFIGURATION_RELEASE -DLLDB_USE_OS_LOG -D_DEBUG -D__STDC_CONSTANT_MACROS -D__STDC_FORMAT_MACROS -D__STDC_LIMIT_MACROS -Itools/lldb/source/API -I/Users/buildslave/jenkins/workspace/lldb-cmake/llvm-project/lldb/source/API -Itools/lldb/source -I/Users/buildslave/jenkins/workspace/lldb-cmake/llvm-project/lldb/include -Itools/lldb/include -I/Applications/Xcode.app/Contents/Developer/Platforms/MacOSX.platform/Developer/SDKs/MacOSX10.14.sdk/usr/include/libxml2 -Iinclude -I/Users/buildslave/jenkins/workspace/lldb-cmake/llvm-project/llvm/include -I/usr/local/Cellar/python/3.7.0/Frameworks/Python.framework/Versions/3.7/include/python3.7m -I/Users/buildslave/jenkins/workspace/lldb-cmake/llvm-project/llvm/../clang/include -Itools/lldb/../clang/include -I/Users/buildslave/jenkins/workspace/lldb-cmake/llvm-project/lldb/source/. -Wdocumentation -fPIC -fvisibility-inlines-hidden -Werror=date-time -Werror=unguarded-availability-new -std=c++14 -fmodules -fmodules-cache-path=/Users/buildslave/jenkins/workspace/lldb-cmake/lldb-build/module.cache -fcxx-modules -Wall -Wextra -Wno-unused-parameter -Wwrite-strings -Wcast-qual -Wmissing-field-initializers -pedantic -Wno-long-long -Wimplicit-fallthrough -Wcovered-switch-default -Wno-noexcept-type -Wnon-virtual-dtor -Wdelete-non-virtual-dtor -Wstring-conversion -fdiagnostics-color -Wno-deprecated-declarations -Wno-unknown-pragmas -Wno-strict-aliasing -Wno-deprecated-register -Wno-vla-extension -O3  -isysroot /Applications/Xcode.app/Contents/Developer/Platforms/MacOSX.platform/Developer/SDKs/MacOSX10.14.sdk -fPIC   -UNDEBUG  -fno-exceptions -fno-rtti -MD -MT tools/lldb/source/API/CMakeFiles/liblldb.dir/SBType.cpp.o -MF tools/lldb/source/API/CMakeFiles/liblldb.dir/SBType.cpp.o.d -o tools/lldb/source/API/CMakeFiles/liblldb.dir/SBType.cpp.o -c /Users/buildslave/jenkins/workspace/lldb-cmake/llvm-project/lldb/source/API/SBType.cpp
[1222/1230] /Users/buildslave/jenkins/workspace/lldb-cmake/host-compiler/bin/clang++  -DGTEST_HAS_RTTI=0 -DHAVE_ROUND -DLIBXML2_DEFINED -DLLDB_CONFIGURATION_RELEASE -DLLDB_USE_OS_LOG -D_DEBUG -D__STDC_CONSTANT_MACROS -D__STDC_FORMAT_MACROS -D__STDC_LIMIT_MACROS -Itools/lldb/source/API -I/Users/buildslave/jenkins/workspace/lldb-cmake/llvm-project/lldb/source/API -Itools/lldb/source -I/Users/buildslave/jenkins/workspace/lldb-cmake/llvm-project/lldb/include -Itools/lldb/include -I/Applications/Xcode.app/Contents/Developer/Platforms/MacOSX.platform/Developer/SDKs/MacOSX10.14.sdk/usr/include/libxml2 -Iinclude -I/Users/buildslave/jenkins/workspace/lldb-cmake/llvm-project/llvm/include -I/usr/local/Cellar/python/3.7.0/Frameworks/Python.framework/Versions/3.7/include/python3.7m -I/Users/buildslave/jenkins/workspace/lldb-cmake/llvm-project/llvm/../clang/include -Itools/lldb/../clang/include -I/Users/buildslave/jenkins/workspace/lldb-cmake/llvm-project/lldb/source/. -Wdocumentation -fPIC -fvisibility-inlines-hidden -Werror=date-time -Werror=unguarded-availability-new -std=c++14 -fmodules -fmodules-cache-path=/Users/buildslave/jenkins/workspace/lldb-cmake/lldb-build/module.cache -fcxx-modules -Wall -Wextra -Wno-unused-parameter -Wwrite-strings -Wcast-qual -Wmissing-field-initializers -pedantic -Wno-long-long -Wimplicit-fallthrough -Wcovered-switch-default -Wno-noexcept-type -Wnon-virtual-dtor -Wdelete-non-virtual-dtor -Wstring-conversion -fdiagnostics-color -Wno-deprecated-declarations -Wno-unknown-pragmas -Wno-strict-aliasing -Wno-deprecated-register -Wno-vla-extension -O3  -isysroot /Applications/Xcode.app/Contents/Developer/Platforms/MacOSX.platform/Developer/SDKs/MacOSX10.14.sdk -fPIC   -UNDEBUG  -fno-exceptions -fno-rtti -MD -MT tools/lldb/source/API/CMakeFiles/liblldb.dir/SystemInitializerFull.cpp.o -MF tools/lldb/source/API/CMakeFiles/liblldb.dir/SystemInitializerFull.cpp.o.d -o tools/lldb/source/API/CMakeFiles/liblldb.dir/SystemInitializerFull.cpp.o -c /Users/buildslave/jenkins/workspace/lldb-cmake/llvm-project/lldb/source/API/SystemInitializerFull.cpp
In file included from /Users/buildslave/jenkins/workspace/lldb-cmake/llvm-project/lldb/source/API/SystemInitializerFull.cpp:80:
In file included from /Users/buildslave/jenkins/workspace/lldb-cmake/llvm-project/lldb/source/./Plugins/Platform/gdb-server/PlatformRemoteGDBServer.h:15:
/Users/buildslave/jenkins/workspace/lldb-cmake/llvm-project/lldb/source/./Plugins/Process/gdb-remote/GDBRemoteCommunicationClient.h:91:18: warning: parameter 'argv' not found in the function declaration [-Wdocumentation]
  /// \param[in] argv
                 ^~~~
/Users/buildslave/jenkins/workspace/lldb-cmake/llvm-project/lldb/source/./Plugins/Process/gdb-remote/GDBRemoteCommunicationClient.h:91:18: note: did you mean 'launch_info'?
  /// \param[in] argv
                 ^~~~
                 launch_info
/Users/buildslave/jenkins/workspace/lldb-cmake/llvm-project/lldb/source/./Plugins/Process/gdb-remote/GDBRemoteCommunicationClient.h:157:18: warning: parameter 'path' not found in the function declaration [-Wdocumentation]
  /// \param[in] path
                 ^~~~
/Users/buildslave/jenkins/workspace/lldb-cmake/llvm-project/lldb/source/./Plugins/Process/gdb-remote/GDBRemoteCommunicationClient.h:157:18: note: did you mean 'file_spec'?
  /// \param[in] path
                 ^~~~
                 file_spec
In file included from /Users/buildslave/jenkins/workspace/lldb-cmake/llvm-project/lldb/source/API/SystemInitializerFull.cpp:88:
/Users/buildslave/jenkins/workspace/lldb-cmake/llvm-project/lldb/source/./Plugins/SymbolFile/DWARF/SymbolFileDWARFDebugMap.h:347:18: warning: parameter 'addr' not found in the function declaration [-Wdocumentation]
  /// \param[in] addr
                 ^~~~
/Users/buildslave/jenkins/workspace/lldb-cmake/llvm-project/lldb/source/./Plugins/SymbolFile/DWARF/SymbolFileDWARFDebugMap.h:347:18: note: did you mean 'line_table'?
  /// \param[in] addr
                 ^~~~
                 line_table
3 warnings generated.
[1223/1230] : && /Users/buildslave/jenkins/workspace/lldb-cmake/host-compiler/bin/clang++  -Wdocumentation -fPIC -fvisibility-inlines-hidden -Werror=date-time -Werror=unguarded-availability-new -std=c++14 -fmodules -fmodules-cache-path=/Users/buildslave/jenkins/workspace/lldb-cmake/lldb-build/module.cache -fcxx-modules -Wall -Wextra -Wno-unused-parameter -Wwrite-strings -Wcast-qual -Wmissing-field-initializers -pedantic -Wno-long-long -Wimplicit-fallthrough -Wcovered-switch-default -Wno-noexcept-type -Wnon-virtual-dtor -Wdelete-non-virtual-dtor -Wstring-conversion -fdiagnostics-color -Wno-deprecated-declarations -Wno-unknown-pragmas -Wno-strict-aliasing -Wno-deprecated-register -Wno-vla-extension -O3  -isysroot /Applications/Xcode.app/Contents/Developer/Platforms/MacOSX.platform/Developer/SDKs/MacOSX10.14.sdk -Wl,-search_paths_first -Wl,-headerpad_max_install_names -Wl,-dead_strip tools/lldb/tools/lldb-server/CMakeFiles/lldb-server.dir/Acceptor.cpp.o tools/lldb/tools/lldb-server/CMakeFiles/lldb-server.dir/lldb-gdbserver.cpp.o tools/lldb/tools/lldb-server/CMakeFiles/lldb-server.dir/lldb-platform.cpp.o tools/lldb/tools/lldb-server/CMakeFiles/lldb-server.dir/lldb-server.cpp.o tools/lldb/tools/lldb-server/CMakeFiles/lldb-server.dir/LLDBServerUtilities.cpp.o tools/lldb/tools/lldb-server/CMakeFiles/lldb-server.dir/SystemInitializerLLGS.cpp.o  -o bin/lldb-server  -Wl,-rpath,@loader_path/../lib lib/libLLVMSupport.a lib/liblldbBase.a lib/liblldbHost.a lib/liblldbInitialization.a lib/liblldbPluginObjectFileMachO.a lib/liblldbPluginInstructionARM.a lib/liblldbPluginInstructionMIPS.a lib/liblldbPluginInstructionMIPS64.a lib/liblldbPluginProcessGDBRemote.a lib/liblldbPluginPlatformMacOSX.a lib/liblldbPluginPlatformPOSIX.a lib/liblldbPluginPlatformMacOSXObjCXX.a -lcompression lib/liblldbCore.a lib/liblldbSymbol.a lib/liblldbTarget.a lib/liblldbPluginProcessUtility.a lib/liblldbInterpreter.a lib/liblldbBreakpoint.a lib/liblldbDataFormatters.a lib/liblldbExpression.a lib/liblldbPluginCPlusPlusLanguage.a lib/liblldbPluginObjCLanguage.a lib/liblldbPluginExpressionParserClang.a lib/liblldbPluginSymbolFileDWARF.a lib/liblldbPluginSymbolFilePDB.a lib/liblldbPluginObjCRuntime.a lib/liblldbCommands.a lib/liblldbPluginObjectFileJIT.a lib/liblldbPluginClangCommon.a lib/liblldbPluginCPPRuntime.a lib/liblldbPluginAppleObjCRuntime.a lib/liblldbPluginSymbolFileNativePDB.a lib/liblldbCore.a lib/liblldbSymbol.a lib/liblldbTarget.a lib/liblldbPluginProcessUtility.a lib/liblldbInterpreter.a lib/liblldbBreakpoint.a lib/liblldbDataFormatters.a lib/liblldbExpression.a lib/liblldbPluginCPlusPlusLanguage.a lib/liblldbPluginObjCLanguage.a lib/liblldbPluginExpressionParserClang.a lib/liblldbPluginSymbolFileDWARF.a lib/liblldbPluginSymbolFilePDB.a lib/liblldbPluginObjCRuntime.a lib/liblldbCommands.a lib/liblldbPluginObjectFileJIT.a lib/liblldbPluginClangCommon.a lib/liblldbPluginCPPRuntime.a lib/liblldbPluginAppleObjCRuntime.a lib/liblldbPluginSymbolFileNativePDB.a lib/liblldbCore.a lib/liblldbSymbol.a lib/liblldbTarget.a lib/liblldbPluginProcessUtility.a lib/liblldbInterpreter.a lib/liblldbBreakpoint.a lib/liblldbDataFormatters.a lib/liblldbExpression.a lib/liblldbPluginCPlusPlusLanguage.a lib/liblldbPluginObjCLanguage.a lib/liblldbPluginExpressionParserClang.a lib/liblldbPluginSymbolFileDWARF.a lib/liblldbPluginSymbolFilePDB.a lib/liblldbPluginObjCRuntime.a lib/liblldbCommands.a lib/liblldbPluginObjectFileJIT.a lib/liblldbPluginClangCommon.a lib/liblldbPluginCPPRuntime.a lib/liblldbPluginAppleObjCRuntime.a lib/liblldbPluginSymbolFileNativePDB.a lib/liblldbCore.a lib/liblldbSymbol.a lib/liblldbTarget.a lib/liblldbPluginProcessUtility.a lib/liblldbInterpreter.a lib/liblldbBreakpoint.a lib/liblldbDataFormatters.a lib/liblldbExpression.a lib/liblldbPluginCPlusPlusLanguage.a lib/liblldbPluginObjCLanguage.a lib/liblldbPluginExpressionParserClang.a lib/liblldbPluginSymbolFileDWARF.a lib/liblldbPluginSymbolFilePDB.a lib/liblldbPluginObjCRuntime.a lib/liblldbCommands.a lib/liblldbPluginObjectFileJIT.a lib/liblldbPluginClangCommon.a lib/liblldbPluginCPPRuntime.a lib/liblldbPluginAppleObjCRuntime.a lib/liblldbPluginSymbolFileNativePDB.a lib/libclangCodeGen.a lib/libLLVMCoroutines.a lib/libLLVMCoverage.a lib/libLLVMLTO.a lib/libLLVMObjCARCOpts.a lib/libLLVMPasses.a lib/libclangRewriteFrontend.a lib/libclangFrontend.a lib/libclangDriver.a lib/libclangParse.a lib/libLLVMOption.a lib/libclangSerialization.a lib/libclangSema.a lib/libclangEdit.a lib/libclangAnalysis.a lib/libclangASTMatchers.a lib/libclangRewrite.a lib/libLLVMipo.a lib/libLLVMIRReader.a lib/libLLVMAsmParser.a lib/libLLVMInstrumentation.a lib/libLLVMLinker.a lib/libLLVMVectorize.a lib/libLLVMMCJIT.a lib/libLLVMExecutionEngine.a lib/libLLVMRuntimeDyld.a lib/liblldbBase.a lib/liblldbHost.a /usr/lib/libedit.dylib lib/liblldbHostMacOSXObjCXX.a lib/liblldbUtility.a -lxml2 -framework Foundation -framework CoreFoundation -framework CoreServices -framework Security /usr/lib/libcurses.dylib /usr/lib/libform.dylib /usr/lib/libpanel.dylib lib/libclangAST.a lib/libclangLex.a lib/libclangBasic.a lib/libLLVMDebugInfoPDB.a lib/libLLVMMipsCodeGen.a lib/libLLVMAsmPrinter.a lib/libLLVMDebugInfoDWARF.a lib/libLLVMGlobalISel.a lib/libLLVMSelectionDAG.a lib/libLLVMCodeGen.a lib/libLLVMBitWriter.a lib/libLLVMScalarOpts.a lib/libLLVMAggressiveInstCombine.a lib/libLLVMInstCombine.a lib/libLLVMTransformUtils.a lib/libLLVMTarget.a lib/libLLVMAnalysis.a lib/libLLVMObject.a lib/libLLVMBitReader.a lib/libLLVMTextAPI.a lib/libLLVMProfileData.a lib/libLLVMCore.a lib/libLLVMRemarks.a lib/libLLVMBitstreamReader.a lib/libLLVMMipsAsmParser.a lib/libLLVMMCParser.a lib/libLLVMMipsDesc.a lib/libLLVMMipsDisassembler.a lib/libLLVMMCDisassembler.a lib/libLLVMMC.a lib/libLLVMBinaryFormat.a lib/libLLVMDebugInfoCodeView.a lib/libLLVMDebugInfoMSF.a lib/libLLVMMipsInfo.a lib/libLLVMSupport.a -lz -lcurses -lm lib/libLLVMDemangle.a && :
[1224/1230] /Users/buildslave/jenkins/workspace/lldb-cmake/host-compiler/bin/clang++  -DGTEST_HAS_RTTI=0 -DHAVE_ROUND -DLIBXML2_DEFINED -DLLDB_CONFIGURATION_RELEASE -DLLDB_USE_OS_LOG -D_DEBUG -D__STDC_CONSTANT_MACROS -D__STDC_FORMAT_MACROS -D__STDC_LIMIT_MACROS -Itools/lldb/source/API -I/Users/buildslave/jenkins/workspace/lldb-cmake/llvm-project/lldb/source/API -Itools/lldb/source -I/Users/buildslave/jenkins/workspace/lldb-cmake/llvm-project/lldb/include -Itools/lldb/include -I/Applications/Xcode.app/Contents/Developer/Platforms/MacOSX.platform/Developer/SDKs/MacOSX10.14.sdk/usr/include/libxml2 -Iinclude -I/Users/buildslave/jenkins/workspace/lldb-cmake/llvm-project/llvm/include -I/usr/local/Cellar/python/3.7.0/Frameworks/Python.framework/Versions/3.7/include/python3.7m -I/Users/buildslave/jenkins/workspace/lldb-cmake/llvm-project/llvm/../clang/include -Itools/lldb/../clang/include -I/Users/buildslave/jenkins/workspace/lldb-cmake/llvm-project/lldb/source/. -Wdocumentation -fPIC -fvisibility-inlines-hidden -Werror=date-time -Werror=unguarded-availability-new -std=c++14 -fmodules -fmodules-cache-path=/Users/buildslave/jenkins/workspace/lldb-cmake/lldb-build/module.cache -fcxx-modules -Wall -Wextra -Wno-unused-parameter -Wwrite-strings -Wcast-qual -Wmissing-field-initializers -pedantic -Wno-long-long -Wimplicit-fallthrough -Wcovered-switch-default -Wno-noexcept-type -Wnon-virtual-dtor -Wdelete-non-virtual-dtor -Wstring-conversion -fdiagnostics-color -Wno-deprecated-declarations -Wno-unknown-pragmas -Wno-strict-aliasing -Wno-deprecated-register -Wno-vla-extension -O3  -isysroot /Applications/Xcode.app/Contents/Developer/Platforms/MacOSX.platform/Developer/SDKs/MacOSX10.14.sdk -fPIC   -UNDEBUG  -fno-exceptions -fno-rtti -MD -MT tools/lldb/source/API/CMakeFiles/liblldb.dir/SBValue.cpp.o -MF tools/lldb/source/API/CMakeFiles/liblldb.dir/SBValue.cpp.o.d -o tools/lldb/source/API/CMakeFiles/liblldb.dir/SBValue.cpp.o -c /Users/buildslave/jenkins/workspace/lldb-cmake/llvm-project/lldb/source/API/SBValue.cpp
[1225/1230] /Users/buildslave/jenkins/workspace/lldb-cmake/host-compiler/bin/clang++  -DGTEST_HAS_RTTI=0 -DHAVE_ROUND -DLIBXML2_DEFINED -DLLDB_CONFIGURATION_RELEASE -DLLDB_USE_OS_LOG -D_DEBUG -D__STDC_CONSTANT_MACROS -D__STDC_FORMAT_MACROS -D__STDC_LIMIT_MACROS -Itools/lldb/source/API -I/Users/buildslave/jenkins/workspace/lldb-cmake/llvm-project/lldb/source/API -Itools/lldb/source -I/Users/buildslave/jenkins/workspace/lldb-cmake/llvm-project/lldb/include -Itools/lldb/include -I/Applications/Xcode.app/Contents/Developer/Platforms/MacOSX.platform/Developer/SDKs/MacOSX10.14.sdk/usr/include/libxml2 -Iinclude -I/Users/buildslave/jenkins/workspace/lldb-cmake/llvm-project/llvm/include -I/usr/local/Cellar/python/3.7.0/Frameworks/Python.framework/Versions/3.7/include/python3.7m -I/Users/buildslave/jenkins/workspace/lldb-cmake/llvm-project/llvm/../clang/include -Itools/lldb/../clang/include -I/Users/buildslave/jenkins/workspace/lldb-cmake/llvm-project/lldb/source/. -Wdocumentation -fPIC -fvisibility-inlines-hidden -Werror=date-time -Werror=unguarded-availability-new -std=c++14 -fmodules -fmodules-cache-path=/Users/buildslave/jenkins/workspace/lldb-cmake/lldb-build/module.cache -fcxx-modules -Wall -Wextra -Wno-unused-parameter -Wwrite-strings -Wcast-qual -Wmissing-field-initializers -pedantic -Wno-long-long -Wimplicit-fallthrough -Wcovered-switch-default -Wno-noexcept-type -Wnon-virtual-dtor -Wdelete-non-virtual-dtor -Wstring-conversion -fdiagnostics-color -Wno-deprecated-declarations -Wno-unknown-pragmas -Wno-strict-aliasing -Wno-deprecated-register -Wno-vla-extension -O3  -isysroot /Applications/Xcode.app/Contents/Developer/Platforms/MacOSX.platform/Developer/SDKs/MacOSX10.14.sdk -fPIC   -UNDEBUG  -fno-exceptions -fno-rtti -MD -MT tools/lldb/source/API/CMakeFiles/liblldb.dir/SBTarget.cpp.o -MF tools/lldb/source/API/CMakeFiles/liblldb.dir/SBTarget.cpp.o.d -o tools/lldb/source/API/CMakeFiles/liblldb.dir/SBTarget.cpp.o -c /Users/buildslave/jenkins/workspace/lldb-cmake/llvm-project/lldb/source/API/SBTarget.cpp
[1226/1230] : && /Users/buildslave/jenkins/workspace/lldb-cmake/host-compiler/bin/clang++ -Wdocumentation -fPIC -fvisibility-inlines-hidden -Werror=date-time -Werror=unguarded-availability-new -std=c++14 -fmodules -fmodules-cache-path=/Users/buildslave/jenkins/workspace/lldb-cmake/lldb-build/module.cache -fcxx-modules -Wall -Wextra -Wno-unused-parameter -Wwrite-strings -Wcast-qual -Wmissing-field-initializers -pedantic -Wno-long-long -Wimplicit-fallthrough -Wcovered-switch-default -Wno-noexcept-type -Wnon-virtual-dtor -Wdelete-non-virtual-dtor -Wstring-conversion -fdiagnostics-color -Wno-deprecated-declarations -Wno-unknown-pragmas -Wno-strict-aliasing -Wno-deprecated-register -Wno-vla-extension -O3 -isysroot /Applications/Xcode.app/Contents/Developer/Platforms/MacOSX.platform/Developer/SDKs/MacOSX10.14.sdk -dynamiclib -Wl,-headerpad_max_install_names -Wl,-dead_strip -Wl,-exported_symbols_list,"/Users/buildslave/jenkins/workspace/lldb-cmake/lldb-build/tools/lldb/source/API/liblldb.exports"  -current_version 10.0.99 -o lib/liblldb.10.0.99svn.dylib -install_name @rpath/liblldb.10.0.99svn.dylib tools/lldb/source/API/CMakeFiles/liblldb.dir/SBAddress.cpp.o tools/lldb/source/API/CMakeFiles/liblldb.dir/SBAttachInfo.cpp.o tools/lldb/source/API/CMakeFiles/liblldb.dir/SBBlock.cpp.o tools/lldb/source/API/CMakeFiles/liblldb.dir/SBBreakpoint.cpp.o tools/lldb/source/API/CMakeFiles/liblldb.dir/SBBreakpointLocation.cpp.o tools/lldb/source/API/CMakeFiles/liblldb.dir/SBBreakpointName.cpp.o tools/lldb/source/API/CMakeFiles/liblldb.dir/SBBreakpointOptionCommon.cpp.o tools/lldb/source/API/CMakeFiles/liblldb.dir/SBBroadcaster.cpp.o tools/lldb/source/API/CMakeFiles/liblldb.dir/SBCommandInterpreter.cpp.o tools/lldb/source/API/CMakeFiles/liblldb.dir/SBCommandReturnObject.cpp.o tools/lldb/source/API/CMakeFiles/liblldb.dir/SBCommunication.cpp.o tools/lldb/source/API/CMakeFiles/liblldb.dir/SBCompileUnit.cpp.o tools/lldb/source/API/CMakeFiles/liblldb.dir/SBData.cpp.o tools/lldb/source/API/CMakeFiles/liblldb.dir/SBDebugger.cpp.o tools/lldb/source/API/CMakeFiles/liblldb.dir/SBDeclaration.cpp.o tools/lldb/source/API/CMakeFiles/liblldb.dir/SBError.cpp.o tools/lldb/source/API/CMakeFiles/liblldb.dir/SBEvent.cpp.o tools/lldb/source/API/CMakeFiles/liblldb.dir/SBExecutionContext.cpp.o tools/lldb/source/API/CMakeFiles/liblldb.dir/SBExpressionOptions.cpp.o tools/lldb/source/API/CMakeFiles/liblldb.dir/SBFileSpec.cpp.o tools/lldb/source/API/CMakeFiles/liblldb.dir/SBFileSpecList.cpp.o tools/lldb/source/API/CMakeFiles/liblldb.dir/SBFrame.cpp.o tools/lldb/source/API/CMakeFiles/liblldb.dir/SBFunction.cpp.o tools/lldb/source/API/CMakeFiles/liblldb.dir/SBHostOS.cpp.o tools/lldb/source/API/CMakeFiles/liblldb.dir/SBInstruction.cpp.o tools/lldb/source/API/CMakeFiles/liblldb.dir/SBInstructionList.cpp.o tools/lldb/source/API/CMakeFiles/liblldb.dir/SBLanguageRuntime.cpp.o tools/lldb/source/API/CMakeFiles/liblldb.dir/SBLaunchInfo.cpp.o tools/lldb/source/API/CMakeFiles/liblldb.dir/SBLineEntry.cpp.o tools/lldb/source/API/CMakeFiles/liblldb.dir/SBListener.cpp.o tools/lldb/source/API/CMakeFiles/liblldb.dir/SBMemoryRegionInfo.cpp.o tools/lldb/source/API/CMakeFiles/liblldb.dir/SBMemoryRegionInfoList.cpp.o tools/lldb/source/API/CMakeFiles/liblldb.dir/SBModule.cpp.o tools/lldb/source/API/CMakeFiles/liblldb.dir/SBModuleSpec.cpp.o tools/lldb/source/API/CMakeFiles/liblldb.dir/SBPlatform.cpp.o tools/lldb/source/API/CMakeFiles/liblldb.dir/SBProcess.cpp.o tools/lldb/source/API/CMakeFiles/liblldb.dir/SBProcessInfo.cpp.o tools/lldb/source/API/CMakeFiles/liblldb.dir/SBQueue.cpp.o tools/lldb/source/API/CMakeFiles/liblldb.dir/SBQueueItem.cpp.o tools/lldb/source/API/CMakeFiles/liblldb.dir/SBReproducer.cpp.o tools/lldb/source/API/CMakeFiles/liblldb.dir/SBSection.cpp.o tools/lldb/source/API/CMakeFiles/liblldb.dir/SBSourceManager.cpp.o tools/lldb/source/API/CMakeFiles/liblldb.dir/SBStream.cpp.o tools/lldb/source/API/CMakeFiles/liblldb.dir/SBStringList.cpp.o tools/lldb/source/API/CMakeFiles/liblldb.dir/SBStructuredData.cpp.o tools/lldb/source/API/CMakeFiles/liblldb.dir/SBSymbol.cpp.o tools/lldb/source/API/CMakeFiles/liblldb.dir/SBSymbolContext.cpp.o tools/lldb/source/API/CMakeFiles/liblldb.dir/SBSymbolContextList.cpp.o tools/lldb/source/API/CMakeFiles/liblldb.dir/SBTarget.cpp.o tools/lldb/source/API/CMakeFiles/liblldb.dir/SBThread.cpp.o tools/lldb/source/API/CMakeFiles/liblldb.dir/SBThreadCollection.cpp.o tools/lldb/source/API/CMakeFiles/liblldb.dir/SBThreadPlan.cpp.o tools/lldb/source/API/CMakeFiles/liblldb.dir/SBTrace.cpp.o tools/lldb/source/API/CMakeFiles/liblldb.dir/SBTraceOptions.cpp.o tools/lldb/source/API/CMakeFiles/liblldb.dir/SBType.cpp.o tools/lldb/source/API/CMakeFiles/liblldb.dir/SBTypeCategory.cpp.o tools/lldb/source/API/CMakeFiles/liblldb.dir/SBTypeEnumMember.cpp.o tools/lldb/source/API/CMakeFiles/liblldb.dir/SBTypeFilter.cpp.o tools/lldb/source/API/CMakeFiles/liblldb.dir/SBTypeFormat.cpp.o tools/lldb/source/API/CMakeFiles/liblldb.dir/SBTypeNameSpecifier.cpp.o tools/lldb/source/API/CMakeFiles/liblldb.dir/SBTypeSummary.cpp.o tools/lldb/source/API/CMakeFiles/liblldb.dir/SBTypeSynthetic.cpp.o tools/lldb/source/API/CMakeFiles/liblldb.dir/SBValue.cpp.o tools/lldb/source/API/CMakeFiles/liblldb.dir/SBValueList.cpp.o tools/lldb/source/API/CMakeFiles/liblldb.dir/SBVariablesOptions.cpp.o tools/lldb/source/API/CMakeFiles/liblldb.dir/SBWatchpoint.cpp.o tools/lldb/source/API/CMakeFiles/liblldb.dir/SBUnixSignals.cpp.o tools/lldb/source/API/CMakeFiles/liblldb.dir/SystemInitializerFull.cpp.o tools/lldb/source/API/CMakeFiles/liblldb.dir/__/__/scripts/LLDBWrapPython.cpp.o  -Wl,-rpath,@loader_path/../lib lib/liblldbBase.a lib/liblldbBreakpoint.a lib/liblldbCore.a lib/liblldbDataFormatters.a lib/liblldbExpression.a lib/liblldbHost.a lib/liblldbInitialization.a lib/liblldbInterpreter.a lib/liblldbSymbol.a lib/liblldbTarget.a lib/liblldbUtility.a lib/liblldbPluginABISysV_arm.a lib/liblldbPluginABISysV_arm64.a lib/liblldbPluginABISysV_hexagon.a lib/liblldbPluginABISysV_ppc.a lib/liblldbPluginABISysV_ppc64.a lib/liblldbPluginABISysV_mips.a lib/liblldbPluginABISysV_mips64.a lib/liblldbPluginABISysV_s390x.a lib/liblldbPluginABISysV_i386.a lib/liblldbPluginABISysV_x86_64.a lib/liblldbPluginABIMacOSX_i386.a lib/liblldbPluginABIMacOSX_arm.a lib/liblldbPluginABIMacOSX_arm64.a lib/liblldbPluginABIWindows_x86_64.a lib/liblldbPluginArchitectureArm.a lib/liblldbPluginArchitectureMips.a lib/liblldbPluginArchitecturePPC64.a lib/liblldbPluginDisassemblerLLVM.a lib/liblldbPluginDynamicLoaderDarwinKernel.a lib/liblldbPluginDynamicLoaderMacOSXDYLD.a lib/liblldbPluginDynamicLoaderPosixDYLD.a lib/liblldbPluginDynamicLoaderStatic.a lib/liblldbPluginDynamicLoaderHexagonDYLD.a lib/liblldbPluginDynamicLoaderWindowsDYLD.a lib/liblldbPluginExpressionParserClang.a lib/liblldbPluginInstructionARM.a lib/liblldbPluginInstructionARM64.a lib/liblldbPluginInstructionMIPS.a lib/liblldbPluginInstructionMIPS64.a lib/liblldbPluginInstructionPPC64.a lib/liblldbPluginInstrumentationRuntimeASan.a lib/liblldbPluginInstrumentationRuntimeMainThreadChecker.a lib/liblldbPluginInstrumentationRuntimeTSan.a lib/liblldbPluginInstrumentationRuntimeUBSan.a lib/liblldbPluginJITLoaderGDB.a lib/liblldbPluginClangCommon.a lib/liblldbPluginCPlusPlusLanguage.a lib/liblldbPluginObjCLanguage.a lib/liblldbPluginObjCPlusPlusLanguage.a lib/liblldbPluginCPPRuntime.a lib/liblldbPluginCXXItaniumABI.a lib/liblldbPluginObjCRuntime.a lib/liblldbPluginAppleObjCRuntime.a lib/liblldbPluginRenderScriptRuntime.a lib/liblldbPluginMemoryHistoryASan.a lib/liblldbPluginObjectContainerBSDArchive.a lib/liblldbPluginObjectContainerMachOArchive.a lib/liblldbPluginObjectFileBreakpad.a lib/liblldbPluginObjectFileELF.a lib/liblldbPluginObjectFileMachO.a lib/liblldbPluginObjectFilePECOFF.a lib/liblldbPluginObjectFileJIT.a lib/liblldbPluginOSPython.a lib/liblldbPluginPlatformLinux.a lib/liblldbPluginPlatformFreeBSD.a lib/liblldbPluginPlatformNetBSD.a lib/liblldbPluginPlatformOpenBSD.a lib/liblldbPluginPlatformMacOSX.a lib/liblldbPluginPlatformWindows.a lib/liblldbPluginPlatformPOSIX.a lib/liblldbPluginPlatformGDB.a lib/liblldbPluginPlatformAndroid.a lib/liblldbPluginProcessMacOSXKernel.a lib/liblldbPluginProcessGDBRemote.a lib/liblldbPluginProcessUtility.a lib/liblldbPluginProcessElfCore.a lib/liblldbPluginProcessMachCore.a lib/liblldbPluginProcessMinidump.a lib/liblldbPluginScriptInterpreterNone.a lib/liblldbPluginScriptInterpreterPython.a lib/liblldbPluginStructuredDataDarwinLog.a lib/liblldbPluginSymbolFileBreakpad.a lib/liblldbPluginSymbolFileDWARF.a lib/liblldbPluginSymbolFileSymtab.a lib/liblldbPluginSymbolFileNativePDB.a lib/liblldbPluginSymbolFilePDB.a lib/liblldbPluginSystemRuntimeMacOSX.a lib/liblldbPluginSymbolVendorMacOSX.a lib/liblldbPluginSymbolVendorELF.a lib/liblldbPluginUnwindAssemblyInstEmulation.a lib/liblldbPluginUnwindAssemblyX86.a lib/libLLVMSupport.a -lcompression lib/libLLVMAArch64CodeGen.a lib/libLLVMAArch64AsmParser.a lib/libLLVMAArch64Disassembler.a lib/libLLVMAArch64Desc.a lib/libLLVMAArch64Info.a lib/libLLVMAArch64Utils.a lib/libLLVMAMDGPUCodeGen.a lib/libLLVMMIRParser.a lib/libLLVMAMDGPUAsmParser.a lib/libLLVMAMDGPUDisassembler.a lib/libLLVMAMDGPUDesc.a lib/libLLVMAMDGPUInfo.a lib/libLLVMAMDGPUUtils.a lib/libLLVMARMCodeGen.a lib/libLLVMARMAsmParser.a lib/libLLVMARMDisassembler.a lib/libLLVMARMDesc.a lib/libLLVMARMInfo.a lib/libLLVMARMUtils.a lib/libLLVMBPFCodeGen.a lib/libLLVMBPFAsmParser.a lib/libLLVMBPFDesc.a lib/libLLVMBPFDisassembler.a lib/libLLVMBPFInfo.a lib/libLLVMHexagonCodeGen.a lib/libLLVMHexagonAsmParser.a lib/libLLVMHexagonDisassembler.a lib/libLLVMHexagonDesc.a lib/libLLVMHexagonInfo.a lib/libLLVMLanaiCodeGen.a lib/libLLVMLanaiAsmParser.a lib/libLLVMLanaiDisassembler.a lib/libLLVMLanaiDesc.a lib/libLLVMLanaiInfo.a lib/libLLVMMSP430CodeGen.a lib/libLLVMMSP430AsmParser.a lib/libLLVMMSP430Desc.a lib/libLLVMMSP430Disassembler.a lib/libLLVMMSP430Info.a lib/libLLVMNVPTXCodeGen.a lib/libLLVMNVPTXDesc.a lib/libLLVMNVPTXInfo.a lib/libLLVMPowerPCCodeGen.a lib/libLLVMPowerPCAsmParser.a lib/libLLVMPowerPCDesc.a lib/libLLVMPowerPCDisassembler.a lib/libLLVMPowerPCInfo.a lib/libLLVMRISCVCodeGen.a lib/libLLVMRISCVAsmParser.a lib/libLLVMRISCVDesc.a lib/libLLVMRISCVDisassembler.a lib/libLLVMRISCVInfo.a lib/libLLVMRISCVUtils.a lib/libLLVMSparcCodeGen.a lib/libLLVMSparcAsmParser.a lib/libLLVMSparcDesc.a lib/libLLVMSparcDisassembler.a lib/libLLVMSparcInfo.a lib/libLLVMSystemZCodeGen.a lib/libLLVMSystemZAsmParser.a lib/libLLVMSystemZDisassembler.a lib/libLLVMSystemZDesc.a lib/libLLVMSystemZInfo.a lib/libLLVMWebAssemblyCodeGen.a lib/libLLVMWebAssemblyAsmParser.a lib/libLLVMWebAssemblyDisassembler.a lib/libLLVMWebAssemblyDesc.a lib/libLLVMWebAssemblyInfo.a lib/libLLVMX86CodeGen.a lib/libLLVMX86AsmParser.a lib/libLLVMX86Desc.a lib/libLLVMX86Disassembler.a lib/libLLVMX86Info.a lib/libLLVMX86Utils.a lib/libLLVMXCoreCodeGen.a lib/libLLVMXCoreDesc.a lib/libLLVMXCoreDisassembler.a lib/libLLVMXCoreInfo.a lib/libLLVMMipsCodeGen.a lib/libLLVMAsmPrinter.a lib/libLLVMGlobalISel.a lib/libLLVMSelectionDAG.a lib/libLLVMMipsAsmParser.a lib/libLLVMMipsDesc.a lib/libLLVMMipsDisassembler.a lib/libLLVMMipsInfo.a lib/liblldbPluginPlatformLinux.a lib/liblldbPluginPlatformGDB.a lib/liblldbPluginDynamicLoaderStatic.a lib/liblldbPluginDynamicLoaderDarwinKernel.a lib/liblldbPluginPlatformMacOSX.a lib/liblldbPluginPlatformPOSIX.a lib/liblldbPluginPlatformMacOSXObjCXX.a lib/liblldbPluginDynamicLoaderMacOSXDYLD.a lib/liblldbPluginDynamicLoaderPosixDYLD.a lib/liblldbPluginProcessElfCore.a lib/liblldbPluginDynamicLoaderPosixDYLD.a lib/liblldbPluginProcessElfCore.a /usr/local/Cellar/python/3.7.0/Frameworks/Python.framework/Versions/3.7/lib/libpython3.7.dylib lib/liblldbPluginObjectFileBreakpad.a lib/liblldbPluginObjectFileMachO.a lib/liblldbPluginObjectFileELF.a lib/liblldbBreakpoint.a lib/liblldbCore.a lib/liblldbDataFormatters.a lib/liblldbExpression.a lib/liblldbInterpreter.a lib/liblldbSymbol.a lib/liblldbTarget.a lib/liblldbPluginExpressionParserClang.a lib/liblldbPluginClangCommon.a lib/liblldbPluginCPlusPlusLanguage.a lib/liblldbPluginObjCLanguage.a lib/liblldbPluginCPPRuntime.a lib/liblldbPluginObjCRuntime.a lib/liblldbPluginAppleObjCRuntime.a lib/liblldbPluginObjectFileJIT.a lib/liblldbPluginProcessUtility.a lib/liblldbPluginSymbolFileDWARF.a lib/liblldbPluginSymbolFileNativePDB.a lib/liblldbPluginSymbolFilePDB.a lib/liblldbCommands.a lib/liblldbBreakpoint.a lib/liblldbCore.a lib/liblldbDataFormatters.a lib/liblldbExpression.a lib/liblldbInterpreter.a lib/liblldbSymbol.a lib/liblldbTarget.a lib/liblldbPluginExpressionParserClang.a lib/liblldbPluginClangCommon.a lib/liblldbPluginCPlusPlusLanguage.a lib/liblldbPluginObjCLanguage.a lib/liblldbPluginCPPRuntime.a lib/liblldbPluginObjCRuntime.a lib/liblldbPluginAppleObjCRuntime.a lib/liblldbPluginObjectFileJIT.a lib/liblldbPluginProcessUtility.a lib/liblldbPluginSymbolFileDWARF.a lib/liblldbPluginSymbolFileNativePDB.a lib/liblldbPluginSymbolFilePDB.a lib/liblldbCommands.a lib/liblldbBreakpoint.a lib/liblldbCore.a lib/liblldbDataFormatters.a lib/liblldbExpression.a lib/liblldbInterpreter.a lib/liblldbSymbol.a lib/liblldbTarget.a lib/liblldbPluginExpressionParserClang.a lib/liblldbPluginClangCommon.a lib/liblldbPluginCPlusPlusLanguage.a lib/liblldbPluginObjCLanguage.a lib/liblldbPluginCPPRuntime.a lib/liblldbPluginObjCRuntime.a lib/liblldbPluginAppleObjCRuntime.a lib/liblldbPluginObjectFileJIT.a lib/liblldbPluginProcessUtility.a lib/liblldbPluginSymbolFileDWARF.a lib/liblldbPluginSymbolFileNativePDB.a lib/liblldbPluginSymbolFilePDB.a lib/liblldbCommands.a lib/liblldbBreakpoint.a lib/liblldbCore.a lib/liblldbDataFormatters.a lib/liblldbExpression.a lib/liblldbInterpreter.a lib/liblldbSymbol.a lib/liblldbTarget.a lib/liblldbPluginExpressionParserClang.a lib/liblldbPluginClangCommon.a lib/liblldbPluginCPlusPlusLanguage.a lib/liblldbPluginObjCLanguage.a lib/liblldbPluginCPPRuntime.a lib/liblldbPluginObjCRuntime.a lib/liblldbPluginAppleObjCRuntime.a lib/liblldbPluginObjectFileJIT.a lib/liblldbPluginProcessUtility.a lib/liblldbPluginSymbolFileDWARF.a lib/liblldbPluginSymbolFileNativePDB.a lib/liblldbPluginSymbolFilePDB.a lib/liblldbCommands.a lib/libclangCodeGen.a lib/libLLVMCoroutines.a lib/libLLVMCoverage.a lib/libLLVMLTO.a lib/libLLVMObjCARCOpts.a lib/libLLVMPasses.a lib/libLLVMCodeGen.a lib/libclangRewriteFrontend.a lib/libclangFrontend.a lib/libclangDriver.a lib/libclangParse.a lib/libLLVMOption.a lib/libclangRewrite.a lib/libclangSerialization.a lib/libclangSema.a lib/libclangEdit.a lib/libclangAnalysis.a lib/libclangASTMatchers.a lib/libLLVMipo.a lib/libLLVMIRReader.a lib/libLLVMAsmParser.a lib/libLLVMScalarOpts.a lib/libLLVMVectorize.a lib/libLLVMBitWriter.a lib/libLLVMAggressiveInstCombine.a lib/libLLVMInstCombine.a lib/libLLVMInstrumentation.a lib/libLLVMLinker.a lib/libLLVMTransformUtils.a lib/libLLVMMCJIT.a lib/libLLVMExecutionEngine.a lib/libLLVMRuntimeDyld.a lib/libLLVMTarget.a lib/libLLVMAnalysis.a lib/libLLVMProfileData.a lib/libLLVMDebugInfoDWARF.a lib/libclangAST.a lib/libclangLex.a lib/libclangBasic.a lib/libLLVMDebugInfoPDB.a lib/liblldbBase.a lib/liblldbHost.a /usr/lib/libedit.dylib lib/liblldbHostMacOSXObjCXX.a lib/libLLVMObject.a lib/libLLVMBitReader.a lib/libLLVMCore.a lib/libLLVMRemarks.a lib/libLLVMBitstreamReader.a lib/libLLVMMCParser.a lib/libLLVMTextAPI.a lib/liblldbUtility.a -lxml2 -framework Foundation -framework CoreFoundation -framework CoreServices -framework Security /usr/lib/libcurses.dylib /usr/lib/libform.dylib /usr/lib/libpanel.dylib lib/libLLVMMCDisassembler.a lib/libLLVMMC.a lib/libLLVMBinaryFormat.a lib/libLLVMDebugInfoCodeView.a lib/libLLVMDebugInfoMSF.a lib/libLLVMSupport.a lib/libLLVMDemangle.a -lz -lcurses -lm && :
[1227/1230] /usr/local/Cellar/cmake/3.12.3/bin/cmake -E cmake_symlink_library lib/liblldb.10.0.99svn.dylib lib/liblldb.10.0.99svn.dylib lib/liblldb.dylib && :
[1228/1230] cd /Users/buildslave/jenkins/workspace/lldb-cmake/lldb-build/tools/lldb && /usr/local/Cellar/python/3.7.0/bin/python3.7 /Users/buildslave/jenkins/workspace/lldb-cmake/llvm-project/lldb/scripts/finishSwigWrapperClasses.py --srcRoot=/Users/buildslave/jenkins/workspace/lldb-cmake/llvm-project/lldb --targetDir=/Users/buildslave/jenkins/workspace/lldb-cmake/lldb-build/./lib --cfgBldDir=/Users/buildslave/jenkins/workspace/lldb-cmake/lldb-build/tools/lldb/scripts --prefix=/Users/buildslave/jenkins/workspace/lldb-cmake/lldb-build --cmakeBuildConfiguration=. --lldbLibDir=lib -m
[1229/1230] : && /Users/buildslave/jenkins/workspace/lldb-cmake/host-compiler/bin/clang++  -Wdocumentation -fPIC -fvisibility-inlines-hidden -Werror=date-time -Werror=unguarded-availability-new -std=c++14 -fmodules -fmodules-cache-path=/Users/buildslave/jenkins/workspace/lldb-cmake/lldb-build/module.cache -fcxx-modules -Wall -Wextra -Wno-unused-parameter -Wwrite-strings -Wcast-qual -Wmissing-field-initializers -pedantic -Wno-long-long -Wimplicit-fallthrough -Wcovered-switch-default -Wno-noexcept-type -Wnon-virtual-dtor -Wdelete-non-virtual-dtor -Wstring-conversion -fdiagnostics-color -Wno-deprecated-declarations -Wno-unknown-pragmas -Wno-strict-aliasing -Wno-deprecated-register -Wno-vla-extension -O3  -isysroot /Applications/Xcode.app/Contents/Developer/Platforms/MacOSX.platform/Developer/SDKs/MacOSX10.14.sdk -Wl,-search_paths_first -Wl,-headerpad_max_install_names -Wl,-dead_strip tools/lldb/tools/lldb-vscode/CMakeFiles/lldb-vscode.dir/lldb-vscode.cpp.o tools/lldb/tools/lldb-vscode/CMakeFiles/lldb-vscode.dir/BreakpointBase.cpp.o tools/lldb/tools/lldb-vscode/CMakeFiles/lldb-vscode.dir/ExceptionBreakpoint.cpp.o tools/lldb/tools/lldb-vscode/CMakeFiles/lldb-vscode.dir/FunctionBreakpoint.cpp.o tools/lldb/tools/lldb-vscode/CMakeFiles/lldb-vscode.dir/IOStream.cpp.o tools/lldb/tools/lldb-vscode/CMakeFiles/lldb-vscode.dir/JSONUtils.cpp.o tools/lldb/tools/lldb-vscode/CMakeFiles/lldb-vscode.dir/LLDBUtils.cpp.o tools/lldb/tools/lldb-vscode/CMakeFiles/lldb-vscode.dir/SourceBreakpoint.cpp.o tools/lldb/tools/lldb-vscode/CMakeFiles/lldb-vscode.dir/VSCode.cpp.o  -o bin/lldb-vscode  -Wl,-rpath,@loader_path/../lib lib/libLLVMSupport.a lib/libLLVMSupport.a lib/liblldb.10.0.99svn.dylib -lpthread -lz -lcurses -lm lib/libLLVMDemangle.a && :
[1230/1230] : && /Users/buildslave/jenkins/workspace/lldb-cmake/host-compiler/bin/clang++  -Wdocumentation -fPIC -fvisibility-inlines-hidden -Werror=date-time -Werror=unguarded-availability-new -std=c++14 -fmodules -fmodules-cache-path=/Users/buildslave/jenkins/workspace/lldb-cmake/lldb-build/module.cache -fcxx-modules -Wall -Wextra -Wno-unused-parameter -Wwrite-strings -Wcast-qual -Wmissing-field-initializers -pedantic -Wno-long-long -Wimplicit-fallthrough -Wcovered-switch-default -Wno-noexcept-type -Wnon-virtual-dtor -Wdelete-non-virtual-dtor -Wstring-conversion -fdiagnostics-color -Wno-deprecated-declarations -Wno-unknown-pragmas -Wno-strict-aliasing -Wno-deprecated-register -Wno-vla-extension -O3  -isysroot /Applications/Xcode.app/Contents/Developer/Platforms/MacOSX.platform/Developer/SDKs/MacOSX10.14.sdk -Wl,-search_paths_first -Wl,-headerpad_max_install_names -Wl,-sectcreate,__TEXT,__info_plist,/Users/buildslave/jenkins/workspace/lldb-cmake/llvm-project/lldb/tools/driver/lldb-Info.plist    -Wl,-dead_strip tools/lldb/tools/driver/CMakeFiles/lldb.dir/Driver.cpp.o tools/lldb/tools/driver/CMakeFiles/lldb.dir/Platform.cpp.o  -o bin/lldb  -Wl,-rpath,@loader_path/../lib lib/libLLVMOption.a lib/libLLVMSupport.a lib/liblldb.10.0.99svn.dylib -lz -lcurses -lm lib/libLLVMDemangle.a && :
Completed at: 2019-09-09T16:23:50
@@@@@@
[Pipeline] }
[Pipeline] // timeout
[Pipeline] }
[Pipeline] // stage
[Pipeline] stage
[Pipeline] { (Test)
[Pipeline] timeout
Timeout set to expire in 1 hr 0 min
[Pipeline] {
[Pipeline] sh
+ set -u
+ export PATH=/usr/local/bin:/usr/local/sbin:/usr/bin:/bin:/usr/sbin:/sbin:/usr/bin:/usr/local/bin
+ PATH=/usr/local/bin:/usr/local/sbin:/usr/bin:/bin:/usr/sbin:/sbin:/usr/bin:/usr/local/bin
+ rm -rf test/results.xml
+ python llvm-zorg/zorg/jenkins/monorepo_build.py lldb-cmake testlong
Clean

Hide Details

@@@ Clean @@@ Removing module cache: /Users/buildslave/jenkins/workspace/lldb-cmake/lldb-build/module.cache Completed at: 2019-09-09T16:23:54 @@@@@@
Run Debug Info Tests

Hide Details

@@@ Run Debug Info Tests @@@ cd /Users/buildslave/jenkins/workspace/lldb-cmake/lldb-build '/usr/local/bin/ninja' '-v' 'check-debuginfo' [0/1] cd /Users/buildslave/jenkins/workspace/lldb-cmake/lldb-build/projects/debuginfo-tests && /usr/local/Cellar/python/3.7.0/bin/python3.7 /Users/buildslave/jenkins/workspace/lldb-cmake/lldb-build/./bin/llvm-lit -v --time-tests --shuffle --xunit-xml-output=/Users/buildslave/jenkins/workspace/lldb-cmake/test/results.xml -v /Users/buildslave/jenkins/workspace/lldb-cmake/lldb-build/projects/debuginfo-tests -- Testing: 24 tests, 24 threads -- llvm-lit: /Users/buildslave/jenkins/workspace/lldb-cmake/llvm-project/llvm/utils/lit/lit/llvm/config.py:340: note: using clang: /Users/buildslave/jenkins/workspace/lldb-cmake/lldb-build/bin/clang llvm-lit: /Users/buildslave/jenkins/workspace/lldb-cmake/llvm-project/llvm/utils/lit/lit/util.py:408: note: using SDKROOT: '/Applications/Xcode.app/Contents/Developer/Platforms/MacOSX.platform/Developer/SDKs/MacOSX10.14.sdk' UNSUPPORTED: debuginfo-tests :: win_cdb/hello.c (1 of 24) UNSUPPORTED: debuginfo-tests :: win_cdb/nrvo.cpp (2 of 24) UNSUPPORTED: debuginfo-tests :: win_cdb/inline-line-gap.cpp (3 of 24) UNSUPPORTED: debuginfo-tests :: win_cdb/global-constant.cpp (4 of 24) UNSUPPORTED: debuginfo-tests :: safestack.c (5 of 24) UNSUPPORTED: debuginfo-tests :: win_cdb/realigned-frame.cpp (6 of 24) UNSUPPORTED: debuginfo-tests :: asan.c (7 of 24) UNSUPPORTED: debuginfo-tests :: asan-deque.cpp (8 of 24) UNSUPPORTED: debuginfo-tests :: asan-blocks.c (9 of 24) PASS: debuginfo-tests :: apple-accel.cpp (10 of 24) PASS: debuginfo-tests :: nested-struct.cpp (11 of 24) PASS: debuginfo-tests :: forward-declare-class.cpp (12 of 24) PASS: debuginfo-tests :: static-member.cpp (13 of 24) FAIL: debuginfo-tests :: nrvo-string.cpp (14 of 24) ******************** TEST 'debuginfo-tests :: nrvo-string.cpp' FAILED ******************** Script: -- : 'RUN: at line 4'; /Users/buildslave/jenkins/workspace/lldb-cmake/lldb-build/bin/clang --driver-mode=g++ -O0 -fno-exceptions --target=x86_64-apple-darwin18.0.0 /Users/buildslave/jenkins/workspace/lldb-cmake/llvm-project/debuginfo-tests/nrvo-string.cpp -o /Users/buildslave/jenkins/workspace/lldb-cmake/lldb-build/projects/debuginfo-tests/Output/nrvo-string.cpp.tmp.out -g : 'RUN: at line 5'; /Users/buildslave/jenkins/workspace/lldb-cmake/llvm-project/debuginfo-tests/test_debuginfo.pl /Users/buildslave/jenkins/workspace/lldb-cmake/llvm-project/debuginfo-tests/nrvo-string.cpp /Users/buildslave/jenkins/workspace/lldb-cmake/lldb-build/projects/debuginfo-tests/Output/nrvo-string.cpp.tmp.out : 'RUN: at line 6'; /Users/buildslave/jenkins/workspace/lldb-cmake/lldb-build/bin/clang --driver-mode=g++ -O1 -fno-exceptions --target=x86_64-apple-darwin18.0.0 /Users/buildslave/jenkins/workspace/lldb-cmake/llvm-project/debuginfo-tests/nrvo-string.cpp -o /Users/buildslave/jenkins/workspace/lldb-cmake/lldb-build/projects/debuginfo-tests/Output/nrvo-string.cpp.tmp.out -g : 'RUN: at line 7'; /Users/buildslave/jenkins/workspace/lldb-cmake/llvm-project/debuginfo-tests/test_debuginfo.pl /Users/buildslave/jenkins/workspace/lldb-cmake/llvm-project/debuginfo-tests/nrvo-string.cpp /Users/buildslave/jenkins/workspace/lldb-cmake/lldb-build/projects/debuginfo-tests/Output/nrvo-string.cpp.tmp.out -- Exit Code: 1

Hide Details

Command Output (stdout): -- Debugger output was: imported lldb from: "/Applications/Xcode.app/Contents/SharedFrameworks/LLDB.framework/Versions/A/Resources/Python" > break 23 SBBreakpoint: id = 1, file = '/Users/buildslave/jenkins/workspace/lldb-cmake/llvm-project/debuginfo-tests/nrvo-string.cpp', line = 23, exact_match = 0, locations = 1 > break 39 SBBreakpoint: id = 2, file = '/Users/buildslave/jenkins/workspace/lldb-cmake/llvm-project/debuginfo-tests/nrvo-string.cpp', line = 39, exact_match = 0, locations = 1 > r error: process exited with status -1 (unable to attach) State = 10

Hide Details

ERROR: Could not launch process. NOTE: There are several reasons why this may happen: * Root needs to run "DevToolsSecurity --enable". * Older versions of lldb cannot launch more than one process simultaneously.

Hide Details

Hide Details

-- Command Output (stderr): -- /Users/buildslave/jenkins/workspace/lldb-cmake/llvm-project/debuginfo-tests/nrvo-string.cpp:52:11: error: CHECK: expected string not found in input // CHECK: = 5 ^ /Users/buildslave/jenkins/workspace/lldb-cmake/lldb-build/projects/debuginfo-tests/Output/nrvo-string.cpp.gdb.output:5:133: note: scanning from here SBBreakpoint: id = 2, file = '/Users/buildslave/jenkins/workspace/lldb-cmake/llvm-project/debuginfo-tests/nrvo-string.cpp', line = 39, exact_match = 0, locations = 1 ^ /Users/buildslave/jenkins/workspace/lldb-cmake/lldb-build/projects/debuginfo-tests/Output/nrvo-string.cpp.gdb.output:5:148: note: possible intended match here SBBreakpoint: id = 2, file = '/Users/buildslave/jenkins/workspace/lldb-cmake/llvm-project/debuginfo-tests/nrvo-string.cpp', line = 39, exact_match = 0, locations = 1 ^

Hide Details

--

Hide Details

******************** FAIL: debuginfo-tests :: stack-var.c (15 of 24) ******************** TEST 'debuginfo-tests :: stack-var.c' FAILED ******************** Script: -- : 'RUN: at line 1'; /Users/buildslave/jenkins/workspace/lldb-cmake/lldb-build/bin/clang --target=x86_64-apple-darwin18.0.0 /Users/buildslave/jenkins/workspace/lldb-cmake/llvm-project/debuginfo-tests/stack-var.c -O -o /Users/buildslave/jenkins/workspace/lldb-cmake/lldb-build/projects/debuginfo-tests/Output/stack-var.c.tmp.out -g : 'RUN: at line 2'; /Users/buildslave/jenkins/workspace/lldb-cmake/llvm-project/debuginfo-tests/test_debuginfo.pl /Users/buildslave/jenkins/workspace/lldb-cmake/llvm-project/debuginfo-tests/stack-var.c /Users/buildslave/jenkins/workspace/lldb-cmake/lldb-build/projects/debuginfo-tests/Output/stack-var.c.tmp.out -- Exit Code: 1

Hide Details

Command Output (stdout): -- Debugger output was: imported lldb from: "/Applications/Xcode.app/Contents/SharedFrameworks/LLDB.framework/Versions/A/Resources/Python" > break 12 SBBreakpoint: id = 1, file = '/Users/buildslave/jenkins/workspace/lldb-cmake/llvm-project/debuginfo-tests/stack-var.c', line = 12, exact_match = 0, locations = 1 > r error: process exited with status -1 (unable to attach) State = 10

Hide Details

ERROR: Could not launch process. NOTE: There are several reasons why this may happen: * Root needs to run "DevToolsSecurity --enable". * Older versions of lldb cannot launch more than one process simultaneously.

Hide Details

Hide Details

-- Command Output (stderr): -- /Users/buildslave/jenkins/workspace/lldb-cmake/llvm-project/debuginfo-tests/stack-var.c:11:12: error: CHECK: expected string not found in input // CHECK: = 23 ^ /Users/buildslave/jenkins/workspace/lldb-cmake/lldb-build/projects/debuginfo-tests/Output/stack-var.c.gdb.output:1:1: note: scanning from here imported lldb from: "/Applications/Xcode.app/Contents/SharedFrameworks/LLDB.framework/Versions/A/Resources/Python" ^ /Users/buildslave/jenkins/workspace/lldb-cmake/lldb-build/projects/debuginfo-tests/Output/stack-var.c.gdb.output:3:18: note: possible intended match here SBBreakpoint: id = 1, file = '/Users/buildslave/jenkins/workspace/lldb-cmake/llvm-project/debuginfo-tests/stack-var.c', line = 12, exact_match = 0, locations = 1 ^

Hide Details

--

Hide Details

******************** XFAIL: debuginfo-tests :: static-member-2.cpp (16 of 24) PASS: debuginfo-tests :: ctor.cpp (17 of 24) PASS: debuginfo-tests :: aggregate-indirect-arg.cpp (18 of 24) PASS: debuginfo-tests :: dbg-arg.c (19 of 24) PASS: debuginfo-tests :: sret.cpp (20 of 24) PASS: debuginfo-tests :: vla.c (21 of 24) FAIL: debuginfo-tests :: block_var.m (22 of 24) ******************** TEST 'debuginfo-tests :: block_var.m' FAILED ******************** Script: -- : 'RUN: at line 1'; /Users/buildslave/jenkins/workspace/lldb-cmake/lldb-build/bin/clang --target=x86_64-apple-darwin18.0.0 -O0 -g /Users/buildslave/jenkins/workspace/lldb-cmake/llvm-project/debuginfo-tests/block_var.m -c -o /Users/buildslave/jenkins/workspace/lldb-cmake/lldb-build/projects/debuginfo-tests/Output/block_var.m.tmp.o : 'RUN: at line 2'; /Users/buildslave/jenkins/workspace/lldb-cmake/lldb-build/bin/clang --target=x86_64-apple-darwin18.0.0 /Users/buildslave/jenkins/workspace/lldb-cmake/lldb-build/projects/debuginfo-tests/Output/block_var.m.tmp.o -o /Users/buildslave/jenkins/workspace/lldb-cmake/lldb-build/projects/debuginfo-tests/Output/block_var.m.tmp.out -framework Foundation : 'RUN: at line 3'; /Users/buildslave/jenkins/workspace/lldb-cmake/llvm-project/debuginfo-tests/test_debuginfo.pl /Users/buildslave/jenkins/workspace/lldb-cmake/llvm-project/debuginfo-tests/block_var.m /Users/buildslave/jenkins/workspace/lldb-cmake/lldb-build/projects/debuginfo-tests/Output/block_var.m.tmp.out -- Exit Code: 1

Hide Details

Command Output (stdout): -- Debugger output was: imported lldb from: "/Applications/Xcode.app/Contents/SharedFrameworks/LLDB.framework/Versions/A/Resources/Python" > break 24 SBBreakpoint: id = 1, file = '/Users/buildslave/jenkins/workspace/lldb-cmake/llvm-project/debuginfo-tests/block_var.m', line = 24, exact_match = 0, locations = 1 > r error: process exited with status -1 (unable to attach) State = 10

Hide Details

ERROR: Could not launch process. NOTE: There are several reasons why this may happen: * Root needs to run "DevToolsSecurity --enable". * Older versions of lldb cannot launch more than one process simultaneously.

Hide Details

Hide Details

-- Command Output (stderr): -- /Users/buildslave/jenkins/workspace/lldb-cmake/llvm-project/debuginfo-tests/block_var.m:10:11: error: CHECK: expected string not found in input // CHECK: ${{[0-9]}} = 42 ^ /Users/buildslave/jenkins/workspace/lldb-cmake/lldb-build/projects/debuginfo-tests/Output/block_var.m.gdb.output:1:1: note: scanning from here imported lldb from: "/Applications/Xcode.app/Contents/SharedFrameworks/LLDB.framework/Versions/A/Resources/Python" ^ /Users/buildslave/jenkins/workspace/lldb-cmake/lldb-build/projects/debuginfo-tests/Output/block_var.m.gdb.output:3:8: note: possible intended match here SBBreakpoint: id = 1, file = '/Users/buildslave/jenkins/workspace/lldb-cmake/llvm-project/debuginfo-tests/block_var.m', line = 24, exact_match = 0, locations = 1 ^

Hide Details

--

Hide Details

******************** FAIL: debuginfo-tests :: foreach.m (23 of 24) ******************** TEST 'debuginfo-tests :: foreach.m' FAILED ******************** Script: -- : 'RUN: at line 1'; /Users/buildslave/jenkins/workspace/lldb-cmake/lldb-build/bin/clang --target=x86_64-apple-darwin18.0.0 -O0 -g /Users/buildslave/jenkins/workspace/lldb-cmake/llvm-project/debuginfo-tests/foreach.m -c -o /Users/buildslave/jenkins/workspace/lldb-cmake/lldb-build/projects/debuginfo-tests/Output/foreach.m.tmp.o : 'RUN: at line 2'; /Users/buildslave/jenkins/workspace/lldb-cmake/lldb-build/bin/clang --target=x86_64-apple-darwin18.0.0 /Users/buildslave/jenkins/workspace/lldb-cmake/lldb-build/projects/debuginfo-tests/Output/foreach.m.tmp.o -o /Users/buildslave/jenkins/workspace/lldb-cmake/lldb-build/projects/debuginfo-tests/Output/foreach.m.tmp.out -framework Foundation : 'RUN: at line 3'; /Users/buildslave/jenkins/workspace/lldb-cmake/llvm-project/debuginfo-tests/test_debuginfo.pl /Users/buildslave/jenkins/workspace/lldb-cmake/llvm-project/debuginfo-tests/foreach.m /Users/buildslave/jenkins/workspace/lldb-cmake/lldb-build/projects/debuginfo-tests/Output/foreach.m.tmp.out -- Exit Code: 1

Hide Details

Command Output (stdout): -- Debugger output was: imported lldb from: "/Applications/Xcode.app/Contents/SharedFrameworks/LLDB.framework/Versions/A/Resources/Python" > break 25 SBBreakpoint: id = 1, file = '/Users/buildslave/jenkins/workspace/lldb-cmake/llvm-project/debuginfo-tests/foreach.m', line = 25, exact_match = 0, locations = 1 > r error: process exited with status -1 (unable to attach) State = 10

Hide Details

ERROR: Could not launch process. NOTE: There are several reasons why this may happen: * Root needs to run "DevToolsSecurity --enable". * Older versions of lldb cannot launch more than one process simultaneously.

Hide Details

Hide Details

-- Command Output (stderr): -- /Users/buildslave/jenkins/workspace/lldb-cmake/llvm-project/debuginfo-tests/foreach.m:11:11: error: CHECK: expected string not found in input // CHECK: aaa ^ /Users/buildslave/jenkins/workspace/lldb-cmake/lldb-build/projects/debuginfo-tests/Output/foreach.m.gdb.output:1:1: note: scanning from here imported lldb from: "/Applications/Xcode.app/Contents/SharedFrameworks/LLDB.framework/Versions/A/Resources/Python" ^ /Users/buildslave/jenkins/workspace/lldb-cmake/lldb-build/projects/debuginfo-tests/Output/foreach.m.gdb.output:1:27: note: possible intended match here imported lldb from: "/Applications/Xcode.app/Contents/SharedFrameworks/LLDB.framework/Versions/A/Resources/Python" ^

Hide Details

--

Hide Details

******************** FAIL: debuginfo-tests :: blocks.m (24 of 24) ******************** TEST 'debuginfo-tests :: blocks.m' FAILED ******************** Script: -- : 'RUN: at line 1'; /Users/buildslave/jenkins/workspace/lldb-cmake/lldb-build/bin/clang --target=x86_64-apple-darwin18.0.0 -O0 -g /Users/buildslave/jenkins/workspace/lldb-cmake/llvm-project/debuginfo-tests/blocks.m -c -o /Users/buildslave/jenkins/workspace/lldb-cmake/lldb-build/projects/debuginfo-tests/Output/blocks.m.tmp.o : 'RUN: at line 2'; /Users/buildslave/jenkins/workspace/lldb-cmake/lldb-build/bin/clang --target=x86_64-apple-darwin18.0.0 /Users/buildslave/jenkins/workspace/lldb-cmake/lldb-build/projects/debuginfo-tests/Output/blocks.m.tmp.o -o /Users/buildslave/jenkins/workspace/lldb-cmake/lldb-build/projects/debuginfo-tests/Output/blocks.m.tmp.out -framework Foundation : 'RUN: at line 3'; /Users/buildslave/jenkins/workspace/lldb-cmake/llvm-project/debuginfo-tests/test_debuginfo.pl /Users/buildslave/jenkins/workspace/lldb-cmake/llvm-project/debuginfo-tests/blocks.m /Users/buildslave/jenkins/workspace/lldb-cmake/lldb-build/projects/debuginfo-tests/Output/blocks.m.tmp.out -- Exit Code: 1

Hide Details

Command Output (stdout): -- Debugger output was: imported lldb from: "/Applications/Xcode.app/Contents/SharedFrameworks/LLDB.framework/Versions/A/Resources/Python" > break 31 SBBreakpoint: id = 1, file = '/Users/buildslave/jenkins/workspace/lldb-cmake/llvm-project/debuginfo-tests/blocks.m', line = 31, exact_match = 0, locations = 1 > r error: process exited with status -1 (unable to attach) State = 10

Hide Details

ERROR: Could not launch process. NOTE: There are several reasons why this may happen: * Root needs to run "DevToolsSecurity --enable". * Older versions of lldb cannot launch more than one process simultaneously.

Hide Details

Hide Details

-- Command Output (stderr): -- /Users/buildslave/jenkins/workspace/lldb-cmake/llvm-project/debuginfo-tests/blocks.m:11:11: error: CHECK: expected string not found in input // CHECK: ${{[0-9]}} = 1 ^ /Users/buildslave/jenkins/workspace/lldb-cmake/lldb-build/projects/debuginfo-tests/Output/blocks.m.gdb.output:1:1: note: scanning from here imported lldb from: "/Applications/Xcode.app/Contents/SharedFrameworks/LLDB.framework/Versions/A/Resources/Python" ^ /Users/buildslave/jenkins/workspace/lldb-cmake/lldb-build/projects/debuginfo-tests/Output/blocks.m.gdb.output:3:8: note: possible intended match here SBBreakpoint: id = 1, file = '/Users/buildslave/jenkins/workspace/lldb-cmake/llvm-project/debuginfo-tests/blocks.m', line = 31, exact_match = 0, locations = 1 ^

Hide Details

--

Hide Details

******************** Testing Time: 3.61s ******************** Failing Tests (5): debuginfo-tests :: nrvo-string.cpp debuginfo-tests :: stack-var.c debuginfo-tests :: blocks.m debuginfo-tests :: block_var.m debuginfo-tests :: foreach.m

Hide Details

Hide Details

Slowest Tests: -------------------------------------------------------------------------- 0.00s: debuginfo-tests :: win_cdb/global-constant.cpp 0.00s: debuginfo-tests :: safestack.c 0.00s: debuginfo-tests :: asan-deque.cpp 0.00s: debuginfo-tests :: asan.c 0.00s: debuginfo-tests :: asan-blocks.c 0.18s: debuginfo-tests :: apple-accel.cpp 0.52s: debuginfo-tests :: nested-struct.cpp 0.52s: debuginfo-tests :: forward-declare-class.cpp 0.88s: debuginfo-tests :: static-member.cpp 0.91s: debuginfo-tests :: nrvo-string.cpp 0.91s: debuginfo-tests :: stack-var.c 1.22s: debuginfo-tests :: static-member-2.cpp 1.25s: debuginfo-tests :: ctor.cpp 1.50s: debuginfo-tests :: aggregate-indirect-arg.cpp 1.52s: debuginfo-tests :: dbg-arg.c 1.57s: debuginfo-tests :: sret.cpp 1.61s: debuginfo-tests :: vla.c 2.30s: debuginfo-tests :: block_var.m 3.03s: debuginfo-tests :: foreach.m 3.49s: debuginfo-tests :: blocks.m

Hide Details

Tests Times: -------------------------------------------------------------------------- [ Range ] :: [ Percentage ] :: [Count] -------------------------------------------------------------------------- [0.00s,0.20s) :: [**************** ] :: [10/24] [0.20s,0.40s) :: [ ] :: [ 0/24] [0.40s,0.60s) :: [*** ] :: [ 2/24] [0.60s,0.80s) :: [ ] :: [ 0/24] [0.80s,1.00s) :: [***** ] :: [ 3/24] [1.00s,1.20s) :: [ ] :: [ 0/24] [1.20s,1.40s) :: [*** ] :: [ 2/24] [1.40s,1.60s) :: [*** ] :: [ 2/24] [1.60s,1.80s) :: [*** ] :: [ 2/24] [1.80s,2.00s) :: [ ] :: [ 0/24] [2.00s,2.20s) :: [ ] :: [ 0/24] [2.20s,2.40s) :: [* ] :: [ 1/24] [2.40s,2.60s) :: [ ] :: [ 0/24] [2.60s,2.80s) :: [ ] :: [ 0/24] [2.80s,3.00s) :: [ ] :: [ 0/24] [3.00s,3.20s) :: [* ] :: [ 1/24] [3.20s,3.40s) :: [ ] :: [ 0/24] [3.40s,3.60s) :: [* ] :: [ 1/24] Expected Passes : 9 Expected Failures : 1 Unsupported Tests : 9 Unexpected Failures: 5 FAILED: projects/debuginfo-tests/CMakeFiles/check-debuginfo cd /Users/buildslave/jenkins/workspace/lldb-cmake/lldb-build/projects/debuginfo-tests && /usr/local/Cellar/python/3.7.0/bin/python3.7 /Users/buildslave/jenkins/workspace/lldb-cmake/lldb-build/./bin/llvm-lit -v --time-tests --shuffle --xunit-xml-output=/Users/buildslave/jenkins/workspace/lldb-cmake/test/results.xml -v /Users/buildslave/jenkins/workspace/lldb-cmake/lldb-build/projects/debuginfo-tests ninja: build stopped: subcommand failed. Command failed Command: ['/usr/local/bin/ninja', '-v', 'check-debuginfo'] [Pipeline] } [Pipeline] // timeout [Pipeline] } [Pipeline] // stage [Pipeline] stage [Pipeline] { (Declarative: Post Actions) [Pipeline] scanForIssues No credentials specified [Clang (LLVM based)] Sleeping for 5 seconds due to JENKINS-32191... [Clang (LLVM based)] Parsing console log (workspace: '/Users/buildslave/jenkins/workspace/lldb-cmake') [Clang (LLVM based)] [-ERROR-] Git blame errors: [Clang (LLVM based)] [-ERROR-] - no blame results for request <llvm-project/lldb/include/lldb/Target/Process.h - [1394, 2373, 523, 717, 1725, 2174]>.

Hide Details

[Clang (LLVM based)] [-ERROR-] Git blame errors: [Clang (LLVM based)] [-ERROR-] - no blame results for request <llvm-project/lldb/include/lldb/Host/common/NativeProcessProtocol.h - [387, 390]>.

Hide Details

[Clang (LLVM based)] [-ERROR-] Git blame errors: [Clang (LLVM based)] [-ERROR-] - no blame results for request <llvm-project/lldb/include/lldb/Utility/ConstString.h - [336, 148, 167, 329, 190]>.

Hide Details

[Clang (LLVM based)] [-ERROR-] Git blame errors: [Clang (LLVM based)] [-ERROR-] - no blame results for request <llvm-project/lldb/include/lldb/Utility/Broadcaster.h - [272, 352, 371, 264, 312, 393, 268]>.

Hide Details

[Clang (LLVM based)] [-ERROR-] Git blame errors: [Clang (LLVM based)] [-ERROR-] - no blame results for request <llvm-project/lldb/include/lldb/Expression/ExpressionParser.h - [32]>.

Hide Details

[Clang (LLVM based)] [-ERROR-] Git blame errors: [Clang (LLVM based)] [-ERROR-] - no blame results for request <llvm-project/lldb/source/Plugins/ExpressionParser/Clang/ASTResultSynthesizer.h - [148, 141]>.

Hide Details

[Clang (LLVM based)] [-ERROR-] Git blame errors: [Clang (LLVM based)] [-ERROR-] - no blame results for request <llvm-project/lldb/include/lldb/Symbol/Declaration.h - [104]>.

Hide Details

[Clang (LLVM based)] [-ERROR-] Git blame errors: [Clang (LLVM based)] [-ERROR-] - no blame results for request <llvm-project/lldb/include/lldb/Host/PseudoTerminal.h - [64, 68, 168, 107, 139, 172, 143]>.

Hide Details

[Clang (LLVM based)] [-ERROR-] Git blame errors: [Clang (LLVM based)] [-ERROR-] - no blame results for request <llvm-project/lldb/include/lldb/Expression/UtilityFunction.h - [67]>.

Hide Details

[Clang (LLVM based)] [-ERROR-] Git blame errors: [Clang (LLVM based)] [-ERROR-] - no blame results for request <llvm-project/lldb/include/lldb/Target/StackFrame.h - [102, 294, 409, 426, 302]>.

Hide Details

[Clang (LLVM based)] [-ERROR-] Git blame errors: [Clang (LLVM based)] [-ERROR-] - no blame results for request <llvm-project/lldb/source/Plugins/InstrumentationRuntime/MainThreadChecker/MainThreadCheckerRuntime.cpp - [156]>.

Hide Details

[Clang (LLVM based)] [-ERROR-] Git blame errors: [Clang (LLVM based)] [-ERROR-] - no blame results for request <llvm-project/lldb/source/Plugins/ExpressionParser/Clang/ClangExpressionDeclMap.h - [256, 66, 259, 280, 474, 490, 300, 444, 253]>.

Hide Details

[Clang (LLVM based)] [-ERROR-] Git blame errors: [Clang (LLVM based)] [-ERROR-] - no blame results for request <llvm-project/lldb/include/lldb/Host/HostProcess.h - [15]>.

Hide Details

[Clang (LLVM based)] [-ERROR-] Git blame errors: [Clang (LLVM based)] [-ERROR-] - no blame results for request <llvm-project/lldb/include/lldb/Utility/Flags.h - [32]>.

Hide Details

[Clang (LLVM based)] [-ERROR-] Git blame errors: [Clang (LLVM based)] [-ERROR-] - no blame results for request <llvm-project/lldb/include/lldb/Core/SearchFilter.h - [355, 309, 358, 87, 105, 410, 413]>.

Hide Details

[Clang (LLVM based)] [-ERROR-] Git blame errors: [Clang (LLVM based)] [-ERROR-] - no blame results for request <llvm-project/lldb/include/lldb/Core/ModuleChild.h - [49, 23]>.

Hide Details

[Clang (LLVM based)] [-ERROR-] Git blame errors: [Clang (LLVM based)] [-ERROR-] - no blame results for request <llvm-project/lldb/source/Plugins/ExpressionParser/Clang/IRForTarget.h - [384, 145, 497, 290, 74, 394, 108, 365, 525, 78, 190, 494]>.

Hide Details

[Clang (LLVM based)] [-ERROR-] Git blame errors: [Clang (LLVM based)] [-ERROR-] - no blame results for request <llvm-project/debuginfo-tests/foreach.m - [11]>.

Hide Details

[Clang (LLVM based)] [-ERROR-] Git blame errors: [Clang (LLVM based)] [-ERROR-] - no blame results for request <llvm-project/lldb/include/lldb/Breakpoint/BreakpointList.h - [141]>.

Hide Details

[Clang (LLVM based)] [-ERROR-] Git blame errors: [Clang (LLVM based)] [-ERROR-] - no blame results for request <llvm-project/lldb/include/lldb/Breakpoint/BreakpointLocationCollection.h - [34, 115, 69, 30]>.

Hide Details

[Clang (LLVM based)] [-ERROR-] Git blame errors: [Clang (LLVM based)] [-ERROR-] - no blame results for request <llvm-project/lldb/include/lldb/Core/AddressRange.h - [150, 126]>.

Hide Details

[Clang (LLVM based)] [-ERROR-] Git blame errors: [Clang (LLVM based)] [-ERROR-] - no blame results for request <llvm-project/lldb/include/lldb/Breakpoint/BreakpointOptions.h - [298]>.

Hide Details

[Clang (LLVM based)] [-ERROR-] Git blame errors: [Clang (LLVM based)] [-ERROR-] - no blame results for request <llvm-project/lldb/include/lldb/Breakpoint/Breakpoint.h - [208, 196, 376]>.

Hide Details

[Clang (LLVM based)] [-ERROR-] Git blame errors: [Clang (LLVM based)] [-ERROR-] - no blame results for request <llvm-project/lldb/include/lldb/Core/Highlighter.h - [102, 46, 47]>.

Hide Details

[Clang (LLVM based)] [-ERROR-] Git blame errors: [Clang (LLVM based)] [-ERROR-] - no blame results for request <llvm-project/lldb/include/lldb/Symbol/Block.h - [81, 85, 246, 235, 60, 63]>.

Hide Details

[Clang (LLVM based)] [-ERROR-] Git blame errors: [Clang (LLVM based)] [-ERROR-] - no blame results for request <llvm-project/llvm/include/llvm/Analysis/ScalarEvolution.h - [1702]>.

Hide Details

[Clang (LLVM based)] [-ERROR-] Git blame errors: [Clang (LLVM based)] [-ERROR-] - no blame results for request <llvm-project/lldb/include/lldb/Core/Module.h - [306, 476, 447]>.

Hide Details

[Clang (LLVM based)] [-ERROR-] Git blame errors: [Clang (LLVM based)] [-ERROR-] - no blame results for request <llvm-project/lldb/include/lldb/Target/Platform.h - [791, 266, 395]>.

Hide Details

[Clang (LLVM based)] [-ERROR-] Git blame errors: [Clang (LLVM based)] [-ERROR-] - no blame results for request <llvm-project/lldb/source/Plugins/ExpressionParser/Clang/ClangASTSource.h - [324, 327, 344, 92, 158]>.

Hide Details

[Clang (LLVM based)] [-ERROR-] Git blame errors: [Clang (LLVM based)] [-ERROR-] - no blame results for request <llvm-project/lldb/include/lldb/Breakpoint/BreakpointID.h - [68]>.

Hide Details

[Clang (LLVM based)] [-ERROR-] Git blame errors: [Clang (LLVM based)] [-ERROR-] - no blame results for request <llvm-project/lldb/include/lldb/Breakpoint/BreakpointResolver.h - [48, 75]>.

Hide Details

[Clang (LLVM based)] [-ERROR-] Git blame errors: [Clang (LLVM based)] [-ERROR-] - no blame results for request <llvm-project/lldb/include/lldb/Expression/DWARFExpression.h - [194, 187, 254]>.

Hide Details

[Clang (LLVM based)] [-ERROR-] Git blame errors: [Clang (LLVM based)] [-ERROR-] - no blame results for request <llvm-project/lldb/include/lldb/Utility/CompletionRequest.h - [133, 134, 157]>.

Hide Details

[Clang (LLVM based)] [-ERROR-] Git blame errors: [Clang (LLVM based)] [-ERROR-] - no blame results for request <llvm-project/lldb/include/lldb/Target/Queue.h - [131]>.

Hide Details

[Clang (LLVM based)] [-ERROR-] Git blame errors: [Clang (LLVM based)] [-ERROR-] - no blame results for request <llvm-project/lldb/source/Plugins/ExpressionParser/Clang/ClangExpressionParser.h - [97, 101, 45]>.

Hide Details

[Clang (LLVM based)] [-ERROR-] Git blame errors: [Clang (LLVM based)] [-ERROR-] - no blame results for request <llvm-project/lldb/include/lldb/Interpreter/CommandObject.h - [229, 264, 238]>.

Hide Details

[Clang (LLVM based)] [-ERROR-] Git blame errors: [Clang (LLVM based)] [-ERROR-] - no blame results for request <llvm-project/lldb/source/Plugins/ExpressionParser/Clang/IRDynamicChecks.h - [80]>.

Hide Details

[Clang (LLVM based)] [-ERROR-] Git blame errors: [Clang (LLVM based)] [-ERROR-] - no blame results for request <llvm-project/lldb/source/Plugins/InstrumentationRuntime/UBSan/UBSanRuntime.cpp - [210]>.

Hide Details

[Clang (LLVM based)] [-ERROR-] Git blame errors: [Clang (LLVM based)] [-ERROR-] - no blame results for request <llvm-project/lldb/include/lldb/Breakpoint/WatchpointList.h - [183]>.

Hide Details

[Clang (LLVM based)] [-ERROR-] Git blame errors: [Clang (LLVM based)] [-ERROR-] - no blame results for request <llvm-project/lldb/include/lldb/Symbol/Function.h - [70, 185]>.

Hide Details

[Clang (LLVM based)] [-ERROR-] Git blame errors: [Clang (LLVM based)] [-ERROR-] - no blame results for request <llvm-project/lldb/source/Plugins/ExpressionParser/Clang/ClangExpressionParser.cpp - [687]>.

Hide Details

[Clang (LLVM based)] [-ERROR-] Git blame errors: [Clang (LLVM based)] [-ERROR-] - no blame results for request <llvm-project/lldb/include/lldb/Breakpoint/BreakpointLocationList.h - [171, 79]>.

Hide Details

[Clang (LLVM based)] [-ERROR-] Git blame errors: [Clang (LLVM based)] [-ERROR-] - no blame results for request <llvm-project/lldb/include/lldb/Target/Thread.h - [1153, 131, 133, 184, 809, 762, 814, 1006]>.

Hide Details

[Clang (LLVM based)] [-ERROR-] Git blame errors: [Clang (LLVM based)] [-ERROR-] - no blame results for request <llvm-project/lldb/source/Plugins/ExpressionParser/Clang/IRDynamicChecks.cpp - [182]>.

Hide Details

[Clang (LLVM based)] [-ERROR-] Git blame errors: [Clang (LLVM based)] [-ERROR-] - no blame results for request <llvm-project/debuginfo-tests/nrvo-string.cpp - [52]>.

Hide Details

[Clang (LLVM based)] [-ERROR-] Git blame errors: [Clang (LLVM based)] [-ERROR-] - no blame results for request <llvm-project/debuginfo-tests/block_var.m - [10]>.

Hide Details

[Clang (LLVM based)] [-ERROR-] Git blame errors: [Clang (LLVM based)] [-ERROR-] - no blame results for request <llvm-project/lldb/include/lldb/Symbol/LineEntry.h - [104, 45, 78]>.

Hide Details

[Clang (LLVM based)] [-ERROR-] Git blame errors: [Clang (LLVM based)] [-ERROR-] - no blame results for request <llvm-project/lldb/source/Plugins/SymbolFile/DWARF/SymbolFileDWARFDebugMap.h - [347]>.

Hide Details

[Clang (LLVM based)] [-ERROR-] Git blame errors: [Clang (LLVM based)] [-ERROR-] - no blame results for request <llvm-project/lldb/include/lldb/Interpreter/Options.h - [166, 185]>.

Hide Details

[Clang (LLVM based)] [-ERROR-] Git blame errors: [Clang (LLVM based)] [-ERROR-] - no blame results for request <llvm-project/lldb/include/lldb/Target/Target.h - [909]>.

Hide Details

[Clang (LLVM based)] [-ERROR-] Git blame errors: [Clang (LLVM based)] [-ERROR-] - no blame results for request <llvm-project/lldb/include/lldb/Breakpoint/BreakpointSite.h - [103, 205, 110, 126]>.

Hide Details

[Clang (LLVM based)] [-ERROR-] Git blame errors: [Clang (LLVM based)] [-ERROR-] - no blame results for request <llvm-project/lldb/include/lldb/Expression/REPL.h - [35]>.

Hide Details

[Clang (LLVM based)] [-ERROR-] Git blame errors: [Clang (LLVM based)] [-ERROR-] - no blame results for request <llvm-project/lldb/include/lldb/Symbol/SymbolContext.h - [322, 54, 282, 302]>.

Hide Details

[Clang (LLVM based)] [-ERROR-] Git blame errors: [Clang (LLVM based)] [-ERROR-] - no blame results for request <llvm-project/debuginfo-tests/blocks.m - [11]>.

Hide Details

[Clang (LLVM based)] [-ERROR-] Git blame errors: [Clang (LLVM based)] [-ERROR-] - no blame results for request <llvm-project/lldb/include/lldb/Symbol/LineTable.h - [200, 138, 204]>.

Hide Details

[Clang (LLVM based)] [-ERROR-] Git blame errors: [Clang (LLVM based)] [-ERROR-] - no blame results for request <llvm-project/lldb/include/lldb/Expression/FunctionCaller.h - [226, 69, 72, 235, 238]>.

Hide Details

[Clang (LLVM based)] [-ERROR-] Git blame errors: [Clang (LLVM based)] [-ERROR-] - no blame results for request <llvm-project/lldb/include/lldb/Expression/UserExpression.h - [49, 169]>.

Hide Details

[Clang (LLVM based)] [-ERROR-] Git blame errors: [Clang (LLVM based)] [-ERROR-] - no blame results for request <llvm-project/lldb/include/lldb/Core/Mangled.h - [130]>.

Hide Details

[Clang (LLVM based)] [-ERROR-] Git blame errors: [Clang (LLVM based)] [-ERROR-] - no blame results for request <llvm-project/lldb/include/lldb/Breakpoint/BreakpointLocation.h - [96, 227]>.

Hide Details

[Clang (LLVM based)] [-ERROR-] Git blame errors: [Clang (LLVM based)] [-ERROR-] - no blame results for request <llvm-project/lldb/include/lldb/Core/Address.h - [82, 68, 436, 181, 86, 73, 124, 77]>.

Hide Details

[Clang (LLVM based)] [-ERROR-] Git blame errors: [Clang (LLVM based)] [-ERROR-] - no blame results for request <llvm-project/lldb/include/lldb/Expression/IRExecutionUnit.h - [180, 183, 329, 190, 207]>.

Hide Details

[Clang (LLVM based)] [-ERROR-] Git blame errors: [Clang (LLVM based)] [-ERROR-] - no blame results for request <llvm-project/lldb/include/lldb/Symbol/CompileUnit.h - [85, 47]>.

Hide Details

[Clang (LLVM based)] [-ERROR-] Git blame errors: [Clang (LLVM based)] [-ERROR-] - no blame results for request <llvm-project/debuginfo-tests/stack-var.c - [11]>.

Hide Details

[Clang (LLVM based)] [-ERROR-] Git blame errors: [Clang (LLVM based)] [-ERROR-] - no blame results for request <llvm-project/lldb/include/lldb/Symbol/ObjectFile.h - [354, 358, 650, 155, 127]>.

Hide Details

[Clang (LLVM based)] [-ERROR-] Git blame errors: [Clang (LLVM based)] [-ERROR-] - no blame results for request <llvm-project/lldb/include/lldb/Core/ModuleList.h - [385, 325, 389, 376, 329, 393, 138, 317, 333]>.

Hide Details

[Clang (LLVM based)] [-ERROR-] Git blame errors: [Clang (LLVM based)] [-ERROR-] - no blame results for request <llvm-project/lldb/include/lldb/Interpreter/CommandInterpreter.h - [54]>.

Hide Details

[Clang (LLVM based)] [-ERROR-] Git blame errors: [Clang (LLVM based)] [-ERROR-] - no blame results for request <llvm-project/llvm/include/llvm/CodeGen/GlobalISel/CombinerHelper.h - [66, 70]>.

Hide Details

[Clang (LLVM based)] [-ERROR-] Git blame errors: [Clang (LLVM based)] [-ERROR-] - no blame results for request <llvm-project/lldb/include/lldb/Target/TargetList.h - [58, 63]>.

Hide Details

[Clang (LLVM based)] [-ERROR-] Git blame errors: [Clang (LLVM based)] [-ERROR-] - no blame results for request <llvm-project/lldb/include/lldb/Host/HostInfoBase.h - [44]>.

Hide Details

[Clang (LLVM based)] [-ERROR-] Git blame errors: [Clang (LLVM based)] [-ERROR-] - no blame results for request <llvm-project/lldb/source/Plugins/ExpressionParser/Clang/ClangExpressionVariable.h - [77]>.

Hide Details

[Clang (LLVM based)] [-ERROR-] Git blame errors: [Clang (LLVM based)] [-ERROR-] - no blame results for request <llvm-project/lldb/source/Plugins/ExpressionParser/Clang/ClangUserExpression.h - [95]>.

Hide Details

[Clang (LLVM based)] [-ERROR-] Git blame errors: [Clang (LLVM based)] [-ERROR-] - no blame results for request <llvm-project/lldb/source/Plugins/Process/gdb-remote/GDBRemoteCommunicationClient.h - [91, 157]>.

Hide Details

[Clang (LLVM based)] [-ERROR-] Git blame errors: [Clang (LLVM based)] [-ERROR-] - no blame results for request <llvm-project/lldb/source/Plugins/ExpressionParser/Clang/ClangFunctionCaller.h - [101, 104]>.

Hide Details

[Clang (LLVM based)] [-ERROR-] Git blame errors: [Clang (LLVM based)] [-ERROR-] - no blame results for request <llvm-project/lldb/include/lldb/Breakpoint/Watchpoint.h - [117]>.

Hide Details

[Clang (LLVM based)] Post processing issues on 'green-dragon-24' with source code encoding 'UTF-8' [Clang (LLVM based)] Resolving absolute file names for all issues in workspace '/Users/buildslave/jenkins/workspace/lldb-cmake' [Clang (LLVM based)] -> 9 resolved, 0 unresolved, 74 already resolved [Clang (LLVM based)] Copying affected files to Jenkins' build folder '/Users/Shared/Jenkins/Home/jobs/lldb-cmake/builds/1296/files-with-issues' [Clang (LLVM based)] -> 74 copied, 0 not in workspace, 0 not-found, 0 with I/O error [Clang (LLVM based)] Resolving module names from module definitions (build.xml, pom.xml, or Manifest.mf files) [Clang (LLVM based)] -> resolved module names for 246 issues [Clang (LLVM based)] Resolving package names (or namespaces) by parsing the affected files [Clang (LLVM based)] -> resolved package names of 74 affected files [Clang (LLVM based)] No filter has been set, publishing all 211 issues [Clang (LLVM based)] Creating fingerprints for all affected code blocks to track issues over different builds [Clang (LLVM based)] -> created fingerprints for 211 issues [Clang (LLVM based)] Invoking Git blamer to create author and commit information for all affected files [Clang (LLVM based)] GIT_COMMIT env = 'HEAD' [Clang (LLVM based)] Git working tree = '/Users/buildslave/jenkins/workspace/lldb-cmake' [Clang (LLVM based)] Git commit ID = '528c2048dc1c30992fd7cbd0941f626369598392' [Clang (LLVM based)] Job workspace = '/Users/buildslave/jenkins/workspace/lldb-cmake' [Clang (LLVM based)] Created blame requests for 74 files - invoking Git blame on agent for each of the requests [Clang (LLVM based)] -> blamed authors of issues in 74 files
[Pipeline] junit Recording test results [BFA] Scanning build for known causes... [Pipeline] emailext [BFA] Found failure cause(s): [BFA] Regression test failed from category Test [BFA] Compile Error from category Compile [BFA] Ninja target failed from category Compile [BFA] Done. 0s Not sending mail to unregistered user Austin.Kerbow@amd.com because your SCM claimed this was associated with a user ID ‘Austin.Kerbow' which your security realm does not recognize; you may need changes in your SCM plugin Not sending mail to unregistered user rnk@google.com because your SCM claimed this was associated with a user ID ‘rnk' which your security realm does not recognize; you may need changes in your SCM plugin Not sending mail to unregistered user apl@fb.com because your SCM claimed this was associated with a user ID ‘apl' which your security realm does not recognize; you may need changes in your SCM plugin Not sending mail to unregistered user aditya_nandakumar@apple.com because your SCM claimed this was associated with a user ID ‘aditya_nandakumar' which your security realm does not recognize; you may need changes in your SCM plugin Not sending mail to unregistered user richard-llvm@metafoo.co.uk because your SCM claimed this was associated with a user ID ‘richard-llvm' which your security realm does not recognize; you may need changes in your SCM plugin Not sending mail to unregistered user Austin.Kerbow@amd.com because your SCM claimed this was associated with a user ID ‘Austin.Kerbow' which your security realm does not recognize; you may need changes in your SCM plugin Not sending mail to unregistered user rnk@google.com because your SCM claimed this was associated with a user ID ‘rnk' which your security realm does not recognize; you may need changes in your SCM plugin Not sending mail to unregistered user apl@fb.com because your SCM claimed this was associated with a user ID ‘apl' which your security realm does not recognize; you may need changes in your SCM plugin Not sending mail to unregistered user richard-llvm@metafoo.co.uk because your SCM claimed this was associated with a user ID ‘richard-llvm' which your security realm does not recognize; you may need changes in your SCM plugin

Hide Details

Begin Pre-Send Script... Sending email to: jdevlieghere@apple.com Andi Bergenn <abergen@apple.com> Andi Bergen <abergen@apple.com> Azhar Mohammed <azhar@apple.com>
> git rev-parse HEAD^{commit} # timeout=10 [Pipeline] } [Pipeline] // stage [Pipeline] } [Pipeline] // withEnv [Pipeline] } [Pipeline] // node [Pipeline] End of Pipeline ERROR: script returned exit code 1 Finished: FAILURE