Failed

lldb-Unit.Target/_/TargetTests.ModuleCacheTest.GetAndPut (from lldb-Unit)

Failing for the past 2 builds (Since Failed#1370 )
Took 30 ms.

Stacktrace

Note: Google Test filter = ModuleCacheTest.GetAndPut
[==========] Running 1 test from 1 test case.
[----------] Global test environment set-up.
[----------] 1 test from ModuleCacheTest
[ RUN      ] ModuleCacheTest.GetAndPut
/Users/buildslave/jenkins/workspace/lldb-cmake/llvm-project/lldb/unittests/Target/ModuleCacheTest.cpp:133: Failure
      Expected: 1u
      Which is: 1
To be equal to: module_sp->FindFunctionSymbols(ConstString("boom"), eFunctionNameTypeFull, sc_list)
      Which is: 2
[  FAILED  ] ModuleCacheTest.GetAndPut (5 ms)
[----------] 1 test from ModuleCacheTest (5 ms total)

[----------] Global test environment tear-down
[==========] 1 test from 1 test case ran. (7 ms total)
[  PASSED  ] 0 tests.
[  FAILED  ] 1 test, listed below:
[  FAILED  ] ModuleCacheTest.GetAndPut

 1 FAILED TEST