AbortedConsole Output

Skipping 410,318 KB.. Full Log
db.SBProcess; proxy of <Swig Object of type 'lldb::SBProcess *' at 0x111551c00> >>: success

Hide Details

PASS: LLDB (/Users/buildslave/jenkins/workspace/lldb-cmake/lldb-build/bin/clang-10-x86_64) :: test_foundation_disasm_gmodules (TestFoundationDisassembly.FoundationDisassembleTestCase) runCmd: settings set symbols.enable-external-lookup false output:

Hide Details

runCmd: settings set plugin.process.gdb-remote.packet-timeout 60 output:

Hide Details

runCmd: settings set symbols.clang-modules-cache-path "/Users/buildslave/jenkins/workspace/lldb-cmake/lldb-build/tools/lldb/lldb-test-build.noindex/module-cache-lldb" output:

Hide Details

runCmd: settings set use-color false output:

Hide Details

runCmd: _regexp-break +[NSString stringWithFormat:] output: Breakpoint 1: where = Foundation`+[NSString stringWithFormat:], address = 0x0000000000004708

Hide Details

Hide Details

Expecting pattern: ^Breakpoint (?P<bpno>[0-9]+): (?P<num_locations>[0-9]+) locations\.$ Not matched

Hide Details

Expecting pattern: ^Breakpoint (?P<bpno>[0-9]+): (?P<num_locations>no) locations \(pending\)\. Not matched

Hide Details

Expecting pattern: ^Breakpoint (?P<bpno>[0-9]+): where = (?P<module>.*)`(?P<symbol>[+\-]{0,1}[^+]+)( \+ (?P<offset>[0-9]+)){0,1}( \[inlined\] (?P<inline_symbol>.*)){0,1} at (?P<file>[^:]+):(?P<line_no>[0-9]+)(?P<column>(:[0-9]+)?), address = (?P<address>0x[0-9a-fA-F]+)$ Not matched

Hide Details

Expecting pattern: ^Breakpoint (?P<bpno>[0-9]+): where = (?P<module>.*)`(?P<symbol>.*)( \+ (?P<offset>[0-9]+)){0,1}, address = (?P<address>0x[0-9a-fA-F]+)$ Matched

Hide Details

runCmd: breakpoint set -n "-[MyString initWithNSString:]" output: Breakpoint 2: where = a.out`-[MyString initWithNSString:] + 20 at main.m:23:16, address = 0x0000000100001474

Hide Details

Hide Details

Expecting pattern: ^Breakpoint (?P<bpno>[0-9]+): (?P<num_locations>[0-9]+) locations\.$ Not matched

Hide Details

Expecting pattern: ^Breakpoint (?P<bpno>[0-9]+): (?P<num_locations>no) locations \(pending\)\. Not matched

Hide Details

Expecting pattern: ^Breakpoint (?P<bpno>[0-9]+): where = (?P<module>.*)`(?P<symbol>[+\-]{0,1}[^+]+)( \+ (?P<offset>[0-9]+)){0,1}( \[inlined\] (?P<inline_symbol>.*)){0,1} at (?P<file>[^:]+):(?P<line_no>[0-9]+)(?P<column>(:[0-9]+)?), address = (?P<address>0x[0-9a-fA-F]+)$ Matched

Hide Details

runCmd: breakpoint set -S "description" --shlib "a.out" output: Breakpoint 3: where = a.out`-[MyString description] + 16 at main.m:43:7, address = 0x00000001000015a0

Hide Details

Hide Details

Expecting pattern: ^Breakpoint (?P<bpno>[0-9]+): (?P<num_locations>[0-9]+) locations\.$ Not matched

Hide Details

Expecting pattern: ^Breakpoint (?P<bpno>[0-9]+): (?P<num_locations>no) locations \(pending\)\. Not matched

Hide Details

Expecting pattern: ^Breakpoint (?P<bpno>[0-9]+): where = (?P<module>.*)`(?P<symbol>[+\-]{0,1}[^+]+)( \+ (?P<offset>[0-9]+)){0,1}( \[inlined\] (?P<inline_symbol>.*)){0,1} at (?P<file>[^:]+):(?P<line_no>[0-9]+)(?P<column>(:[0-9]+)?), address = (?P<address>0x[0-9a-fA-F]+)$ Matched

Hide Details

runCmd: _regexp-break -[NSAutoreleasePool release] output: Breakpoint 4: where = Foundation`-[NSAutoreleasePool release], address = 0x0000000000003cee

Hide Details

Hide Details

Expecting pattern: ^Breakpoint (?P<bpno>[0-9]+): (?P<num_locations>[0-9]+) locations\.$ Not matched

Hide Details

Expecting pattern: ^Breakpoint (?P<bpno>[0-9]+): (?P<num_locations>no) locations \(pending\)\. Not matched

Hide Details

Expecting pattern: ^Breakpoint (?P<bpno>[0-9]+): where = (?P<module>.*)`(?P<symbol>[+\-]{0,1}[^+]+)( \+ (?P<offset>[0-9]+)){0,1}( \[inlined\] (?P<inline_symbol>.*)){0,1} at (?P<file>[^:]+):(?P<line_no>[0-9]+)(?P<column>(:[0-9]+)?), address = (?P<address>0x[0-9a-fA-F]+)$ Not matched

Hide Details

Expecting pattern: ^Breakpoint (?P<bpno>[0-9]+): where = (?P<module>.*)`(?P<symbol>.*)( \+ (?P<offset>[0-9]+)){0,1}, address = (?P<address>0x[0-9a-fA-F]+)$ Matched

Hide Details

runCmd: run output: Process 24162 stopped * thread #1, queue = 'com.apple.main-thread', stop reason = breakpoint 1.1 frame #0: 0x00007fff3bb35708 Foundation`+[NSString stringWithFormat:] Foundation`+[NSString stringWithFormat:]: -> 0x7fff3bb35708 <+0>: pushq %rbp 0x7fff3bb35709 <+1>: movq %rsp, %rbp 0x7fff3bb3570c <+4>: pushq %r15 0x7fff3bb3570e <+6>: pushq %r14

Hide Details

Process 24162 launched: '/Users/buildslave/jenkins/workspace/lldb-cmake/lldb-build/tools/lldb/lldb-test-build.noindex/lang/objc/foundation/TestFoundationDisassembly.test_simple_disasm_dsym/a.out' (x86_64)

Hide Details

Hide Details

runCmd: thread backtrace output: * thread #1, queue = 'com.apple.main-thread', stop reason = breakpoint 1.1 * frame #0: 0x00007fff3bb35708 Foundation`+[NSString stringWithFormat:] frame #1: 0x000000010000175b a.out`Test_NSString(program="/Users/buildslave/jenkins/workspace/lldb-cmake/lldb-build/tools/lldb/lldb-test-build.noindex/lang/objc/foundation/TestFoundationDisassembly.test_simple_disasm_dsym/a.out") at main.m:69:21 frame #2: 0x0000000100001b05 a.out`main(argc=1, argv=0x00007ffeefbff578) at main.m:132:5 frame #3: 0x00007fff66902085 libdyld.dylib`start + 1 frame #4: 0x00007fff66902085 libdyld.dylib`start + 1

Hide Details

Hide Details

Expecting sub string: Foundation`+[NSString stringWithFormat:] Matched

Hide Details

runCmd: disassemble -f output: Foundation`+[NSString stringWithFormat:]: -> 0x7fff3bb35708 <+0>: pushq %rbp 0x7fff3bb35709 <+1>: movq %rsp, %rbp 0x7fff3bb3570c <+4>: pushq %r15 0x7fff3bb3570e <+6>: pushq %r14 0x7fff3bb35710 <+8>: pushq %rbx 0x7fff3bb35711 <+9>: subq $0xd8, %rsp 0x7fff3bb35718 <+16>: movq %rdx, %r14 0x7fff3bb3571b <+19>: testb %al, %al 0x7fff3bb3571d <+21>: je 0x7fff3bb3574b ; <+67> 0x7fff3bb3571f <+23>: movaps %xmm0, -0xc0(%rbp) 0x7fff3bb35726 <+30>: movaps %xmm1, -0xb0(%rbp) 0x7fff3bb3572d <+37>: movaps %xmm2, -0xa0(%rbp) 0x7fff3bb35734 <+44>: movaps %xmm3, -0x90(%rbp) 0x7fff3bb3573b <+51>: movaps %xmm4, -0x80(%rbp) 0x7fff3bb3573f <+55>: movaps %xmm5, -0x70(%rbp) 0x7fff3bb35743 <+59>: movaps %xmm6, -0x60(%rbp) 0x7fff3bb35747 <+63>: movaps %xmm7, -0x50(%rbp) 0x7fff3bb3574b <+67>: leaq -0xf0(%rbp), %rax 0x7fff3bb35752 <+74>: movq %r9, 0x28(%rax) 0x7fff3bb35756 <+78>: movq %r8, 0x20(%rax) 0x7fff3bb3575a <+82>: movq %rcx, 0x18(%rax) 0x7fff3bb3575e <+86>: movq 0x55b4bcbb(%rip), %rcx ; (void *)0x00007fff9870f070: __stack_chk_guard 0x7fff3bb35765 <+93>: movq (%rcx), %rcx 0x7fff3bb35768 <+96>: movq %rcx, -0x20(%rbp) 0x7fff3bb3576c <+100>: leaq -0x40(%rbp), %rbx 0x7fff3bb35770 <+104>: movq %rax, 0x10(%rbx) 0x7fff3bb35774 <+108>: leaq 0x10(%rbp), %rax 0x7fff3bb35778 <+112>: movq %rax, 0x8(%rbx) 0x7fff3bb3577c <+116>: movabsq $0x3000000018, %rax ; imm = 0x3000000018 0x7fff3bb35786 <+126>: movq %rax, (%rbx) 0x7fff3bb35789 <+129>: movq 0x55c29778(%rip), %rsi ; "allocWithZone:" 0x7fff3bb35790 <+136>: movq 0x55b4c281(%rip), %r15 ; (void *)0x00007fff6582d580: objc_msgSend 0x7fff3bb35797 <+143>: xorl %edx, %edx 0x7fff3bb35799 <+145>: callq *%r15 0x7fff3bb3579c <+148>: movq 0x55c2d7dd(%rip), %rsi ; "initWithFormat:locale:arguments:" 0x7fff3bb357a3 <+155>: xorl %ecx, %ecx 0x7fff3bb357a5 <+157>: movq %rax, %rdi 0x7fff3bb357a8 <+160>: movq %r14, %rdx 0x7fff3bb357ab <+163>: movq %rbx, %r8 0x7fff3bb357ae <+166>: callq *%r15 0x7fff3bb357b1 <+169>: movq 0x55c29510(%rip), %rsi ; "autorelease" 0x7fff3bb357b8 <+176>: movq %rax, %rdi 0x7fff3bb357bb <+179>: callq *%r15 0x7fff3bb357be <+182>: movq 0x55b4bc5b(%rip), %rcx ; (void *)0x00007fff9870f070: __stack_chk_guard 0x7fff3bb357c5 <+189>: movq (%rcx), %rcx 0x7fff3bb357c8 <+192>: cmpq -0x20(%rbp), %rcx 0x7fff3bb357cc <+196>: jne 0x7fff3bb357dc ; <+212> 0x7fff3bb357ce <+198>: addq $0xd8, %rsp 0x7fff3bb357d5 <+205>: popq %rbx 0x7fff3bb357d6 <+206>: popq %r14 0x7fff3bb357d8 <+208>: popq %r15 0x7fff3bb357da <+210>: popq %rbp 0x7fff3bb357db <+211>: retq 0x7fff3bb357dc <+212>: callq 0x7fff3be468b4 ; symbol stub for: __stack_chk_fail

Hide Details

Hide Details

runCmd: process continue output: Process 24162 resuming Process 24162 stopped * thread #1, queue = 'com.apple.main-thread', stop reason = breakpoint 1.1 frame #0: 0x00007fff3bb35708 Foundation`+[NSString stringWithFormat:] Foundation`+[NSString stringWithFormat:]: -> 0x7fff3bb35708 <+0>: pushq %rbp 0x7fff3bb35709 <+1>: movq %rsp, %rbp 0x7fff3bb3570c <+4>: pushq %r15 0x7fff3bb3570e <+6>: pushq %r14

Hide Details

Hide Details

Hide Details

runCmd: process continue output: Process 24162 resuming Process 24162 stopped * thread #1, queue = 'com.apple.main-thread', stop reason = breakpoint 2.1 frame #0: 0x0000000100001474 a.out`-[MyString initWithNSString:](self=0x0000000101900110, _cmd="initWithNSString:", string=@"Hello from '/Users/buildslave/jenkins/workspace/lldb-cmake/lldb-build/tools/lldb/lldb-test-build.noindex/lang/objc/foundation/TestFoundationDisassembly.test_simple_disasm_dsym/a.out'") at main.m:23:16 20 21 - (id)initWithNSString:(NSString *)string 22 { -> 23 if (self = [super init]) ^ 24 { 25 str = [NSString stringWithString:string]; 26 date = [NSDate date];

Hide Details

Hide Details

Hide Details

runCmd: thread backtrace output: * thread #1, queue = 'com.apple.main-thread', stop reason = breakpoint 2.1 * frame #0: 0x0000000100001474 a.out`-[MyString initWithNSString:](self=0x0000000101900110, _cmd="initWithNSString:", string=@"Hello from '/Users/buildslave/jenkins/workspace/lldb-cmake/lldb-build/tools/lldb/lldb-test-build.noindex/lang/objc/foundation/TestFoundationDisassembly.test_simple_disasm_dsym/a.out'") at main.m:23:16 frame #1: 0x00000001000018b0 a.out`Test_MyString(program="/Users/buildslave/jenkins/workspace/lldb-cmake/lldb-build/tools/lldb/lldb-test-build.noindex/lang/objc/foundation/TestFoundationDisassembly.test_simple_disasm_dsym/a.out") at main.m:95:20 frame #2: 0x0000000100001b14 a.out`main(argc=1, argv=0x00007ffeefbff578) at main.m:133:5 frame #3: 0x00007fff66902085 libdyld.dylib`start + 1 frame #4: 0x00007fff66902085 libdyld.dylib`start + 1

Hide Details

Hide Details

Expecting sub string: a.out`-[MyString initWithNSString:] Matched

Hide Details

runCmd: disassemble -f output: a.out`-[MyString initWithNSString:]: 0x100001460 <+0>: pushq %rbp 0x100001461 <+1>: movq %rsp, %rbp 0x100001464 <+4>: subq $0x30, %rsp 0x100001468 <+8>: movq %rdi, -0x8(%rbp) 0x10000146c <+12>: movq %rsi, -0x10(%rbp) 0x100001470 <+16>: movq %rdx, -0x18(%rbp) -> 0x100001474 <+20>: movq -0x8(%rbp), %rax 0x100001478 <+24>: movq %rax, -0x28(%rbp) 0x10000147c <+28>: movq 0x10b5(%rip), %rax ; (void *)0x0000000100002560: MyString 0x100001483 <+35>: movq %rax, -0x20(%rbp) 0x100001487 <+39>: movq 0xffa(%rip), %rsi ; "init" 0x10000148e <+46>: leaq -0x28(%rbp), %rdi 0x100001492 <+50>: callq 0x100001bbe ; symbol stub for: objc_msgSendSuper2 0x100001497 <+55>: movq %rax, -0x8(%rbp) 0x10000149b <+59>: cmpq $0x0, %rax 0x10000149f <+63>: je 0x1000014f5 ; <+149> at main.m 0x1000014a5 <+69>: movq 0x1064(%rip), %rax ; (void *)0x00007fff9177b950: NSString 0x1000014ac <+76>: movq -0x18(%rbp), %rdx 0x1000014b0 <+80>: movq 0xfd9(%rip), %rsi ; "stringWithString:" 0x1000014b7 <+87>: movq %rax, %rdi 0x1000014ba <+90>: callq *0xb50(%rip) ; (void *)0x00007fff6582d580: objc_msgSend 0x1000014c0 <+96>: movq -0x8(%rbp), %rcx 0x1000014c4 <+100>: movq 0x1075(%rip), %rdx ; MyString.str 0x1000014cb <+107>: movq %rax, (%rcx,%rdx) 0x1000014cf <+111>: movq 0x1042(%rip), %rax ; (void *)0x00007fff912ca3c8: NSDate 0x1000014d6 <+118>: movq 0xfbb(%rip), %rsi ; "date" 0x1000014dd <+125>: movq %rax, %rdi 0x1000014e0 <+128>: callq *0xb2a(%rip) ; (void *)0x00007fff6582d580: objc_msgSend 0x1000014e6 <+134>: movq -0x8(%rbp), %rcx 0x1000014ea <+138>: movq 0x1057(%rip), %rdx ; MyString.date 0x1000014f1 <+145>: movq %rax, (%rcx,%rdx) 0x1000014f5 <+149>: xorl %edx, %edx 0x1000014f7 <+151>: movq -0x8(%rbp), %rax 0x1000014fb <+155>: movq 0xf9e(%rip), %rsi ; "setDescriptionPauses:" 0x100001502 <+162>: movq %rax, %rdi 0x100001505 <+165>: callq *0xb05(%rip) ; (void *)0x00007fff6582d580: objc_msgSend 0x10000150b <+171>: movq -0x8(%rbp), %rax 0x10000150f <+175>: addq $0x30, %rsp 0x100001513 <+179>: popq %rbp 0x100001514 <+180>: retq 0x100001515 <+181>: nopw %cs:(%rax,%rax) 0x10000151f <+191>: nop

Hide Details

Hide Details

runCmd: process continue output: Process 24162 resuming Process 24162 stopped * thread #1, queue = 'com.apple.main-thread', stop reason = breakpoint 3.1 frame #0: 0x00000001000015a0 a.out`-[MyString description](self=0x0000000101900110, _cmd="description") at main.m:43:7 40 { 41 // Set a breakpoint on '-[MyString description]' and test expressions: 42 // expression (char *)sel_getName(_cmd) -> 43 if (self.descriptionPauses) // Break here for description test ^ 44 { 45 printf ("\nAbout to sleep.\n"); 46 usleep(100000);

Hide Details

Hide Details

Hide Details

runCmd: thread backtrace output: * thread #1, queue = 'com.apple.main-thread', stop reason = breakpoint 3.1 * frame #0: 0x00000001000015a0 a.out`-[MyString description](self=0x0000000101900110, _cmd="description") at main.m:43:7 frame #1: 0x00000001000018c8 a.out`Test_MyString(program="/Users/buildslave/jenkins/workspace/lldb-cmake/lldb-build/tools/lldb/lldb-test-build.noindex/lang/objc/foundation/TestFoundationDisassembly.test_simple_disasm_dsym/a.out") at main.m:96:37 frame #2: 0x0000000100001b14 a.out`main(argc=1, argv=0x00007ffeefbff578) at main.m:133:5 frame #3: 0x00007fff66902085 libdyld.dylib`start + 1 frame #4: 0x00007fff66902085 libdyld.dylib`start + 1

Hide Details

Hide Details

Expecting sub string: a.out`-[MyString description] Matched

Hide Details

runCmd: disassemble -f output: a.out`-[MyString description]: 0x100001590 <+0>: pushq %rbp 0x100001591 <+1>: movq %rsp, %rbp 0x100001594 <+4>: subq $0x20, %rsp 0x100001598 <+8>: movq %rdi, -0x8(%rbp) 0x10000159c <+12>: movq %rsi, -0x10(%rbp) -> 0x1000015a0 <+16>: movq -0x8(%rbp), %rax 0x1000015a4 <+20>: movq 0xf05(%rip), %rsi ; "descriptionPauses" 0x1000015ab <+27>: movq %rax, %rdi 0x1000015ae <+30>: callq *0xa5c(%rip) ; (void *)0x00007fff6582d580: objc_msgSend 0x1000015b4 <+36>: cmpb $0x0, %al 0x1000015b6 <+38>: je 0x1000015d7 ; <+71> at main.m 0x1000015bc <+44>: leaq 0x7c1(%rip), %rdi ; "\nAbout to sleep.\n" 0x1000015c3 <+51>: movb $0x0, %al 0x1000015c5 <+53>: callq 0x100001bca ; symbol stub for: printf 0x1000015ca <+58>: movl $0x186a0, %edi ; imm = 0x186A0 0x1000015cf <+63>: movl %eax, -0x14(%rbp) 0x1000015d2 <+66>: callq 0x100001bd0 ; symbol stub for: usleep 0x1000015d7 <+71>: leaq 0xa7a(%rip), %rax ; @" with timestamp: %@" 0x1000015de <+78>: movq -0x8(%rbp), %rcx 0x1000015e2 <+82>: movq 0xf57(%rip), %rdx ; MyString.str 0x1000015e9 <+89>: movq (%rcx,%rdx), %rcx 0x1000015ed <+93>: movq -0x8(%rbp), %rdx 0x1000015f1 <+97>: movq 0xf50(%rip), %rsi ; MyString.date 0x1000015f8 <+104>: movq (%rdx,%rsi), %rdx 0x1000015fc <+108>: movq 0xeb5(%rip), %rsi ; "stringByAppendingFormat:" 0x100001603 <+115>: movq %rcx, %rdi 0x100001606 <+118>: movq %rdx, -0x20(%rbp) 0x10000160a <+122>: movq %rax, %rdx 0x10000160d <+125>: movq -0x20(%rbp), %rcx 0x100001611 <+129>: movb $0x0, %al 0x100001613 <+131>: callq *0x9f7(%rip) ; (void *)0x00007fff6582d580: objc_msgSend 0x100001619 <+137>: addq $0x20, %rsp 0x10000161d <+141>: popq %rbp 0x10000161e <+142>: retq 0x10000161f <+143>: nop

Hide Details

Hide Details

runCmd: process continue output: Process 24162 resuming Process 24162 stopped * thread #1, queue = 'com.apple.main-thread', stop reason = breakpoint 3.1 frame #0: 0x00000001000015a0 a.out`-[MyString description](self=0x0000000101900110, _cmd="description") at main.m:43:7 40 { 41 // Set a breakpoint on '-[MyString description]' and test expressions: 42 // expression (char *)sel_getName(_cmd) -> 43 if (self.descriptionPauses) // Break here for description test ^ 44 { 45 printf ("\nAbout to sleep.\n"); 46 usleep(100000);

Hide Details

Hide Details

Hide Details

runCmd: process continue output: Process 24162 resuming Process 24162 stopped * thread #1, queue = 'com.apple.main-thread', stop reason = breakpoint 4.1 frame #0: 0x00007fff3bb34cee Foundation`-[NSAutoreleasePool release] Foundation`-[NSAutoreleasePool release]: -> 0x7fff3bb34cee <+0>: pushq %rbp 0x7fff3bb34cef <+1>: movq %rsp, %rbp 0x7fff3bb34cf2 <+4>: pushq %r15 0x7fff3bb34cf4 <+6>: pushq %r14

Hide Details

Hide Details

Hide Details

runCmd: thread backtrace output: * thread #1, queue = 'com.apple.main-thread', stop reason = breakpoint 4.1 * frame #0: 0x00007fff3bb34cee Foundation`-[NSAutoreleasePool release] frame #1: 0x0000000100001b63 a.out`main(argc=1, argv=0x00007ffeefbff578) at main.m:139:5 frame #2: 0x00007fff66902085 libdyld.dylib`start + 1 frame #3: 0x00007fff66902085 libdyld.dylib`start + 1

Hide Details

Hide Details

Expecting sub string: Foundation`-[NSAutoreleasePool release] Matched

Hide Details

runCmd: disassemble -f output: Foundation`-[NSAutoreleasePool release]: -> 0x7fff3bb34cee <+0>: pushq %rbp 0x7fff3bb34cef <+1>: movq %rsp, %rbp 0x7fff3bb34cf2 <+4>: pushq %r15 0x7fff3bb34cf4 <+6>: pushq %r14 0x7fff3bb34cf6 <+8>: pushq %rbx 0x7fff3bb34cf7 <+9>: subq $0x18, %rsp 0x7fff3bb34cfb <+13>: movq %rsi, %r14 0x7fff3bb34cfe <+16>: movq %rdi, %rbx 0x7fff3bb34d01 <+19>: movq 0x55c37d28(%rip), %r15 ; NSAutoreleasePool._reserved2 0x7fff3bb34d08 <+26>: cmpq $0x0, (%rbx,%r15) 0x7fff3bb34d0d <+31>: je 0x7fff3bb34d2e ; <+64> 0x7fff3bb34d0f <+33>: movq %rbx, %rdi 0x7fff3bb34d12 <+36>: movq %r14, %rsi 0x7fff3bb34d15 <+39>: callq 0x7fff3bd0cf28 ; _NSMethodExceptionProem 0x7fff3bb34d1a <+44>: movq %rax, %rcx 0x7fff3bb34d1d <+47>: leaq 0x55b68584(%rip), %rdi ; @"%@: This pool has already been released, do not drain it (double release)." 0x7fff3bb34d24 <+54>: xorl %eax, %eax 0x7fff3bb34d26 <+56>: movq %rcx, %rsi 0x7fff3bb34d29 <+59>: callq 0x7fff3bbb1819 ; NSLog 0x7fff3bb34d2e <+64>: movq 0x55c37cf3(%rip), %rax ; NSAutoreleasePool._reserved3 0x7fff3bb34d35 <+71>: cmpq $0x0, (%rbx,%rax) 0x7fff3bb34d3a <+76>: je 0x7fff3bb34d5b ; <+109> 0x7fff3bb34d3c <+78>: movq %rbx, %rdi 0x7fff3bb34d3f <+81>: movq %r14, %rsi 0x7fff3bb34d42 <+84>: callq 0x7fff3bd0cf28 ; _NSMethodExceptionProem 0x7fff3bb34d47 <+89>: movq %rax, %rcx 0x7fff3bb34d4a <+92>: leaq 0x55b68577(%rip), %rdi ; @"%@: This pool has already been drained, do not release it (double release)." 0x7fff3bb34d51 <+99>: xorl %eax, %eax 0x7fff3bb34d53 <+101>: movq %rcx, %rsi 0x7fff3bb34d56 <+104>: callq 0x7fff3bbb1819 ; NSLog 0x7fff3bb34d5b <+109>: movq 0x55c37cbe(%rip), %rax ; NSAutoreleasePool._token 0x7fff3bb34d62 <+116>: movq (%rbx,%rax), %rdi 0x7fff3bb34d66 <+120>: movq $-0x1, (%rbx,%r15) 0x7fff3bb34d6e <+128>: xorl %ecx, %ecx 0x7fff3bb34d70 <+130>: movq %rcx, (%rbx,%rax) 0x7fff3bb34d74 <+134>: testq %rdi, %rdi 0x7fff3bb34d77 <+137>: je 0x7fff3bb34dd4 ; <+230> 0x7fff3bb34d79 <+139>: callq 0x7fff3be46326 ; symbol stub for: _CFAutoreleasePoolPop 0x7fff3bb34d7e <+144>: cmpb $0x0, 0x55c4cd23(%rip) ; NSAppleEventManagerWillProcessFirstEventNotification + 103 0x7fff3bb34d85 <+151>: je 0x7fff3bb34db6 ; <+200> 0x7fff3bb34d87 <+153>: movq %rbx, %rdi 0x7fff3bb34d8a <+156>: callq 0x7fff3be470a0 ; symbol stub for: objc_removeAssociatedObjects 0x7fff3bb34d8f <+161>: leaq 0x55c4b7ea(%rip), %rcx ; _NSAPCache 0x7fff3bb34d96 <+168>: xorl %edx, %edx 0x7fff3bb34d98 <+170>: movq (%rcx), %rax 0x7fff3bb34d9b <+173>: testq %rax, %rax 0x7fff3bb34d9e <+176>: jne 0x7fff3bb34da9 ; <+187> 0x7fff3bb34da0 <+178>: xorl %eax, %eax 0x7fff3bb34da2 <+180>: lock 0x7fff3bb34da3 <+181>: cmpxchgq %rbx, (%rcx) 0x7fff3bb34da7 <+185>: je 0x7fff3bb34dd4 ; <+230> 0x7fff3bb34da9 <+187>: incq %rdx 0x7fff3bb34dac <+190>: addq $0x8, %rcx 0x7fff3bb34db0 <+194>: cmpq $0x20, %rdx 0x7fff3bb34db4 <+198>: jb 0x7fff3bb34d98 ; <+170> 0x7fff3bb34db6 <+200>: leaq -0x28(%rbp), %rdi 0x7fff3bb34dba <+204>: movq %rbx, (%rdi) 0x7fff3bb34dbd <+207>: movq 0x55c36894(%rip), %rax ; (void *)0x00007fff91779150: NSAutoreleasePool 0x7fff3bb34dc4 <+214>: movq %rax, 0x8(%rdi) 0x7fff3bb34dc8 <+218>: movq 0x55c29ef1(%rip), %rsi ; "dealloc" 0x7fff3bb34dcf <+225>: callq 0x7fff3be47082 ; symbol stub for: objc_msgSendSuper2 0x7fff3bb34dd4 <+230>: addq $0x18, %rsp 0x7fff3bb34dd8 <+234>: popq %rbx 0x7fff3bb34dd9 <+235>: popq %r14 0x7fff3bb34ddb <+237>: popq %r15 0x7fff3bb34ddd <+239>: popq %rbp 0x7fff3bb34dde <+240>: retq 0x7fff3bb34ddf <+241>: nop

Hide Details

Hide Details

<bound method SBProcess.Kill of <lldb.SBProcess; proxy of <Swig Object of type 'lldb::SBProcess *' at 0x110b97f30> >>: success

Hide Details

PASS: LLDB (/Users/buildslave/jenkins/workspace/lldb-cmake/lldb-build/bin/clang-10-x86_64) :: test_simple_disasm_dsym (TestFoundationDisassembly.FoundationDisassembleTestCase) runCmd: settings set symbols.enable-external-lookup false output:

Hide Details

runCmd: settings set plugin.process.gdb-remote.packet-timeout 60 output:

Hide Details

runCmd: settings set symbols.clang-modules-cache-path "/Users/buildslave/jenkins/workspace/lldb-cmake/lldb-build/tools/lldb/lldb-test-build.noindex/module-cache-lldb" output:

Hide Details

runCmd: settings set use-color false output:

Hide Details

runCmd: _regexp-break +[NSString stringWithFormat:] output: Breakpoint 1: where = Foundation`+[NSString stringWithFormat:], address = 0x0000000000004708

Hide Details

Hide Details

Expecting pattern: ^Breakpoint (?P<bpno>[0-9]+): (?P<num_locations>[0-9]+) locations\.$ Not matched

Hide Details

Expecting pattern: ^Breakpoint (?P<bpno>[0-9]+): (?P<num_locations>no) locations \(pending\)\. Not matched

Hide Details

Expecting pattern: ^Breakpoint (?P<bpno>[0-9]+): where = (?P<module>.*)`(?P<symbol>[+\-]{0,1}[^+]+)( \+ (?P<offset>[0-9]+)){0,1}( \[inlined\] (?P<inline_symbol>.*)){0,1} at (?P<file>[^:]+):(?P<line_no>[0-9]+)(?P<column>(:[0-9]+)?), address = (?P<address>0x[0-9a-fA-F]+)$ Not matched

Hide Details

Expecting pattern: ^Breakpoint (?P<bpno>[0-9]+): where = (?P<module>.*)`(?P<symbol>.*)( \+ (?P<offset>[0-9]+)){0,1}, address = (?P<address>0x[0-9a-fA-F]+)$ Matched

Hide Details

runCmd: breakpoint set -n "-[MyString initWithNSString:]" output: Breakpoint 2: where = a.out`-[MyString initWithNSString:] + 20 at main.m:23:16, address = 0x0000000100001474

Hide Details

Hide Details

Expecting pattern: ^Breakpoint (?P<bpno>[0-9]+): (?P<num_locations>[0-9]+) locations\.$ Not matched

Hide Details

Expecting pattern: ^Breakpoint (?P<bpno>[0-9]+): (?P<num_locations>no) locations \(pending\)\. Not matched

Hide Details

Expecting pattern: ^Breakpoint (?P<bpno>[0-9]+): where = (?P<module>.*)`(?P<symbol>[+\-]{0,1}[^+]+)( \+ (?P<offset>[0-9]+)){0,1}( \[inlined\] (?P<inline_symbol>.*)){0,1} at (?P<file>[^:]+):(?P<line_no>[0-9]+)(?P<column>(:[0-9]+)?), address = (?P<address>0x[0-9a-fA-F]+)$ Matched

Hide Details

runCmd: breakpoint set -S "description" --shlib "a.out" output: Breakpoint 3: where = a.out`-[MyString description] + 16 at main.m:43:7, address = 0x00000001000015a0

Hide Details

Hide Details

Expecting pattern: ^Breakpoint (?P<bpno>[0-9]+): (?P<num_locations>[0-9]+) locations\.$ Not matched

Hide Details

Expecting pattern: ^Breakpoint (?P<bpno>[0-9]+): (?P<num_locations>no) locations \(pending\)\. Not matched

Hide Details

Expecting pattern: ^Breakpoint (?P<bpno>[0-9]+): where = (?P<module>.*)`(?P<symbol>[+\-]{0,1}[^+]+)( \+ (?P<offset>[0-9]+)){0,1}( \[inlined\] (?P<inline_symbol>.*)){0,1} at (?P<file>[^:]+):(?P<line_no>[0-9]+)(?P<column>(:[0-9]+)?), address = (?P<address>0x[0-9a-fA-F]+)$ Matched

Hide Details

runCmd: _regexp-break -[NSAutoreleasePool release] output: Breakpoint 4: where = Foundation`-[NSAutoreleasePool release], address = 0x0000000000003cee

Hide Details

Hide Details

Expecting pattern: ^Breakpoint (?P<bpno>[0-9]+): (?P<num_locations>[0-9]+) locations\.$ Not matched

Hide Details

Expecting pattern: ^Breakpoint (?P<bpno>[0-9]+): (?P<num_locations>no) locations \(pending\)\. Not matched

Hide Details

Expecting pattern: ^Breakpoint (?P<bpno>[0-9]+): where = (?P<module>.*)`(?P<symbol>[+\-]{0,1}[^+]+)( \+ (?P<offset>[0-9]+)){0,1}( \[inlined\] (?P<inline_symbol>.*)){0,1} at (?P<file>[^:]+):(?P<line_no>[0-9]+)(?P<column>(:[0-9]+)?), address = (?P<address>0x[0-9a-fA-F]+)$ Not matched

Hide Details

Expecting pattern: ^Breakpoint (?P<bpno>[0-9]+): where = (?P<module>.*)`(?P<symbol>.*)( \+ (?P<offset>[0-9]+)){0,1}, address = (?P<address>0x[0-9a-fA-F]+)$ Matched

Hide Details

runCmd: run output: Process 24250 stopped * thread #1, queue = 'com.apple.main-thread', stop reason = breakpoint 1.1 frame #0: 0x00007fff3bb35708 Foundation`+[NSString stringWithFormat:] Foundation`+[NSString stringWithFormat:]: -> 0x7fff3bb35708 <+0>: pushq %rbp 0x7fff3bb35709 <+1>: movq %rsp, %rbp 0x7fff3bb3570c <+4>: pushq %r15 0x7fff3bb3570e <+6>: pushq %r14

Hide Details

Process 24250 launched: '/Users/buildslave/jenkins/workspace/lldb-cmake/lldb-build/tools/lldb/lldb-test-build.noindex/lang/objc/foundation/TestFoundationDisassembly.test_simple_disasm_dwarf/a.out' (x86_64)

Hide Details

Hide Details

runCmd: thread backtrace output: * thread #1, queue = 'com.apple.main-thread', stop reason = breakpoint 1.1 * frame #0: 0x00007fff3bb35708 Foundation`+[NSString stringWithFormat:] frame #1: 0x000000010000175b a.out`Test_NSString(program="/Users/buildslave/jenkins/workspace/lldb-cmake/lldb-build/tools/lldb/lldb-test-build.noindex/lang/objc/foundation/TestFoundationDisassembly.test_simple_disasm_dwarf/a.out") at main.m:69:21 frame #2: 0x0000000100001b05 a.out`main(argc=1, argv=0x00007ffeefbff578) at main.m:132:5 frame #3: 0x00007fff66902085 libdyld.dylib`start + 1 frame #4: 0x00007fff66902085 libdyld.dylib`start + 1

Hide Details

Hide Details

Expecting sub string: Foundation`+[NSString stringWithFormat:] Matched

Hide Details

runCmd: disassemble -f output: Foundation`+[NSString stringWithFormat:]: -> 0x7fff3bb35708 <+0>: pushq %rbp 0x7fff3bb35709 <+1>: movq %rsp, %rbp 0x7fff3bb3570c <+4>: pushq %r15 0x7fff3bb3570e <+6>: pushq %r14 0x7fff3bb35710 <+8>: pushq %rbx 0x7fff3bb35711 <+9>: subq $0xd8, %rsp 0x7fff3bb35718 <+16>: movq %rdx, %r14 0x7fff3bb3571b <+19>: testb %al, %al 0x7fff3bb3571d <+21>: je 0x7fff3bb3574b ; <+67> 0x7fff3bb3571f <+23>: movaps %xmm0, -0xc0(%rbp) 0x7fff3bb35726 <+30>: movaps %xmm1, -0xb0(%rbp) 0x7fff3bb3572d <+37>: movaps %xmm2, -0xa0(%rbp) 0x7fff3bb35734 <+44>: movaps %xmm3, -0x90(%rbp) 0x7fff3bb3573b <+51>: movaps %xmm4, -0x80(%rbp) 0x7fff3bb3573f <+55>: movaps %xmm5, -0x70(%rbp) 0x7fff3bb35743 <+59>: movaps %xmm6, -0x60(%rbp) 0x7fff3bb35747 <+63>: movaps %xmm7, -0x50(%rbp) 0x7fff3bb3574b <+67>: leaq -0xf0(%rbp), %rax 0x7fff3bb35752 <+74>: movq %r9, 0x28(%rax) 0x7fff3bb35756 <+78>: movq %r8, 0x20(%rax) 0x7fff3bb3575a <+82>: movq %rcx, 0x18(%rax) 0x7fff3bb3575e <+86>: movq 0x55b4bcbb(%rip), %rcx ; (void *)0x00007fff9870f070: __stack_chk_guard 0x7fff3bb35765 <+93>: movq (%rcx), %rcx 0x7fff3bb35768 <+96>: movq %rcx, -0x20(%rbp) 0x7fff3bb3576c <+100>: leaq -0x40(%rbp), %rbx 0x7fff3bb35770 <+104>: movq %rax, 0x10(%rbx) 0x7fff3bb35774 <+108>: leaq 0x10(%rbp), %rax 0x7fff3bb35778 <+112>: movq %rax, 0x8(%rbx) 0x7fff3bb3577c <+116>: movabsq $0x3000000018, %rax ; imm = 0x3000000018 0x7fff3bb35786 <+126>: movq %rax, (%rbx) 0x7fff3bb35789 <+129>: movq 0x55c29778(%rip), %rsi ; "allocWithZone:" 0x7fff3bb35790 <+136>: movq 0x55b4c281(%rip), %r15 ; (void *)0x00007fff6582d580: objc_msgSend 0x7fff3bb35797 <+143>: xorl %edx, %edx 0x7fff3bb35799 <+145>: callq *%r15 0x7fff3bb3579c <+148>: movq 0x55c2d7dd(%rip), %rsi ; "initWithFormat:locale:arguments:" 0x7fff3bb357a3 <+155>: xorl %ecx, %ecx 0x7fff3bb357a5 <+157>: movq %rax, %rdi 0x7fff3bb357a8 <+160>: movq %r14, %rdx 0x7fff3bb357ab <+163>: movq %rbx, %r8 0x7fff3bb357ae <+166>: callq *%r15 0x7fff3bb357b1 <+169>: movq 0x55c29510(%rip), %rsi ; "autorelease" 0x7fff3bb357b8 <+176>: movq %rax, %rdi 0x7fff3bb357bb <+179>: callq *%r15 0x7fff3bb357be <+182>: movq 0x55b4bc5b(%rip), %rcx ; (void *)0x00007fff9870f070: __stack_chk_guard 0x7fff3bb357c5 <+189>: movq (%rcx), %rcx 0x7fff3bb357c8 <+192>: cmpq -0x20(%rbp), %rcx 0x7fff3bb357cc <+196>: jne 0x7fff3bb357dc ; <+212> 0x7fff3bb357ce <+198>: addq $0xd8, %rsp 0x7fff3bb357d5 <+205>: popq %rbx 0x7fff3bb357d6 <+206>: popq %r14 0x7fff3bb357d8 <+208>: popq %r15 0x7fff3bb357da <+210>: popq %rbp 0x7fff3bb357db <+211>: retq 0x7fff3bb357dc <+212>: callq 0x7fff3be468b4 ; symbol stub for: __stack_chk_fail

Hide Details

Hide Details

runCmd: process continue output: Process 24250 resuming Process 24250 stopped * thread #1, queue = 'com.apple.main-thread', stop reason = breakpoint 1.1 frame #0: 0x00007fff3bb35708 Foundation`+[NSString stringWithFormat:] Foundation`+[NSString stringWithFormat:]: -> 0x7fff3bb35708 <+0>: pushq %rbp 0x7fff3bb35709 <+1>: movq %rsp, %rbp 0x7fff3bb3570c <+4>: pushq %r15 0x7fff3bb3570e <+6>: pushq %r14

Hide Details

Hide Details

Hide Details

runCmd: process continue output: Process 24250 resuming Process 24250 stopped * thread #1, queue = 'com.apple.main-thread', stop reason = breakpoint 2.1 frame #0: 0x0000000100001474 a.out`-[MyString initWithNSString:](self=0x0000000102100000, _cmd="initWithNSString:", string=@"Hello from '/Users/buildslave/jenkins/workspace/lldb-cmake/lldb-build/tools/lldb/lldb-test-build.noindex/lang/objc/foundation/TestFoundationDisassembly.test_simple_disasm_dwarf/a.out'") at main.m:23:16 20 21 - (id)initWithNSString:(NSString *)string 22 { -> 23 if (self = [super init]) ^ 24 { 25 str = [NSString stringWithString:string]; 26 date = [NSDate date];

Hide Details

Hide Details

Hide Details

runCmd: thread backtrace output: * thread #1, queue = 'com.apple.main-thread', stop reason = breakpoint 2.1 * frame #0: 0x0000000100001474 a.out`-[MyString initWithNSString:](self=0x0000000102100000, _cmd="initWithNSString:", string=@"Hello from '/Users/buildslave/jenkins/workspace/lldb-cmake/lldb-build/tools/lldb/lldb-test-build.noindex/lang/objc/foundation/TestFoundationDisassembly.test_simple_disasm_dwarf/a.out'") at main.m:23:16 frame #1: 0x00000001000018b0 a.out`Test_MyString(program="/Users/buildslave/jenkins/workspace/lldb-cmake/lldb-build/tools/lldb/lldb-test-build.noindex/lang/objc/foundation/TestFoundationDisassembly.test_simple_disasm_dwarf/a.out") at main.m:95:20 frame #2: 0x0000000100001b14 a.out`main(argc=1, argv=0x00007ffeefbff578) at main.m:133:5 frame #3: 0x00007fff66902085 libdyld.dylib`start + 1 frame #4: 0x00007fff66902085 libdyld.dylib`start + 1

Hide Details

Hide Details

Expecting sub string: a.out`-[MyString initWithNSString:] Matched

Hide Details

runCmd: disassemble -f output: a.out`-[MyString initWithNSString:]: 0x100001460 <+0>: pushq %rbp 0x100001461 <+1>: movq %rsp, %rbp 0x100001464 <+4>: subq $0x30, %rsp 0x100001468 <+8>: movq %rdi, -0x8(%rbp) 0x10000146c <+12>: movq %rsi, -0x10(%rbp) 0x100001470 <+16>: movq %rdx, -0x18(%rbp) -> 0x100001474 <+20>: movq -0x8(%rbp), %rax 0x100001478 <+24>: movq %rax, -0x28(%rbp) 0x10000147c <+28>: movq 0x10b5(%rip), %rax ; (void *)0x0000000100002560: MyString 0x100001483 <+35>: movq %rax, -0x20(%rbp) 0x100001487 <+39>: movq 0xffa(%rip), %rsi ; "init" 0x10000148e <+46>: leaq -0x28(%rbp), %rdi 0x100001492 <+50>: callq 0x100001bbe ; symbol stub for: objc_msgSendSuper2 0x100001497 <+55>: movq %rax, -0x8(%rbp) 0x10000149b <+59>: cmpq $0x0, %rax 0x10000149f <+63>: je 0x1000014f5 ; <+149> at main.m 0x1000014a5 <+69>: movq 0x1064(%rip), %rax ; (void *)0x00007fff9177b950: NSString 0x1000014ac <+76>: movq -0x18(%rbp), %rdx 0x1000014b0 <+80>: movq 0xfd9(%rip), %rsi ; "stringWithString:" 0x1000014b7 <+87>: movq %rax, %rdi 0x1000014ba <+90>: callq *0xb50(%rip) ; (void *)0x00007fff6582d580: objc_msgSend 0x1000014c0 <+96>: movq -0x8(%rbp), %rcx 0x1000014c4 <+100>: movq 0x1075(%rip), %rdx ; MyString.str 0x1000014cb <+107>: movq %rax, (%rcx,%rdx) 0x1000014cf <+111>: movq 0x1042(%rip), %rax ; (void *)0x00007fff912ca3c8: NSDate 0x1000014d6 <+118>: movq 0xfbb(%rip), %rsi ; "date" 0x1000014dd <+125>: movq %rax, %rdi 0x1000014e0 <+128>: callq *0xb2a(%rip) ; (void *)0x00007fff6582d580: objc_msgSend 0x1000014e6 <+134>: movq -0x8(%rbp), %rcx 0x1000014ea <+138>: movq 0x1057(%rip), %rdx ; MyString.date 0x1000014f1 <+145>: movq %rax, (%rcx,%rdx) 0x1000014f5 <+149>: xorl %edx, %edx 0x1000014f7 <+151>: movq -0x8(%rbp), %rax 0x1000014fb <+155>: movq 0xf9e(%rip), %rsi ; "setDescriptionPauses:" 0x100001502 <+162>: movq %rax, %rdi 0x100001505 <+165>: callq *0xb05(%rip) ; (void *)0x00007fff6582d580: objc_msgSend 0x10000150b <+171>: movq -0x8(%rbp), %rax 0x10000150f <+175>: addq $0x30, %rsp 0x100001513 <+179>: popq %rbp 0x100001514 <+180>: retq 0x100001515 <+181>: nopw %cs:(%rax,%rax) 0x10000151f <+191>: nop

Hide Details

Hide Details

runCmd: process continue output: Process 24250 resuming Process 24250 stopped * thread #1, queue = 'com.apple.main-thread', stop reason = breakpoint 3.1 frame #0: 0x00000001000015a0 a.out`-[MyString description](self=0x0000000102100000, _cmd="description") at main.m:43:7 40 { 41 // Set a breakpoint on '-[MyString description]' and test expressions: 42 // expression (char *)sel_getName(_cmd) -> 43 if (self.descriptionPauses) // Break here for description test ^ 44 { 45 printf ("\nAbout to sleep.\n"); 46 usleep(100000);

Hide Details

Hide Details

Hide Details

runCmd: thread backtrace output: * thread #1, queue = 'com.apple.main-thread', stop reason = breakpoint 3.1 * frame #0: 0x00000001000015a0 a.out`-[MyString description](self=0x0000000102100000, _cmd="description") at main.m:43:7 frame #1: 0x00000001000018c8 a.out`Test_MyString(program="/Users/buildslave/jenkins/workspace/lldb-cmake/lldb-build/tools/lldb/lldb-test-build.noindex/lang/objc/foundation/TestFoundationDisassembly.test_simple_disasm_dwarf/a.out") at main.m:96:37 frame #2: 0x0000000100001b14 a.out`main(argc=1, argv=0x00007ffeefbff578) at main.m:133:5 frame #3: 0x00007fff66902085 libdyld.dylib`start + 1 frame #4: 0x00007fff66902085 libdyld.dylib`start + 1

Hide Details

Hide Details

Expecting sub string: a.out`-[MyString description] Matched

Hide Details

runCmd: disassemble -f output: a.out`-[MyString description]: 0x100001590 <+0>: pushq %rbp 0x100001591 <+1>: movq %rsp, %rbp 0x100001594 <+4>: subq $0x20, %rsp 0x100001598 <+8>: movq %rdi, -0x8(%rbp) 0x10000159c <+12>: movq %rsi, -0x10(%rbp) -> 0x1000015a0 <+16>: movq -0x8(%rbp), %rax 0x1000015a4 <+20>: movq 0xf05(%rip), %rsi ; "descriptionPauses" 0x1000015ab <+27>: movq %rax, %rdi 0x1000015ae <+30>: callq *0xa5c(%rip) ; (void *)0x00007fff6582d580: objc_msgSend 0x1000015b4 <+36>: cmpb $0x0, %al 0x1000015b6 <+38>: je 0x1000015d7 ; <+71> at main.m 0x1000015bc <+44>: leaq 0x7c1(%rip), %rdi ; "\nAbout to sleep.\n" 0x1000015c3 <+51>: movb $0x0, %al 0x1000015c5 <+53>: callq 0x100001bca ; symbol stub for: printf 0x1000015ca <+58>: movl $0x186a0, %edi ; imm = 0x186A0 0x1000015cf <+63>: movl %eax, -0x14(%rbp) 0x1000015d2 <+66>: callq 0x100001bd0 ; symbol stub for: usleep 0x1000015d7 <+71>: leaq 0xa7a(%rip), %rax ; @" with timestamp: %@" 0x1000015de <+78>: movq -0x8(%rbp), %rcx 0x1000015e2 <+82>: movq 0xf57(%rip), %rdx ; MyString.str 0x1000015e9 <+89>: movq (%rcx,%rdx), %rcx 0x1000015ed <+93>: movq -0x8(%rbp), %rdx 0x1000015f1 <+97>: movq 0xf50(%rip), %rsi ; MyString.date 0x1000015f8 <+104>: movq (%rdx,%rsi), %rdx 0x1000015fc <+108>: movq 0xeb5(%rip), %rsi ; "stringByAppendingFormat:" 0x100001603 <+115>: movq %rcx, %rdi 0x100001606 <+118>: movq %rdx, -0x20(%rbp) 0x10000160a <+122>: movq %rax, %rdx 0x10000160d <+125>: movq -0x20(%rbp), %rcx 0x100001611 <+129>: movb $0x0, %al 0x100001613 <+131>: callq *0x9f7(%rip) ; (void *)0x00007fff6582d580: objc_msgSend 0x100001619 <+137>: addq $0x20, %rsp 0x10000161d <+141>: popq %rbp 0x10000161e <+142>: retq 0x10000161f <+143>: nop

Hide Details

Hide Details

runCmd: process continue output: Process 24250 resuming Process 24250 stopped * thread #1, queue = 'com.apple.main-thread', stop reason = breakpoint 3.1 frame #0: 0x00000001000015a0 a.out`-[MyString description](self=0x0000000102100000, _cmd="description") at main.m:43:7 40 { 41 // Set a breakpoint on '-[MyString description]' and test expressions: 42 // expression (char *)sel_getName(_cmd) -> 43 if (self.descriptionPauses) // Break here for description test ^ 44 { 45 printf ("\nAbout to sleep.\n"); 46 usleep(100000);

Hide Details

Hide Details

Hide Details

runCmd: process continue output: Process 24250 resuming Process 24250 stopped * thread #1, queue = 'com.apple.main-thread', stop reason = breakpoint 4.1 frame #0: 0x00007fff3bb34cee Foundation`-[NSAutoreleasePool release] Foundation`-[NSAutoreleasePool release]: -> 0x7fff3bb34cee <+0>: pushq %rbp 0x7fff3bb34cef <+1>: movq %rsp, %rbp 0x7fff3bb34cf2 <+4>: pushq %r15 0x7fff3bb34cf4 <+6>: pushq %r14

Hide Details

Hide Details

Hide Details

runCmd: thread backtrace output: * thread #1, queue = 'com.apple.main-thread', stop reason = breakpoint 4.1 * frame #0: 0x00007fff3bb34cee Foundation`-[NSAutoreleasePool release] frame #1: 0x0000000100001b63 a.out`main(argc=1, argv=0x00007ffeefbff578) at main.m:139:5 frame #2: 0x00007fff66902085 libdyld.dylib`start + 1 frame #3: 0x00007fff66902085 libdyld.dylib`start + 1

Hide Details

Hide Details

Expecting sub string: Foundation`-[NSAutoreleasePool release] Matched

Hide Details

runCmd: disassemble -f output: Foundation`-[NSAutoreleasePool release]: -> 0x7fff3bb34cee <+0>: pushq %rbp 0x7fff3bb34cef <+1>: movq %rsp, %rbp 0x7fff3bb34cf2 <+4>: pushq %r15 0x7fff3bb34cf4 <+6>: pushq %r14 0x7fff3bb34cf6 <+8>: pushq %rbx 0x7fff3bb34cf7 <+9>: subq $0x18, %rsp 0x7fff3bb34cfb <+13>: movq %rsi, %r14 0x7fff3bb34cfe <+16>: movq %rdi, %rbx 0x7fff3bb34d01 <+19>: movq 0x55c37d28(%rip), %r15 ; NSAutoreleasePool._reserved2 0x7fff3bb34d08 <+26>: cmpq $0x0, (%rbx,%r15) 0x7fff3bb34d0d <+31>: je 0x7fff3bb34d2e ; <+64> 0x7fff3bb34d0f <+33>: movq %rbx, %rdi 0x7fff3bb34d12 <+36>: movq %r14, %rsi 0x7fff3bb34d15 <+39>: callq 0x7fff3bd0cf28 ; _NSMethodExceptionProem 0x7fff3bb34d1a <+44>: movq %rax, %rcx 0x7fff3bb34d1d <+47>: leaq 0x55b68584(%rip), %rdi ; @"%@: This pool has already been released, do not drain it (double release)." 0x7fff3bb34d24 <+54>: xorl %eax, %eax 0x7fff3bb34d26 <+56>: movq %rcx, %rsi 0x7fff3bb34d29 <+59>: callq 0x7fff3bbb1819 ; NSLog 0x7fff3bb34d2e <+64>: movq 0x55c37cf3(%rip), %rax ; NSAutoreleasePool._reserved3 0x7fff3bb34d35 <+71>: cmpq $0x0, (%rbx,%rax) 0x7fff3bb34d3a <+76>: je 0x7fff3bb34d5b ; <+109> 0x7fff3bb34d3c <+78>: movq %rbx, %rdi 0x7fff3bb34d3f <+81>: movq %r14, %rsi 0x7fff3bb34d42 <+84>: callq 0x7fff3bd0cf28 ; _NSMethodExceptionProem 0x7fff3bb34d47 <+89>: movq %rax, %rcx 0x7fff3bb34d4a <+92>: leaq 0x55b68577(%rip), %rdi ; @"%@: This pool has already been drained, do not release it (double release)." 0x7fff3bb34d51 <+99>: xorl %eax, %eax 0x7fff3bb34d53 <+101>: movq %rcx, %rsi 0x7fff3bb34d56 <+104>: callq 0x7fff3bbb1819 ; NSLog 0x7fff3bb34d5b <+109>: movq 0x55c37cbe(%rip), %rax ; NSAutoreleasePool._token 0x7fff3bb34d62 <+116>: movq (%rbx,%rax), %rdi 0x7fff3bb34d66 <+120>: movq $-0x1, (%rbx,%r15) 0x7fff3bb34d6e <+128>: xorl %ecx, %ecx 0x7fff3bb34d70 <+130>: movq %rcx, (%rbx,%rax) 0x7fff3bb34d74 <+134>: testq %rdi, %rdi 0x7fff3bb34d77 <+137>: je 0x7fff3bb34dd4 ; <+230> 0x7fff3bb34d79 <+139>: callq 0x7fff3be46326 ; symbol stub for: _CFAutoreleasePoolPop 0x7fff3bb34d7e <+144>: cmpb $0x0, 0x55c4cd23(%rip) ; NSAppleEventManagerWillProcessFirstEventNotification + 103 0x7fff3bb34d85 <+151>: je 0x7fff3bb34db6 ; <+200> 0x7fff3bb34d87 <+153>: movq %rbx, %rdi 0x7fff3bb34d8a <+156>: callq 0x7fff3be470a0 ; symbol stub for: objc_removeAssociatedObjects 0x7fff3bb34d8f <+161>: leaq 0x55c4b7ea(%rip), %rcx ; _NSAPCache 0x7fff3bb34d96 <+168>: xorl %edx, %edx 0x7fff3bb34d98 <+170>: movq (%rcx), %rax 0x7fff3bb34d9b <+173>: testq %rax, %rax 0x7fff3bb34d9e <+176>: jne 0x7fff3bb34da9 ; <+187> 0x7fff3bb34da0 <+178>: xorl %eax, %eax 0x7fff3bb34da2 <+180>: lock 0x7fff3bb34da3 <+181>: cmpxchgq %rbx, (%rcx) 0x7fff3bb34da7 <+185>: je 0x7fff3bb34dd4 ; <+230> 0x7fff3bb34da9 <+187>: incq %rdx 0x7fff3bb34dac <+190>: addq $0x8, %rcx 0x7fff3bb34db0 <+194>: cmpq $0x20, %rdx 0x7fff3bb34db4 <+198>: jb 0x7fff3bb34d98 ; <+170> 0x7fff3bb34db6 <+200>: leaq -0x28(%rbp), %rdi 0x7fff3bb34dba <+204>: movq %rbx, (%rdi) 0x7fff3bb34dbd <+207>: movq 0x55c36894(%rip), %rax ; (void *)0x00007fff91779150: NSAutoreleasePool 0x7fff3bb34dc4 <+214>: movq %rax, 0x8(%rdi) 0x7fff3bb34dc8 <+218>: movq 0x55c29ef1(%rip), %rsi ; "dealloc" 0x7fff3bb34dcf <+225>: callq 0x7fff3be47082 ; symbol stub for: objc_msgSendSuper2 0x7fff3bb34dd4 <+230>: addq $0x18, %rsp 0x7fff3bb34dd8 <+234>: popq %rbx 0x7fff3bb34dd9 <+235>: popq %r14 0x7fff3bb34ddb <+237>: popq %r15 0x7fff3bb34ddd <+239>: popq %rbp 0x7fff3bb34dde <+240>: retq 0x7fff3bb34ddf <+241>: nop

Hide Details

Hide Details

<bound method SBProcess.Kill of <lldb.SBProcess; proxy of <Swig Object of type 'lldb::SBProcess *' at 0x111551b10> >>: success

Hide Details

PASS: LLDB (/Users/buildslave/jenkins/workspace/lldb-cmake/lldb-build/bin/clang-10-x86_64) :: test_simple_disasm_dwarf (TestFoundationDisassembly.FoundationDisassembleTestCase) UNSUPPORTED: LLDB (/Users/buildslave/jenkins/workspace/lldb-cmake/lldb-build/bin/clang-10-x86_64) :: test_simple_disasm_dwo (TestFoundationDisassembly.FoundationDisassembleTestCase) (test case does not fall in any category of interest for this run) runCmd: settings set symbols.enable-external-lookup false output:

Hide Details

runCmd: settings set plugin.process.gdb-remote.packet-timeout 60 output:

Hide Details

runCmd: settings set symbols.clang-modules-cache-path "/Users/buildslave/jenkins/workspace/lldb-cmake/lldb-build/tools/lldb/lldb-test-build.noindex/module-cache-lldb" output:

Hide Details

runCmd: settings set use-color false output:

Hide Details

runCmd: _regexp-break +[NSString stringWithFormat:] output: Breakpoint 1: where = Foundation`+[NSString stringWithFormat:], address = 0x0000000000004708

Hide Details

Hide Details

Expecting pattern: ^Breakpoint (?P<bpno>[0-9]+): (?P<num_locations>[0-9]+) locations\.$ Not matched

Hide Details

Expecting pattern: ^Breakpoint (?P<bpno>[0-9]+): (?P<num_locations>no) locations \(pending\)\. Not matched

Hide Details

Expecting pattern: ^Breakpoint (?P<bpno>[0-9]+): where = (?P<module>.*)`(?P<symbol>[+\-]{0,1}[^+]+)( \+ (?P<offset>[0-9]+)){0,1}( \[inlined\] (?P<inline_symbol>.*)){0,1} at (?P<file>[^:]+):(?P<line_no>[0-9]+)(?P<column>(:[0-9]+)?), address = (?P<address>0x[0-9a-fA-F]+)$ Not matched

Hide Details

Expecting pattern: ^Breakpoint (?P<bpno>[0-9]+): where = (?P<module>.*)`(?P<symbol>.*)( \+ (?P<offset>[0-9]+)){0,1}, address = (?P<address>0x[0-9a-fA-F]+)$ Matched

Hide Details

runCmd: breakpoint set -n "-[MyString initWithNSString:]" output: Breakpoint 2: where = a.out`-[MyString initWithNSString:] + 20 at main.m:23:16, address = 0x0000000100001474

Hide Details

Hide Details

Expecting pattern: ^Breakpoint (?P<bpno>[0-9]+): (?P<num_locations>[0-9]+) locations\.$ Not matched

Hide Details

Expecting pattern: ^Breakpoint (?P<bpno>[0-9]+): (?P<num_locations>no) locations \(pending\)\. Not matched

Hide Details

Expecting pattern: ^Breakpoint (?P<bpno>[0-9]+): where = (?P<module>.*)`(?P<symbol>[+\-]{0,1}[^+]+)( \+ (?P<offset>[0-9]+)){0,1}( \[inlined\] (?P<inline_symbol>.*)){0,1} at (?P<file>[^:]+):(?P<line_no>[0-9]+)(?P<column>(:[0-9]+)?), address = (?P<address>0x[0-9a-fA-F]+)$ Matched

Hide Details

runCmd: breakpoint set -S "description" --shlib "a.out" output: Breakpoint 3: where = a.out`-[MyString description] + 16 at main.m:43:7, address = 0x00000001000015a0

Hide Details

Hide Details

Expecting pattern: ^Breakpoint (?P<bpno>[0-9]+): (?P<num_locations>[0-9]+) locations\.$ Not matched

Hide Details

Expecting pattern: ^Breakpoint (?P<bpno>[0-9]+): (?P<num_locations>no) locations \(pending\)\. Not matched

Hide Details

Expecting pattern: ^Breakpoint (?P<bpno>[0-9]+): where = (?P<module>.*)`(?P<symbol>[+\-]{0,1}[^+]+)( \+ (?P<offset>[0-9]+)){0,1}( \[inlined\] (?P<inline_symbol>.*)){0,1} at (?P<file>[^:]+):(?P<line_no>[0-9]+)(?P<column>(:[0-9]+)?), address = (?P<address>0x[0-9a-fA-F]+)$ Matched

Hide Details

runCmd: _regexp-break -[NSAutoreleasePool release] output: Breakpoint 4: where = Foundation`-[NSAutoreleasePool release], address = 0x0000000000003cee

Hide Details

Hide Details

Expecting pattern: ^Breakpoint (?P<bpno>[0-9]+): (?P<num_locations>[0-9]+) locations\.$ Not matched

Hide Details

Expecting pattern: ^Breakpoint (?P<bpno>[0-9]+): (?P<num_locations>no) locations \(pending\)\. Not matched

Hide Details

Expecting pattern: ^Breakpoint (?P<bpno>[0-9]+): where = (?P<module>.*)`(?P<symbol>[+\-]{0,1}[^+]+)( \+ (?P<offset>[0-9]+)){0,1}( \[inlined\] (?P<inline_symbol>.*)){0,1} at (?P<file>[^:]+):(?P<line_no>[0-9]+)(?P<column>(:[0-9]+)?), address = (?P<address>0x[0-9a-fA-F]+)$ Not matched

Hide Details

Expecting pattern: ^Breakpoint (?P<bpno>[0-9]+): where = (?P<module>.*)`(?P<symbol>.*)( \+ (?P<offset>[0-9]+)){0,1}, address = (?P<address>0x[0-9a-fA-F]+)$ Matched

Hide Details

runCmd: run output: Process 24327 stopped * thread #1, queue = 'com.apple.main-thread', stop reason = breakpoint 1.1 frame #0: 0x00007fff3bb35708 Foundation`+[NSString stringWithFormat:] Foundation`+[NSString stringWithFormat:]: -> 0x7fff3bb35708 <+0>: pushq %rbp 0x7fff3bb35709 <+1>: movq %rsp, %rbp 0x7fff3bb3570c <+4>: pushq %r15 0x7fff3bb3570e <+6>: pushq %r14

Hide Details

Process 24327 launched: '/Users/buildslave/jenkins/workspace/lldb-cmake/lldb-build/tools/lldb/lldb-test-build.noindex/lang/objc/foundation/TestFoundationDisassembly.test_simple_disasm_gmodules/a.out' (x86_64)

Hide Details

Hide Details

runCmd: thread backtrace output: * thread #1, queue = 'com.apple.main-thread', stop reason = breakpoint 1.1 * frame #0: 0x00007fff3bb35708 Foundation`+[NSString stringWithFormat:] frame #1: 0x000000010000175b a.out`Test_NSString(program="/Users/buildslave/jenkins/workspace/lldb-cmake/lldb-build/tools/lldb/lldb-test-build.noindex/lang/objc/foundation/TestFoundationDisassembly.test_simple_disasm_gmodules/a.out") at main.m:69:21 frame #2: 0x0000000100001b05 a.out`main(argc=1, argv=0x00007ffeefbff570) at main.m:132:5 frame #3: 0x00007fff66902085 libdyld.dylib`start + 1

Hide Details

Hide Details

Expecting sub string: Foundation`+[NSString stringWithFormat:] Matched

Hide Details

runCmd: disassemble -f output: Foundation`+[NSString stringWithFormat:]: -> 0x7fff3bb35708 <+0>: pushq %rbp 0x7fff3bb35709 <+1>: movq %rsp, %rbp 0x7fff3bb3570c <+4>: pushq %r15 0x7fff3bb3570e <+6>: pushq %r14 0x7fff3bb35710 <+8>: pushq %rbx 0x7fff3bb35711 <+9>: subq $0xd8, %rsp 0x7fff3bb35718 <+16>: movq %rdx, %r14 0x7fff3bb3571b <+19>: testb %al, %al 0x7fff3bb3571d <+21>: je 0x7fff3bb3574b ; <+67> 0x7fff3bb3571f <+23>: movaps %xmm0, -0xc0(%rbp) 0x7fff3bb35726 <+30>: movaps %xmm1, -0xb0(%rbp) 0x7fff3bb3572d <+37>: movaps %xmm2, -0xa0(%rbp) 0x7fff3bb35734 <+44>: movaps %xmm3, -0x90(%rbp) 0x7fff3bb3573b <+51>: movaps %xmm4, -0x80(%rbp) 0x7fff3bb3573f <+55>: movaps %xmm5, -0x70(%rbp) 0x7fff3bb35743 <+59>: movaps %xmm6, -0x60(%rbp) 0x7fff3bb35747 <+63>: movaps %xmm7, -0x50(%rbp) 0x7fff3bb3574b <+67>: leaq -0xf0(%rbp), %rax 0x7fff3bb35752 <+74>: movq %r9, 0x28(%rax) 0x7fff3bb35756 <+78>: movq %r8, 0x20(%rax) 0x7fff3bb3575a <+82>: movq %rcx, 0x18(%rax) 0x7fff3bb3575e <+86>: movq 0x55b4bcbb(%rip), %rcx ; (void *)0x00007fff9870f070: __stack_chk_guard 0x7fff3bb35765 <+93>: movq (%rcx), %rcx 0x7fff3bb35768 <+96>: movq %rcx, -0x20(%rbp) 0x7fff3bb3576c <+100>: leaq -0x40(%rbp), %rbx 0x7fff3bb35770 <+104>: movq %rax, 0x10(%rbx) 0x7fff3bb35774 <+108>: leaq 0x10(%rbp), %rax 0x7fff3bb35778 <+112>: movq %rax, 0x8(%rbx) 0x7fff3bb3577c <+116>: movabsq $0x3000000018, %rax ; imm = 0x3000000018 0x7fff3bb35786 <+126>: movq %rax, (%rbx) 0x7fff3bb35789 <+129>: movq 0x55c29778(%rip), %rsi ; "allocWithZone:" 0x7fff3bb35790 <+136>: movq 0x55b4c281(%rip), %r15 ; (void *)0x00007fff6582d580: objc_msgSend 0x7fff3bb35797 <+143>: xorl %edx, %edx 0x7fff3bb35799 <+145>: callq *%r15 0x7fff3bb3579c <+148>: movq 0x55c2d7dd(%rip), %rsi ; "initWithFormat:locale:arguments:" 0x7fff3bb357a3 <+155>: xorl %ecx, %ecx 0x7fff3bb357a5 <+157>: movq %rax, %rdi 0x7fff3bb357a8 <+160>: movq %r14, %rdx 0x7fff3bb357ab <+163>: movq %rbx, %r8 0x7fff3bb357ae <+166>: callq *%r15 0x7fff3bb357b1 <+169>: movq 0x55c29510(%rip), %rsi ; "autorelease" 0x7fff3bb357b8 <+176>: movq %rax, %rdi 0x7fff3bb357bb <+179>: callq *%r15 0x7fff3bb357be <+182>: movq 0x55b4bc5b(%rip), %rcx ; (void *)0x00007fff9870f070: __stack_chk_guard 0x7fff3bb357c5 <+189>: movq (%rcx), %rcx 0x7fff3bb357c8 <+192>: cmpq -0x20(%rbp), %rcx 0x7fff3bb357cc <+196>: jne 0x7fff3bb357dc ; <+212> 0x7fff3bb357ce <+198>: addq $0xd8, %rsp 0x7fff3bb357d5 <+205>: popq %rbx 0x7fff3bb357d6 <+206>: popq %r14 0x7fff3bb357d8 <+208>: popq %r15 0x7fff3bb357da <+210>: popq %rbp 0x7fff3bb357db <+211>: retq 0x7fff3bb357dc <+212>: callq 0x7fff3be468b4 ; symbol stub for: __stack_chk_fail

Hide Details

Hide Details

runCmd: process continue output: Process 24327 resuming Process 24327 stopped * thread #1, queue = 'com.apple.main-thread', stop reason = breakpoint 1.1 frame #0: 0x00007fff3bb35708 Foundation`+[NSString stringWithFormat:] Foundation`+[NSString stringWithFormat:]: -> 0x7fff3bb35708 <+0>: pushq %rbp 0x7fff3bb35709 <+1>: movq %rsp, %rbp 0x7fff3bb3570c <+4>: pushq %r15 0x7fff3bb3570e <+6>: pushq %r14

Hide Details

Hide Details

Hide Details

runCmd: process continue output: Process 24327 resuming Process 24327 stopped * thread #1, queue = 'com.apple.main-thread', stop reason = breakpoint 2.1 frame #0: 0x0000000100001474 a.out`-[MyString initWithNSString:](self=0x0000000102300190, _cmd="initWithNSString:", string=@"Hello from '/Users/buildslave/jenkins/workspace/lldb-cmake/lldb-build/tools/lldb/lldb-test-build.noindex/lang/objc/foundation/TestFoundationDisassembly.test_simple_disasm_gmodules/a.out'") at main.m:23:16 20 21 - (id)initWithNSString:(NSString *)string 22 { -> 23 if (self = [super init]) ^ 24 { 25 str = [NSString stringWithString:string]; 26 date = [NSDate date];

Hide Details

Hide Details

Hide Details

runCmd: thread backtrace output: * thread #1, queue = 'com.apple.main-thread', stop reason = breakpoint 2.1 * frame #0: 0x0000000100001474 a.out`-[MyString initWithNSString:](self=0x0000000102300190, _cmd="initWithNSString:", string=@"Hello from '/Users/buildslave/jenkins/workspace/lldb-cmake/lldb-build/tools/lldb/lldb-test-build.noindex/lang/objc/foundation/TestFoundationDisassembly.test_simple_disasm_gmodules/a.out'") at main.m:23:16 frame #1: 0x00000001000018b0 a.out`Test_MyString(program="/Users/buildslave/jenkins/workspace/lldb-cmake/lldb-build/tools/lldb/lldb-test-build.noindex/lang/objc/foundation/TestFoundationDisassembly.test_simple_disasm_gmodules/a.out") at main.m:95:20 frame #2: 0x0000000100001b14 a.out`main(argc=1, argv=0x00007ffeefbff570) at main.m:133:5 frame #3: 0x00007fff66902085 libdyld.dylib`start + 1

Hide Details

Hide Details

Expecting sub string: a.out`-[MyString initWithNSString:] Matched

Hide Details

runCmd: disassemble -f output: a.out`-[MyString initWithNSString:]: 0x100001460 <+0>: pushq %rbp 0x100001461 <+1>: movq %rsp, %rbp 0x100001464 <+4>: subq $0x30, %rsp 0x100001468 <+8>: movq %rdi, -0x8(%rbp) 0x10000146c <+12>: movq %rsi, -0x10(%rbp) 0x100001470 <+16>: movq %rdx, -0x18(%rbp) -> 0x100001474 <+20>: movq -0x8(%rbp), %rax 0x100001478 <+24>: movq %rax, -0x28(%rbp) 0x10000147c <+28>: movq 0x10b5(%rip), %rax ; (void *)0x0000000100002560: MyString 0x100001483 <+35>: movq %rax, -0x20(%rbp) 0x100001487 <+39>: movq 0xffa(%rip), %rsi ; "init" 0x10000148e <+46>: leaq -0x28(%rbp), %rdi 0x100001492 <+50>: callq 0x100001bbe ; symbol stub for: objc_msgSendSuper2 0x100001497 <+55>: movq %rax, -0x8(%rbp) 0x10000149b <+59>: cmpq $0x0, %rax 0x10000149f <+63>: je 0x1000014f5 ; <+149> at main.m 0x1000014a5 <+69>: movq 0x1064(%rip), %rax ; (void *)0x00007fff9177b950: NSString 0x1000014ac <+76>: movq -0x18(%rbp), %rdx 0x1000014b0 <+80>: movq 0xfd9(%rip), %rsi ; "stringWithString:" 0x1000014b7 <+87>: movq %rax, %rdi 0x1000014ba <+90>: callq *0xb50(%rip) ; (void *)0x00007fff6582d580: objc_msgSend 0x1000014c0 <+96>: movq -0x8(%rbp), %rcx 0x1000014c4 <+100>: movq 0x1075(%rip), %rdx ; MyString.str 0x1000014cb <+107>: movq %rax, (%rcx,%rdx) 0x1000014cf <+111>: movq 0x1042(%rip), %rax ; (void *)0x00007fff912ca3c8: NSDate 0x1000014d6 <+118>: movq 0xfbb(%rip), %rsi ; "date" 0x1000014dd <+125>: movq %rax, %rdi 0x1000014e0 <+128>: callq *0xb2a(%rip) ; (void *)0x00007fff6582d580: objc_msgSend 0x1000014e6 <+134>: movq -0x8(%rbp), %rcx 0x1000014ea <+138>: movq 0x1057(%rip), %rdx ; MyString.date 0x1000014f1 <+145>: movq %rax, (%rcx,%rdx) 0x1000014f5 <+149>: xorl %edx, %edx 0x1000014f7 <+151>: movq -0x8(%rbp), %rax 0x1000014fb <+155>: movq 0xf9e(%rip), %rsi ; "setDescriptionPauses:" 0x100001502 <+162>: movq %rax, %rdi 0x100001505 <+165>: callq *0xb05(%rip) ; (void *)0x00007fff6582d580: objc_msgSend 0x10000150b <+171>: movq -0x8(%rbp), %rax 0x10000150f <+175>: addq $0x30, %rsp 0x100001513 <+179>: popq %rbp 0x100001514 <+180>: retq 0x100001515 <+181>: nopw %cs:(%rax,%rax) 0x10000151f <+191>: nop

Hide Details

Hide Details

runCmd: process continue output: Process 24327 resuming Process 24327 stopped * thread #1, queue = 'com.apple.main-thread', stop reason = breakpoint 3.1 frame #0: 0x00000001000015a0 a.out`-[MyString description](self=0x0000000102300190, _cmd="description") at main.m:43:7 40 { 41 // Set a breakpoint on '-[MyString description]' and test expressions: 42 // expression (char *)sel_getName(_cmd) -> 43 if (self.descriptionPauses) // Break here for description test ^ 44 { 45 printf ("\nAbout to sleep.\n"); 46 usleep(100000);

Hide Details

Hide Details

Hide Details

runCmd: thread backtrace output: * thread #1, queue = 'com.apple.main-thread', stop reason = breakpoint 3.1 * frame #0: 0x00000001000015a0 a.out`-[MyString description](self=0x0000000102300190, _cmd="description") at main.m:43:7 frame #1: 0x00000001000018c8 a.out`Test_MyString(program="/Users/buildslave/jenkins/workspace/lldb-cmake/lldb-build/tools/lldb/lldb-test-build.noindex/lang/objc/foundation/TestFoundationDisassembly.test_simple_disasm_gmodules/a.out") at main.m:96:37 frame #2: 0x0000000100001b14 a.out`main(argc=1, argv=0x00007ffeefbff570) at main.m:133:5 frame #3: 0x00007fff66902085 libdyld.dylib`start + 1

Hide Details

Hide Details

Expecting sub string: a.out`-[MyString description] Matched

Hide Details

runCmd: disassemble -f output: a.out`-[MyString description]: 0x100001590 <+0>: pushq %rbp 0x100001591 <+1>: movq %rsp, %rbp 0x100001594 <+4>: subq $0x20, %rsp 0x100001598 <+8>: movq %rdi, -0x8(%rbp) 0x10000159c <+12>: movq %rsi, -0x10(%rbp) -> 0x1000015a0 <+16>: movq -0x8(%rbp), %rax 0x1000015a4 <+20>: movq 0xf05(%rip), %rsi ; "descriptionPauses" 0x1000015ab <+27>: movq %rax, %rdi 0x1000015ae <+30>: callq *0xa5c(%rip) ; (void *)0x00007fff6582d580: objc_msgSend 0x1000015b4 <+36>: cmpb $0x0, %al 0x1000015b6 <+38>: je 0x1000015d7 ; <+71> at main.m 0x1000015bc <+44>: leaq 0x7c1(%rip), %rdi ; "\nAbout to sleep.\n" 0x1000015c3 <+51>: movb $0x0, %al 0x1000015c5 <+53>: callq 0x100001bca ; symbol stub for: printf 0x1000015ca <+58>: movl $0x186a0, %edi ; imm = 0x186A0 0x1000015cf <+63>: movl %eax, -0x14(%rbp) 0x1000015d2 <+66>: callq 0x100001bd0 ; symbol stub for: usleep 0x1000015d7 <+71>: leaq 0xa7a(%rip), %rax ; @" with timestamp: %@" 0x1000015de <+78>: movq -0x8(%rbp), %rcx 0x1000015e2 <+82>: movq 0xf57(%rip), %rdx ; MyString.str 0x1000015e9 <+89>: movq (%rcx,%rdx), %rcx 0x1000015ed <+93>: movq -0x8(%rbp), %rdx 0x1000015f1 <+97>: movq 0xf50(%rip), %rsi ; MyString.date 0x1000015f8 <+104>: movq (%rdx,%rsi), %rdx 0x1000015fc <+108>: movq 0xeb5(%rip), %rsi ; "stringByAppendingFormat:" 0x100001603 <+115>: movq %rcx, %rdi 0x100001606 <+118>: movq %rdx, -0x20(%rbp) 0x10000160a <+122>: movq %rax, %rdx 0x10000160d <+125>: movq -0x20(%rbp), %rcx 0x100001611 <+129>: movb $0x0, %al 0x100001613 <+131>: callq *0x9f7(%rip) ; (void *)0x00007fff6582d580: objc_msgSend 0x100001619 <+137>: addq $0x20, %rsp 0x10000161d <+141>: popq %rbp 0x10000161e <+142>: retq 0x10000161f <+143>: nop

Hide Details

Hide Details

runCmd: process continue output: Process 24327 resuming Process 24327 stopped * thread #1, queue = 'com.apple.main-thread', stop reason = breakpoint 3.1 frame #0: 0x00000001000015a0 a.out`-[MyString description](self=0x0000000102300190, _cmd="description") at main.m:43:7 40 { 41 // Set a breakpoint on '-[MyString description]' and test expressions: 42 // expression (char *)sel_getName(_cmd) -> 43 if (self.descriptionPauses) // Break here for description test ^ 44 { 45 printf ("\nAbout to sleep.\n"); 46 usleep(100000);

Hide Details

Hide Details

Hide Details

runCmd: process continue output: Process 24327 resuming Process 24327 stopped * thread #1, queue = 'com.apple.main-thread', stop reason = breakpoint 4.1 frame #0: 0x00007fff3bb34cee Foundation`-[NSAutoreleasePool release] Foundation`-[NSAutoreleasePool release]: -> 0x7fff3bb34cee <+0>: pushq %rbp 0x7fff3bb34cef <+1>: movq %rsp, %rbp 0x7fff3bb34cf2 <+4>: pushq %r15 0x7fff3bb34cf4 <+6>: pushq %r14

Hide Details

Hide Details

Hide Details

runCmd: thread backtrace output: * thread #1, queue = 'com.apple.main-thread', stop reason = breakpoint 4.1 * frame #0: 0x00007fff3bb34cee Foundation`-[NSAutoreleasePool release] frame #1: 0x0000000100001b63 a.out`main(argc=1, argv=0x00007ffeefbff570) at main.m:139:5 frame #2: 0x00007fff66902085 libdyld.dylib`start + 1

Hide Details

Hide Details

Expecting sub string: Foundation`-[NSAutoreleasePool release] Matched

Hide Details

runCmd: disassemble -f output: Foundation`-[NSAutoreleasePool release]: -> 0x7fff3bb34cee <+0>: pushq %rbp 0x7fff3bb34cef <+1>: movq %rsp, %rbp 0x7fff3bb34cf2 <+4>: pushq %r15 0x7fff3bb34cf4 <+6>: pushq %r14 0x7fff3bb34cf6 <+8>: pushq %rbx 0x7fff3bb34cf7 <+9>: subq $0x18, %rsp 0x7fff3bb34cfb <+13>: movq %rsi, %r14 0x7fff3bb34cfe <+16>: movq %rdi, %rbx 0x7fff3bb34d01 <+19>: movq 0x55c37d28(%rip), %r15 ; NSAutoreleasePool._reserved2 0x7fff3bb34d08 <+26>: cmpq $0x0, (%rbx,%r15) 0x7fff3bb34d0d <+31>: je 0x7fff3bb34d2e ; <+64> 0x7fff3bb34d0f <+33>: movq %rbx, %rdi 0x7fff3bb34d12 <+36>: movq %r14, %rsi 0x7fff3bb34d15 <+39>: callq 0x7fff3bd0cf28 ; _NSMethodExceptionProem 0x7fff3bb34d1a <+44>: movq %rax, %rcx 0x7fff3bb34d1d <+47>: leaq 0x55b68584(%rip), %rdi ; @"%@: This pool has already been released, do not drain it (double release)." 0x7fff3bb34d24 <+54>: xorl %eax, %eax 0x7fff3bb34d26 <+56>: movq %rcx, %rsi 0x7fff3bb34d29 <+59>: callq 0x7fff3bbb1819 ; NSLog 0x7fff3bb34d2e <+64>: movq 0x55c37cf3(%rip), %rax ; NSAutoreleasePool._reserved3 0x7fff3bb34d35 <+71>: cmpq $0x0, (%rbx,%rax) 0x7fff3bb34d3a <+76>: je 0x7fff3bb34d5b ; <+109> 0x7fff3bb34d3c <+78>: movq %rbx, %rdi 0x7fff3bb34d3f <+81>: movq %r14, %rsi 0x7fff3bb34d42 <+84>: callq 0x7fff3bd0cf28 ; _NSMethodExceptionProem 0x7fff3bb34d47 <+89>: movq %rax, %rcx 0x7fff3bb34d4a <+92>: leaq 0x55b68577(%rip), %rdi ; @"%@: This pool has already been drained, do not release it (double release)." 0x7fff3bb34d51 <+99>: xorl %eax, %eax 0x7fff3bb34d53 <+101>: movq %rcx, %rsi 0x7fff3bb34d56 <+104>: callq 0x7fff3bbb1819 ; NSLog 0x7fff3bb34d5b <+109>: movq 0x55c37cbe(%rip), %rax ; NSAutoreleasePool._token 0x7fff3bb34d62 <+116>: movq (%rbx,%rax), %rdi 0x7fff3bb34d66 <+120>: movq $-0x1, (%rbx,%r15) 0x7fff3bb34d6e <+128>: xorl %ecx, %ecx 0x7fff3bb34d70 <+130>: movq %rcx, (%rbx,%rax) 0x7fff3bb34d74 <+134>: testq %rdi, %rdi 0x7fff3bb34d77 <+137>: je 0x7fff3bb34dd4 ; <+230> 0x7fff3bb34d79 <+139>: callq 0x7fff3be46326 ; symbol stub for: _CFAutoreleasePoolPop 0x7fff3bb34d7e <+144>: cmpb $0x0, 0x55c4cd23(%rip) ; NSAppleEventManagerWillProcessFirstEventNotification + 103 0x7fff3bb34d85 <+151>: je 0x7fff3bb34db6 ; <+200> 0x7fff3bb34d87 <+153>: movq %rbx, %rdi 0x7fff3bb34d8a <+156>: callq 0x7fff3be470a0 ; symbol stub for: objc_removeAssociatedObjects 0x7fff3bb34d8f <+161>: leaq 0x55c4b7ea(%rip), %rcx ; _NSAPCache 0x7fff3bb34d96 <+168>: xorl %edx, %edx 0x7fff3bb34d98 <+170>: movq (%rcx), %rax 0x7fff3bb34d9b <+173>: testq %rax, %rax 0x7fff3bb34d9e <+176>: jne 0x7fff3bb34da9 ; <+187> 0x7fff3bb34da0 <+178>: xorl %eax, %eax 0x7fff3bb34da2 <+180>: lock 0x7fff3bb34da3 <+181>: cmpxchgq %rbx, (%rcx) 0x7fff3bb34da7 <+185>: je 0x7fff3bb34dd4 ; <+230> 0x7fff3bb34da9 <+187>: incq %rdx 0x7fff3bb34dac <+190>: addq $0x8, %rcx 0x7fff3bb34db0 <+194>: cmpq $0x20, %rdx 0x7fff3bb34db4 <+198>: jb 0x7fff3bb34d98 ; <+170> 0x7fff3bb34db6 <+200>: leaq -0x28(%rbp), %rdi 0x7fff3bb34dba <+204>: movq %rbx, (%rdi) 0x7fff3bb34dbd <+207>: movq 0x55c36894(%rip), %rax ; (void *)0x00007fff91779150: NSAutoreleasePool 0x7fff3bb34dc4 <+214>: movq %rax, 0x8(%rdi) 0x7fff3bb34dc8 <+218>: movq 0x55c29ef1(%rip), %rsi ; "dealloc" 0x7fff3bb34dcf <+225>: callq 0x7fff3be47082 ; symbol stub for: objc_msgSendSuper2 0x7fff3bb34dd4 <+230>: addq $0x18, %rsp 0x7fff3bb34dd8 <+234>: popq %rbx 0x7fff3bb34dd9 <+235>: popq %r14 0x7fff3bb34ddb <+237>: popq %r15 0x7fff3bb34ddd <+239>: popq %rbp 0x7fff3bb34dde <+240>: retq 0x7fff3bb34ddf <+241>: nop

Hide Details

Hide Details

<bound method SBProcess.Kill of <lldb.SBProcess; proxy of <Swig Object of type 'lldb::SBProcess *' at 0x110b97f60> >>: success

Hide Details

PASS: LLDB (/Users/buildslave/jenkins/workspace/lldb-cmake/lldb-build/bin/clang-10-x86_64) :: test_simple_disasm_gmodules (TestFoundationDisassembly.FoundationDisassembleTestCase) Restore dir to: /Users/buildslave/jenkins/workspace/lldb-cmake/lldb-build/tools/lldb/lit ====================================================================== ERROR: test_foundation_disasm_dwarf (TestFoundationDisassembly.FoundationDisassembleTestCase) Do 'disassemble -n func' on each and every 'Code' symbol entry from the Foundation.framework. ---------------------------------------------------------------------- Error when building test subject.

Hide Details

Build Command: make VPATH=/Users/buildslave/jenkins/workspace/lldb-cmake/llvm-project/lldb/packages/Python/lldbsuite/test/lang/objc/foundation -C /Users/buildslave/jenkins/workspace/lldb-cmake/lldb-build/tools/lldb/lldb-test-build.noindex/lang/objc/foundation/TestFoundationDisassembly.test_foundation_disasm_dwarf -I /Users/buildslave/jenkins/workspace/lldb-cmake/llvm-project/lldb/packages/Python/lldbsuite/test/lang/objc/foundation -I /Users/buildslave/jenkins/workspace/lldb-cmake/llvm-project/lldb/packages/Python/lldbsuite/test/make -f /Users/buildslave/jenkins/workspace/lldb-cmake/llvm-project/lldb/packages/Python/lldbsuite/test/lang/objc/foundation/Makefile MAKE_DSYM=NO ARCH=x86_64 CC="/Users/buildslave/jenkins/workspace/lldb-cmake/lldb-build/bin/clang-10"

Hide Details

Build Command Output: clang-10: error: unable to execute command: Killed: 9 clang-10: error: clang frontend command failed due to signal (use -v to see invocation) clang version 10.0.99 (http://labmaster3.local/git/llvm-project.git 950b70dcc7e3e06f7ffbb0386f82d5085cd709a9) Target: x86_64-apple-darwin18.0.0 Thread model: posix InstalledDir: /Users/buildslave/jenkins/workspace/lldb-cmake/lldb-build/bin clang-10: note: diagnostic msg: PLEASE submit a bug report to https://bugs.llvm.org/ and include the crash backtrace, preprocessed source, and associated run script. clang-10: note: diagnostic msg: ********************

Hide Details

PLEASE ATTACH THE FOLLOWING FILES TO THE BUG REPORT: Preprocessed source(s) and associated run script(s) are located at: clang-10: note: diagnostic msg: /var/folders/09/r4vw4v8n5kb67jl66zvlbljw0000gn/T/lit_tmp_s3yc8naf/main-438513.d clang-10: note: diagnostic msg: /var/folders/09/r4vw4v8n5kb67jl66zvlbljw0000gn/T/lit_tmp_s3yc8naf/main-438513.sh clang-10: note: diagnostic msg: Crash backtrace is located in clang-10: note: diagnostic msg: /Users/buildslave/Library/Logs/DiagnosticReports/clang-10_<YYYY-MM-DD-HHMMSS>_<hostname>.crash clang-10: note: diagnostic msg: (choose the .crash file that corresponds to your crash) clang-10: note: diagnostic msg:

Hide Details

******************** make: *** [a.out] Killed: 9

Hide Details

Test Directory: /Users/buildslave/jenkins/workspace/lldb-cmake/llvm-project/lldb/packages/Python/lldbsuite/test/lang/objc/foundation ---------------------------------------------------------------------- Ran 8 tests in 508.231s

Hide Details

RESULT: FAILED (5 passes, 0 failures, 1 errors, 2 skipped, 0 expected failures, 0 unexpected successes)

Hide Details

******************** PASS: lldb-Suite :: commands/frame/diagnose/dereference-argument/TestDiagnoseDereferenceArgument.py (1451 of 1734) PASS: lldb-Suite :: functionalities/float-display/TestFloatDisplay.py (1452 of 1734) PASS: lldb-Unit :: Utility/./UtilityTests/AnsiTerminal.Basic (1453 of 1734) PASS: lldb-Unit :: Utility/./UtilityTests/EventTest.DumpEventDataBytes (1454 of 1734) PASS: lldb-Suite :: macosx/add-dsym/TestAddDsymMidExecutionCommand.py (1455 of 1734) PASS: lldb-Unit :: Utility/./UtilityTests/StreamTeeTest.Constructor2Streams (1456 of 1734) PASS: lldb-Suite :: functionalities/thread/num_threads/TestNumThreads.py (1457 of 1734) PASS: lldb-Suite :: python_api/value/change_values/TestChangeValueAPI.py (1458 of 1734) PASS: lldb-Unit :: Symbol/./SymbolTests/TestClangASTContext.TestGetBasicTypeFromEnum (1459 of 1734) PASS: lldb-Unit :: Expression/./ExpressionTests/DiagnosticManagerTest.PutStringSeverities (1460 of 1734) PASS: lldb-Suite :: lang/c/stepping/TestStepAndBreakpoints.py (1461 of 1734) PASS: lldb-Unit :: SymbolFile/DWARF/./SymbolFileDWARFTests/SymbolFileDWARFTests.TestAbilitiesForDWARF (1462 of 1734) PASS: lldb-Suite :: commands/expression/completion-crash-incomplete-record/TestCompletionCrashIncompleteRecord.py (1463 of 1734) PASS: lldb-Unit :: UnwindAssembly/x86/./UnwindAssemblyx86Tests/Testx86AssemblyInspectionEngine.TestPushR14 (1464 of 1734) PASS: lldb-Unit :: Utility/./UtilityTests/AnsiTerminal.KnownPrefix (1465 of 1734) PASS: lldb-Suite :: python_api/process/TestProcessAPI.py (1466 of 1734) PASS: lldb-Unit :: Utility/./UtilityTests/StringExtractorTest.GetHexU8_Exact (1467 of 1734) PASS: lldb-Unit :: ScriptInterpreter/Python/./ScriptInterpreterPythonTests/PythonDataObjectsTest.TestPythonIntegerToStr (1468 of 1734) PASS: lldb-Unit :: Utility/./UtilityTests/ArgsTest.ReplaceArgumentAtIndexOutOfRange (1469 of 1734) PASS: lldb-Suite :: lang/objc/foundation/TestObjCMethods2.py (1470 of 1734) PASS: lldb-Suite :: commands/disassemble/basic/TestDisassembleBreakpoint.py (1471 of 1734) PASS: lldb-Unit :: Utility/./UtilityTests/StringExtractorTest.GetNameColonValueContainsColon (1472 of 1734) PASS: lldb-Unit :: UnwindAssembly/x86/./UnwindAssemblyx86Tests/Testx86AssemblyInspectionEngine.TestStackRealignMSVC_i386 (1473 of 1734) PASS: lldb-Unit :: Language/Highlighting/./HighlighterTests/HighlighterTest.ClangSquareBrackets (1474 of 1734) PASS: LLDB :: SymbolFile/DWARF/debug-types-address-ranges.s (1475 of 1734) PASS: lldb-Suite :: tools/lldb-server/TestGdbRemoteRegisterState.py (1476 of 1734) PASS: lldb-Suite :: lang/cpp/auto/TestCPPAuto.py (1477 of 1734) PASS: lldb-Suite :: python_api/frame/inlines/TestInlinedFrame.py (1478 of 1734) PASS: lldb-Suite :: functionalities/archives/TestBSDArchives.py (1479 of 1734) PASS: lldb-Suite :: functionalities/data-formatter/data-formatter-categories/TestDataFormatterCategories.py (1480 of 1734) PASS: lldb-Unit :: Utility/./UtilityTests/StreamTest.PutChar (1481 of 1734) PASS: lldb-Unit :: Utility/./UtilityTests/UriParserTest.LongPath (1482 of 1734) UNSUPPORTED: LLDB :: Unwind/unwind-plan-dwarf-dump.test (1483 of 1734) PASS: lldb-Unit :: Utility/./UtilityTests/RangeTest.Copy (1484 of 1734) PASS: LLDB :: Driver/LocalLLDBInit.test (1485 of 1734) PASS: lldb-Suite :: functionalities/thread/concurrent_events/TestConcurrentDelaySignalBreak.py (1486 of 1734) PASS: lldb-Suite :: functionalities/data-formatter/data-formatter-stl/libcxx/atomic/TestLibCxxAtomic.py (1487 of 1734) PASS: lldb-Suite :: functionalities/data-formatter/data-formatter-python-synth/TestDataFormatterPythonSynth.py (1488 of 1734) TIMEOUT: LLDB :: Quit/TestQuitExitCodeTooManyArgs.test (1489 of 1734) ******************** TEST 'LLDB :: Quit/TestQuitExitCodeTooManyArgs.test' FAILED ******************** Script: -- : 'RUN: at line 2'; /Users/buildslave/jenkins/workspace/lldb-cmake/lldb-build/bin/lldb --no-lldbinit -S /Users/buildslave/jenkins/workspace/lldb-cmake/lldb-build/tools/lldb/lit/lit-lldb-init -b -s /Users/buildslave/jenkins/workspace/lldb-cmake/llvm-project/lldb/lit/Quit/TestQuitExitCodeTooManyArgs.test 2>&1 | /Users/buildslave/jenkins/workspace/lldb-cmake/lldb-build/bin/FileCheck /Users/buildslave/jenkins/workspace/lldb-cmake/llvm-project/lldb/lit/Quit/TestQuitExitCodeTooManyArgs.test -- Exit Code: -9 Timeout: Reached timeout of 600 seconds

Hide Details

Hide Details

******************** PASS: LLDB :: BuildScript/modes.test (1490 of 1734) TIMEOUT: LLDB :: SymbolFile/sizeless-symbol.test (1491 of 1734) ******************** TEST 'LLDB :: SymbolFile/sizeless-symbol.test' FAILED ******************** Script: -- : 'RUN: at line 2'; /Users/buildslave/jenkins/workspace/lldb-cmake/lldb-build/bin/clang -isysroot /Applications/Xcode.app/Contents/Developer/Platforms/MacOSX.platform/Developer/SDKs/MacOSX.sdk -fmodules-cache-path=/Users/buildslave/jenkins/workspace/lldb-cmake/lldb-build/tools/lldb/lldb-test-build.noindex/module-cache-clang -target x86_64-unknown-unknown-elf /Users/buildslave/jenkins/workspace/lldb-cmake/llvm-project/lldb/lit/SymbolFile/Inputs/sizeless-symbol.s -c -o /Users/buildslave/jenkins/workspace/lldb-cmake/lldb-build/tools/lldb/lit/SymbolFile/Output/sizeless-symbol.test.tmp.o : 'RUN: at line 3'; /Users/buildslave/jenkins/workspace/lldb-cmake/lldb-build/bin/lldb --no-lldbinit -S /Users/buildslave/jenkins/workspace/lldb-cmake/lldb-build/tools/lldb/lit/lit-lldb-init /Users/buildslave/jenkins/workspace/lldb-cmake/lldb-build/tools/lldb/lit/SymbolFile/Output/sizeless-symbol.test.tmp.o -s /Users/buildslave/jenkins/workspace/lldb-cmake/llvm-project/lldb/lit/SymbolFile/sizeless-symbol.test -o quit | /Users/buildslave/jenkins/workspace/lldb-cmake/lldb-build/bin/FileCheck /Users/buildslave/jenkins/workspace/lldb-cmake/llvm-project/lldb/lit/SymbolFile/sizeless-symbol.test -- Exit Code: -9 Timeout: Reached timeout of 600 seconds

Hide Details

Command Output (stderr): -- clang-10: warning: argument unused during compilation: '-isysroot /Applications/Xcode.app/Contents/Developer/Platforms/MacOSX.platform/Developer/SDKs/MacOSX.sdk' [-Wunused-command-line-argument] clang-10: warning: argument unused during compilation: '-fmodules-cache-path=/Users/buildslave/jenkins/workspace/lldb-cmake/lldb-build/tools/lldb/lldb-test-build.noindex/module-cache-clang' [-Wunused-command-line-argument]

Hide Details

--

Hide Details

******************** PASS: lldb-Unit :: Utility/./UtilityTests/BinaryStreamTest.PutSLEB128MaxValue (1492 of 1734) PASS: lldb-Unit :: Utility/./UtilityTests/SerializationRountripTest.SerializeDeserializeCString (1493 of 1734) PASS: lldb-Unit :: Host/./HostTests/NativeProcessProtocolTest.ReadCStringFromMemory (1494 of 1734) PASS: lldb-Unit :: Process/gdb-remote/./ProcessGdbRemoteTests/GDBRemoteClientBaseTest.InterruptNoResponse (1495 of 1734) PASS: LLDB :: SymbolFile/DWARF/debug-types-dwo-cross-reference.cpp (1496 of 1734) PASS: lldb-Unit :: Language/Highlighting/./HighlighterTests/HighlighterTest.FallbackHighlighter (1497 of 1734) TIMEOUT: LLDB :: Minidump/breakpad-symbols.test (1498 of 1734) ******************** TEST 'LLDB :: Minidump/breakpad-symbols.test' FAILED ******************** Script: -- : 'RUN: at line 6'; /Users/buildslave/jenkins/workspace/lldb-cmake/lldb-build/bin/yaml2obj /Users/buildslave/jenkins/workspace/lldb-cmake/llvm-project/lldb/lit/Minidump/Inputs/linux-x86_64.yaml > /Users/buildslave/jenkins/workspace/lldb-cmake/lldb-build/tools/lldb/lit/Minidump/Output/breakpad-symbols.test.tmp : 'RUN: at line 7'; /Users/buildslave/jenkins/workspace/lldb-cmake/lldb-build/bin/lldb --no-lldbinit -S /Users/buildslave/jenkins/workspace/lldb-cmake/lldb-build/tools/lldb/lit/lit-lldb-init -c /Users/buildslave/jenkins/workspace/lldb-cmake/lldb-build/tools/lldb/lit/Minidump/Output/breakpad-symbols.test.tmp -o "target symbols add -s /tmp/test/linux-x86_64 /Users/buildslave/jenkins/workspace/lldb-cmake/llvm-project/lldb/lit/Minidump/Inputs/linux-x86_64.syms" -s /Users/buildslave/jenkins/workspace/lldb-cmake/llvm-project/lldb/lit/Minidump/breakpad-symbols.test -o exit | /Users/buildslave/jenkins/workspace/lldb-cmake/lldb-build/bin/FileCheck /Users/buildslave/jenkins/workspace/lldb-cmake/llvm-project/lldb/lit/Minidump/breakpad-symbols.test -- Exit Code: -9 Timeout: Reached timeout of 600 seconds

Hide Details

Hide Details

******************** PASS: lldb-Unit :: Process/minidump/./LLDBMinidumpTests/MinidumpParserTest.GetPid (1499 of 1734) PASS: lldb-Suite :: functionalities/tail_call_frames/inlining_and_tail_calls/TestInliningAndTailCalls.py (1500 of 1734) TIMEOUT: LLDB :: SymbolFile/DWARF/debug_aranges-empty-section.s (1501 of 1734) ******************** TEST 'LLDB :: SymbolFile/DWARF/debug_aranges-empty-section.s' FAILED ******************** Script: -- : 'RUN: at line 5'; /Users/buildslave/jenkins/workspace/lldb-cmake/lldb-build/bin/llvm-mc /Users/buildslave/jenkins/workspace/lldb-cmake/llvm-project/lldb/lit/SymbolFile/DWARF/debug_aranges-empty-section.s -triple x86_64-pc-linux -filetype=obj >/Users/buildslave/jenkins/workspace/lldb-cmake/lldb-build/tools/lldb/lit/SymbolFile/DWARF/Output/debug_aranges-empty-section.s.tmp : 'RUN: at line 6'; lldb /Users/buildslave/jenkins/workspace/lldb-cmake/lldb-build/tools/lldb/lit/SymbolFile/DWARF/Output/debug_aranges-empty-section.s.tmp -o "breakpoint set -n f" -b | /Users/buildslave/jenkins/workspace/lldb-cmake/lldb-build/bin/FileCheck /Users/buildslave/jenkins/workspace/lldb-cmake/llvm-project/lldb/lit/SymbolFile/DWARF/debug_aranges-empty-section.s -- Exit Code: -9 Timeout: Reached timeout of 600 seconds

Hide Details

Hide Details

******************** UNSUPPORTED: LLDB :: SymbolFile/NativePDB/local-variables.cpp (1502 of 1734) PASS: lldb-Unit :: Utility/./UtilityTests/FileSpecTest.EqualSeparator (1503 of 1734) PASS: lldb-Suite :: functionalities/breakpoint/dummy_target_breakpoints/TestBreakpointsWithNoTargets.py (1504 of 1734) PASS: lldb-Suite :: functionalities/postmortem/wow64_minidump/TestWow64MiniDump.py (1505 of 1734) PASS: lldb-Unit :: Utility/./UtilityTests/EnvironmentTest.EnvpConversion (1506 of 1734) PASS: lldb-Suite :: functionalities/tail_call_frames/disambiguate_call_site/TestDisambiguateCallSite.py (1507 of 1734) PASS: lldb-Unit :: Utility/./UtilityTests/VMRange.ContainsRange (1508 of 1734) PASS: lldb-Unit :: ObjectFile/ELF/./ObjectFileELFTests/ObjectFileELFTest.SectionsResolveConsistently (1509 of 1734) PASS: lldb-Unit :: Symbol/./SymbolTests/SymbolsTest.TerminateLocateExecutableSymbolFileForUnknownExecutableAndUnknownSymbolFile (1510 of 1734) PASS: lldb-Unit :: UnwindAssembly/x86/./UnwindAssemblyx86Tests/Testx86AssemblyInspectionEngine.Testi386IgnoredRegisters (1511 of 1734) PASS: lldb-Suite :: commands/command/invalid-args/TestInvalidArgsCommand.py (1512 of 1734) TIMEOUT: LLDB :: ExecControl/StopHook/stop-hook.test (1513 of 1734) ******************** TEST 'LLDB :: ExecControl/StopHook/stop-hook.test' FAILED ******************** Script: -- : 'RUN: at line 1'; /Users/buildslave/jenkins/workspace/lldb-cmake/lldb-build/bin/clang -isysroot /Applications/Xcode.app/Contents/Developer/Platforms/MacOSX.platform/Developer/SDKs/MacOSX.sdk -fmodules-cache-path=/Users/buildslave/jenkins/workspace/lldb-cmake/lldb-build/tools/lldb/lldb-test-build.noindex/module-cache-clang /Users/buildslave/jenkins/workspace/lldb-cmake/llvm-project/lldb/lit/ExecControl/StopHook/Inputs/stop-hook.c -g -o /Users/buildslave/jenkins/workspace/lldb-cmake/lldb-build/tools/lldb/lit/ExecControl/StopHook/Output/stop-hook.test.tmp : 'RUN: at line 3'; /Users/buildslave/jenkins/workspace/lldb-cmake/lldb-build/bin/lldb --no-lldbinit -S /Users/buildslave/jenkins/workspace/lldb-cmake/lldb-build/tools/lldb/lit/lit-lldb-init -b -s /Users/buildslave/jenkins/workspace/lldb-cmake/llvm-project/lldb/lit/ExecControl/StopHook/Inputs/stop-hook-1.lldbinit -s /Users/buildslave/jenkins/workspace/lldb-cmake/llvm-project/lldb/lit/ExecControl/StopHook/stop-hook.test -f /Users/buildslave/jenkins/workspace/lldb-cmake/lldb-build/tools/lldb/lit/ExecControl/StopHook/Output/stop-hook.test.tmp | /Users/buildslave/jenkins/workspace/lldb-cmake/lldb-build/bin/FileCheck --check-prefix=CHECK --check-prefix=CHECK-FUNC /Users/buildslave/jenkins/workspace/lldb-cmake/llvm-project/lldb/lit/ExecControl/StopHook/stop-hook.test : 'RUN: at line 6'; /Users/buildslave/jenkins/workspace/lldb-cmake/lldb-build/bin/lldb --no-lldbinit -S /Users/buildslave/jenkins/workspace/lldb-cmake/lldb-build/tools/lldb/lit/lit-lldb-init -b -s /Users/buildslave/jenkins/workspace/lldb-cmake/llvm-project/lldb/lit/ExecControl/StopHook/Inputs/stop-hook-2.lldbinit -s /Users/buildslave/jenkins/workspace/lldb-cmake/llvm-project/lldb/lit/ExecControl/StopHook/stop-hook.test -f /Users/buildslave/jenkins/workspace/lldb-cmake/lldb-build/tools/lldb/lit/ExecControl/StopHook/Output/stop-hook.test.tmp | /Users/buildslave/jenkins/workspace/lldb-cmake/lldb-build/bin/FileCheck /Users/buildslave/jenkins/workspace/lldb-cmake/llvm-project/lldb/lit/ExecControl/StopHook/stop-hook.test : 'RUN: at line 8'; /Users/buildslave/jenkins/workspace/lldb-cmake/lldb-build/bin/lldb --no-lldbinit -S /Users/buildslave/jenkins/workspace/lldb-cmake/lldb-build/tools/lldb/lit/lit-lldb-init -b -s /Users/buildslave/jenkins/workspace/lldb-cmake/llvm-project/lldb/lit/ExecControl/StopHook/Inputs/stop-hook-3.lldbinit -s /Users/buildslave/jenkins/workspace/lldb-cmake/llvm-project/lldb/lit/ExecControl/StopHook/stop-hook.test -f /Users/buildslave/jenkins/workspace/lldb-cmake/lldb-build/tools/lldb/lit/ExecControl/StopHook/Output/stop-hook.test.tmp | /Users/buildslave/jenkins/workspace/lldb-cmake/lldb-build/bin/FileCheck /Users/buildslave/jenkins/workspace/lldb-cmake/llvm-project/lldb/lit/ExecControl/StopHook/stop-hook.test -- Exit Code: -9 Timeout: Reached timeout of 600 seconds

Hide Details

Command Output (stderr): -- clang-10: warning: argument unused during compilation: '-fmodules-cache-path=/Users/buildslave/jenkins/workspace/lldb-cmake/lldb-build/tools/lldb/lldb-test-build.noindex/module-cache-clang' [-Wunused-command-line-argument]

Hide Details

--

Hide Details

******************** TIMEOUT: LLDB :: SymbolFile/DWARF/debug_ranges_and_rnglists.test (1514 of 1734) ******************** TEST 'LLDB :: SymbolFile/DWARF/debug_ranges_and_rnglists.test' FAILED ******************** Script: -- : 'RUN: at line 3'; /Users/buildslave/jenkins/workspace/lldb-cmake/lldb-build/bin/llvm-mc -triple=x86_64-pc-linux -filetype=obj /Users/buildslave/jenkins/workspace/lldb-cmake/llvm-project/lldb/lit/SymbolFile/DWARF/debug_ranges.s > /Users/buildslave/jenkins/workspace/lldb-cmake/lldb-build/tools/lldb/lit/SymbolFile/DWARF/Output/debug_ranges_and_rnglists.test.tmp-ranges.o : 'RUN: at line 4'; /Users/buildslave/jenkins/workspace/lldb-cmake/lldb-build/bin/llvm-mc -triple=x86_64-pc-linux -filetype=obj /Users/buildslave/jenkins/workspace/lldb-cmake/llvm-project/lldb/lit/SymbolFile/DWARF/debug_rnglists.s > /Users/buildslave/jenkins/workspace/lldb-cmake/lldb-build/tools/lldb/lit/SymbolFile/DWARF/Output/debug_ranges_and_rnglists.test.tmp-rnglists.o : 'RUN: at line 5'; /Users/buildslave/jenkins/workspace/lldb-cmake/lldb-build/bin/ld.lld -r /Users/buildslave/jenkins/workspace/lldb-cmake/lldb-build/tools/lldb/lit/SymbolFile/DWARF/Output/debug_ranges_and_rnglists.test.tmp-ranges.o /Users/buildslave/jenkins/workspace/lldb-cmake/lldb-build/tools/lldb/lit/SymbolFile/DWARF/Output/debug_ranges_and_rnglists.test.tmp-rnglists.o -o /Users/buildslave/jenkins/workspace/lldb-cmake/lldb-build/tools/lldb/lit/SymbolFile/DWARF/Output/debug_ranges_and_rnglists.test.tmp : 'RUN: at line 6'; /Users/buildslave/jenkins/workspace/lldb-cmake/lldb-build/bin/lldb --no-lldbinit -S /Users/buildslave/jenkins/workspace/lldb-cmake/lldb-build/tools/lldb/lit/lit-lldb-init /Users/buildslave/jenkins/workspace/lldb-cmake/lldb-build/tools/lldb/lit/SymbolFile/DWARF/Output/debug_ranges_and_rnglists.test.tmp -s /Users/buildslave/jenkins/workspace/lldb-cmake/llvm-project/lldb/lit/SymbolFile/DWARF/debug_ranges_and_rnglists.test | /Users/buildslave/jenkins/workspace/lldb-cmake/lldb-build/bin/FileCheck /Users/buildslave/jenkins/workspace/lldb-cmake/llvm-project/lldb/lit/SymbolFile/DWARF/debug_ranges_and_rnglists.test -- Exit Code: -9 Timeout: Reached timeout of 600 seconds

Hide Details

Hide Details

******************** PASS: lldb-Unit :: Utility/./UtilityTests/StringExtractorTest.GetHexU8_Extra_NoEof (1515 of 1734) TIMEOUT: LLDB :: Register/x86-64-ymm-write.test (1516 of 1734) ******************** TEST 'LLDB :: Register/x86-64-ymm-write.test' FAILED ******************** Script: -- : 'RUN: at line 4'; /Users/buildslave/jenkins/workspace/lldb-cmake/lldb-build/bin/clang --driver-mode=g++ -isysroot /Applications/Xcode.app/Contents/Developer/Platforms/MacOSX.platform/Developer/SDKs/MacOSX.sdk -fmodules-cache-path=/Users/buildslave/jenkins/workspace/lldb-cmake/lldb-build/tools/lldb/lldb-test-build.noindex/module-cache-clang /Users/buildslave/jenkins/workspace/lldb-cmake/llvm-project/lldb/lit/Register/Inputs/x86-ymm-write.cpp -o /Users/buildslave/jenkins/workspace/lldb-cmake/lldb-build/tools/lldb/lit/Register/Output/x86-64-ymm-write.test.tmp : 'RUN: at line 5'; /Users/buildslave/jenkins/workspace/lldb-cmake/lldb-build/bin/lldb --no-lldbinit -S /Users/buildslave/jenkins/workspace/lldb-cmake/lldb-build/tools/lldb/lit/lit-lldb-init -b -s /Users/buildslave/jenkins/workspace/lldb-cmake/llvm-project/lldb/lit/Register/x86-64-ymm-write.test /Users/buildslave/jenkins/workspace/lldb-cmake/lldb-build/tools/lldb/lit/Register/Output/x86-64-ymm-write.test.tmp | /Users/buildslave/jenkins/workspace/lldb-cmake/lldb-build/bin/FileCheck /Users/buildslave/jenkins/workspace/lldb-cmake/llvm-project/lldb/lit/Register/x86-64-ymm-write.test -- Exit Code: -9 Timeout: Reached timeout of 600 seconds

Hide Details

Command Output (stderr): -- clang-10: warning: argument unused during compilation: '-fmodules-cache-path=/Users/buildslave/jenkins/workspace/lldb-cmake/lldb-build/tools/lldb/lldb-test-build.noindex/module-cache-clang' [-Wunused-command-line-argument]

Hide Details

--

Hide Details

******************** XFAIL: LLDB :: Register/x86-64-write.test (1517 of 1734) PASS: lldb-Unit :: Utility/./UtilityTests/StringExtractorTest.GetHexU8_Underflow (1518 of 1734) PASS: lldb-Unit :: UnwindAssembly/x86/./UnwindAssemblyx86Tests/Testx86AssemblyInspectionEngine.TestPopEBX (1519 of 1734) PASS: lldb-Unit :: Utility/./UtilityTests/StreamTest.PutHex64ByteOrderBig (1520 of 1734) PASS: lldb-Suite :: functionalities/darwin_log/filter/regex/activity/TestDarwinLogFilterRegexActivity.py (1521 of 1734) PASS: lldb-Suite :: commands/expression/expr-in-syscall/TestExpressionInSyscall.py (1522 of 1734) PASS: LLDB :: SymbolFile/DWARF/debug-types-dwarf5.s (1523 of 1734) PASS: lldb-Suite :: functionalities/data-formatter/data-formatter-stl/libcxx/initializerlist/TestInitializerList.py (1524 of 1734) PASS: lldb-Suite :: commands/expression/import-std-module/forward_list-basic/TestBasicForwardList.py (1525 of 1734) PASS: lldb-Unit :: Utility/./UtilityTests/TimeoutTest.Construction (1526 of 1734) TIMEOUT: LLDB :: SymbolFile/DWARF/debug-types-missing-signature.test (1527 of 1734) ******************** TEST 'LLDB :: SymbolFile/DWARF/debug-types-missing-signature.test' FAILED ******************** Script: -- : 'RUN: at line 3'; /Users/buildslave/jenkins/workspace/lldb-cmake/lldb-build/bin/clang --driver-mode=g++ -isysroot /Applications/Xcode.app/Contents/Developer/Platforms/MacOSX.platform/Developer/SDKs/MacOSX.sdk -fmodules-cache-path=/Users/buildslave/jenkins/workspace/lldb-cmake/lldb-build/tools/lldb/lldb-test-build.noindex/module-cache-clang -target x86_64-pc-linux /Users/buildslave/jenkins/workspace/lldb-cmake/llvm-project/lldb/lit/SymbolFile/DWARF/Inputs/debug-types-basic.cpp -g -gdwarf-4 -fdebug-types-section -c -o /Users/buildslave/jenkins/workspace/lldb-cmake/lldb-build/tools/lldb/lit/SymbolFile/DWARF/Output/debug-types-missing-signature.test.tmp.o : 'RUN: at line 5'; /Users/buildslave/jenkins/workspace/lldb-cmake/lldb-build/bin/llvm-objcopy --remove-section=.debug_types /Users/buildslave/jenkins/workspace/lldb-cmake/lldb-build/tools/lldb/lit/SymbolFile/DWARF/Output/debug-types-missing-signature.test.tmp.o /Users/buildslave/jenkins/workspace/lldb-cmake/lldb-build/tools/lldb/lit/SymbolFile/DWARF/Output/debug-types-missing-signature.test.tmp : 'RUN: at line 8'; /Users/buildslave/jenkins/workspace/lldb-cmake/lldb-build/bin/lldb --no-lldbinit -S /Users/buildslave/jenkins/workspace/lldb-cmake/lldb-build/tools/lldb/lit/lit-lldb-init /Users/buildslave/jenkins/workspace/lldb-cmake/lldb-build/tools/lldb/lit/SymbolFile/DWARF/Output/debug-types-missing-signature.test.tmp -b -o "type lookup A" | /Users/buildslave/jenkins/workspace/lldb-cmake/lldb-build/bin/FileCheck --check-prefix=LOOKUPA /Users/buildslave/jenkins/workspace/lldb-cmake/llvm-project/lldb/lit/SymbolFile/DWARF/debug-types-missing-signature.test : 'RUN: at line 11'; /Users/buildslave/jenkins/workspace/lldb-cmake/lldb-build/bin/lldb --no-lldbinit -S /Users/buildslave/jenkins/workspace/lldb-cmake/lldb-build/tools/lldb/lit/lit-lldb-init /Users/buildslave/jenkins/workspace/lldb-cmake/lldb-build/tools/lldb/lit/SymbolFile/DWARF/Output/debug-types-missing-signature.test.tmp -b -o "type lookup E" | /Users/buildslave/jenkins/workspace/lldb-cmake/lldb-build/bin/FileCheck --check-prefix=LOOKUPE /Users/buildslave/jenkins/workspace/lldb-cmake/llvm-project/lldb/lit/SymbolFile/DWARF/debug-types-missing-signature.test : 'RUN: at line 14'; /Users/buildslave/jenkins/workspace/lldb-cmake/lldb-build/bin/lldb --no-lldbinit -S /Users/buildslave/jenkins/workspace/lldb-cmake/lldb-build/tools/lldb/lit/lit-lldb-init /Users/buildslave/jenkins/workspace/lldb-cmake/lldb-build/tools/lldb/lit/SymbolFile/DWARF/Output/debug-types-missing-signature.test.tmp -b -o "type lookup EC" | /Users/buildslave/jenkins/workspace/lldb-cmake/lldb-build/bin/FileCheck --check-prefix=LOOKUPEC /Users/buildslave/jenkins/workspace/lldb-cmake/llvm-project/lldb/lit/SymbolFile/DWARF/debug-types-missing-signature.test : 'RUN: at line 17'; /Users/buildslave/jenkins/workspace/lldb-cmake/lldb-build/bin/lldb --no-lldbinit -S /Users/buildslave/jenkins/workspace/lldb-cmake/lldb-build/tools/lldb/lit/lit-lldb-init /Users/buildslave/jenkins/workspace/lldb-cmake/lldb-build/tools/lldb/lit/SymbolFile/DWARF/Output/debug-types-missing-signature.test.tmp -b -o "print (E) 1" 2>&1 | /Users/buildslave/jenkins/workspace/lldb-cmake/lldb-build/bin/FileCheck --check-prefix=PRINTE /Users/buildslave/jenkins/workspace/lldb-cmake/llvm-project/lldb/lit/SymbolFile/DWARF/debug-types-missing-signature.test : 'RUN: at line 20'; /Users/buildslave/jenkins/workspace/lldb-cmake/lldb-build/bin/lldb --no-lldbinit -S /Users/buildslave/jenkins/workspace/lldb-cmake/lldb-build/tools/lldb/lit/lit-lldb-init /Users/buildslave/jenkins/workspace/lldb-cmake/lldb-build/tools/lldb/lit/SymbolFile/DWARF/Output/debug-types-missing-signature.test.tmp -b -o "print (EC) 1" 2>&1 | /Users/buildslave/jenkins/workspace/lldb-cmake/lldb-build/bin/FileCheck --check-prefix=PRINTEC /Users/buildslave/jenkins/workspace/lldb-cmake/llvm-project/lldb/lit/SymbolFile/DWARF/debug-types-missing-signature.test : 'RUN: at line 23'; /Users/buildslave/jenkins/workspace/lldb-cmake/lldb-build/bin/lldb --no-lldbinit -S /Users/buildslave/jenkins/workspace/lldb-cmake/lldb-build/tools/lldb/lit/lit-lldb-init /Users/buildslave/jenkins/workspace/lldb-cmake/lldb-build/tools/lldb/lit/SymbolFile/DWARF/Output/debug-types-missing-signature.test.tmp -b -o "target variable a e ec" | /Users/buildslave/jenkins/workspace/lldb-cmake/lldb-build/bin/FileCheck --check-prefix=VARS /Users/buildslave/jenkins/workspace/lldb-cmake/llvm-project/lldb/lit/SymbolFile/DWARF/debug-types-missing-signature.test -- Exit Code: -9 Timeout: Reached timeout of 600 seconds

Hide Details

Command Output (stderr): -- clang-10: warning: argument unused during compilation: '-fmodules-cache-path=/Users/buildslave/jenkins/workspace/lldb-cmake/lldb-build/tools/lldb/lldb-test-build.noindex/module-cache-clang' [-Wunused-command-line-argument]

Hide Details

--

Hide Details

******************** PASS: lldb-Unit :: Process/gdb-remote/./ProcessGdbRemoteTests/GDBRemoteClientBaseTest.SendContinueAndAsyncSignal (1528 of 1734) PASS: lldb-Suite :: commands/source/info/TestSourceInfo.py (1529 of 1734) PASS: lldb-Unit :: Utility/./UtilityTests/LogChannelEnabledTest.LLDB_LOG_ERROR (1530 of 1734) PASS: lldb-Suite :: functionalities/tail_call_frames/ambiguous_tail_call_seq2/TestAmbiguousTailCallSeq2.py (1531 of 1734) PASS: LLDB :: Breakpoint/debug_rnglist_rlestartend.test (1532 of 1734) PASS: lldb-Unit :: UnwindAssembly/x86/./UnwindAssemblyx86Tests/Testx86AssemblyInspectionEngine.TestPopEDI (1533 of 1734) PASS: lldb-Suite :: python_api/lldbutil/process/TestPrintStackTraces.py (1534 of 1734) PASS: lldb-Unit :: ScriptInterpreter/Python/./ScriptInterpreterPythonTests/PythonDataObjectsTest.TestResetting (1535 of 1734) PASS: lldb-Unit :: Utility/./UtilityTests/UriParserTest.BracketedHostnamePort (1536 of 1734) PASS: lldb-Suite :: lang/c/stepping/TestThreadStepping.py (1537 of 1734) PASS: lldb-Unit :: Utility/./UtilityTests/ArgsTest.TestSingleArgWithQuotedSpace (1538 of 1734) PASS: lldb-Unit :: ScriptInterpreter/Python/./ScriptInterpreterPythonTests/PythonDataObjectsTest.TestPythonBytes (1539 of 1734) PASS: lldb-Suite :: functionalities/set-data/TestSetData.py (1540 of 1734) PASS: lldb-Suite :: commands/expression/import-std-module/unique_ptr-dbg-info-content/TestUniquePtrDbgInfoContent.py (1541 of 1734) PASS: lldb-Suite :: benchmarks/startup/TestStartupDelays.py (1542 of 1734) PASS: lldb-Unit :: ScriptInterpreter/Python/./ScriptInterpreterPythonTests/PythonDataObjectsTest.TestPythonIntegerToStructuredInteger (1543 of 1734) PASS: lldb-Suite :: types/TestRecursiveTypes.py (1544 of 1734) PASS: LLDB :: SymbolFile/DWARF/split-dwarf-inlining.cpp (1545 of 1734) PASS: lldb-Suite :: tools/lldb-server/TestGdbRemoteSingleStep.py (1546 of 1734) PASS: lldb-Suite :: functionalities/pre_run_dylibs/TestPreRunDylibs.py (1547 of 1734) PASS: lldb-Suite :: functionalities/postmortem/minidump-new/TestMiniDumpUUID.py (1548 of 1734) PASS: lldb-Unit :: Utility/./UtilityTests/StatusTest.ErrorConversion (1549 of 1734) PASS: lldb-Unit :: Utility/./UtilityTests/StringListTest.LongestCommonPrefixSingleElement (1550 of 1734) PASS: lldb-Unit :: Utility/./UtilityTests/StringExtractorTest.DecodeHexU8_Underflow (1551 of 1734) PASS: lldb-Suite :: functionalities/thread/thread_specific_break/TestThreadSpecificBreakpoint.py (1552 of 1734) PASS: lldb-Suite :: functionalities/gdb_remote_client/TestArmRegisterDefinition.py (1553 of 1734) PASS: lldb-Unit :: UnwindAssembly/x86/./UnwindAssemblyx86Tests/Testx86AssemblyInspectionEngine.TestPopR15 (1554 of 1734) PASS: lldb-Unit :: Process/minidump/./LLDBMinidumpTests/RegisterContextMinidump.ConvertMinidumpContext_x86_32 (1555 of 1734) PASS: LLDB :: SymbolFile/DWARF/dwarf5_locations.s (1556 of 1734) PASS: lldb-Unit :: Utility/./UtilityTests/StreamTest.PutRawBytesToMixedEndian (1557 of 1734) PASS: LLDB :: Commands/command-regex-delete.test (1558 of 1734) PASS: lldb-Unit :: Utility/./UtilityTests/RangeTest.ContainsRange (1559 of 1734) PASS: lldb-Suite :: python_api/function_symbol/TestSymbolAPI.py (1560 of 1734) PASS: lldb-Unit :: ScriptInterpreter/Python/./ScriptInterpreterPythonTests/PythonDataObjectsTest.TestPythonString (1561 of 1734) PASS: lldb-Suite :: commands/target/basic/TestTargetCommand.py (1562 of 1734) PASS: lldb-Unit :: UnwindAssembly/ARM64/./Arm64InstEmulationTests/TestArm64InstEmulation.TestFramelessThreeEpilogueFunction (1563 of 1734) PASS: lldb-Suite :: functionalities/breakpoint/breakpoint_locations/TestBreakpointLocations.py (1564 of 1734) PASS: lldb-Suite :: functionalities/breakpoint/source_regexp/TestSourceRegexBreakpoints.py (1565 of 1734) PASS: lldb-Unit :: Utility/./UtilityTests/BinaryStreamTest.PutSLEB128SevenBytes (1566 of 1734) PASS: LLDB :: SymbolFile/DWARF/find-method.cpp (1567 of 1734) PASS: lldb-Unit :: Utility/./UtilityTests/StringListTest.SplitIntoLinesSingleTrailingCR (1568 of 1734) TIMEOUT: LLDB :: Expr/TestTypeOfDeclTypeExpr.test (1569 of 1734) ******************** TEST 'LLDB :: Expr/TestTypeOfDeclTypeExpr.test' FAILED ******************** Script: -- : 'RUN: at line 1'; /Users/buildslave/jenkins/workspace/lldb-cmake/lldb-build/bin/lldb --no-lldbinit -S /Users/buildslave/jenkins/workspace/lldb-cmake/lldb-build/tools/lldb/lit/lit-lldb-init -b -s /Users/buildslave/jenkins/workspace/lldb-cmake/llvm-project/lldb/lit/Expr/TestTypeOfDeclTypeExpr.test | /Users/buildslave/jenkins/workspace/lldb-cmake/lldb-build/bin/FileCheck /Users/buildslave/jenkins/workspace/lldb-cmake/llvm-project/lldb/lit/Expr/TestTypeOfDeclTypeExpr.test -- Exit Code: -9 Timeout: Reached timeout of 600 seconds

Hide Details

Hide Details

******************** PASS: lldb-Unit :: Utility/./UtilityTests/StringListTest.CopyList (1570 of 1734) PASS: lldb-Unit :: Utility/./UtilityTests/ArgsTest.BareSingleQuote (1571 of 1734) PASS: lldb-Unit :: Utility/./UtilityTests/OptionsWithRawTest.TerminatedQuote (1572 of 1734) PASS: lldb-Unit :: Language/Highlighting/./HighlighterTests/HighlighterTest.ClangIdentifiers (1573 of 1734) PASS: lldb-Unit :: Utility/./UtilityTests/StringListTest.PopBack (1574 of 1734) PASS: lldb-Unit :: Utility/./UtilityTests/StringListTest.Assignment (1575 of 1734) PASS: lldb-Unit :: Utility/./UtilityTests/ScalarTest.Scalar_512 (1576 of 1734) PASS: lldb-Unit :: Process/gdb-remote/./ProcessGdbRemoteTests/GDBRemoteClientBaseTest.SendContinueDelegateInterface (1577 of 1734) PASS: lldb-Unit :: Host/./HostTests/FileSystemTest.Resolve (1578 of 1734) PASS: lldb-Suite :: lang/objc/objc-super/TestObjCSuper.py (1579 of 1734) PASS: lldb-Suite :: android/platform/TestDefaultCacheLineSize.py (1580 of 1734) PASS: LLDB :: SymbolFile/DWARF/compilercontext.ll (1581 of 1734) TIMEOUT: LLDB :: Register/x86-mm-xmm-write.test (1582 of 1734) ******************** TEST 'LLDB :: Register/x86-mm-xmm-write.test' FAILED ******************** Script: -- : 'RUN: at line 4'; /Users/buildslave/jenkins/workspace/lldb-cmake/lldb-build/bin/clang --driver-mode=g++ -isysroot /Applications/Xcode.app/Contents/Developer/Platforms/MacOSX.platform/Developer/SDKs/MacOSX.sdk -fmodules-cache-path=/Users/buildslave/jenkins/workspace/lldb-cmake/lldb-build/tools/lldb/lldb-test-build.noindex/module-cache-clang /Users/buildslave/jenkins/workspace/lldb-cmake/llvm-project/lldb/lit/Register/Inputs/x86-mm-xmm-write.cpp -o /Users/buildslave/jenkins/workspace/lldb-cmake/lldb-build/tools/lldb/lit/Register/Output/x86-mm-xmm-write.test.tmp : 'RUN: at line 5'; /Users/buildslave/jenkins/workspace/lldb-cmake/lldb-build/bin/lldb --no-lldbinit -S /Users/buildslave/jenkins/workspace/lldb-cmake/lldb-build/tools/lldb/lit/lit-lldb-init -b -s /Users/buildslave/jenkins/workspace/lldb-cmake/llvm-project/lldb/lit/Register/x86-mm-xmm-write.test /Users/buildslave/jenkins/workspace/lldb-cmake/lldb-build/tools/lldb/lit/Register/Output/x86-mm-xmm-write.test.tmp | /Users/buildslave/jenkins/workspace/lldb-cmake/lldb-build/bin/FileCheck /Users/buildslave/jenkins/workspace/lldb-cmake/llvm-project/lldb/lit/Register/x86-mm-xmm-write.test -- Exit Code: -9 Timeout: Reached timeout of 600 seconds

Hide Details

Command Output (stderr): -- clang-10: warning: argument unused during compilation: '-fmodules-cache-path=/Users/buildslave/jenkins/workspace/lldb-cmake/lldb-build/tools/lldb/lldb-test-build.noindex/module-cache-clang' [-Wunused-command-line-argument]

Hide Details

--

Hide Details

******************** PASS: lldb-Suite :: functionalities/data-formatter/var-in-aggregate-misuse/TestVarInAggregateMisuse.py (1583 of 1734) PASS: lldb-Suite :: tools/lldb-vscode/step/TestVSCode_step.py (1584 of 1734) PASS: lldb-Suite :: python_api/default-constructor/TestDefaultConstructorForAPIObjects.py (1585 of 1734) PASS: lldb-Unit :: Utility/./UtilityTests/StreamTest.ShiftOperatorChars (1586 of 1734) PASS: lldb-Suite :: functionalities/thread/concurrent_events/TestConcurrentNWatchNBreak.py (1587 of 1734) PASS: lldb-Unit :: Host/./HostTests/TaskPoolTest.AddTask (1588 of 1734) TIMEOUT: LLDB :: SymbolFile/DWARF/debug-types-signature-loop.s (1589 of 1734) ******************** TEST 'LLDB :: SymbolFile/DWARF/debug-types-signature-loop.s' FAILED ******************** Script: -- : 'RUN: at line 3'; /Users/buildslave/jenkins/workspace/lldb-cmake/lldb-build/bin/llvm-mc -filetype=obj -triple x86_64-pc-linux -o /Users/buildslave/jenkins/workspace/lldb-cmake/lldb-build/tools/lldb/lit/SymbolFile/DWARF/Output/debug-types-signature-loop.s.tmp.o /Users/buildslave/jenkins/workspace/lldb-cmake/llvm-project/lldb/lit/SymbolFile/DWARF/debug-types-signature-loop.s : 'RUN: at line 4'; /Users/buildslave/jenkins/workspace/lldb-cmake/lldb-build/bin/ld.lld /Users/buildslave/jenkins/workspace/lldb-cmake/lldb-build/tools/lldb/lit/SymbolFile/DWARF/Output/debug-types-signature-loop.s.tmp.o -o /Users/buildslave/jenkins/workspace/lldb-cmake/lldb-build/tools/lldb/lit/SymbolFile/DWARF/Output/debug-types-signature-loop.s.tmp : 'RUN: at line 5'; /Users/buildslave/jenkins/workspace/lldb-cmake/lldb-build/bin/lldb --no-lldbinit -S /Users/buildslave/jenkins/workspace/lldb-cmake/lldb-build/tools/lldb/lit/lit-lldb-init /Users/buildslave/jenkins/workspace/lldb-cmake/lldb-build/tools/lldb/lit/SymbolFile/DWARF/Output/debug-types-signature-loop.s.tmp -o "target variable e" -b | /Users/buildslave/jenkins/workspace/lldb-cmake/lldb-build/bin/FileCheck /Users/buildslave/jenkins/workspace/lldb-cmake/llvm-project/lldb/lit/SymbolFile/DWARF/debug-types-signature-loop.s -- Exit Code: -9 Timeout: Reached timeout of 600 seconds

Hide Details

Command Output (stderr): -- ld.lld: warning: cannot find entry symbol _start; defaulting to 0x201000

Hide Details

--

Hide Details

******************** PASS: lldb-Unit :: Utility/./UtilityTests/VMRange.SetEndAddress (1590 of 1734) PASS: lldb-Unit :: Process/gdb-remote/./ProcessGdbRemoteTests/GDBRemoteCommunicationServerTest.SendErrorResponse_ErrorList (1591 of 1734) PASS: lldb-Suite :: commands/frame/diagnose/local-variable/TestLocalVariable.py (1592 of 1734) PASS: lldb-Suite :: commands/expression/save_jit_objects/TestSaveJITObjects.py (1593 of 1734) PASS: lldb-Suite :: functionalities/postmortem/elf-core/TestLinuxCore.py (1594 of 1734) PASS: lldb-Suite :: tools/lldb-server/TestAppleSimulatorOSType.py (1595 of 1734) PASS: lldb-Unit :: Target/./TargetTests/ExecutionContextTest.GetByteOrderTarget (1596 of 1734) PASS: lldb-Unit :: Host/./HostTests/MainLoopTest.TerminatesImmediately (1597 of 1734) PASS: lldb-Suite :: commands/expression/cast_int_to_anonymous_enum/TestCastIntToAnonymousEnum.py (1598 of 1734) TIMEOUT: LLDB :: SymbolFile/DWARF/parallel-indexing-stress.s (1599 of 1734) ******************** TEST 'LLDB :: SymbolFile/DWARF/parallel-indexing-stress.s' FAILED ******************** Script: -- : 'RUN: at line 5'; /Users/buildslave/jenkins/workspace/lldb-cmake/lldb-build/bin/llvm-mc -triple x86_64-pc-linux /Users/buildslave/jenkins/workspace/lldb-cmake/llvm-project/lldb/lit/SymbolFile/DWARF/parallel-indexing-stress.s -o /Users/buildslave/jenkins/workspace/lldb-cmake/lldb-build/tools/lldb/lit/SymbolFile/DWARF/Output/parallel-indexing-stress.s.tmp -filetype=obj : 'RUN: at line 6'; /Users/buildslave/jenkins/workspace/lldb-cmake/lldb-build/bin/lldb --no-lldbinit -S /Users/buildslave/jenkins/workspace/lldb-cmake/lldb-build/tools/lldb/lit/lit-lldb-init /Users/buildslave/jenkins/workspace/lldb-cmake/lldb-build/tools/lldb/lit/SymbolFile/DWARF/Output/parallel-indexing-stress.s.tmp -o "target variable A" -b | /Users/buildslave/jenkins/workspace/lldb-cmake/lldb-build/bin/FileCheck /Users/buildslave/jenkins/workspace/lldb-cmake/llvm-project/lldb/lit/SymbolFile/DWARF/parallel-indexing-stress.s -- Exit Code: -9 Timeout: Reached timeout of 600 seconds

Hide Details

Hide Details

******************** PASS: lldb-Unit :: Symbol/./SymbolTests/TestClangASTContext.TestGetBasicTypeFromName (1600 of 1734) PASS: lldb-Unit :: Utility/./UtilityTests/BinaryStreamTest.PutSLEB128FiveBytes (1601 of 1734) PASS: lldb-Suite :: lang/cpp/limit-debug-info/TestWithLimitDebugInfo.py (1602 of 1734) UNSUPPORTED: LLDB :: SymbolFile/PDB/variables-locations.test (1603 of 1734) PASS: lldb-Suite :: functionalities/gdb_remote_client/TestTargetXMLArch.py (1604 of 1734) PASS: lldb-Suite :: functionalities/breakpoint/move_nearest/TestMoveNearest.py (1605 of 1734) PASS: lldb-Unit :: UnwindAssembly/x86/./UnwindAssemblyx86Tests/Testx86AssemblyInspectionEngine.TestPushEDX (1606 of 1734) UNSUPPORTED: LLDB :: ExecControl/StopHook/stop-hook-threads.test (1607 of 1734) TIMEOUT: LLDB :: SymbolFile/Breakpad/line-table-edgecases.test (1608 of 1734) ******************** TEST 'LLDB :: SymbolFile/Breakpad/line-table-edgecases.test' FAILED ******************** Script: -- : 'RUN: at line 5'; /Users/buildslave/jenkins/workspace/lldb-cmake/lldb-build/bin/yaml2obj /Users/buildslave/jenkins/workspace/lldb-cmake/llvm-project/lldb/lit/SymbolFile/Breakpad/Inputs/basic-elf.yaml > /Users/buildslave/jenkins/workspace/lldb-cmake/lldb-build/tools/lldb/lit/SymbolFile/Breakpad/Output/line-table-edgecases.out : 'RUN: at line 6'; /Users/buildslave/jenkins/workspace/lldb-cmake/lldb-build/bin/lldb --no-lldbinit -S /Users/buildslave/jenkins/workspace/lldb-cmake/lldb-build/tools/lldb/lit/lit-lldb-init /Users/buildslave/jenkins/workspace/lldb-cmake/lldb-build/tools/lldb/lit/SymbolFile/Breakpad/Output/line-table-edgecases.out -o "target symbols add -s line-table-edgecases.out /Users/buildslave/jenkins/workspace/lldb-cmake/llvm-project/lldb/lit/SymbolFile/Breakpad/Inputs/line-table-edgecases.syms" -s /Users/buildslave/jenkins/workspace/lldb-cmake/llvm-project/lldb/lit/SymbolFile/Breakpad/line-table-edgecases.test -o exit | /Users/buildslave/jenkins/workspace/lldb-cmake/lldb-build/bin/FileCheck /Users/buildslave/jenkins/workspace/lldb-cmake/llvm-project/lldb/lit/SymbolFile/Breakpad/line-table-edgecases.test -- Exit Code: -9 Timeout: Reached timeout of 600 seconds

Hide Details

Hide Details

******************** PASS: lldb-Unit :: Utility/./UtilityTests/NameMatchesTest.Ignore (1609 of 1734) PASS: lldb-Unit :: Host/./HostTests/SocketAddressTest.Set (1610 of 1734) PASS: lldb-Suite :: functionalities/source-map/TestTargetSourceMap.py (1611 of 1734) PASS: lldb-Unit :: Utility/./UtilityTests/FileSpecTest.FormatFileSpec (1612 of 1734) PASS: lldb-Suite :: lang/objc/global_ptrs/TestGlobalObjects.py (1613 of 1734) PASS: lldb-Suite :: commands/watchpoints/variable_out_of_scope/TestWatchedVarHitWhenInScope.py (1614 of 1734) PASS: LLDB :: Settings/TestStopCommandSourceOnError.test (1615 of 1734) TIMEOUT: LLDB :: SymbolFile/Breakpad/symtab-macho.test (1616 of 1734) ******************** TEST 'LLDB :: SymbolFile/Breakpad/symtab-macho.test' FAILED ******************** Script: -- : 'RUN: at line 1'; /Users/buildslave/jenkins/workspace/lldb-cmake/lldb-build/bin/yaml2obj /Users/buildslave/jenkins/workspace/lldb-cmake/llvm-project/lldb/lit/SymbolFile/Breakpad/Inputs/basic-macho.yaml > /Users/buildslave/jenkins/workspace/lldb-cmake/lldb-build/tools/lldb/lit/SymbolFile/Breakpad/Output/symtab-macho.out : 'RUN: at line 2'; /Users/buildslave/jenkins/workspace/lldb-cmake/lldb-build/bin/lldb --no-lldbinit -S /Users/buildslave/jenkins/workspace/lldb-cmake/lldb-build/tools/lldb/lit/lit-lldb-init /Users/buildslave/jenkins/workspace/lldb-cmake/lldb-build/tools/lldb/lit/SymbolFile/Breakpad/Output/symtab-macho.out -o "target symbols add /Users/buildslave/jenkins/workspace/lldb-cmake/llvm-project/lldb/lit/SymbolFile/Breakpad/Inputs/symtab-macho.syms" -s /Users/buildslave/jenkins/workspace/lldb-cmake/llvm-project/lldb/lit/SymbolFile/Breakpad/symtab-macho.test | /Users/buildslave/jenkins/workspace/lldb-cmake/lldb-build/bin/FileCheck /Users/buildslave/jenkins/workspace/lldb-cmake/llvm-project/lldb/lit/SymbolFile/Breakpad/symtab-macho.test -- Exit Code: -9 Timeout: Reached timeout of 600 seconds

Hide Details

Hide Details

******************** PASS: lldb-Unit :: Utility/./UtilityTests/VMRange.Ordering (1617 of 1734) TIMEOUT: LLDB :: SymbolFile/DWARF/gnu-style-compression.cpp (1618 of 1734) ******************** TEST 'LLDB :: SymbolFile/DWARF/gnu-style-compression.cpp' FAILED ******************** Script: -- : 'RUN: at line 3'; /Users/buildslave/jenkins/workspace/lldb-cmake/lldb-build/bin/clang -isysroot /Applications/Xcode.app/Contents/Developer/Platforms/MacOSX.platform/Developer/SDKs/MacOSX.sdk -fmodules-cache-path=/Users/buildslave/jenkins/workspace/lldb-cmake/lldb-build/tools/lldb/lldb-test-build.noindex/module-cache-clang /Users/buildslave/jenkins/workspace/lldb-cmake/llvm-project/lldb/lit/SymbolFile/DWARF/gnu-style-compression.cpp -target x86_64-pc-linux -g -gsplit-dwarf -c -o /Users/buildslave/jenkins/workspace/lldb-cmake/lldb-build/tools/lldb/lit/SymbolFile/DWARF/Output/gnu-style-compression.cpp.tmp -Wa,--compress-debug-sections=zlib-gnu : 'RUN: at line 5'; /Users/buildslave/jenkins/workspace/lldb-cmake/lldb-build/bin/lldb --no-lldbinit -S /Users/buildslave/jenkins/workspace/lldb-cmake/lldb-build/tools/lldb/lit/lit-lldb-init /Users/buildslave/jenkins/workspace/lldb-cmake/lldb-build/tools/lldb/lit/SymbolFile/DWARF/Output/gnu-style-compression.cpp.tmp -o "target var s a" -b | /Users/buildslave/jenkins/workspace/lldb-cmake/lldb-build/bin/FileCheck /Users/buildslave/jenkins/workspace/lldb-cmake/llvm-project/lldb/lit/SymbolFile/DWARF/gnu-style-compression.cpp -- Exit Code: -9 Timeout: Reached timeout of 600 seconds

Hide Details

Command Output (stderr): -- clang-10: warning: argument unused during compilation: '-fmodules-cache-path=/Users/buildslave/jenkins/workspace/lldb-cmake/lldb-build/tools/lldb/lldb-test-build.noindex/module-cache-clang' [-Wunused-command-line-argument]

Hide Details

--

Hide Details

******************** PASS: lldb-Unit :: Utility/./UtilityTests/UserIDResolver.GetGroupName (1619 of 1734) PASS: lldb-Suite :: commands/settings/quoting/TestQuoting.py (1620 of 1734) PASS: LLDB :: Modules/ELF/PT_LOAD-overlap.yaml (1621 of 1734) PASS: lldb-Suite :: functionalities/data-formatter/typedef_array/TestTypedefArray.py (1622 of 1734) PASS: lldb-Unit :: Language/Highlighting/./HighlighterTests/HighlighterTest.ClangEmptyInput (1623 of 1734) PASS: lldb-Unit :: Utility/./UtilityTests/Flags.Reset (1624 of 1734) PASS: lldb-Suite :: lang/cpp/offsetof/TestOffsetofCpp.py (1625 of 1734) PASS: lldb-Unit :: Utility/./UtilityTests/NameMatchesTest.Contains (1626 of 1734) PASS: lldb-Unit :: Utility/./UtilityTests/StringListTest.ForRange (1627 of 1734) PASS: lldb-Suite :: lang/c/set_values/TestSetValues.py (1628 of 1734) PASS: lldb-Unit :: Utility/./UtilityTests/DataExtractorTest.GetMaxS64 (1629 of 1734) PASS: lldb-Suite :: functionalities/object-file/TestImageListMultiArchitecture.py (1630 of 1734) PASS: lldb-Suite :: functionalities/tsan/cpp_global_location/TestTsanCPPGlobalLocation.py (1631 of 1734) PASS: lldb-Unit :: Utility/./UtilityTests/StringListTest.GetSize (1632 of 1734) PASS: lldb-Unit :: Host/./HostTests/FileSystemTest.GetByteSize (1633 of 1734) PASS: lldb-Suite :: functionalities/tail_call_frames/unambiguous_sequence/TestUnambiguousTailCalls.py (1634 of 1734) PASS: lldb-Unit :: Target/./TargetTests/ModuleCacheTest.GetAndPut (1635 of 1734) UNSUPPORTED: LLDB :: Register/x86-64-zmm-write.test (1636 of 1734) PASS: LLDB :: Minidump/Windows/find-module.test (1637 of 1734) PASS: lldb-Suite :: sample_test/TestSampleInlineTest.py (1638 of 1734) PASS: lldb-Unit :: Expression/./ExpressionTests/DiagnosticManagerTest.PutString (1639 of 1734) PASS: lldb-Suite :: macosx/duplicate-archive-members/TestDuplicateMembers.py (1640 of 1734) PASS: lldb-Suite :: lang/objc/foundation/TestRuntimeTypes.py (1641 of 1734) PASS: lldb-Suite :: commands/platform/basic/TestPlatformCommand.py (1642 of 1734) PASS: lldb-Unit :: UnwindAssembly/x86/./UnwindAssemblyx86Tests/Testx86AssemblyInspectionEngine.TestPush0 (1643 of 1734) PASS: lldb-Suite :: types/TestDoubleTypesExpr.py (1644 of 1734) PASS: LLDB :: Commands/CommandScriptImmediateOutput/CommandScriptImmediateOutputFile.test (1645 of 1734) PASS: lldb-Unit :: Process/gdb-remote/./ProcessGdbRemoteTests/GDBRemoteClientBaseTest.SendContinueAndAsyncPacket (1646 of 1734) PASS: lldb-Suite :: python_api/watchpoint/condition/TestWatchpointConditionAPI.py (1647 of 1734) PASS: lldb-Unit :: Utility/./UtilityTests/StringListTest.ShiftMove (1648 of 1734) PASS: lldb-Suite :: macosx/function-starts/TestFunctionStarts.py (1649 of 1734) PASS: lldb-Unit :: ObjectFile/Breakpad/./ObjectFileBreakpadTests/LineRecord.parse (1650 of 1734) PASS: lldb-Suite :: functionalities/data-formatter/data-formatter-stl/libstdcpp/list/TestDataFormatterStdList.py (1651 of 1734) PASS: lldb-Unit :: Utility/./UtilityTests/ArgsTest.TestArgv (1652 of 1734) PASS: LLDB :: Reproducer/Modules/TestModuleCXX.test (1653 of 1734) PASS: lldb-Suite :: lang/objc/foundation/TestObjectDescriptionAPI.py (1654 of 1734) PASS: lldb-Suite :: functionalities/thread/concurrent_events/TestConcurrentSignalDelayWatch.py (1655 of 1734) PASS: LLDB :: Breakpoint/ppc64-localentry.test (1656 of 1734) PASS: lldb-Suite :: functionalities/data-formatter/boolreference/TestFormattersBoolRefPtr.py (1657 of 1734) PASS: lldb-Unit :: UnwindAssembly/x86/./UnwindAssemblyx86Tests/Testx86AssemblyInspectionEngine.TestPushEBP (1658 of 1734) PASS: lldb-Unit :: Utility/./UtilityTests/RangeTest.ContainsAddrInvalid (1659 of 1734) PASS: lldb-Unit :: UnwindAssembly/x86/./UnwindAssemblyx86Tests/Testx86AssemblyInspectionEngine.TestPushEAX (1660 of 1734) PASS: lldb-Unit :: SymbolFile/NativePDB/./SymbolFileNativePDBTests/PDBFPOProgramToDWARFExpressionTests.UnknownOp (1661 of 1734) PASS: lldb-Unit :: Utility/./UtilityTests/ConstStringTest.MangledCounterpart (1662 of 1734) PASS: lldb-Suite :: functionalities/memory/cache/TestMemoryCache.py (1663 of 1734) PASS: lldb-Unit :: Language/Highlighting/./HighlighterTests/HighlighterTest.DefaultHighlighterWithCursor (1664 of 1734) PASS: lldb-Suite :: functionalities/data-formatter/data-formatter-objc/TestDataFormatterObjCCF.py (1665 of 1734) PASS: lldb-Suite :: python_api/sbstructureddata/TestStructuredDataAPI.py (1666 of 1734) PASS: lldb-Unit :: Utility/./UtilityTests/UriParserTest.MinimalPortPath (1667 of 1734) PASS: lldb-Suite :: lang/cpp/wchar_t/TestCxxWCharT.py (1668 of 1734) PASS: lldb-Unit :: Process/gdb-remote/./ProcessGdbRemoteTests/GDBRemoteClientBaseTest.SendContinueAndInterrupt2PacketBug (1669 of 1734) PASS: lldb-Suite :: linux/thread/create_during_instruction_step/TestCreateDuringInstructionStep.py (1670 of 1734) UNSUPPORTED: LLDB :: SymbolFile/NativePDB/stack_unwinding01.cpp (1671 of 1734) PASS: lldb-Suite :: lang/cpp/extern_c/TestExternCSymbols.py (1672 of 1734) PASS: lldb-Suite :: lang/objc/modules/TestObjCModules.py (1673 of 1734) PASS: lldb-Unit :: Language/Highlighting/./HighlighterTests/HighlighterTest.ClangOperators (1674 of 1734) PASS: lldb-Unit :: Utility/./UtilityTests/OptionsWithRawTest.WhitespaceInput (1675 of 1734) PASS: lldb-Suite :: functionalities/postmortem/minidump/TestMiniDump.py (1676 of 1734) PASS: lldb-Unit :: Utility/./UtilityTests/StringLexerTest.GetUnlexed (1677 of 1734) PASS: lldb-Unit :: Utility/./UtilityTests/OptionsWithRawTest.MultiWordSuffix (1678 of 1734) PASS: lldb-Suite :: lang/c/const_variables/TestConstVariables.py (1679 of 1734) PASS: lldb-Unit :: Utility/./UtilityTests/StreamTest.PutCString (1680 of 1734) PASS: lldb-Suite :: lang/c/find_struct_type/TestFindStructTypes.py (1681 of 1734) PASS: LLDB :: Settings/TestDisassemblyFormat.test (1682 of 1734) PASS: lldb-Unit :: Utility/./UtilityTests/StringListTest.SplitIntoLinesEmpty (1683 of 1734) PASS: lldb-Suite :: functionalities/fat_archives/TestFatArchives.py (1684 of 1734) PASS: LLDB :: Unwind/eh-frame-dwarf-unwind.test (1685 of 1734) PASS: lldb-Suite :: lang/objc/print-obj/TestPrintObj.py (1686 of 1734) PASS: lldb-Unit :: Utility/./UtilityTests/OptionsWithRawTest.ArgsButNoLeadingDash (1687 of 1734) PASS: lldb-Unit :: Utility/./UtilityTests/BinaryStreamTest.PutULEB128SixBytes (1688 of 1734) PASS: lldb-Unit :: Utility/./UtilityTests/StringExtractorTest.GetU64BigEndian (1689 of 1734) PASS: lldb-Suite :: commands/watchpoints/multi_watchpoint_slots/TestWatchpointMultipleSlots.py (1690 of 1734) PASS: lldb-Suite :: functionalities/thread/concurrent_events/TestConcurrentTwoWatchpointsOneDelayBreakpoint.py (1691 of 1734) PASS: lldb-Suite :: lang/cpp/nsimport/TestCppNsImport.py (1692 of 1734) PASS: lldb-Unit :: ObjectFile/Breakpad/./ObjectFileBreakpadTests/ModuleRecord.parse (1693 of 1734) PASS: lldb-Unit :: Utility/./UtilityTests/LogChannelEnabledTest.LogVerboseThread (1694 of 1734) PASS: lldb-Unit :: Utility/./UtilityTests/BinaryStreamTest.PutSLEB128EightBytes (1695 of 1734) PASS: lldb-Unit :: Breakpoint/./LLDBBreakpointTests/BreakpointIDTest.StringIsBreakpointName (1696 of 1734) PASS: lldb-Unit :: Utility/./UtilityTests/BinaryStreamTest.PutSLEB128OneByte (1697 of 1734) PASS: lldb-Suite :: commands/expression/invalid-args/TestInvalidArgsExpression.py (1698 of 1734) PASS: lldb-Suite :: commands/expression/import-std-module/conflicts/TestStdModuleWithConflicts.py (1699 of 1734) PASS: lldb-Unit :: Utility/./UtilityTests/ArchSpecTest.MergeFromMachOUnknown (1700 of 1734) PASS: lldb-Unit :: ScriptInterpreter/Python/./ScriptInterpreterPythonTests/PythonDataObjectsTest.TestGlobalNameResolutionNoDot (1701 of 1734) PASS: lldb-Suite :: commands/expression/multiline-completion/TestMultilineCompletion.py (1702 of 1734) PASS: LLDB :: SymbolFile/NativePDB/ast-functions.cpp (1703 of 1734) PASS: lldb-Unit :: Utility/./UtilityTests/VASprintfTest.EncodingError (1704 of 1734) PASS: lldb-Unit :: Utility/./UtilityTests/LogChannelTest.EnableOptions (1705 of 1734) PASS: lldb-Suite :: functionalities/breakpoint/breakpoint_set_restart/TestBreakpointSetRestart.py (1706 of 1734) PASS: lldb-Unit :: Utility/./UtilityTests/StreamTest.ShiftOperatorStrings (1707 of 1734) PASS: lldb-Suite :: functionalities/darwin_log/filter/regex/message/TestDarwinLogFilterRegexMessage.py (1708 of 1734) PASS: lldb-Unit :: Utility/./UtilityTests/RegularExpression.Match (1709 of 1734) PASS: lldb-Suite :: functionalities/data-formatter/data-formatter-ptr-to-array/TestPtrToArrayFormatting.py (1710 of 1734) PASS: lldb-Suite :: sample_test/TestSampleTest.py (1711 of 1734) PASS: lldb-Suite :: python_api/class_members/TestSBTypeClassMembers.py (1712 of 1734) PASS: lldb-Suite :: functionalities/avoids-fd-leak/TestFdLeak.py (1713 of 1734) PASS: lldb-Suite :: lang/c/forward/TestForwardDeclaration.py (1714 of 1734) PASS: lldb-Suite :: functionalities/thread/concurrent_events/TestConcurrentTwoBreakpointsOneWatchpoint.py (1715 of 1734) PASS: lldb-Suite :: lang/c/inlines/TestRedefinitionsInInlines.py (1716 of 1734) PASS: lldb-Suite :: functionalities/breakpoint/address_breakpoints/TestAddressBreakpoints.py (1717 of 1734) PASS: lldb-Suite :: lang/cpp/breakpoint-commands/TestCPPBreakpointCommands.py (1718 of 1734) TIMEOUT: LLDB :: SymbolFile/DWARF/split-dwarf-multiple-cu.ll (1719 of 1734) ******************** TEST 'LLDB :: SymbolFile/DWARF/split-dwarf-multiple-cu.ll' FAILED ******************** Script: -- : 'RUN: at line 4'; llc /Users/buildslave/jenkins/workspace/lldb-cmake/llvm-project/lldb/lit/SymbolFile/DWARF/split-dwarf-multiple-cu.ll -filetype=obj -o /Users/buildslave/jenkins/workspace/lldb-cmake/lldb-build/tools/lldb/lit/SymbolFile/DWARF/Output/split-dwarf-multiple-cu.ll.tmp.o --split-dwarf-file=/Users/buildslave/jenkins/workspace/lldb-cmake/lldb-build/tools/lldb/lit/SymbolFile/DWARF/Output/split-dwarf-multiple-cu.ll.tmp.o : 'RUN: at line 5'; /Users/buildslave/jenkins/workspace/lldb-cmake/lldb-build/bin/lldb --no-lldbinit -S /Users/buildslave/jenkins/workspace/lldb-cmake/lldb-build/tools/lldb/lit/lit-lldb-init /Users/buildslave/jenkins/workspace/lldb-cmake/lldb-build/tools/lldb/lit/SymbolFile/DWARF/Output/split-dwarf-multiple-cu.ll.tmp.o -o "image lookup -s x1 -v" -o "image lookup -s x2 -v" -b | /Users/buildslave/jenkins/workspace/lldb-cmake/lldb-build/bin/FileCheck /Users/buildslave/jenkins/workspace/lldb-cmake/llvm-project/lldb/lit/SymbolFile/DWARF/split-dwarf-multiple-cu.ll -- Exit Code: -9 Timeout: Reached timeout of 600 seconds

Hide Details

Hide Details

******************** PASS: lldb-Suite :: lang/cpp/static_members/TestCPPStaticMembers.py (1720 of 1734) PASS: lldb-Suite :: lang/cpp/symbols/TestSymbols.py (1721 of 1734) PASS: lldb-Suite :: lang/objc/objc-struct-return/TestObjCStructReturn.py (1722 of 1734) PASS: lldb-Suite :: lang/objc/blocks/TestObjCIvarsInBlocks.py (1723 of 1734) PASS: lldb-Suite :: lang/objc/objc-ivar-offsets/TestObjCIvarOffsets.py (1724 of 1734) PASS: lldb-Suite :: functionalities/data-formatter/nsarraysynth/TestNSArraySynthetic.py (1725 of 1734) PASS: lldb-Suite :: lang/objc/rdar-11355592/TestRdar11355592.py (1726 of 1734) PASS: lldb-Suite :: lang/cpp/namespace/TestNamespaceLookup.py (1727 of 1734) TIMEOUT: LLDB :: SymbolFile/NativePDB/disassembly.cpp (1728 of 1734) ******************** TEST 'LLDB :: SymbolFile/NativePDB/disassembly.cpp' FAILED ******************** Script: -- : 'RUN: at line 5'; '/usr/local/opt/python/bin/python3.7' /Users/buildslave/jenkins/workspace/lldb-cmake/llvm-project/lldb/lit/helper/build.py --compiler=any --arch=64 --tools-dir=/Users/buildslave/jenkins/workspace/lldb-cmake/lldb-build/./bin --libs-dir=/Users/buildslave/jenkins/workspace/lldb-cmake/lldb-build/./lib --compiler=clang-cl --nodefaultlib -o /Users/buildslave/jenkins/workspace/lldb-cmake/lldb-build/tools/lldb/lit/SymbolFile/NativePDB/Output/disassembly.cpp.tmp.exe -- /Users/buildslave/jenkins/workspace/lldb-cmake/llvm-project/lldb/lit/SymbolFile/NativePDB/disassembly.cpp : 'RUN: at line 6'; env LLDB_USE_NATIVE_PDB_READER=1 /Users/buildslave/jenkins/workspace/lldb-cmake/lldb-build/bin/lldb --no-lldbinit -S /Users/buildslave/jenkins/workspace/lldb-cmake/lldb-build/tools/lldb/lit/lit-lldb-init -f /Users/buildslave/jenkins/workspace/lldb-cmake/lldb-build/tools/lldb/lit/SymbolFile/NativePDB/Output/disassembly.cpp.tmp.exe -s /Users/buildslave/jenkins/workspace/lldb-cmake/llvm-project/lldb/lit/SymbolFile/NativePDB/Inputs/disassembly.lldbinit | /Users/buildslave/jenkins/workspace/lldb-cmake/lldb-build/bin/FileCheck /Users/buildslave/jenkins/workspace/lldb-cmake/llvm-project/lldb/lit/SymbolFile/NativePDB/disassembly.cpp -- Exit Code: -9 Timeout: Reached timeout of 600 seconds

Hide Details

Command Output (stdout): -- Cleaning disassembly.ilk Cleaning disassembly.cpp.tmp.exe-disassembly.obj Cleaning disassembly.cpp.tmp.pdb Cleaning disassembly.cpp.tmp.exe

Hide Details

Hide Details

Hide Details

compiling disassembly.cpp -> disassembly.cpp.tmp.exe-disassembly.obj STDOUT:

Hide Details

Hide Details

Hide Details

Hide Details

linking disassembly.cpp.tmp.exe-disassembly.obj -> disassembly.cpp.tmp.exe STDOUT:

Hide Details

Hide Details

--

Hide Details

******************** TIMEOUT: LLDB :: SymbolFile/DWARF/debug_ranges.s (1729 of 1734) ******************** TEST 'LLDB :: SymbolFile/DWARF/debug_ranges.s' FAILED ******************** Script: -- : 'RUN: at line 3'; /Users/buildslave/jenkins/workspace/lldb-cmake/lldb-build/bin/llvm-mc -triple=x86_64-pc-linux -filetype=obj /Users/buildslave/jenkins/workspace/lldb-cmake/llvm-project/lldb/lit/SymbolFile/DWARF/debug_ranges.s > /Users/buildslave/jenkins/workspace/lldb-cmake/lldb-build/tools/lldb/lit/SymbolFile/DWARF/Output/debug_ranges.s.tmp : 'RUN: at line 4'; /Users/buildslave/jenkins/workspace/lldb-cmake/lldb-build/bin/lldb --no-lldbinit -S /Users/buildslave/jenkins/workspace/lldb-cmake/lldb-build/tools/lldb/lit/lit-lldb-init /Users/buildslave/jenkins/workspace/lldb-cmake/lldb-build/tools/lldb/lit/SymbolFile/DWARF/Output/debug_ranges.s.tmp -o "image lookup -v -s lookup_ranges" -o exit | /Users/buildslave/jenkins/workspace/lldb-cmake/lldb-build/bin/FileCheck /Users/buildslave/jenkins/workspace/lldb-cmake/llvm-project/lldb/lit/SymbolFile/DWARF/debug_ranges.s -- Exit Code: -9 Timeout: Reached timeout of 600 seconds

Hide Details

Hide Details

******************** TIMEOUT: LLDB :: Minidump/disassemble-no-module.yaml (1730 of 1734) ******************** TEST 'LLDB :: Minidump/disassemble-no-module.yaml' FAILED ******************** Script: -- : 'RUN: at line 1'; /Users/buildslave/jenkins/workspace/lldb-cmake/lldb-build/bin/yaml2obj /Users/buildslave/jenkins/workspace/lldb-cmake/llvm-project/lldb/lit/Minidump/disassemble-no-module.yaml > /Users/buildslave/jenkins/workspace/lldb-cmake/lldb-build/tools/lldb/lit/Minidump/Output/disassemble-no-module.yaml.tmp : 'RUN: at line 2'; /Users/buildslave/jenkins/workspace/lldb-cmake/lldb-build/bin/lldb --no-lldbinit -S /Users/buildslave/jenkins/workspace/lldb-cmake/lldb-build/tools/lldb/lit/lit-lldb-init -c /Users/buildslave/jenkins/workspace/lldb-cmake/lldb-build/tools/lldb/lit/Minidump/Output/disassemble-no-module.yaml.tmp -o bt -o disassemble 2>&1 | /Users/buildslave/jenkins/workspace/lldb-cmake/lldb-build/bin/FileCheck /Users/buildslave/jenkins/workspace/lldb-cmake/llvm-project/lldb/lit/Minidump/disassemble-no-module.yaml -- Exit Code: -9 Timeout: Reached timeout of 600 seconds

Hide Details

Hide Details

******************** TIMEOUT: LLDB :: Breakpoint/jitbp_elf.test (1731 of 1734) ******************** TEST 'LLDB :: Breakpoint/jitbp_elf.test' FAILED ******************** Script: -- : 'RUN: at line 4'; /Users/buildslave/jenkins/workspace/lldb-cmake/lldb-build/bin/clang -isysroot /Applications/Xcode.app/Contents/Developer/Platforms/MacOSX.platform/Developer/SDKs/MacOSX.sdk -fmodules-cache-path=/Users/buildslave/jenkins/workspace/lldb-cmake/lldb-build/tools/lldb/lldb-test-build.noindex/module-cache-clang -g -S -emit-llvm --target=x86_64-unknown-unknown-elf -o /Users/buildslave/jenkins/workspace/lldb-cmake/lldb-build/tools/lldb/lit/Breakpoint/Output/jitbp_elf.test.tmp.ll /Users/buildslave/jenkins/workspace/lldb-cmake/llvm-project/lldb/lit/Breakpoint/Inputs/jitbp.cpp : 'RUN: at line 5'; /Users/buildslave/jenkins/workspace/lldb-cmake/lldb-build/bin/lldb --no-lldbinit -S /Users/buildslave/jenkins/workspace/lldb-cmake/lldb-build/tools/lldb/lit/lit-lldb-init -b -o 'settings set plugin.jit-loader.gdb.enable on' -o 'b jitbp' -o 'run -jit-kind=mcjit /Users/buildslave/jenkins/workspace/lldb-cmake/lldb-build/tools/lldb/lit/Breakpoint/Output/jitbp_elf.test.tmp.ll' /Users/buildslave/jenkins/workspace/lldb-cmake/lldb-build/bin/lli | /Users/buildslave/jenkins/workspace/lldb-cmake/lldb-build/bin/FileCheck /Users/buildslave/jenkins/workspace/lldb-cmake/llvm-project/lldb/lit/Breakpoint/jitbp_elf.test -- Exit Code: -9 Timeout: Reached timeout of 600 seconds

Hide Details

Command Output (stderr): -- clang-10: warning: argument unused during compilation: '-fmodules-cache-path=/Users/buildslave/jenkins/workspace/lldb-cmake/lldb-build/tools/lldb/lldb-test-build.noindex/module-cache-clang' [-Wunused-command-line-argument]

Hide Details

--

Hide Details

******************** TIMEOUT: LLDB :: Reproducer/Functionalities/TestStepping.test (1732 of 1734) ******************** TEST 'LLDB :: Reproducer/Functionalities/TestStepping.test' FAILED ******************** Script: -- : 'RUN: at line 5'; rm -rf /Users/buildslave/jenkins/workspace/lldb-cmake/lldb-build/tools/lldb/lit/Reproducer/Functionalities/Output/TestStepping.test.tmp.repro : 'RUN: at line 6'; /Users/buildslave/jenkins/workspace/lldb-cmake/lldb-build/bin/clang -isysroot /Applications/Xcode.app/Contents/Developer/Platforms/MacOSX.platform/Developer/SDKs/MacOSX.sdk -fmodules-cache-path=/Users/buildslave/jenkins/workspace/lldb-cmake/lldb-build/tools/lldb/lldb-test-build.noindex/module-cache-clang /Users/buildslave/jenkins/workspace/lldb-cmake/llvm-project/lldb/lit/Reproducer/Functionalities/Inputs/stepping.c -O0 -g -o /Users/buildslave/jenkins/workspace/lldb-cmake/lldb-build/tools/lldb/lit/Reproducer/Functionalities/Output/TestStepping.test.tmp.out : 'RUN: at line 7'; grep -v '#' /Users/buildslave/jenkins/workspace/lldb-cmake/llvm-project/lldb/lit/Reproducer/Functionalities/TestStepping.test > /Users/buildslave/jenkins/workspace/lldb-cmake/lldb-build/tools/lldb/lit/Reproducer/Functionalities/Output/TestStepping.test.tmp.in : 'RUN: at line 9'; /Users/buildslave/jenkins/workspace/lldb-cmake/lldb-build/bin/lldb --no-lldbinit -S /Users/buildslave/jenkins/workspace/lldb-cmake/lldb-build/tools/lldb/lit/lit-lldb-init -x -b -s /Users/buildslave/jenkins/workspace/lldb-cmake/lldb-build/tools/lldb/lit/Reproducer/Functionalities/Output/TestStepping.test.tmp.in --capture --capture-path /Users/buildslave/jenkins/workspace/lldb-cmake/lldb-build/tools/lldb/lit/Reproducer/Functionalities/Output/TestStepping.test.tmp.repro /Users/buildslave/jenkins/workspace/lldb-cmake/lldb-build/tools/lldb/lit/Reproducer/Functionalities/Output/TestStepping.test.tmp.out | /Users/buildslave/jenkins/workspace/lldb-cmake/lldb-build/bin/FileCheck /Users/buildslave/jenkins/workspace/lldb-cmake/llvm-project/lldb/lit/Reproducer/Functionalities/TestStepping.test --check-prefix CHECK : 'RUN: at line 10'; /Users/buildslave/jenkins/workspace/lldb-cmake/lldb-build/bin/lldb --no-lldbinit -S /Users/buildslave/jenkins/workspace/lldb-cmake/lldb-build/tools/lldb/lit/lit-lldb-init --replay /Users/buildslave/jenkins/workspace/lldb-cmake/lldb-build/tools/lldb/lit/Reproducer/Functionalities/Output/TestStepping.test.tmp.repro | /Users/buildslave/jenkins/workspace/lldb-cmake/lldb-build/bin/FileCheck /Users/buildslave/jenkins/workspace/lldb-cmake/llvm-project/lldb/lit/Reproducer/Functionalities/TestStepping.test --check-prefix CHECK -- Exit Code: -9 Timeout: Reached timeout of 600 seconds

Hide Details

Command Output (stderr): -- clang-10: warning: argument unused during compilation: '-fmodules-cache-path=/Users/buildslave/jenkins/workspace/lldb-cmake/lldb-build/tools/lldb/lldb-test-build.noindex/module-cache-clang' [-Wunused-command-line-argument]

Hide Details

--

Hide Details

******************** TIMEOUT: LLDB :: SymbolFile/DWARF/dir-separator-posix.s (1733 of 1734) ******************** TEST 'LLDB :: SymbolFile/DWARF/dir-separator-posix.s' FAILED ******************** Script: -- : 'RUN: at line 6'; /Users/buildslave/jenkins/workspace/lldb-cmake/lldb-build/bin/llvm-mc -triple x86_64-pc-linux /Users/buildslave/jenkins/workspace/lldb-cmake/llvm-project/lldb/lit/SymbolFile/DWARF/dir-separator-posix.s -filetype=obj > /Users/buildslave/jenkins/workspace/lldb-cmake/lldb-build/tools/lldb/lit/SymbolFile/DWARF/Output/dir-separator-posix.s.tmp.o : 'RUN: at line 7'; /Users/buildslave/jenkins/workspace/lldb-cmake/lldb-build/bin/ld.lld /Users/buildslave/jenkins/workspace/lldb-cmake/lldb-build/tools/lldb/lit/SymbolFile/DWARF/Output/dir-separator-posix.s.tmp.o -o /Users/buildslave/jenkins/workspace/lldb-cmake/lldb-build/tools/lldb/lit/SymbolFile/DWARF/Output/dir-separator-posix.s.tmp : 'RUN: at line 8'; /Users/buildslave/jenkins/workspace/lldb-cmake/lldb-build/bin/lldb --no-lldbinit -S /Users/buildslave/jenkins/workspace/lldb-cmake/lldb-build/tools/lldb/lit/lit-lldb-init /Users/buildslave/jenkins/workspace/lldb-cmake/lldb-build/tools/lldb/lit/SymbolFile/DWARF/Output/dir-separator-posix.s.tmp -s /Users/buildslave/jenkins/workspace/lldb-cmake/llvm-project/lldb/lit/SymbolFile/DWARF/Inputs/dir-separator-posix.lldbinit -o exit | /Users/buildslave/jenkins/workspace/lldb-cmake/lldb-build/bin/FileCheck /Users/buildslave/jenkins/workspace/lldb-cmake/llvm-project/lldb/lit/SymbolFile/DWARF/dir-separator-posix.s -- Exit Code: -9 Timeout: Reached timeout of 600 seconds

Hide Details

Hide Details

******************** Cancelling nested steps due to timeout Sending interrupt signal to process sh: line 1: 99971 Terminated: 15 JENKINS_SERVER_COOKIE=$jsc '/bin/sh' -xe '/Users/buildslave/jenkins/workspace/lldb-cmake@tmp/durable-6905b5b0/script.sh' > '/Users/buildslave/jenkins/workspace/lldb-cmake@tmp/durable-6905b5b0/jenkins-log.txt' 2>&1 ninja: build stopped: interrupted by user. script returned exit code 143 [Pipeline] } [Pipeline] // timeout [Pipeline] } [Pipeline] // stage [Pipeline] stage [Pipeline] { (Declarative: Post Actions) [Pipeline] scanForIssues No credentials specified [Clang (LLVM based)] Sleeping for 5 seconds due to JENKINS-32191... [Clang (LLVM based)] Parsing console log (workspace: '/Users/buildslave/jenkins/workspace/lldb-cmake') [Clang (LLVM based)] [-ERROR-] Can't resolve absolute paths for some files: [Clang (LLVM based)] [-ERROR-] - /Users/buildslave/jenkins/workspace/lldb-cmake/lldb-build/Makefile.rules [Clang (LLVM based)] [-ERROR-] Can't create fingerprints for some files: [Clang (LLVM based)] [-ERROR-] - '/Users/buildslave/jenkins/workspace/lldb-cmake/lldb-build/Makefile.rules', IO exception has been thrown: java.nio.file.NoSuchFileException: /Users/buildslave/jenkins/workspace/lldb-cmake/lldb-build/Makefile.rules [Clang (LLVM based)] [-ERROR-] Git blame errors: [Clang (LLVM based)] [-ERROR-] - no blame results for request <llvm-project/lldb/include/lldb/Target/Process.h - [1394, 2373, 523, 717, 1725, 2174]>.

Hide Details

[Clang (LLVM based)] [-ERROR-] Git blame errors: [Clang (LLVM based)] [-ERROR-] - no blame results for request <llvm-project/lldb/include/lldb/Host/common/NativeProcessProtocol.h - [387, 390]>.

Hide Details

[Clang (LLVM based)] [-ERROR-] Git blame errors: [Clang (LLVM based)] [-ERROR-] - no blame results for request <llvm-project/lldb/include/lldb/Utility/ConstString.h - [336, 148, 167, 329, 190]>.

Hide Details

[Clang (LLVM based)] [-ERROR-] Git blame errors: [Clang (LLVM based)] [-ERROR-] - no blame results for request <llvm-project/lldb/include/lldb/Utility/Broadcaster.h - [272, 352, 371, 264, 312, 393, 268]>.

Hide Details

[Clang (LLVM based)] [-ERROR-] Git blame errors: [Clang (LLVM based)] [-ERROR-] - no blame results for request <llvm-project/lldb/include/lldb/Expression/ExpressionParser.h - [32]>.

Hide Details

[Clang (LLVM based)] [-ERROR-] Git blame errors: [Clang (LLVM based)] [-ERROR-] - no blame results for request <llvm-project/lldb/source/Plugins/ExpressionParser/Clang/ASTResultSynthesizer.h - [148, 141]>.

Hide Details

[Clang (LLVM based)] [-ERROR-] Git blame errors: [Clang (LLVM based)] [-ERROR-] - no blame results for request <llvm-project/lldb/include/lldb/Symbol/Declaration.h - [104]>.

Hide Details

[Clang (LLVM based)] [-ERROR-] Git blame errors: [Clang (LLVM based)] [-ERROR-] - no blame results for request <llvm-project/lldb/include/lldb/Host/PseudoTerminal.h - [64, 68, 168, 107, 139, 172, 143]>.

Hide Details

[Clang (LLVM based)] [-ERROR-] Git blame errors: [Clang (LLVM based)] [-ERROR-] - no blame results for request <llvm-project/lldb/include/lldb/Expression/UtilityFunction.h - [67]>.

Hide Details

[Clang (LLVM based)] [-ERROR-] Git blame errors: [Clang (LLVM based)] [-ERROR-] - no blame results for request <llvm-project/lldb/include/lldb/Target/StackFrame.h - [102, 294, 409, 426, 302]>.

Hide Details

[Clang (LLVM based)] [-ERROR-] Git blame errors: [Clang (LLVM based)] [-ERROR-] - no blame results for request <llvm-project/lldb/source/Plugins/InstrumentationRuntime/MainThreadChecker/MainThreadCheckerRuntime.cpp - [156]>.

Hide Details

[Clang (LLVM based)] [-ERROR-] Git blame errors: [Clang (LLVM based)] [-ERROR-] - no blame results for request <llvm-project/lldb/source/Plugins/ExpressionParser/Clang/ClangExpressionDeclMap.h - [256, 66, 259, 280, 474, 490, 300, 444, 253]>.

Hide Details

[Clang (LLVM based)] [-ERROR-] Git blame errors: [Clang (LLVM based)] [-ERROR-] - no blame results for request <llvm-project/lldb/include/lldb/Utility/Flags.h - [32]>.

Hide Details

[Clang (LLVM based)] [-ERROR-] Git blame errors: [Clang (LLVM based)] [-ERROR-] - no blame results for request <llvm-project/lldb/include/lldb/Host/HostProcess.h - [15]>.

Hide Details

[Clang (LLVM based)] [-ERROR-] Git blame errors: [Clang (LLVM based)] [-ERROR-] - no blame results for request <llvm-project/lldb/include/lldb/Core/SearchFilter.h - [355, 309, 358, 87, 105, 410, 413]>.

Hide Details

[Clang (LLVM based)] [-ERROR-] Git blame errors: [Clang (LLVM based)] [-ERROR-] - no blame results for request <llvm-project/lldb/include/lldb/Core/ModuleChild.h - [49, 23]>.

Hide Details

[Clang (LLVM based)] [-ERROR-] Git blame errors: [Clang (LLVM based)] [-ERROR-] - no blame results for request <llvm-project/lldb/source/Plugins/ExpressionParser/Clang/IRForTarget.h - [384, 145, 497, 290, 74, 394, 108, 365, 525, 78, 190, 494]>.

Hide Details

[Clang (LLVM based)] [-ERROR-] Git blame errors: [Clang (LLVM based)] [-ERROR-] - no blame results for request <llvm-project/lldb/include/lldb/Breakpoint/BreakpointList.h - [141]>.

Hide Details

[Clang (LLVM based)] [-ERROR-] Git blame errors: [Clang (LLVM based)] [-ERROR-] - no blame results for request <llvm-project/lldb/include/lldb/Breakpoint/BreakpointLocationCollection.h - [34, 115, 69, 30]>.

Hide Details

[Clang (LLVM based)] [-ERROR-] Git blame errors: [Clang (LLVM based)] [-ERROR-] - no blame results for request <llvm-project/lldb/include/lldb/Core/AddressRange.h - [150, 126]>.

Hide Details

[Clang (LLVM based)] [-ERROR-] Git blame errors: [Clang (LLVM based)] [-ERROR-] - no blame results for request <llvm-project/lldb/include/lldb/Breakpoint/BreakpointOptions.h - [298]>.

Hide Details

[Clang (LLVM based)] [-ERROR-] Git blame errors: [Clang (LLVM based)] [-ERROR-] - no blame results for request <llvm-project/lldb/include/lldb/Breakpoint/Breakpoint.h - [208, 196, 376]>.

Hide Details

[Clang (LLVM based)] [-ERROR-] Git blame errors: [Clang (LLVM based)] [-ERROR-] - no blame results for request <llvm-project/lldb/include/lldb/Core/Highlighter.h - [102, 46, 47]>.

Hide Details

[Clang (LLVM based)] [-ERROR-] Git blame errors: [Clang (LLVM based)] [-ERROR-] - no blame results for request <llvm-project/lldb/include/lldb/Symbol/Block.h - [81, 85, 246, 235, 60, 63]>.

Hide Details

[Clang (LLVM based)] [-ERROR-] Git blame errors: [Clang (LLVM based)] [-ERROR-] - no blame results for request <llvm-project/llvm/include/llvm/Analysis/ScalarEvolution.h - [1702]>.

Hide Details

[Clang (LLVM based)] [-ERROR-] Git blame errors: [Clang (LLVM based)] [-ERROR-] - no blame results for request <llvm-project/lldb/include/lldb/Core/Module.h - [306, 476, 447]>.

Hide Details

[Clang (LLVM based)] [-ERROR-] Git blame errors: [Clang (LLVM based)] [-ERROR-] - no blame results for request <llvm-project/lldb/include/lldb/Target/Platform.h - [791, 266, 395]>.

Hide Details

[Clang (LLVM based)] [-ERROR-] Git blame errors: [Clang (LLVM based)] [-ERROR-] - no blame results for request <llvm-project/clang/lib/CodeGen/CGDecl.cpp - [1868, 1870]>.

Hide Details

[Clang (LLVM based)] [-ERROR-] Git blame errors: [Clang (LLVM based)] [-ERROR-] - no blame results for request <llvm-project/lldb/source/Plugins/ExpressionParser/Clang/ClangASTSource.h - [324, 327, 344, 92, 158]>.

Hide Details

[Clang (LLVM based)] [-ERROR-] Git blame errors: [Clang (LLVM based)] [-ERROR-] - no blame results for request <llvm-project/lldb/include/lldb/Breakpoint/BreakpointID.h - [68]>.

Hide Details

[Clang (LLVM based)] [-ERROR-] Git blame errors: [Clang (LLVM based)] [-ERROR-] - no blame results for request <llvm-project/lldb/include/lldb/Breakpoint/BreakpointResolver.h - [48, 75]>.

Hide Details

[Clang (LLVM based)] [-ERROR-] Git blame errors: [Clang (LLVM based)] [-ERROR-] - no blame results for request <llvm-project/lldb/include/lldb/Expression/DWARFExpression.h - [194, 187, 254]>.

Hide Details

[Clang (LLVM based)] [-ERROR-] Git blame errors: [Clang (LLVM based)] [-ERROR-] - no blame results for request <llvm-project/lldb/include/lldb/Utility/CompletionRequest.h - [133, 134, 157]>.

Hide Details

[Clang (LLVM based)] [-ERROR-] Git blame errors: [Clang (LLVM based)] [-ERROR-] - no blame results for request <llvm-project/lldb/include/lldb/Target/Queue.h - [131]>.

Hide Details

[Clang (LLVM based)] [-ERROR-] Git blame errors: [Clang (LLVM based)] [-ERROR-] - no blame results for request <lldb-build/Makefile.rules - [606]>.

Hide Details

[Clang (LLVM based)] [-ERROR-] Git blame errors: [Clang (LLVM based)] [-ERROR-] - no blame results for request <llvm-project/lldb/source/Plugins/ExpressionParser/Clang/ClangExpressionParser.h - [97, 101, 45]>.

Hide Details

[Clang (LLVM based)] [-ERROR-] Git blame errors: [Clang (LLVM based)] [-ERROR-] - no blame results for request <llvm-project/lldb/include/lldb/Interpreter/CommandObject.h - [229, 264, 238]>.

Hide Details

[Clang (LLVM based)] [-ERROR-] Git blame errors: [Clang (LLVM based)] [-ERROR-] - no blame results for request <llvm-project/lldb/source/Plugins/ExpressionParser/Clang/IRDynamicChecks.h - [80]>.

Hide Details

[Clang (LLVM based)] [-ERROR-] Git blame errors: [Clang (LLVM based)] [-ERROR-] - no blame results for request <llvm-project/lldb/source/Plugins/InstrumentationRuntime/UBSan/UBSanRuntime.cpp - [210]>.

Hide Details

[Clang (LLVM based)] [-ERROR-] Git blame errors: [Clang (LLVM based)] [-ERROR-] - no blame results for request <llvm-project/lldb/packages/Python/lldbsuite/test/commands/expression/persist_objc_pointeetype/main.m - [44]>.

Hide Details

[Clang (LLVM based)] [-ERROR-] Git blame errors: [Clang (LLVM based)] [-ERROR-] - no blame results for request <llvm-project/lldb/include/lldb/Breakpoint/WatchpointList.h - [183]>.

Hide Details

[Clang (LLVM based)] [-ERROR-] Git blame errors: [Clang (LLVM based)] [-ERROR-] - no blame results for request <llvm-project/lldb/include/lldb/Symbol/Function.h - [70, 185]>.

Hide Details

[Clang (LLVM based)] [-ERROR-] Git blame errors: [Clang (LLVM based)] [-ERROR-] - no blame results for request <llvm-project/lldb/source/Plugins/ExpressionParser/Clang/ClangExpressionParser.cpp - [686]>.

Hide Details

[Clang (LLVM based)] [-ERROR-] Git blame errors: [Clang (LLVM based)] [-ERROR-] - no blame results for request <llvm-project/lldb/include/lldb/Breakpoint/BreakpointLocationList.h - [171, 79]>.

Hide Details

[Clang (LLVM based)] [-ERROR-] Git blame errors: [Clang (LLVM based)] [-ERROR-] - no blame results for request <llvm-project/lldb/include/lldb/Target/Thread.h - [1153, 131, 133, 184, 809, 762, 814, 1006]>.

Hide Details

[Clang (LLVM based)] [-ERROR-] Git blame errors: [Clang (LLVM based)] [-ERROR-] - no blame results for request <llvm-project/lldb/source/Plugins/ExpressionParser/Clang/IRDynamicChecks.cpp - [182]>.

Hide Details

[Clang (LLVM based)] [-ERROR-] Git blame errors: [Clang (LLVM based)] [-ERROR-] - no blame results for request <llvm-project/llvm/lib/Transforms/Utils/FlattenCFG.cpp - [323, 100, 132, 117, 133, 134, 108, 124]>.

Hide Details

[Clang (LLVM based)] [-ERROR-] Git blame errors: [Clang (LLVM based)] [-ERROR-] - no blame results for request <llvm-project/lldb/include/lldb/Symbol/LineEntry.h - [104, 45, 78]>.

Hide Details

[Clang (LLVM based)] [-ERROR-] Git blame errors: [Clang (LLVM based)] [-ERROR-] - no blame results for request <llvm-project/lldb/source/Plugins/SymbolFile/DWARF/SymbolFileDWARFDebugMap.h - [347]>.

Hide Details

[Clang (LLVM based)] [-ERROR-] Git blame errors: [Clang (LLVM based)] [-ERROR-] - no blame results for request <llvm-project/lldb/packages/Python/lldbsuite/test/lang/objc/conflicting-definition/Makefile - [16]>.

Hide Details

[Clang (LLVM based)] [-ERROR-] Git blame errors: [Clang (LLVM based)] [-ERROR-] - no blame results for request <llvm-project/llvm/tools/llvm-reduce/deltas/ReduceArguments.cpp - [43]>.

Hide Details

[Clang (LLVM based)] [-ERROR-] Git blame errors: [Clang (LLVM based)] [-ERROR-] - no blame results for request <llvm-project/lldb/include/lldb/Interpreter/Options.h - [166, 185]>.

Hide Details

[Clang (LLVM based)] [-ERROR-] Git blame errors: [Clang (LLVM based)] [-ERROR-] - no blame results for request <llvm-project/lldb/packages/Python/lldbsuite/test/commands/frame/diagnose/bad-reference/main.cpp - [12]>.

Hide Details

[Clang (LLVM based)] [-ERROR-] Git blame errors: [Clang (LLVM based)] [-ERROR-] - no blame results for request <llvm-project/lldb/include/lldb/Target/Target.h - [909]>.

Hide Details

[Clang (LLVM based)] [-ERROR-] Git blame errors: [Clang (LLVM based)] [-ERROR-] - no blame results for request <llvm-project/lldb/include/lldb/Breakpoint/BreakpointSite.h - [103, 205, 110, 126]>.

Hide Details

[Clang (LLVM based)] [-ERROR-] Git blame errors: [Clang (LLVM based)] [-ERROR-] - no blame results for request <llvm-project/lldb/include/lldb/Expression/REPL.h - [35]>.

Hide Details

[Clang (LLVM based)] [-ERROR-] Git blame errors: [Clang (LLVM based)] [-ERROR-] - no blame results for request <llvm-project/lldb/include/lldb/Symbol/SymbolContext.h - [322, 54, 282, 302]>.

Hide Details

[Clang (LLVM based)] [-ERROR-] Git blame errors: [Clang (LLVM based)] [-ERROR-] - no blame results for request <llvm-project/lldb/include/lldb/Symbol/LineTable.h - [200, 138, 204]>.

Hide Details

[Clang (LLVM based)] [-ERROR-] Git blame errors: [Clang (LLVM based)] [-ERROR-] - no blame results for request <llvm-project/lldb/include/lldb/Expression/FunctionCaller.h - [226, 69, 72, 235, 238]>.

Hide Details

[Clang (LLVM based)] [-ERROR-] Git blame errors: [Clang (LLVM based)] [-ERROR-] - no blame results for request <llvm-project/lldb/include/lldb/Expression/UserExpression.h - [49, 169]>.

Hide Details

[Clang (LLVM based)] [-ERROR-] Git blame errors: [Clang (LLVM based)] [-ERROR-] - no blame results for request <llvm-project/lldb/include/lldb/Core/Mangled.h - [130]>.

Hide Details

[Clang (LLVM based)] [-ERROR-] Git blame errors: [Clang (LLVM based)] [-ERROR-] - no blame results for request <llvm-project/lldb/include/lldb/Breakpoint/BreakpointLocation.h - [96, 227]>.

Hide Details

[Clang (LLVM based)] [-ERROR-] Git blame errors: [Clang (LLVM based)] [-ERROR-] - no blame results for request <llvm-project/lldb/include/lldb/Core/Address.h - [82, 68, 436, 181, 86, 73, 124, 77]>.

Hide Details

[Clang (LLVM based)] [-ERROR-] Git blame errors: [Clang (LLVM based)] [-ERROR-] - no blame results for request <llvm-project/lldb/include/lldb/Expression/IRExecutionUnit.h - [180, 183, 329, 190, 207]>.

Hide Details

[Clang (LLVM based)] [-ERROR-] Git blame errors: [Clang (LLVM based)] [-ERROR-] - no blame results for request <llvm-project/lldb/include/lldb/Symbol/CompileUnit.h - [85, 47]>.

Hide Details

[Clang (LLVM based)] [-ERROR-] Git blame errors: [Clang (LLVM based)] [-ERROR-] - no blame results for request <llvm-project/clang/lib/Format/TokenAnnotator.cpp - [29]>.

Hide Details

[Clang (LLVM based)] [-ERROR-] Git blame errors: [Clang (LLVM based)] [-ERROR-] - no blame results for request <llvm-project/lldb/packages/Python/lldbsuite/test/macosx/indirect_symbol/Makefile - [19]>.

Hide Details

[Clang (LLVM based)] [-ERROR-] Git blame errors: [Clang (LLVM based)] [-ERROR-] - no blame results for request <llvm-project/lldb/include/lldb/Symbol/ObjectFile.h - [354, 358, 650, 155, 127]>.

Hide Details

[Clang (LLVM based)] [-ERROR-] Git blame errors: [Clang (LLVM based)] [-ERROR-] - no blame results for request <llvm-project/lldb/include/lldb/Core/ModuleList.h - [385, 325, 389, 376, 329, 393, 138, 317, 333]>.

Hide Details

[Clang (LLVM based)] [-ERROR-] Git blame errors: [Clang (LLVM based)] [-ERROR-] - no blame results for request <llvm-project/lldb/include/lldb/Interpreter/CommandInterpreter.h - [54]>.

Hide Details

[Clang (LLVM based)] [-ERROR-] Git blame errors: [Clang (LLVM based)] [-ERROR-] - no blame results for request <llvm-project/llvm/include/llvm/CodeGen/GlobalISel/CombinerHelper.h - [66, 70]>.

Hide Details

[Clang (LLVM based)] [-ERROR-] Git blame errors: [Clang (LLVM based)] [-ERROR-] - no blame results for request <llvm-project/lldb/include/lldb/Target/TargetList.h - [58, 63]>.

Hide Details

[Clang (LLVM based)] [-ERROR-] Git blame errors: [Clang (LLVM based)] [-ERROR-] - no blame results for request <llvm-project/lldb/include/lldb/Host/HostInfoBase.h - [44]>.

Hide Details

[Clang (LLVM based)] [-ERROR-] Git blame errors: [Clang (LLVM based)] [-ERROR-] - no blame results for request <llvm-project/lldb/source/Plugins/ExpressionParser/Clang/ClangExpressionVariable.h - [77]>.

Hide Details

[Clang (LLVM based)] [-ERROR-] Git blame errors: [Clang (LLVM based)] [-ERROR-] - no blame results for request <llvm-project/lldb/tools/lldb-vscode/LLDBUtils.h - [116]>.

Hide Details

[Clang (LLVM based)] [-ERROR-] Git blame errors: [Clang (LLVM based)] [-ERROR-] - no blame results for request <llvm-project/lldb/source/Plugins/ExpressionParser/Clang/ClangUserExpression.h - [95]>.

Hide Details

[Clang (LLVM based)] [-ERROR-] Git blame errors: [Clang (LLVM based)] [-ERROR-] - no blame results for request <llvm-project/lldb/source/Plugins/Process/gdb-remote/GDBRemoteCommunicationClient.h - [91, 157]>.

Hide Details

[Clang (LLVM based)] [-ERROR-] Git blame errors: [Clang (LLVM based)] [-ERROR-] - no blame results for request <llvm-project/lldb/source/Plugins/ExpressionParser/Clang/ClangFunctionCaller.h - [101, 104]>.

Hide Details

[Clang (LLVM based)] [-ERROR-] Git blame errors: [Clang (LLVM based)] [-ERROR-] - no blame results for request <llvm-project/lldb/include/lldb/Breakpoint/Watchpoint.h - [117]>.

Hide Details

[Clang (LLVM based)] Post processing issues on 'green-dragon-24' with source code encoding 'UTF-8' [Clang (LLVM based)] Resolving absolute file names for all issues in workspace '/Users/buildslave/jenkins/workspace/lldb-cmake' [Clang (LLVM based)] -> 9 resolved, 1 unresolved, 78 already resolved [Clang (LLVM based)] Copying affected files to Jenkins' build folder '/Users/Shared/Jenkins/Home/jobs/lldb-cmake/builds/1477/files-with-issues' [Clang (LLVM based)] -> 78 copied, 0 not in workspace, 1 not-found, 0 with I/O error [Clang (LLVM based)] Resolving module names from module definitions (build.xml, pom.xml, or Manifest.mf files) [Clang (LLVM based)] -> resolved module names for 260 issues [Clang (LLVM based)] Resolving package names (or namespaces) by parsing the affected files [Clang (LLVM based)] -> resolved package names of 79 affected files [Clang (LLVM based)] No filter has been set, publishing all 225 issues [Clang (LLVM based)] Creating fingerprints for all affected code blocks to track issues over different builds [Clang (LLVM based)] -> created fingerprints for 224 issues [Clang (LLVM based)] Invoking Git blamer to create author and commit information for all affected files [Clang (LLVM based)] GIT_COMMIT env = 'HEAD' [Clang (LLVM based)] Git working tree = '/Users/buildslave/jenkins/workspace/lldb-cmake' [Clang (LLVM based)] Git commit ID = '3f47ba41b6f8380e321c10cd908212eaaa9e1847' [Clang (LLVM based)] Job workspace = '/Users/buildslave/jenkins/workspace/lldb-cmake' [Clang (LLVM based)] Created blame requests for 79 files - invoking Git blame on agent for each of the requests [Clang (LLVM based)] -> blamed authors of issues in 79 files
[Pipeline] junit Recording test results [Pipeline] } [Pipeline] // stage [Pipeline] } [Pipeline] // withEnv [Pipeline] } [Pipeline] // node [Pipeline] End of Pipeline [BFA] Scanning build for known causes... > git rev-parse HEAD^{commit} # timeout=10 [BFA] Found failure cause(s): [BFA] Regression test failed from category Test [BFA] Compile Error from category Compile [BFA] Done. 103s Timeout has been exceeded Finished: ABORTED