FailedConsole Output

Skipping 927 KB.. Full Log
           None

Hide Details

Hide Details

PASS: LLDB (/Users/buildslave/jenkins/workspace/lldb-cmake/lldb-build/bin/clang-11-x86_64) :: test_qRegisterInfo_contains_required_generics_debugserver (TestLldbGdbServer.LldbGdbServerTestCase) runCmd: settings clear -all output:

Hide Details

runCmd: settings set symbols.enable-external-lookup false output:

Hide Details

runCmd: settings set target.auto-apply-fixits false output:

Hide Details

runCmd: settings set plugin.process.gdb-remote.packet-timeout 60 output:

Hide Details

runCmd: settings set symbols.clang-modules-cache-path "/Users/buildslave/jenkins/workspace/lldb-cmake/lldb-build/lldb-test-build.noindex/module-cache-lldb/lldb-api" output:

Hide Details

runCmd: settings set use-color false output:

Hide Details

runCmd: setting set target.prefer-dynamic-value no-dynamic-values output:

Hide Details

UNSUPPORTED: LLDB (/Users/buildslave/jenkins/workspace/lldb-cmake/lldb-build/bin/clang-11-x86_64) :: test_qRegisterInfo_contains_required_generics_llgs (TestLldbGdbServer.LldbGdbServerTestCase) (llgs tests) runCmd: settings clear -all output:

Hide Details

runCmd: settings set symbols.enable-external-lookup false output:

Hide Details

runCmd: settings set target.auto-apply-fixits false output:

Hide Details

runCmd: settings set plugin.process.gdb-remote.packet-timeout 60 output:

Hide Details

runCmd: settings set symbols.clang-modules-cache-path "/Users/buildslave/jenkins/workspace/lldb-cmake/lldb-build/lldb-test-build.noindex/module-cache-lldb/lldb-api" output:

Hide Details

runCmd: settings set use-color false output:

Hide Details

runCmd: setting set target.prefer-dynamic-value no-dynamic-values output:

Hide Details

Adding tearDown hook: def shutdown_named_pipe(): # Close the pipe. try: named_pipe.close() except: print("failed to close named pipe") None

Hide Details

# Delete the pipe. try: os.remove(named_pipe_path) except: print("failed to delete named pipe: {}".format(named_pipe_path)) None

Hide Details

# Delete the temp directory. try: os.rmdir(temp_dir) except: print( "failed to delete temp dir: {}, directory contents: '{}'".format( temp_dir, os.listdir(temp_dir))) None

Hide Details

Hide Details

Adding tearDown hook: def cleanupSubprocesses(self): # Ensure any subprocesses are cleaned up for p in self.subprocesses: p.terminate() del p del self.subprocesses[:] # Ensure any forked processes are cleaned up for pid in self.forkedProcessPids: try: os.kill(pid, signal.SIGTERM) except OSError: pass

Hide Details

Hide Details

Adding tearDown hook: def shutdown_debug_monitor(): try: server.terminate() except: logger.warning( "failed to terminate server for debug monitor: {}; ignoring".format( sys.exc_info()[0]))

Hide Details

Hide Details

Adding tearDown hook: def shutdown_socket(): if sock: try: # send the kill packet so lldb-server shuts down gracefully sock.sendall(GdbRemoteTestCaseBase._GDBREMOTE_KILL_PACKET) except: logger.warning( "failed to send kill packet to debug monitor: {}; ignoring".format( sys.exc_info()[0]))

Hide Details

try: sock.close() except: logger.warning( "failed to close socket to debug monitor: {}; ignoring".format( sys.exc_info()[0]))

Hide Details

Hide Details

Executing tearDown hook: def shutdown_socket(): if sock: try: # send the kill packet so lldb-server shuts down gracefully sock.sendall(GdbRemoteTestCaseBase._GDBREMOTE_KILL_PACKET) except: logger.warning( "failed to send kill packet to debug monitor: {}; ignoring".format( sys.exc_info()[0]))

Hide Details

try: sock.close() except: logger.warning( "failed to close socket to debug monitor: {}; ignoring".format( sys.exc_info()[0]))

Hide Details

Hide Details

2020-06-06 16:51:27,674 WARNING failed to send kill packet to debug monitor: <class 'TypeError'>; ignoring Executing tearDown hook: def shutdown_debug_monitor(): try: server.terminate() except: logger.warning( "failed to terminate server for debug monitor: {}; ignoring".format( sys.exc_info()[0]))

Hide Details

Hide Details

Executing tearDown hook: def cleanupSubprocesses(self): # Ensure any subprocesses are cleaned up for p in self.subprocesses: p.terminate() del p del self.subprocesses[:] # Ensure any forked processes are cleaned up for pid in self.forkedProcessPids: try: os.kill(pid, signal.SIGTERM) except OSError: pass

Hide Details

Hide Details

Executing tearDown hook: def shutdown_named_pipe(): # Close the pipe. try: named_pipe.close() except: print("failed to close named pipe") None

Hide Details

# Delete the pipe. try: os.remove(named_pipe_path) except: print("failed to delete named pipe: {}".format(named_pipe_path)) None

Hide Details

# Delete the temp directory. try: os.rmdir(temp_dir) except: print( "failed to delete temp dir: {}, directory contents: '{}'".format( temp_dir, os.listdir(temp_dir))) None

Hide Details

Hide Details

PASS: LLDB (/Users/buildslave/jenkins/workspace/lldb-cmake/lldb-build/bin/clang-11-x86_64) :: test_qRegisterInfo_returns_all_valid_results_debugserver (TestLldbGdbServer.LldbGdbServerTestCase) runCmd: settings clear -all output:

Hide Details

runCmd: settings set symbols.enable-external-lookup false output:

Hide Details

runCmd: settings set target.auto-apply-fixits false output:

Hide Details

runCmd: settings set plugin.process.gdb-remote.packet-timeout 60 output:

Hide Details

runCmd: settings set symbols.clang-modules-cache-path "/Users/buildslave/jenkins/workspace/lldb-cmake/lldb-build/lldb-test-build.noindex/module-cache-lldb/lldb-api" output:

Hide Details

runCmd: settings set use-color false output:

Hide Details

runCmd: setting set target.prefer-dynamic-value no-dynamic-values output:

Hide Details

UNSUPPORTED: LLDB (/Users/buildslave/jenkins/workspace/lldb-cmake/lldb-build/bin/clang-11-x86_64) :: test_qRegisterInfo_returns_all_valid_results_llgs (TestLldbGdbServer.LldbGdbServerTestCase) (llgs tests) runCmd: settings clear -all output:

Hide Details

runCmd: settings set symbols.enable-external-lookup false output:

Hide Details

runCmd: settings set target.auto-apply-fixits false output:

Hide Details

runCmd: settings set plugin.process.gdb-remote.packet-timeout 60 output:

Hide Details

runCmd: settings set symbols.clang-modules-cache-path "/Users/buildslave/jenkins/workspace/lldb-cmake/lldb-build/lldb-test-build.noindex/module-cache-lldb/lldb-api" output:

Hide Details

runCmd: settings set use-color false output:

Hide Details

runCmd: setting set target.prefer-dynamic-value no-dynamic-values output:

Hide Details

Adding tearDown hook: def shutdown_named_pipe(): # Close the pipe. try: named_pipe.close() except: print("failed to close named pipe") None

Hide Details

# Delete the pipe. try: os.remove(named_pipe_path) except: print("failed to delete named pipe: {}".format(named_pipe_path)) None

Hide Details

# Delete the temp directory. try: os.rmdir(temp_dir) except: print( "failed to delete temp dir: {}, directory contents: '{}'".format( temp_dir, os.listdir(temp_dir))) None

Hide Details

Hide Details

Adding tearDown hook: def cleanupSubprocesses(self): # Ensure any subprocesses are cleaned up for p in self.subprocesses: p.terminate() del p del self.subprocesses[:] # Ensure any forked processes are cleaned up for pid in self.forkedProcessPids: try: os.kill(pid, signal.SIGTERM) except OSError: pass

Hide Details

Hide Details

Adding tearDown hook: def shutdown_debug_monitor(): try: server.terminate() except: logger.warning( "failed to terminate server for debug monitor: {}; ignoring".format( sys.exc_info()[0]))

Hide Details

Hide Details

Adding tearDown hook: def shutdown_socket(): if sock: try: # send the kill packet so lldb-server shuts down gracefully sock.sendall(GdbRemoteTestCaseBase._GDBREMOTE_KILL_PACKET) except: logger.warning( "failed to send kill packet to debug monitor: {}; ignoring".format( sys.exc_info()[0]))

Hide Details

try: sock.close() except: logger.warning( "failed to close socket to debug monitor: {}; ignoring".format( sys.exc_info()[0]))

Hide Details

Hide Details

Executing tearDown hook: def shutdown_socket(): if sock: try: # send the kill packet so lldb-server shuts down gracefully sock.sendall(GdbRemoteTestCaseBase._GDBREMOTE_KILL_PACKET) except: logger.warning( "failed to send kill packet to debug monitor: {}; ignoring".format( sys.exc_info()[0]))

Hide Details

try: sock.close() except: logger.warning( "failed to close socket to debug monitor: {}; ignoring".format( sys.exc_info()[0]))

Hide Details

Hide Details

2020-06-06 16:51:30,501 WARNING failed to send kill packet to debug monitor: <class 'TypeError'>; ignoring Executing tearDown hook: def shutdown_debug_monitor(): try: server.terminate() except: logger.warning( "failed to terminate server for debug monitor: {}; ignoring".format( sys.exc_info()[0]))

Hide Details

Hide Details

Executing tearDown hook: def cleanupSubprocesses(self): # Ensure any subprocesses are cleaned up for p in self.subprocesses: p.terminate() del p del self.subprocesses[:] # Ensure any forked processes are cleaned up for pid in self.forkedProcessPids: try: os.kill(pid, signal.SIGTERM) except OSError: pass

Hide Details

Hide Details

Executing tearDown hook: def shutdown_named_pipe(): # Close the pipe. try: named_pipe.close() except: print("failed to close named pipe") None

Hide Details

# Delete the pipe. try: os.remove(named_pipe_path) except: print("failed to delete named pipe: {}".format(named_pipe_path)) None

Hide Details

# Delete the temp directory. try: os.rmdir(temp_dir) except: print( "failed to delete temp dir: {}, directory contents: '{}'".format( temp_dir, os.listdir(temp_dir))) None

Hide Details

Hide Details

PASS: LLDB (/Users/buildslave/jenkins/workspace/lldb-cmake/lldb-build/bin/clang-11-x86_64) :: test_qRegisterInfo_returns_one_valid_result_debugserver (TestLldbGdbServer.LldbGdbServerTestCase) runCmd: settings clear -all output:

Hide Details

runCmd: settings set symbols.enable-external-lookup false output:

Hide Details

runCmd: settings set target.auto-apply-fixits false output:

Hide Details

runCmd: settings set plugin.process.gdb-remote.packet-timeout 60 output:

Hide Details

runCmd: settings set symbols.clang-modules-cache-path "/Users/buildslave/jenkins/workspace/lldb-cmake/lldb-build/lldb-test-build.noindex/module-cache-lldb/lldb-api" output:

Hide Details

runCmd: settings set use-color false output:

Hide Details

runCmd: setting set target.prefer-dynamic-value no-dynamic-values output:

Hide Details

UNSUPPORTED: LLDB (/Users/buildslave/jenkins/workspace/lldb-cmake/lldb-build/bin/clang-11-x86_64) :: test_qRegisterInfo_returns_one_valid_result_llgs (TestLldbGdbServer.LldbGdbServerTestCase) (llgs tests) runCmd: settings clear -all output:

Hide Details

runCmd: settings set symbols.enable-external-lookup false output:

Hide Details

runCmd: settings set target.auto-apply-fixits false output:

Hide Details

runCmd: settings set plugin.process.gdb-remote.packet-timeout 60 output:

Hide Details

runCmd: settings set symbols.clang-modules-cache-path "/Users/buildslave/jenkins/workspace/lldb-cmake/lldb-build/lldb-test-build.noindex/module-cache-lldb/lldb-api" output:

Hide Details

runCmd: settings set use-color false output:

Hide Details

runCmd: setting set target.prefer-dynamic-value no-dynamic-values output:

Hide Details

Adding tearDown hook: def shutdown_named_pipe(): # Close the pipe. try: named_pipe.close() except: print("failed to close named pipe") None

Hide Details

# Delete the pipe. try: os.remove(named_pipe_path) except: print("failed to delete named pipe: {}".format(named_pipe_path)) None

Hide Details

# Delete the temp directory. try: os.rmdir(temp_dir) except: print( "failed to delete temp dir: {}, directory contents: '{}'".format( temp_dir, os.listdir(temp_dir))) None

Hide Details

Hide Details

Adding tearDown hook: def cleanupSubprocesses(self): # Ensure any subprocesses are cleaned up for p in self.subprocesses: p.terminate() del p del self.subprocesses[:] # Ensure any forked processes are cleaned up for pid in self.forkedProcessPids: try: os.kill(pid, signal.SIGTERM) except OSError: pass

Hide Details

Hide Details

Adding tearDown hook: def shutdown_debug_monitor(): try: server.terminate() except: logger.warning( "failed to terminate server for debug monitor: {}; ignoring".format( sys.exc_info()[0]))

Hide Details

Hide Details

Adding tearDown hook: def shutdown_socket(): if sock: try: # send the kill packet so lldb-server shuts down gracefully sock.sendall(GdbRemoteTestCaseBase._GDBREMOTE_KILL_PACKET) except: logger.warning( "failed to send kill packet to debug monitor: {}; ignoring".format( sys.exc_info()[0]))

Hide Details

try: sock.close() except: logger.warning( "failed to close socket to debug monitor: {}; ignoring".format( sys.exc_info()[0]))

Hide Details

Hide Details

Executing tearDown hook: def shutdown_socket(): if sock: try: # send the kill packet so lldb-server shuts down gracefully sock.sendall(GdbRemoteTestCaseBase._GDBREMOTE_KILL_PACKET) except: logger.warning( "failed to send kill packet to debug monitor: {}; ignoring".format( sys.exc_info()[0]))

Hide Details

try: sock.close() except: logger.warning( "failed to close socket to debug monitor: {}; ignoring".format( sys.exc_info()[0]))

Hide Details

Hide Details

2020-06-06 16:51:33,149 WARNING failed to send kill packet to debug monitor: <class 'TypeError'>; ignoring Executing tearDown hook: def shutdown_debug_monitor(): try: server.terminate() except: logger.warning( "failed to terminate server for debug monitor: {}; ignoring".format( sys.exc_info()[0]))

Hide Details

Hide Details

Executing tearDown hook: def cleanupSubprocesses(self): # Ensure any subprocesses are cleaned up for p in self.subprocesses: p.terminate() del p del self.subprocesses[:] # Ensure any forked processes are cleaned up for pid in self.forkedProcessPids: try: os.kill(pid, signal.SIGTERM) except OSError: pass

Hide Details

Hide Details

Executing tearDown hook: def shutdown_named_pipe(): # Close the pipe. try: named_pipe.close() except: print("failed to close named pipe") None

Hide Details

# Delete the pipe. try: os.remove(named_pipe_path) except: print("failed to delete named pipe: {}".format(named_pipe_path)) None

Hide Details

# Delete the temp directory. try: os.rmdir(temp_dir) except: print( "failed to delete temp dir: {}, directory contents: '{}'".format( temp_dir, os.listdir(temp_dir))) None

Hide Details

Hide Details

PASS: LLDB (/Users/buildslave/jenkins/workspace/lldb-cmake/lldb-build/bin/clang-11-x86_64) :: test_qSupported_returns_known_stub_features_debugserver (TestLldbGdbServer.LldbGdbServerTestCase) runCmd: settings clear -all output:

Hide Details

runCmd: settings set symbols.enable-external-lookup false output:

Hide Details

runCmd: settings set target.auto-apply-fixits false output:

Hide Details

runCmd: settings set plugin.process.gdb-remote.packet-timeout 60 output:

Hide Details

runCmd: settings set symbols.clang-modules-cache-path "/Users/buildslave/jenkins/workspace/lldb-cmake/lldb-build/lldb-test-build.noindex/module-cache-lldb/lldb-api" output:

Hide Details

runCmd: settings set use-color false output:

Hide Details

runCmd: setting set target.prefer-dynamic-value no-dynamic-values output:

Hide Details

UNSUPPORTED: LLDB (/Users/buildslave/jenkins/workspace/lldb-cmake/lldb-build/bin/clang-11-x86_64) :: test_qSupported_returns_known_stub_features_llgs (TestLldbGdbServer.LldbGdbServerTestCase) (llgs tests) runCmd: settings clear -all output:

Hide Details

runCmd: settings set symbols.enable-external-lookup false output:

Hide Details

runCmd: settings set target.auto-apply-fixits false output:

Hide Details

runCmd: settings set plugin.process.gdb-remote.packet-timeout 60 output:

Hide Details

runCmd: settings set symbols.clang-modules-cache-path "/Users/buildslave/jenkins/workspace/lldb-cmake/lldb-build/lldb-test-build.noindex/module-cache-lldb/lldb-api" output:

Hide Details

runCmd: settings set use-color false output:

Hide Details

runCmd: setting set target.prefer-dynamic-value no-dynamic-values output:

Hide Details

Adding tearDown hook: def shutdown_named_pipe(): # Close the pipe. try: named_pipe.close() except: print("failed to close named pipe") None

Hide Details

# Delete the pipe. try: os.remove(named_pipe_path) except: print("failed to delete named pipe: {}".format(named_pipe_path)) None

Hide Details

# Delete the temp directory. try: os.rmdir(temp_dir) except: print( "failed to delete temp dir: {}, directory contents: '{}'".format( temp_dir, os.listdir(temp_dir))) None

Hide Details

Hide Details

Adding tearDown hook: def shutdown_process_for_attach(): try: inferior.terminate() except: logger.warning( "failed to terminate inferior process for attach: {}; ignoring".format( sys.exc_info()[0]))

Hide Details

Hide Details

Adding tearDown hook: def cleanupSubprocesses(self): # Ensure any subprocesses are cleaned up for p in self.subprocesses: p.terminate() del p del self.subprocesses[:] # Ensure any forked processes are cleaned up for pid in self.forkedProcessPids: try: os.kill(pid, signal.SIGTERM) except OSError: pass

Hide Details

Hide Details

Adding tearDown hook: def shutdown_debug_monitor(): try: server.terminate() except: logger.warning( "failed to terminate server for debug monitor: {}; ignoring".format( sys.exc_info()[0]))

Hide Details

Hide Details

Adding tearDown hook: def shutdown_socket(): if sock: try: # send the kill packet so lldb-server shuts down gracefully sock.sendall(GdbRemoteTestCaseBase._GDBREMOTE_KILL_PACKET) except: logger.warning( "failed to send kill packet to debug monitor: {}; ignoring".format( sys.exc_info()[0]))

Hide Details

try: sock.close() except: logger.warning( "failed to close socket to debug monitor: {}; ignoring".format( sys.exc_info()[0]))

Hide Details

Hide Details

Executing tearDown hook: def shutdown_socket(): if sock: try: # send the kill packet so lldb-server shuts down gracefully sock.sendall(GdbRemoteTestCaseBase._GDBREMOTE_KILL_PACKET) except: logger.warning( "failed to send kill packet to debug monitor: {}; ignoring".format( sys.exc_info()[0]))

Hide Details

try: sock.close() except: logger.warning( "failed to close socket to debug monitor: {}; ignoring".format( sys.exc_info()[0]))

Hide Details

Hide Details

2020-06-06 16:51:35,990 WARNING failed to send kill packet to debug monitor: <class 'TypeError'>; ignoring Executing tearDown hook: def shutdown_debug_monitor(): try: server.terminate() except: logger.warning( "failed to terminate server for debug monitor: {}; ignoring".format( sys.exc_info()[0]))

Hide Details

Hide Details

Executing tearDown hook: def cleanupSubprocesses(self): # Ensure any subprocesses are cleaned up for p in self.subprocesses: p.terminate() del p del self.subprocesses[:] # Ensure any forked processes are cleaned up for pid in self.forkedProcessPids: try: os.kill(pid, signal.SIGTERM) except OSError: pass

Hide Details

Hide Details

Executing tearDown hook: def shutdown_process_for_attach(): try: inferior.terminate() except: logger.warning( "failed to terminate inferior process for attach: {}; ignoring".format( sys.exc_info()[0]))

Hide Details

Hide Details

Executing tearDown hook: def shutdown_named_pipe(): # Close the pipe. try: named_pipe.close() except: print("failed to close named pipe") None

Hide Details

# Delete the pipe. try: os.remove(named_pipe_path) except: print("failed to delete named pipe: {}".format(named_pipe_path)) None

Hide Details

# Delete the temp directory. try: os.rmdir(temp_dir) except: print( "failed to delete temp dir: {}, directory contents: '{}'".format( temp_dir, os.listdir(temp_dir))) None

Hide Details

Hide Details

PASS: LLDB (/Users/buildslave/jenkins/workspace/lldb-cmake/lldb-build/bin/clang-11-x86_64) :: test_qThreadInfo_contains_thread_attach_debugserver (TestLldbGdbServer.LldbGdbServerTestCase) runCmd: settings clear -all output:

Hide Details

runCmd: settings set symbols.enable-external-lookup false output:

Hide Details

runCmd: settings set target.auto-apply-fixits false output:

Hide Details

runCmd: settings set plugin.process.gdb-remote.packet-timeout 60 output:

Hide Details

runCmd: settings set symbols.clang-modules-cache-path "/Users/buildslave/jenkins/workspace/lldb-cmake/lldb-build/lldb-test-build.noindex/module-cache-lldb/lldb-api" output:

Hide Details

runCmd: settings set use-color false output:

Hide Details

runCmd: setting set target.prefer-dynamic-value no-dynamic-values output:

Hide Details

UNSUPPORTED: LLDB (/Users/buildslave/jenkins/workspace/lldb-cmake/lldb-build/bin/clang-11-x86_64) :: test_qThreadInfo_contains_thread_attach_llgs (TestLldbGdbServer.LldbGdbServerTestCase) (llgs tests) runCmd: settings clear -all output:

Hide Details

runCmd: settings set symbols.enable-external-lookup false output:

Hide Details

runCmd: settings set target.auto-apply-fixits false output:

Hide Details

runCmd: settings set plugin.process.gdb-remote.packet-timeout 60 output:

Hide Details

runCmd: settings set symbols.clang-modules-cache-path "/Users/buildslave/jenkins/workspace/lldb-cmake/lldb-build/lldb-test-build.noindex/module-cache-lldb/lldb-api" output:

Hide Details

runCmd: settings set use-color false output:

Hide Details

runCmd: setting set target.prefer-dynamic-value no-dynamic-values output:

Hide Details

Adding tearDown hook: def shutdown_named_pipe(): # Close the pipe. try: named_pipe.close() except: print("failed to close named pipe") None

Hide Details

# Delete the pipe. try: os.remove(named_pipe_path) except: print("failed to delete named pipe: {}".format(named_pipe_path)) None

Hide Details

# Delete the temp directory. try: os.rmdir(temp_dir) except: print( "failed to delete temp dir: {}, directory contents: '{}'".format( temp_dir, os.listdir(temp_dir))) None

Hide Details

Hide Details

Adding tearDown hook: def cleanupSubprocesses(self): # Ensure any subprocesses are cleaned up for p in self.subprocesses: p.terminate() del p del self.subprocesses[:] # Ensure any forked processes are cleaned up for pid in self.forkedProcessPids: try: os.kill(pid, signal.SIGTERM) except OSError: pass

Hide Details

Hide Details

Adding tearDown hook: def shutdown_debug_monitor(): try: server.terminate() except: logger.warning( "failed to terminate server for debug monitor: {}; ignoring".format( sys.exc_info()[0]))

Hide Details

Hide Details

Adding tearDown hook: def shutdown_socket(): if sock: try: # send the kill packet so lldb-server shuts down gracefully sock.sendall(GdbRemoteTestCaseBase._GDBREMOTE_KILL_PACKET) except: logger.warning( "failed to send kill packet to debug monitor: {}; ignoring".format( sys.exc_info()[0]))

Hide Details

try: sock.close() except: logger.warning( "failed to close socket to debug monitor: {}; ignoring".format( sys.exc_info()[0]))

Hide Details

Hide Details

Executing tearDown hook: def shutdown_socket(): if sock: try: # send the kill packet so lldb-server shuts down gracefully sock.sendall(GdbRemoteTestCaseBase._GDBREMOTE_KILL_PACKET) except: logger.warning( "failed to send kill packet to debug monitor: {}; ignoring".format( sys.exc_info()[0]))

Hide Details

try: sock.close() except: logger.warning( "failed to close socket to debug monitor: {}; ignoring".format( sys.exc_info()[0]))

Hide Details

Hide Details

2020-06-06 16:51:38,837 WARNING failed to send kill packet to debug monitor: <class 'TypeError'>; ignoring Executing tearDown hook: def shutdown_debug_monitor(): try: server.terminate() except: logger.warning( "failed to terminate server for debug monitor: {}; ignoring".format( sys.exc_info()[0]))

Hide Details

Hide Details

Executing tearDown hook: def cleanupSubprocesses(self): # Ensure any subprocesses are cleaned up for p in self.subprocesses: p.terminate() del p del self.subprocesses[:] # Ensure any forked processes are cleaned up for pid in self.forkedProcessPids: try: os.kill(pid, signal.SIGTERM) except OSError: pass

Hide Details

Hide Details

Executing tearDown hook: def shutdown_named_pipe(): # Close the pipe. try: named_pipe.close() except: print("failed to close named pipe") None

Hide Details

# Delete the pipe. try: os.remove(named_pipe_path) except: print("failed to delete named pipe: {}".format(named_pipe_path)) None

Hide Details

# Delete the temp directory. try: os.rmdir(temp_dir) except: print( "failed to delete temp dir: {}, directory contents: '{}'".format( temp_dir, os.listdir(temp_dir))) None

Hide Details

Hide Details

PASS: LLDB (/Users/buildslave/jenkins/workspace/lldb-cmake/lldb-build/bin/clang-11-x86_64) :: test_qThreadInfo_contains_thread_launch_debugserver (TestLldbGdbServer.LldbGdbServerTestCase) runCmd: settings clear -all output:

Hide Details

runCmd: settings set symbols.enable-external-lookup false output:

Hide Details

runCmd: settings set target.auto-apply-fixits false output:

Hide Details

runCmd: settings set plugin.process.gdb-remote.packet-timeout 60 output:

Hide Details

runCmd: settings set symbols.clang-modules-cache-path "/Users/buildslave/jenkins/workspace/lldb-cmake/lldb-build/lldb-test-build.noindex/module-cache-lldb/lldb-api" output:

Hide Details

runCmd: settings set use-color false output:

Hide Details

runCmd: setting set target.prefer-dynamic-value no-dynamic-values output:

Hide Details

UNSUPPORTED: LLDB (/Users/buildslave/jenkins/workspace/lldb-cmake/lldb-build/bin/clang-11-x86_64) :: test_qThreadInfo_contains_thread_launch_llgs (TestLldbGdbServer.LldbGdbServerTestCase) (llgs tests) runCmd: settings clear -all output:

Hide Details

runCmd: settings set symbols.enable-external-lookup false output:

Hide Details

runCmd: settings set target.auto-apply-fixits false output:

Hide Details

runCmd: settings set plugin.process.gdb-remote.packet-timeout 60 output:

Hide Details

runCmd: settings set symbols.clang-modules-cache-path "/Users/buildslave/jenkins/workspace/lldb-cmake/lldb-build/lldb-test-build.noindex/module-cache-lldb/lldb-api" output:

Hide Details

runCmd: settings set use-color false output:

Hide Details

runCmd: setting set target.prefer-dynamic-value no-dynamic-values output:

Hide Details

Adding tearDown hook: def shutdown_named_pipe(): # Close the pipe. try: named_pipe.close() except: print("failed to close named pipe") None

Hide Details

# Delete the pipe. try: os.remove(named_pipe_path) except: print("failed to delete named pipe: {}".format(named_pipe_path)) None

Hide Details

# Delete the temp directory. try: os.rmdir(temp_dir) except: print( "failed to delete temp dir: {}, directory contents: '{}'".format( temp_dir, os.listdir(temp_dir))) None

Hide Details

Hide Details

Adding tearDown hook: def shutdown_process_for_attach(): try: inferior.terminate() except: logger.warning( "failed to terminate inferior process for attach: {}; ignoring".format( sys.exc_info()[0]))

Hide Details

Hide Details

Adding tearDown hook: def cleanupSubprocesses(self): # Ensure any subprocesses are cleaned up for p in self.subprocesses: p.terminate() del p del self.subprocesses[:] # Ensure any forked processes are cleaned up for pid in self.forkedProcessPids: try: os.kill(pid, signal.SIGTERM) except OSError: pass

Hide Details

Hide Details

Adding tearDown hook: def shutdown_debug_monitor(): try: server.terminate() except: logger.warning( "failed to terminate server for debug monitor: {}; ignoring".format( sys.exc_info()[0]))

Hide Details

Hide Details

Adding tearDown hook: def shutdown_socket(): if sock: try: # send the kill packet so lldb-server shuts down gracefully sock.sendall(GdbRemoteTestCaseBase._GDBREMOTE_KILL_PACKET) except: logger.warning( "failed to send kill packet to debug monitor: {}; ignoring".format( sys.exc_info()[0]))

Hide Details

try: sock.close() except: logger.warning( "failed to close socket to debug monitor: {}; ignoring".format( sys.exc_info()[0]))

Hide Details

Hide Details

Executing tearDown hook: def shutdown_socket(): if sock: try: # send the kill packet so lldb-server shuts down gracefully sock.sendall(GdbRemoteTestCaseBase._GDBREMOTE_KILL_PACKET) except: logger.warning( "failed to send kill packet to debug monitor: {}; ignoring".format( sys.exc_info()[0]))

Hide Details

try: sock.close() except: logger.warning( "failed to close socket to debug monitor: {}; ignoring".format( sys.exc_info()[0]))

Hide Details

Hide Details

2020-06-06 16:51:41,788 WARNING failed to send kill packet to debug monitor: <class 'TypeError'>; ignoring Executing tearDown hook: def shutdown_debug_monitor(): try: server.terminate() except: logger.warning( "failed to terminate server for debug monitor: {}; ignoring".format( sys.exc_info()[0]))

Hide Details

Hide Details

Executing tearDown hook: def cleanupSubprocesses(self): # Ensure any subprocesses are cleaned up for p in self.subprocesses: p.terminate() del p del self.subprocesses[:] # Ensure any forked processes are cleaned up for pid in self.forkedProcessPids: try: os.kill(pid, signal.SIGTERM) except OSError: pass

Hide Details

Hide Details

Executing tearDown hook: def shutdown_process_for_attach(): try: inferior.terminate() except: logger.warning( "failed to terminate inferior process for attach: {}; ignoring".format( sys.exc_info()[0]))

Hide Details

Hide Details

Executing tearDown hook: def shutdown_named_pipe(): # Close the pipe. try: named_pipe.close() except: print("failed to close named pipe") None

Hide Details

# Delete the pipe. try: os.remove(named_pipe_path) except: print("failed to delete named pipe: {}".format(named_pipe_path)) None

Hide Details

# Delete the temp directory. try: os.rmdir(temp_dir) except: print( "failed to delete temp dir: {}, directory contents: '{}'".format( temp_dir, os.listdir(temp_dir))) None

Hide Details

Hide Details

PASS: LLDB (/Users/buildslave/jenkins/workspace/lldb-cmake/lldb-build/bin/clang-11-x86_64) :: test_qThreadInfo_matches_qC_attach_debugserver (TestLldbGdbServer.LldbGdbServerTestCase) runCmd: settings clear -all output:

Hide Details

runCmd: settings set symbols.enable-external-lookup false output:

Hide Details

runCmd: settings set target.auto-apply-fixits false output:

Hide Details

runCmd: settings set plugin.process.gdb-remote.packet-timeout 60 output:

Hide Details

runCmd: settings set symbols.clang-modules-cache-path "/Users/buildslave/jenkins/workspace/lldb-cmake/lldb-build/lldb-test-build.noindex/module-cache-lldb/lldb-api" output:

Hide Details

runCmd: settings set use-color false output:

Hide Details

runCmd: setting set target.prefer-dynamic-value no-dynamic-values output:

Hide Details

UNSUPPORTED: LLDB (/Users/buildslave/jenkins/workspace/lldb-cmake/lldb-build/bin/clang-11-x86_64) :: test_qThreadInfo_matches_qC_attach_llgs (TestLldbGdbServer.LldbGdbServerTestCase) (llgs tests) runCmd: settings clear -all output:

Hide Details

runCmd: settings set symbols.enable-external-lookup false output:

Hide Details

runCmd: settings set target.auto-apply-fixits false output:

Hide Details

runCmd: settings set plugin.process.gdb-remote.packet-timeout 60 output:

Hide Details

runCmd: settings set symbols.clang-modules-cache-path "/Users/buildslave/jenkins/workspace/lldb-cmake/lldb-build/lldb-test-build.noindex/module-cache-lldb/lldb-api" output:

Hide Details

runCmd: settings set use-color false output:

Hide Details

runCmd: setting set target.prefer-dynamic-value no-dynamic-values output:

Hide Details

Adding tearDown hook: def shutdown_named_pipe(): # Close the pipe. try: named_pipe.close() except: print("failed to close named pipe") None

Hide Details

# Delete the pipe. try: os.remove(named_pipe_path) except: print("failed to delete named pipe: {}".format(named_pipe_path)) None

Hide Details

# Delete the temp directory. try: os.rmdir(temp_dir) except: print( "failed to delete temp dir: {}, directory contents: '{}'".format( temp_dir, os.listdir(temp_dir))) None

Hide Details

Hide Details

Adding tearDown hook: def cleanupSubprocesses(self): # Ensure any subprocesses are cleaned up for p in self.subprocesses: p.terminate() del p del self.subprocesses[:] # Ensure any forked processes are cleaned up for pid in self.forkedProcessPids: try: os.kill(pid, signal.SIGTERM) except OSError: pass

Hide Details

Hide Details

Adding tearDown hook: def shutdown_debug_monitor(): try: server.terminate() except: logger.warning( "failed to terminate server for debug monitor: {}; ignoring".format( sys.exc_info()[0]))

Hide Details

Hide Details

Adding tearDown hook: def shutdown_socket(): if sock: try: # send the kill packet so lldb-server shuts down gracefully sock.sendall(GdbRemoteTestCaseBase._GDBREMOTE_KILL_PACKET) except: logger.warning( "failed to send kill packet to debug monitor: {}; ignoring".format( sys.exc_info()[0]))

Hide Details

try: sock.close() except: logger.warning( "failed to close socket to debug monitor: {}; ignoring".format( sys.exc_info()[0]))

Hide Details

Hide Details

Executing tearDown hook: def shutdown_socket(): if sock: try: # send the kill packet so lldb-server shuts down gracefully sock.sendall(GdbRemoteTestCaseBase._GDBREMOTE_KILL_PACKET) except: logger.warning( "failed to send kill packet to debug monitor: {}; ignoring".format( sys.exc_info()[0]))

Hide Details

try: sock.close() except: logger.warning( "failed to close socket to debug monitor: {}; ignoring".format( sys.exc_info()[0]))

Hide Details

Hide Details

2020-06-06 16:51:44,654 WARNING failed to send kill packet to debug monitor: <class 'TypeError'>; ignoring Executing tearDown hook: def shutdown_debug_monitor(): try: server.terminate() except: logger.warning( "failed to terminate server for debug monitor: {}; ignoring".format( sys.exc_info()[0]))

Hide Details

Hide Details

Executing tearDown hook: def cleanupSubprocesses(self): # Ensure any subprocesses are cleaned up for p in self.subprocesses: p.terminate() del p del self.subprocesses[:] # Ensure any forked processes are cleaned up for pid in self.forkedProcessPids: try: os.kill(pid, signal.SIGTERM) except OSError: pass

Hide Details

Hide Details

Executing tearDown hook: def shutdown_named_pipe(): # Close the pipe. try: named_pipe.close() except: print("failed to close named pipe") None

Hide Details

# Delete the pipe. try: os.remove(named_pipe_path) except: print("failed to delete named pipe: {}".format(named_pipe_path)) None

Hide Details

# Delete the temp directory. try: os.rmdir(temp_dir) except: print( "failed to delete temp dir: {}, directory contents: '{}'".format( temp_dir, os.listdir(temp_dir))) None

Hide Details

Hide Details

PASS: LLDB (/Users/buildslave/jenkins/workspace/lldb-cmake/lldb-build/bin/clang-11-x86_64) :: test_qThreadInfo_matches_qC_launch_debugserver (TestLldbGdbServer.LldbGdbServerTestCase) runCmd: settings clear -all output:

Hide Details

runCmd: settings set symbols.enable-external-lookup false output:

Hide Details

runCmd: settings set target.auto-apply-fixits false output:

Hide Details

runCmd: settings set plugin.process.gdb-remote.packet-timeout 60 output:

Hide Details

runCmd: settings set symbols.clang-modules-cache-path "/Users/buildslave/jenkins/workspace/lldb-cmake/lldb-build/lldb-test-build.noindex/module-cache-lldb/lldb-api" output:

Hide Details

runCmd: settings set use-color false output:

Hide Details

runCmd: setting set target.prefer-dynamic-value no-dynamic-values output:

Hide Details

UNSUPPORTED: LLDB (/Users/buildslave/jenkins/workspace/lldb-cmake/lldb-build/bin/clang-11-x86_64) :: test_qThreadInfo_matches_qC_launch_llgs (TestLldbGdbServer.LldbGdbServerTestCase) (llgs tests) runCmd: settings clear -all output:

Hide Details

runCmd: settings set symbols.enable-external-lookup false output:

Hide Details

runCmd: settings set target.auto-apply-fixits false output:

Hide Details

runCmd: settings set plugin.process.gdb-remote.packet-timeout 60 output:

Hide Details

runCmd: settings set symbols.clang-modules-cache-path "/Users/buildslave/jenkins/workspace/lldb-cmake/lldb-build/lldb-test-build.noindex/module-cache-lldb/lldb-api" output:

Hide Details

runCmd: settings set use-color false output:

Hide Details

runCmd: setting set target.prefer-dynamic-value no-dynamic-values output:

Hide Details

Adding tearDown hook: def shutdown_named_pipe(): # Close the pipe. try: named_pipe.close() except: print("failed to close named pipe") None

Hide Details

# Delete the pipe. try: os.remove(named_pipe_path) except: print("failed to delete named pipe: {}".format(named_pipe_path)) None

Hide Details

# Delete the temp directory. try: os.rmdir(temp_dir) except: print( "failed to delete temp dir: {}, directory contents: '{}'".format( temp_dir, os.listdir(temp_dir))) None

Hide Details

Hide Details

Adding tearDown hook: def cleanupSubprocesses(self): # Ensure any subprocesses are cleaned up for p in self.subprocesses: p.terminate() del p del self.subprocesses[:] # Ensure any forked processes are cleaned up for pid in self.forkedProcessPids: try: os.kill(pid, signal.SIGTERM) except OSError: pass

Hide Details

Hide Details

Adding tearDown hook: def shutdown_debug_monitor(): try: server.terminate() except: logger.warning( "failed to terminate server for debug monitor: {}; ignoring".format( sys.exc_info()[0]))

Hide Details

Hide Details

Adding tearDown hook: def shutdown_socket(): if sock: try: # send the kill packet so lldb-server shuts down gracefully sock.sendall(GdbRemoteTestCaseBase._GDBREMOTE_KILL_PACKET) except: logger.warning( "failed to send kill packet to debug monitor: {}; ignoring".format( sys.exc_info()[0]))

Hide Details

try: sock.close() except: logger.warning( "failed to close socket to debug monitor: {}; ignoring".format( sys.exc_info()[0]))

Hide Details

Hide Details

Executing tearDown hook: def shutdown_socket(): if sock: try: # send the kill packet so lldb-server shuts down gracefully sock.sendall(GdbRemoteTestCaseBase._GDBREMOTE_KILL_PACKET) except: logger.warning( "failed to send kill packet to debug monitor: {}; ignoring".format( sys.exc_info()[0]))

Hide Details

try: sock.close() except: logger.warning( "failed to close socket to debug monitor: {}; ignoring".format( sys.exc_info()[0]))

Hide Details

Hide Details

2020-06-06 16:51:48,535 WARNING failed to send kill packet to debug monitor: <class 'TypeError'>; ignoring Executing tearDown hook: def shutdown_debug_monitor(): try: server.terminate() except: logger.warning( "failed to terminate server for debug monitor: {}; ignoring".format( sys.exc_info()[0]))

Hide Details

Hide Details

Executing tearDown hook: def cleanupSubprocesses(self): # Ensure any subprocesses are cleaned up for p in self.subprocesses: p.terminate() del p del self.subprocesses[:] # Ensure any forked processes are cleaned up for pid in self.forkedProcessPids: try: os.kill(pid, signal.SIGTERM) except OSError: pass

Hide Details

Hide Details

Executing tearDown hook: def shutdown_named_pipe(): # Close the pipe. try: named_pipe.close() except: print("failed to close named pipe") None

Hide Details

# Delete the pipe. try: os.remove(named_pipe_path) except: print("failed to delete named pipe: {}".format(named_pipe_path)) None

Hide Details

# Delete the temp directory. try: os.rmdir(temp_dir) except: print( "failed to delete temp dir: {}, directory contents: '{}'".format( temp_dir, os.listdir(temp_dir))) None

Hide Details

Hide Details

PASS: LLDB (/Users/buildslave/jenkins/workspace/lldb-cmake/lldb-build/bin/clang-11-x86_64) :: test_software_breakpoint_set_and_remove_work_debugserver (TestLldbGdbServer.LldbGdbServerTestCase) runCmd: settings clear -all output:

Hide Details

runCmd: settings set symbols.enable-external-lookup false output:

Hide Details

runCmd: settings set target.auto-apply-fixits false output:

Hide Details

runCmd: settings set plugin.process.gdb-remote.packet-timeout 60 output:

Hide Details

runCmd: settings set symbols.clang-modules-cache-path "/Users/buildslave/jenkins/workspace/lldb-cmake/lldb-build/lldb-test-build.noindex/module-cache-lldb/lldb-api" output:

Hide Details

runCmd: settings set use-color false output:

Hide Details

runCmd: setting set target.prefer-dynamic-value no-dynamic-values output:

Hide Details

UNSUPPORTED: LLDB (/Users/buildslave/jenkins/workspace/lldb-cmake/lldb-build/bin/clang-11-x86_64) :: test_software_breakpoint_set_and_remove_work_llgs (TestLldbGdbServer.LldbGdbServerTestCase) (llgs tests) runCmd: settings clear -all output:

Hide Details

runCmd: settings set symbols.enable-external-lookup false output:

Hide Details

runCmd: settings set target.auto-apply-fixits false output:

Hide Details

runCmd: settings set plugin.process.gdb-remote.packet-timeout 60 output:

Hide Details

runCmd: settings set symbols.clang-modules-cache-path "/Users/buildslave/jenkins/workspace/lldb-cmake/lldb-build/lldb-test-build.noindex/module-cache-lldb/lldb-api" output:

Hide Details

runCmd: settings set use-color false output:

Hide Details

runCmd: setting set target.prefer-dynamic-value no-dynamic-values output:

Hide Details

Adding tearDown hook: def shutdown_named_pipe(): # Close the pipe. try: named_pipe.close() except: print("failed to close named pipe") None

Hide Details

# Delete the pipe. try: os.remove(named_pipe_path) except: print("failed to delete named pipe: {}".format(named_pipe_path)) None

Hide Details

# Delete the temp directory. try: os.rmdir(temp_dir) except: print( "failed to delete temp dir: {}, directory contents: '{}'".format( temp_dir, os.listdir(temp_dir))) None

Hide Details

Hide Details

Adding tearDown hook: def cleanupSubprocesses(self): # Ensure any subprocesses are cleaned up for p in self.subprocesses: p.terminate() del p del self.subprocesses[:] # Ensure any forked processes are cleaned up for pid in self.forkedProcessPids: try: os.kill(pid, signal.SIGTERM) except OSError: pass

Hide Details

Hide Details

Adding tearDown hook: def shutdown_debug_monitor(): try: server.terminate() except: logger.warning( "failed to terminate server for debug monitor: {}; ignoring".format( sys.exc_info()[0]))

Hide Details

Hide Details

Adding tearDown hook: def shutdown_socket(): if sock: try: # send the kill packet so lldb-server shuts down gracefully sock.sendall(GdbRemoteTestCaseBase._GDBREMOTE_KILL_PACKET) except: logger.warning( "failed to send kill packet to debug monitor: {}; ignoring".format( sys.exc_info()[0]))

Hide Details

try: sock.close() except: logger.warning( "failed to close socket to debug monitor: {}; ignoring".format( sys.exc_info()[0]))

Hide Details

Hide Details

Executing tearDown hook: def shutdown_socket(): if sock: try: # send the kill packet so lldb-server shuts down gracefully sock.sendall(GdbRemoteTestCaseBase._GDBREMOTE_KILL_PACKET) except: logger.warning( "failed to send kill packet to debug monitor: {}; ignoring".format( sys.exc_info()[0]))

Hide Details

try: sock.close() except: logger.warning( "failed to close socket to debug monitor: {}; ignoring".format( sys.exc_info()[0]))

Hide Details

Hide Details

2020-06-06 16:51:48,622 WARNING failed to send kill packet to debug monitor: <class 'TypeError'>; ignoring Executing tearDown hook: def shutdown_debug_monitor(): try: server.terminate() except: logger.warning( "failed to terminate server for debug monitor: {}; ignoring".format( sys.exc_info()[0]))

Hide Details

Hide Details

Executing tearDown hook: def cleanupSubprocesses(self): # Ensure any subprocesses are cleaned up for p in self.subprocesses: p.terminate() del p del self.subprocesses[:] # Ensure any forked processes are cleaned up for pid in self.forkedProcessPids: try: os.kill(pid, signal.SIGTERM) except OSError: pass

Hide Details

Hide Details

Executing tearDown hook: def shutdown_named_pipe(): # Close the pipe. try: named_pipe.close() except: print("failed to close named pipe") None

Hide Details

# Delete the pipe. try: os.remove(named_pipe_path) except: print("failed to delete named pipe: {}".format(named_pipe_path)) None

Hide Details

# Delete the temp directory. try: os.rmdir(temp_dir) except: print( "failed to delete temp dir: {}, directory contents: '{}'".format( temp_dir, os.listdir(temp_dir))) None

Hide Details

Hide Details

PASS: LLDB (/Users/buildslave/jenkins/workspace/lldb-cmake/lldb-build/bin/clang-11-x86_64) :: test_start_no_ack_mode_debugserver (TestLldbGdbServer.LldbGdbServerTestCase) runCmd: settings clear -all output:

Hide Details

runCmd: settings set symbols.enable-external-lookup false output:

Hide Details

runCmd: settings set target.auto-apply-fixits false output:

Hide Details

runCmd: settings set plugin.process.gdb-remote.packet-timeout 60 output:

Hide Details

runCmd: settings set symbols.clang-modules-cache-path "/Users/buildslave/jenkins/workspace/lldb-cmake/lldb-build/lldb-test-build.noindex/module-cache-lldb/lldb-api" output:

Hide Details

runCmd: settings set use-color false output:

Hide Details

runCmd: setting set target.prefer-dynamic-value no-dynamic-values output:

Hide Details

UNSUPPORTED: LLDB (/Users/buildslave/jenkins/workspace/lldb-cmake/lldb-build/bin/clang-11-x86_64) :: test_start_no_ack_mode_llgs (TestLldbGdbServer.LldbGdbServerTestCase) (llgs tests) runCmd: settings clear -all output:

Hide Details

runCmd: settings set symbols.enable-external-lookup false output:

Hide Details

runCmd: settings set target.auto-apply-fixits false output:

Hide Details

runCmd: settings set plugin.process.gdb-remote.packet-timeout 60 output:

Hide Details

runCmd: settings set symbols.clang-modules-cache-path "/Users/buildslave/jenkins/workspace/lldb-cmake/lldb-build/lldb-test-build.noindex/module-cache-lldb/lldb-api" output:

Hide Details

runCmd: settings set use-color false output:

Hide Details

runCmd: setting set target.prefer-dynamic-value no-dynamic-values output:

Hide Details

Adding tearDown hook: def shutdown_named_pipe(): # Close the pipe. try: named_pipe.close() except: print("failed to close named pipe") None

Hide Details

# Delete the pipe. try: os.remove(named_pipe_path) except: print("failed to delete named pipe: {}".format(named_pipe_path)) None

Hide Details

# Delete the temp directory. try: os.rmdir(temp_dir) except: print( "failed to delete temp dir: {}, directory contents: '{}'".format( temp_dir, os.listdir(temp_dir))) None

Hide Details

Hide Details

Adding tearDown hook: def cleanupSubprocesses(self): # Ensure any subprocesses are cleaned up for p in self.subprocesses: p.terminate() del p del self.subprocesses[:] # Ensure any forked processes are cleaned up for pid in self.forkedProcessPids: try: os.kill(pid, signal.SIGTERM) except OSError: pass

Hide Details

Hide Details

Adding tearDown hook: def shutdown_debug_monitor(): try: server.terminate() except: logger.warning( "failed to terminate server for debug monitor: {}; ignoring".format( sys.exc_info()[0]))

Hide Details

Hide Details

Adding tearDown hook: def shutdown_socket(): if sock: try: # send the kill packet so lldb-server shuts down gracefully sock.sendall(GdbRemoteTestCaseBase._GDBREMOTE_KILL_PACKET) except: logger.warning( "failed to send kill packet to debug monitor: {}; ignoring".format( sys.exc_info()[0]))

Hide Details

try: sock.close() except: logger.warning( "failed to close socket to debug monitor: {}; ignoring".format( sys.exc_info()[0]))

Hide Details

Hide Details

Executing tearDown hook: def shutdown_socket(): if sock: try: # send the kill packet so lldb-server shuts down gracefully sock.sendall(GdbRemoteTestCaseBase._GDBREMOTE_KILL_PACKET) except: logger.warning( "failed to send kill packet to debug monitor: {}; ignoring".format( sys.exc_info()[0]))

Hide Details

try: sock.close() except: logger.warning( "failed to close socket to debug monitor: {}; ignoring".format( sys.exc_info()[0]))

Hide Details

Hide Details

2020-06-06 16:51:48,813 WARNING failed to send kill packet to debug monitor: <class 'TypeError'>; ignoring Executing tearDown hook: def shutdown_debug_monitor(): try: server.terminate() except: logger.warning( "failed to terminate server for debug monitor: {}; ignoring".format( sys.exc_info()[0]))

Hide Details

Hide Details

Executing tearDown hook: def cleanupSubprocesses(self): # Ensure any subprocesses are cleaned up for p in self.subprocesses: p.terminate() del p del self.subprocesses[:] # Ensure any forked processes are cleaned up for pid in self.forkedProcessPids: try: os.kill(pid, signal.SIGTERM) except OSError: pass

Hide Details

Hide Details

Executing tearDown hook: def shutdown_named_pipe(): # Close the pipe. try: named_pipe.close() except: print("failed to close named pipe") None

Hide Details

# Delete the pipe. try: os.remove(named_pipe_path) except: print("failed to delete named pipe: {}".format(named_pipe_path)) None

Hide Details

# Delete the temp directory. try: os.rmdir(temp_dir) except: print( "failed to delete temp dir: {}, directory contents: '{}'".format( temp_dir, os.listdir(temp_dir))) None

Hide Details

Hide Details

PASS: LLDB (/Users/buildslave/jenkins/workspace/lldb-cmake/lldb-build/bin/clang-11-x86_64) :: test_thread_suffix_supported_debugserver (TestLldbGdbServer.LldbGdbServerTestCase) runCmd: settings clear -all output:

Hide Details

runCmd: settings set symbols.enable-external-lookup false output:

Hide Details

runCmd: settings set target.auto-apply-fixits false output:

Hide Details

runCmd: settings set plugin.process.gdb-remote.packet-timeout 60 output:

Hide Details

runCmd: settings set symbols.clang-modules-cache-path "/Users/buildslave/jenkins/workspace/lldb-cmake/lldb-build/lldb-test-build.noindex/module-cache-lldb/lldb-api" output:

Hide Details

runCmd: settings set use-color false output:

Hide Details

runCmd: setting set target.prefer-dynamic-value no-dynamic-values output:

Hide Details

UNSUPPORTED: LLDB (/Users/buildslave/jenkins/workspace/lldb-cmake/lldb-build/bin/clang-11-x86_64) :: test_thread_suffix_supported_llgs (TestLldbGdbServer.LldbGdbServerTestCase) (llgs tests) runCmd: settings clear -all output:

Hide Details

runCmd: settings set symbols.enable-external-lookup false output:

Hide Details

runCmd: settings set target.auto-apply-fixits false output:

Hide Details

runCmd: settings set plugin.process.gdb-remote.packet-timeout 60 output:

Hide Details

runCmd: settings set symbols.clang-modules-cache-path "/Users/buildslave/jenkins/workspace/lldb-cmake/lldb-build/lldb-test-build.noindex/module-cache-lldb/lldb-api" output:

Hide Details

runCmd: settings set use-color false output:

Hide Details

runCmd: setting set target.prefer-dynamic-value no-dynamic-values output:

Hide Details

Adding tearDown hook: def shutdown_named_pipe(): # Close the pipe. try: named_pipe.close() except: print("failed to close named pipe") None

Hide Details

# Delete the pipe. try: os.remove(named_pipe_path) except: print("failed to delete named pipe: {}".format(named_pipe_path)) None

Hide Details

# Delete the temp directory. try: os.rmdir(temp_dir) except: print( "failed to delete temp dir: {}, directory contents: '{}'".format( temp_dir, os.listdir(temp_dir))) None

Hide Details

Hide Details

Adding tearDown hook: def cleanupSubprocesses(self): # Ensure any subprocesses are cleaned up for p in self.subprocesses: p.terminate() del p del self.subprocesses[:] # Ensure any forked processes are cleaned up for pid in self.forkedProcessPids: try: os.kill(pid, signal.SIGTERM) except OSError: pass

Hide Details

Hide Details

Adding tearDown hook: def shutdown_debug_monitor(): try: server.terminate() except: logger.warning( "failed to terminate server for debug monitor: {}; ignoring".format( sys.exc_info()[0]))

Hide Details

Hide Details

Adding tearDown hook: def shutdown_socket(): if sock: try: # send the kill packet so lldb-server shuts down gracefully sock.sendall(GdbRemoteTestCaseBase._GDBREMOTE_KILL_PACKET) except: logger.warning( "failed to send kill packet to debug monitor: {}; ignoring".format( sys.exc_info()[0]))

Hide Details

try: sock.close() except: logger.warning( "failed to close socket to debug monitor: {}; ignoring".format( sys.exc_info()[0]))

Hide Details

Hide Details

Executing tearDown hook: def shutdown_socket(): if sock: try: # send the kill packet so lldb-server shuts down gracefully sock.sendall(GdbRemoteTestCaseBase._GDBREMOTE_KILL_PACKET) except: logger.warning( "failed to send kill packet to debug monitor: {}; ignoring".format( sys.exc_info()[0]))

Hide Details

try: sock.close() except: logger.warning( "failed to close socket to debug monitor: {}; ignoring".format( sys.exc_info()[0]))

Hide Details

Hide Details

2020-06-06 16:51:52,548 WARNING failed to send kill packet to debug monitor: <class 'TypeError'>; ignoring Executing tearDown hook: def shutdown_debug_monitor(): try: server.terminate() except: logger.warning( "failed to terminate server for debug monitor: {}; ignoring".format( sys.exc_info()[0]))

Hide Details

Hide Details

Executing tearDown hook: def cleanupSubprocesses(self): # Ensure any subprocesses are cleaned up for p in self.subprocesses: p.terminate() del p del self.subprocesses[:] # Ensure any forked processes are cleaned up for pid in self.forkedProcessPids: try: os.kill(pid, signal.SIGTERM) except OSError: pass

Hide Details

Hide Details

Executing tearDown hook: def shutdown_named_pipe(): # Close the pipe. try: named_pipe.close() except: print("failed to close named pipe") None

Hide Details

# Delete the pipe. try: os.remove(named_pipe_path) except: print("failed to delete named pipe: {}".format(named_pipe_path)) None

Hide Details

# Delete the temp directory. try: os.rmdir(temp_dir) except: print( "failed to delete temp dir: {}, directory contents: '{}'".format( temp_dir, os.listdir(temp_dir))) None

Hide Details

Hide Details

PASS: LLDB (/Users/buildslave/jenkins/workspace/lldb-cmake/lldb-build/bin/clang-11-x86_64) :: test_written_M_content_reads_back_correctly_debugserver (TestLldbGdbServer.LldbGdbServerTestCase) runCmd: settings clear -all output:

Hide Details

runCmd: settings set symbols.enable-external-lookup false output:

Hide Details

runCmd: settings set target.auto-apply-fixits false output:

Hide Details

runCmd: settings set plugin.process.gdb-remote.packet-timeout 60 output:

Hide Details

runCmd: settings set symbols.clang-modules-cache-path "/Users/buildslave/jenkins/workspace/lldb-cmake/lldb-build/lldb-test-build.noindex/module-cache-lldb/lldb-api" output:

Hide Details

runCmd: settings set use-color false output:

Hide Details

runCmd: setting set target.prefer-dynamic-value no-dynamic-values output:

Hide Details

UNSUPPORTED: LLDB (/Users/buildslave/jenkins/workspace/lldb-cmake/lldb-build/bin/clang-11-x86_64) :: test_written_M_content_reads_back_correctly_llgs (TestLldbGdbServer.LldbGdbServerTestCase) (llgs tests) Restore dir to: /Users/buildslave/jenkins/workspace/lldb-cmake/lldb-build/tools/lldb/test ====================================================================== FAIL: test_attach_commandline_continue_app_exits_debugserver (TestLldbGdbServer.LldbGdbServerTestCase) ---------------------------------------------------------------------- Traceback (most recent call last): File "/Users/buildslave/jenkins/workspace/lldb-cmake/llvm-project/lldb/packages/Python/lldbsuite/test/decorators.py", line 140, in wrapper func(*args, **kwargs) File "/Users/buildslave/jenkins/workspace/lldb-cmake/llvm-project/lldb/test/API/tools/lldb-server/TestLldbGdbServer.py", line 228, in test_attach_commandline_continue_app_exits_debugserver self.attach_commandline_continue_app_exits() File "/Users/buildslave/jenkins/workspace/lldb-cmake/llvm-project/lldb/test/API/tools/lldb-server/TestLldbGdbServer.py", line 200, in attach_commandline_continue_app_exits procs = self.prep_debug_monitor_and_inferior() File "/Users/buildslave/jenkins/workspace/lldb-cmake/llvm-project/lldb/packages/Python/lldbsuite/test/tools/lldb-server/gdbremote_testcase.py", line 584, in prep_debug_monitor_and_inferior server = self.connect_to_debug_monitor(attach_pid=attach_pid) File "/Users/buildslave/jenkins/workspace/lldb-cmake/llvm-project/lldb/packages/Python/lldbsuite/test/tools/lldb-server/gdbremote_testcase.py", line 418, in connect_to_debug_monitor server = self.launch_debug_monitor(attach_pid=attach_pid) File "/Users/buildslave/jenkins/workspace/lldb-cmake/llvm-project/lldb/packages/Python/lldbsuite/test/tools/lldb-server/gdbremote_testcase.py", line 411, in launch_debug_monitor self.port = self.get_stub_port_from_named_socket(self._READ_TIMEOUT) File "/Users/buildslave/jenkins/workspace/lldb-cmake/llvm-project/lldb/packages/Python/lldbsuite/test/tools/lldb-server/gdbremote_testcase.py", line 217, in get_stub_port_from_named_socket "write side of pipe has not written anything - stub isn't writing to pipe.") AssertionError: 0 == 0 : write side of pipe has not written anything - stub isn't writing to pipe. Config=x86_64-/Users/buildslave/jenkins/workspace/lldb-cmake/lldb-build/bin/clang-11 ---------------------------------------------------------------------- Ran 65 tests in 96.881s

Hide Details

RESULT: FAILED (29 passes, 1 failures, 0 errors, 34 skipped, 1 expected failures, 0 unexpected successes)

Hide Details

--

Hide Details

******************** PASS: lldb-unit :: Utility/./UtilityTests/OptionsWithRawTest.EmptyArgsOnlySuffix (1290 of 2049) PASS: lldb-api :: functionalities/breakpoint/breakpoint_options/TestBreakpointOptions.py (1291 of 2049) PASS: lldb-unit :: Utility/./UtilityTests/LogChannelEnabledTest.LogThread (1292 of 2049) UNSUPPORTED: lldb-shell :: Register/x86-64-gp-write.test (1293 of 2049) PASS: lldb-unit :: Utility/./UtilityTests/BinaryStreamTest.PutSLEB128One (1294 of 2049) PASS: lldb-api :: functionalities/breakpoint/source_regexp/TestSourceRegexBreakpoints.py (1295 of 2049) PASS: lldb-api :: commands/expression/call-function/TestCallStdStringFunction.py (1296 of 2049) PASS: lldb-api :: lang/objc/foundation/TestSymbolTable.py (1297 of 2049) PASS: lldb-api :: python_api/sbplatform/TestSBPlatform.py (1298 of 2049) PASS: lldb-unit :: Utility/./UtilityTests/ReproducerTest.SetReplay (1299 of 2049) PASS: lldb-api :: commands/expression/namespace_local_var_same_name_cpp_and_c/TestNamespaceLocalVarSameNameCppAndC.py (1300 of 2049) PASS: lldb-api :: tools/lldb-server/TestGdbRemoteExitCode.py (1301 of 2049) PASS: lldb-unit :: Symbol/./SymbolTests/TestTypeSystemClang.TestGetBasicTypeFromEnum (1302 of 2049) PASS: lldb-api :: lang/objc/objc-ivar-offsets/TestObjCIvarOffsets.py (1303 of 2049) PASS: lldb-shell :: SymbolFile/NativePDB/source-list.cpp (1304 of 2049) PASS: lldb-unit :: Utility/./UtilityTests/StringListTest.Clear (1305 of 2049) PASS: lldb-api :: functionalities/data-formatter/data-formatter-objc/TestDataFormatterObjCNSData.py (1306 of 2049) PASS: lldb-shell :: BuildScript/script-args.test (1307 of 2049) PASS: lldb-api :: functionalities/thread/concurrent_events/TestConcurrentDelaySignalWatch.py (1308 of 2049) PASS: lldb-unit :: Utility/./UtilityTests/NameMatchesTest.EndsWith (1309 of 2049) UNSUPPORTED: lldb-api :: tools/lldb-server/TestGdbRemoteAuxvSupport.py (1310 of 2049) PASS: lldb-shell :: ObjectFile/Breakpad/discontiguous-sections.test (1311 of 2049) PASS: lldb-unit :: Host/./HostTests/SocketTest.TCPListen0ConnectAccept (1312 of 2049) PASS: lldb-unit :: Core/./LLDBCoreTests/RichManglingContextTest.IPDRealloc (1313 of 2049) PASS: lldb-unit :: Utility/./UtilityTests/Flags.IsClear (1314 of 2049) PASS: lldb-api :: commands/expression/context-object/TestContextObject.py (1315 of 2049) PASS: lldb-unit :: Utility/./UtilityTests/StringExtractorTest.GetHexU8_Exact_NoEof (1316 of 2049) PASS: lldb-api :: lang/cpp/member-and-local-vars-with-same-name/TestMembersAndLocalsWithSameName.py (1317 of 2049) PASS: lldb-unit :: DataFormatter/./LLDBFormatterTests/StringPrinterTests.SwiftUTF8 (1318 of 2049) PASS: lldb-unit :: Utility/./UtilityTests/RangeTest.DoesIntersect (1319 of 2049) PASS: lldb-unit :: UnwindAssembly/x86/./UnwindAssemblyx86Tests/Testx86AssemblyInspectionEngine.TestPopR12 (1320 of 2049) PASS: lldb-unit :: Utility/./UtilityTests/RangeTest.Constructor (1321 of 2049) PASS: lldb-shell :: SymbolFile/DWARF/find-inline-method.s (1322 of 2049) PASS: lldb-api :: commands/settings/use_source_cache/TestUseSourceCache.py (1323 of 2049) PASS: lldb-unit :: Symbol/./SymbolTests/TestClangASTImporter.RecordLayout (1324 of 2049) PASS: lldb-unit :: Utility/./UtilityTests/StringExtractorTest.GetHexBytes_OddPair (1325 of 2049) PASS: lldb-unit :: debugserver/./debugserverTests/RNBSocket.AnyListen (1326 of 2049) PASS: lldb-unit :: Utility/./UtilityTests/BinaryStreamTest.PutSLEB128NineBytes (1327 of 2049) PASS: lldb-api :: macosx/thread-names/TestInterruptThreadNames.py (1328 of 2049) PASS: lldb-unit :: Expression/./ExpressionTests/DiagnosticManagerTest.AppendMessageNoDiag (1329 of 2049) PASS: lldb-unit :: Utility/./UtilityTests/StreamTest.ShiftOperatorPtr (1330 of 2049) PASS: lldb-unit :: UnwindAssembly/ARM64/./Arm64InstEmulationTests/TestArm64InstEmulation.TestCFARegisterTrackedAcrossJumps (1331 of 2049) PASS: lldb-unit :: SymbolFile/NativePDB/./SymbolFileNativePDBTests/PDBFPOProgramToDWARFExpressionTests.UnresolvedRegisterReference (1332 of 2049) PASS: lldb-unit :: ScriptInterpreter/Python/./ScriptInterpreterPythonTests/PythonDataObjectsTest.TestPythonBytes (1333 of 2049) PASS: lldb-unit :: UnwindAssembly/x86/./UnwindAssemblyx86Tests/Testx86AssemblyInspectionEngine.Testi386IgnoredRegisters (1334 of 2049) PASS: lldb-unit :: Language/Highlighting/./HighlighterTests/HighlighterTest.ClangTrailingBackslashMissingNewLine (1335 of 2049) PASS: lldb-api :: functionalities/thread/concurrent_events/TestConcurrentSignalDelayWatch.py (1336 of 2049) PASS: lldb-unit :: Utility/./UtilityTests/SerializationRountripTest.SerializeDeserializeCString (1337 of 2049) PASS: lldb-api :: functionalities/breakpoint/address_breakpoints/TestBadAddressBreakpoints.py (1338 of 2049) PASS: lldb-unit :: Utility/./UtilityTests/ArgsTest.ReplaceArgumentAtIndexFarOutOfRange (1339 of 2049) PASS: lldb-api :: lang/objcxx/class-name-clash/TestNameClash.py (1340 of 2049) PASS: lldb-api :: commands/expression/unicode-in-variable/TestUnicodeInVariable.py (1341 of 2049) PASS: lldb-unit :: Utility/./UtilityTests/ConstStringTest.format_provider (1342 of 2049) PASS: lldb-unit :: Target/./TargetTests/PathMappingListTest.AbsoluteTests (1343 of 2049) PASS: lldb-unit :: Utility/./UtilityTests/ScalarTest.CastOperations (1344 of 2049) PASS: lldb-unit :: Language/Highlighting/./HighlighterTests/HighlighterTest.HighlighterSelectionType (1345 of 2049) PASS: lldb-unit :: Utility/./UtilityTests/SerializationRountripTest.SerializeDeserializeCStringArrayNullptrElem (1346 of 2049) PASS: lldb-shell :: SymbolFile/DWARF/find-basic-variable.cpp (1347 of 2049) PASS: lldb-unit :: Utility/./UtilityTests/ScalarTest.Equality (1348 of 2049) PASS: lldb-api :: commands/expression/import-std-module/basic/TestImportStdModule.py (1349 of 2049) PASS: lldb-unit :: SymbolFile/NativePDB/./SymbolFileNativePDBTests/PDBFPOProgramToDWARFExpressionTests.UnresolvedCyclicRegisterAssignmentReference (1350 of 2049) PASS: lldb-unit :: Utility/./UtilityTests/TimerTest.CategoryTimes (1351 of 2049) PASS: lldb-shell :: SymbolFile/DWARF/clang-ast-from-dwarf-unamed-and-anon-structs.cpp (1352 of 2049) PASS: lldb-api :: functionalities/conditional_break/TestConditionalBreak.py (1353 of 2049) PASS: lldb-unit :: Utility/./UtilityTests/ProcessInfoTest.Constructor (1354 of 2049) PASS: lldb-api :: lang/objc/objc-foundation-dictionary-empty/TestNSDictionary0.py (1355 of 2049) PASS: lldb-unit :: Utility/./UtilityTests/PassiveReplayTest.InstrumentedFoo (1356 of 2049) PASS: lldb-api :: functionalities/wrong_commands/TestWrongCommands.py (1357 of 2049) PASS: lldb-shell :: Reproducer/TestRelativePath.test (1358 of 2049) PASS: lldb-unit :: Utility/./UtilityTests/StringListTest.JoinNonSpace (1359 of 2049) UNSUPPORTED: lldb-api :: tools/lldb-server/signal-filtering/TestGdbRemote_QPassSignals.py (1360 of 2049) PASS: lldb-unit :: Utility/./UtilityTests/ArgsTest.TestTrailingBackslash (1361 of 2049) PASS: lldb-shell :: Recognizer/assert.test (1362 of 2049) PASS: lldb-unit :: Utility/./UtilityTests/UriParserTest.BadPort2 (1363 of 2049) PASS: lldb-shell :: SymbolFile/DWARF/module-ownership.mm (1364 of 2049) PASS: lldb-shell :: ObjectFile/ELF/netbsd-core-amd64.test (1365 of 2049) PASS: lldb-unit :: Expression/./ExpressionTests/CppModuleConfigurationTest.LibCppV2 (1366 of 2049) UNSUPPORTED: lldb-api :: tools/lldb-server/thread-name/TestGdbRemoteThreadName.py (1367 of 2049) PASS: lldb-unit :: Utility/./UtilityTests/StringListTest.CopyList (1368 of 2049) PASS: lldb-api :: functionalities/target_var/TestTargetVar.py (1369 of 2049) PASS: lldb-unit :: Host/./HostTests/ConnectionFileDescriptorTest.TCPGetURIv4 (1370 of 2049) XFAIL: lldb-shell :: Register/x86-mm-xmm-read.test (1371 of 2049) PASS: lldb-unit :: UnwindAssembly/x86/./UnwindAssemblyx86Tests/Testx86AssemblyInspectionEngine.TestSimple32bitFrameFunction (1372 of 2049) PASS: lldb-api :: lang/c/modules/TestCModules.py (1373 of 2049) UNSUPPORTED: lldb-shell :: SymbolFile/NativePDB/typedefs.cpp (1374 of 2049) PASS: lldb-unit :: ObjectFile/Breakpad/./ObjectFileBreakpadTests/StackCFIRecord.parse (1375 of 2049) PASS: lldb-unit :: Utility/./UtilityTests/StreamTest.PutSLEB128 (1376 of 2049) PASS: lldb-api :: functionalities/memory/read/TestMemoryRead.py (1377 of 2049) PASS: lldb-api :: lang/cpp/dynamic-value/TestCppValueCast.py (1378 of 2049) PASS: lldb-api :: commands/expression/expr-in-syscall/TestExpressionInSyscall.py (1379 of 2049) PASS: lldb-api :: commands/expression/invalid-args/TestInvalidArgsExpression.py (1380 of 2049) PASS: lldb-api :: commands/expression/import-std-module/vector/TestVectorFromStdModule.py (1381 of 2049) PASS: lldb-api :: commands/expression/completion-in-lambda-and-unnamed-class/TestCompletionInLambdaAndUnnamedClass.py (1382 of 2049) PASS: lldb-unit :: Process/gdb-remote/./ProcessGdbRemoteTests/GDBRemoteCommunicationClientTest.GetQOffsets (1383 of 2049) UNSUPPORTED: lldb-api :: functionalities/darwin_log/source/debug/TestDarwinLogSourceDebug.py (1384 of 2049) PASS: lldb-api :: lang/c/array_types/TestArrayTypes.py (1385 of 2049) PASS: lldb-shell :: SymbolFile/Breakpad/symtab-macho.test (1386 of 2049) PASS: lldb-unit :: Utility/./UtilityTests/StringExtractorTest.GetHexBytesAvail_OddPair (1387 of 2049) PASS: lldb-api :: commands/apropos/with-process/TestAproposWithProcess.py (1388 of 2049) UNSUPPORTED: lldb-shell :: SymbolFile/PDB/type-quals.test (1389 of 2049) PASS: lldb-unit :: Utility/./UtilityTests/StreamTest.PutHex64ByteOrderBig (1390 of 2049) PASS: lldb-shell :: Reproducer/TestSynchronous.test (1391 of 2049) PASS: lldb-unit :: Utility/./UtilityTests/SharedCluster.ClusterManager (1392 of 2049) PASS: lldb-api :: functionalities/thread/concurrent_events/TestConcurrentDelayedCrashWithBreakpointWatchpoint.py (1393 of 2049) PASS: lldb-api :: lang/c/anonymous/TestAnonymous.py (1394 of 2049) PASS: lldb-api :: lang/c/tls_globals/TestTlsGlobals.py (1395 of 2049) PASS: lldb-shell :: Reproducer/Functionalities/TestStepping.test (1396 of 2049) PASS: lldb-api :: lang/objc/exceptions/TestObjCExceptions.py (1397 of 2049) PASS: lldb-api :: lang/objc/foundation/TestObjCMethodsNSError.py (1398 of 2049) PASS: lldb-api :: macosx/profile_vrs_detach/TestDetachVrsProfile.py (1399 of 2049) PASS: lldb-unit :: DataFormatter/./LLDBFormatterTests/StringPrinterTests.CxxASCII (1400 of 2049) PASS: lldb-unit :: Process/minidump/./LLDBMinidumpTests/MinidumpParserTest.InvalidMinidump (1401 of 2049) PASS: lldb-unit :: Symbol/./SymbolTests/TestTypeSystemClang.TestFunctionTemplateInRecordConstruction (1402 of 2049) PASS: lldb-unit :: Utility/./UtilityTests/StringListTest.ShiftMove (1403 of 2049) PASS: lldb-unit :: SymbolFile/DWARF/./SymbolFileDWARFTests/SymbolFileDWARFTests.ParseArangesNonzeroSegmentSize (1404 of 2049) PASS: lldb-unit :: ScriptInterpreter/Python/./ScriptInterpreterPythonTests/PythonDataObjectsTest.TestGlobalNameResolutionWithDot (1405 of 2049) PASS: lldb-shell :: ObjectFile/ELF/PT_LOAD.yaml (1406 of 2049) PASS: lldb-unit :: Utility/./UtilityTests/StringExtractorTest.GetHexBytes_Underflow (1407 of 2049) UNSUPPORTED: lldb-shell :: SymbolFile/NativePDB/local-variables.cpp (1408 of 2049) PASS: lldb-shell :: Minidump/Windows/Sigsegv/sigsegv.test (1409 of 2049) PASS: lldb-shell :: SymbolFile/DWARF/debug-types-dwo-cross-reference.cpp (1410 of 2049) PASS: lldb-api :: python_api/findvalue_duplist/TestSBFrameFindValue.py (1411 of 2049) PASS: lldb-unit :: UnwindAssembly/x86/./UnwindAssemblyx86Tests/Testx86AssemblyInspectionEngine.Test32bitFramelessSmallStackFrame (1412 of 2049) PASS: lldb-unit :: ScriptInterpreter/Python/./ScriptInterpreterPythonTests/PythonDataObjectsTest.TestPythonTupleValues (1413 of 2049) PASS: lldb-unit :: Utility/./UtilityTests/StringListTest.GetMaxStringLengthMixed (1414 of 2049) PASS: lldb-api :: functionalities/data-formatter/data-formatter-stl/libcxx/unique_ptr/TestDataFormatterLibcxxUniquePtr.py (1415 of 2049) PASS: lldb-api :: commands/target/dump-symtab-demangle/TestDumpSymtabDemangle.py (1416 of 2049) UNSUPPORTED: lldb-shell :: Register/arm-gp-read.test (1417 of 2049) PASS: lldb-shell :: SymbolFile/DWARF/find-variable-dwo.cpp (1418 of 2049) PASS: lldb-unit :: Utility/./UtilityTests/ArgsTest.ReplaceArgumentAtIndexEqual (1419 of 2049) PASS: lldb-unit :: Core/./LLDBCoreTests/MangledTest.EmptyForInvalidName (1420 of 2049) PASS: lldb-api :: tools/lldb-vscode/attach/TestVSCode_attach.py (1421 of 2049) PASS: lldb-api :: commands/disassemble/basic/TestFrameDisassemble.py (1422 of 2049) PASS: lldb-unit :: Symbol/./SymbolTests/TestTypeSystemClang.TestConvertAccessTypeToAccessSpecifier (1423 of 2049) PASS: lldb-api :: commands/watchpoints/watchpoint_count/TestWatchpointCount.py (1424 of 2049) PASS: lldb-api :: functionalities/show_location/TestShowLocationDwarf5.py (1425 of 2049) PASS: lldb-api :: functionalities/gdb_remote_client/TestRegDefinitionInParts.py (1426 of 2049) PASS: lldb-unit :: UnwindAssembly/x86/./UnwindAssemblyx86Tests/Testx86AssemblyInspectionEngine.Test64bitFramelessBigStackFrame (1427 of 2049) PASS: lldb-api :: commands/target/stop-hooks/TestStopHooks.py (1428 of 2049) PASS: lldb-api :: commands/expression/radar_8638051/Test8638051.py (1429 of 2049) PASS: lldb-api :: python_api/default-constructor/TestDefaultConstructorForAPIObjects.py (1430 of 2049) PASS: lldb-api :: functionalities/breakpoint/breakpoint_by_line_and_column/TestBreakpointByLineAndColumn.py (1431 of 2049) PASS: lldb-api :: tools/lldb-server/inferior-crash/TestGdbRemoteAbort.py (1432 of 2049) PASS: lldb-api :: functionalities/value_md5_crash/TestValueMD5Crash.py (1433 of 2049) PASS: lldb-api :: functionalities/data-formatter/hexcaps/TestDataFormatterHexCaps.py (1434 of 2049) PASS: lldb-unit :: ObjectFile/ELF/./ObjectFileELFTests/ObjectFileELFTest.GetModuleSpecifications_EarlySectionHeaders (1435 of 2049) PASS: lldb-shell :: SymbolFile/DWARF/debug-line-basic.s (1436 of 2049) PASS: lldb-unit :: Language/Highlighting/./HighlighterTests/HighlighterTest.ClangCursorPosBeforeOtherToken (1437 of 2049) PASS: lldb-unit :: Utility/./UtilityTests/StringListTest.InsertStringAtIndexStdString (1438 of 2049) PASS: lldb-api :: functionalities/tail_call_frames/unambiguous_sequence/TestUnambiguousTailCalls.py (1439 of 2049) PASS: lldb-unit :: UnwindAssembly/x86/./UnwindAssemblyx86Tests/Testx86AssemblyInspectionEngine.TestPushR13 (1440 of 2049) PASS: lldb-api :: functionalities/breakpoint/breakpoint_command/TestRegexpBreakCommand.py (1441 of 2049) PASS: lldb-api :: commands/version/TestVersion.py (1442 of 2049) PASS: lldb-api :: commands/expression/import-std-module/list-dbg-info-content/TestDbgInfoContentListFromStdModule.py (1443 of 2049) PASS: lldb-api :: lang/c/step-target/TestStepTarget.py (1444 of 2049) PASS: lldb-unit :: Utility/./UtilityTests/StreamTest.AddressRangeInvalidRange (1445 of 2049) PASS: lldb-unit :: Utility/./UtilityTests/StreamTeeTest.Constructor1Stream (1446 of 2049) PASS: lldb-shell :: Reproducer/Modules/TestModuleCXX.test (1447 of 2049) PASS: lldb-unit :: debugserver/./debugserverTests/RNBSocket.LoopBackListenIPv6 (1448 of 2049) PASS: lldb-unit :: Utility/./UtilityTests/Flags.AllSet (1449 of 2049) PASS: lldb-shell :: Driver/TestHelp.test (1450 of 2049) PASS: lldb-unit :: Utility/./UtilityTests/RangeTest.ContainsEndInclusiveInvalid (1451 of 2049) PASS: lldb-unit :: Utility/./UtilityTests/LogChannelTest.Disable (1452 of 2049) PASS: lldb-shell :: SymbolFile/DWARF/dwarf5-index-is-used.cpp (1453 of 2049) PASS: lldb-unit :: Process/gdb-remote/./ProcessGdbRemoteTests/GDBRemoteCommunicationClientTest.SendGetDataPacket (1454 of 2049) PASS: lldb-unit :: Utility/./UtilityTests/ArchSpecTest.MergeFromMachOUnknown (1455 of 2049) PASS: lldb-api :: commands/command/script_alias/TestCommandScriptAlias.py (1456 of 2049) PASS: lldb-api :: functionalities/thread/backtrace_all/TestBacktraceAll.py (1457 of 2049) PASS: lldb-unit :: Utility/./UtilityTests/PassiveReplayTest.InstrumentedBarRef (1458 of 2049) UNSUPPORTED: lldb-shell :: Register/x86-zmm-write.test (1459 of 2049) PASS: lldb-unit :: Host/./HostTests/FileSystemTest.Exists (1460 of 2049) PASS: lldb-unit :: Process/minidump/./LLDBMinidumpTests/MinidumpParserTest.GetExceptionStream (1461 of 2049) PASS: lldb-unit :: Utility/./UtilityTests/BinaryStreamTest.PutULEB128EightBytes (1462 of 2049) PASS: lldb-api :: commands/expression/import-std-module/empty-module/TestEmptyStdModule.py (1463 of 2049) PASS: lldb-api :: commands/frame/diagnose/complicated-expression/TestComplicatedExpression.py (1464 of 2049) PASS: lldb-api :: lang/cpp/stl/TestStdCXXDisassembly.py (1465 of 2049) PASS: lldb-api :: functionalities/postmortem/netbsd-core/TestNetBSDCore.py (1466 of 2049) PASS: lldb-api :: lang/cpp/overloaded-functions/TestOverloadedFunctions.py (1467 of 2049) PASS: lldb-unit :: Host/./HostTests/MainLoopTest.DetectsEOF (1468 of 2049) PASS: lldb-unit :: SymbolFile/NativePDB/./SymbolFileNativePDBTests/PDBFPOProgramToDWARFExpressionTests.InvalidOpUnary (1469 of 2049) PASS: lldb-unit :: Utility/./UtilityTests/RangeTest.EqualInvalid (1470 of 2049) PASS: lldb-unit :: Utility/./UtilityTests/NameMatchesTest.Contains (1471 of 2049) PASS: lldb-api :: lang/objc/real-definition/TestRealDefinition.py (1472 of 2049) PASS: lldb-unit :: Utility/./UtilityTests/ListenerTest.GetEventWait (1473 of 2049) PASS: lldb-api :: functionalities/data-formatter/data-formatter-objc/cmtime/TestDataFormatterCMTime.py (1474 of 2049) PASS: lldb-unit :: Process/minidump/./LLDBMinidumpTests/RegisterContextMinidump.ConvertMinidumpContext_x86_32 (1475 of 2049) PASS: lldb-unit :: Utility/./UtilityTests/UriParserTest.BracketedHostname (1476 of 2049) UNSUPPORTED: lldb-api :: functionalities/unwind/standard/TestStandardUnwind.py (1477 of 2049) PASS: lldb-shell :: Commands/CommandScriptImmediateOutput/CommandScriptImmediateOutputConsole.test (1478 of 2049) PASS: lldb-api :: commands/watchpoints/watchpoint_commands/command/TestWatchpointCommandPython.py (1479 of 2049) PASS: lldb-unit :: Interpreter/./InterpreterTests/OptionArgParserTest.toBoolean (1480 of 2049) PASS: lldb-api :: sample_test/TestSampleInlineTest.py (1481 of 2049) PASS: lldb-api :: commands/expression/fixits/TestFixIts.py (1482 of 2049) PASS: lldb-unit :: Utility/./UtilityTests/StreamTest.QuotedCString (1483 of 2049) PASS: lldb-api :: python_api/frame/get-variables/TestGetVariables.py (1484 of 2049) PASS: lldb-unit :: Utility/./UtilityTests/ScalarTest.ComparisonFloat (1485 of 2049) PASS: lldb-api :: functionalities/data-formatter/array_typedef/TestArrayTypedef.py (1486 of 2049) PASS: lldb-unit :: Utility/./UtilityTests/DataExtractorTest.GetBitfield (1487 of 2049) PASS: lldb-unit :: Utility/./UtilityTests/StreamTeeTest.Flush (1488 of 2049) PASS: lldb-shell :: Reproducer/TestPythonImport.test (1489 of 2049) PASS: lldb-shell :: SymbolFile/DWARF/clang-ast-from-dwarf-objc-property.m (1490 of 2049) PASS: lldb-unit :: Symbol/./SymbolTests/Type.CompilerContextPattern (1491 of 2049) PASS: lldb-api :: tools/lldb-vscode/breakpoint/TestVSCode_setBreakpoints.py (1492 of 2049) PASS: lldb-unit :: Utility/./UtilityTests/LogTest.Register (1493 of 2049) PASS: lldb-unit :: Utility/./UtilityTests/StringListTest.SplitIntoLines (1494 of 2049) PASS: lldb-shell :: ObjectFile/PECOFF/basic-info-arm64.yaml (1495 of 2049) PASS: lldb-unit :: Utility/./UtilityTests/StringExtractorTest.GetHexU8_Extra (1496 of 2049) PASS: lldb-api :: commands/expression/formatters/TestFormatters.py (1497 of 2049) PASS: lldb-unit :: Utility/./UtilityTests/DataExtractorTest.GetCStrAtEnd (1498 of 2049) PASS: lldb-unit :: SymbolFile/DWARF/./SymbolFileDWARFTests/SymbolFileDWARFTests.TestAbbrevMissingTerminator (1499 of 2049) PASS: lldb-unit :: Expression/./ExpressionTests/DiagnosticManagerTest.HasFixits (1500 of 2049) PASS: lldb-shell :: Process/TestEnvironment.test (1501 of 2049) PASS: lldb-shell :: SymbolFile/NativePDB/tag-types.cpp (1502 of 2049) PASS: lldb-unit :: Utility/./UtilityTests/ArchSpecTest.TripleComponentsWereSpecified (1503 of 2049) PASS: lldb-unit :: Utility/./UtilityTests/BinaryStreamTest.PutSLEB128EightBytes (1504 of 2049) PASS: lldb-api :: lang/cpp/exceptions/TestCPPExceptionBreakpoints.py (1505 of 2049) PASS: lldb-shell :: Driver/TestFile.test (1506 of 2049) PASS: lldb-shell :: Breakpoint/single-file-split-dwarf.test (1507 of 2049) PASS: lldb-unit :: ScriptInterpreter/Lua/./ScriptInterpreterLuaTests/ScriptInterpreterTest.Plugin (1508 of 2049) PASS: lldb-shell :: SymbolFile/DWARF/compilercontext.ll (1509 of 2049) PASS: lldb-api :: commands/command/nested_alias/TestNestedAlias.py (1510 of 2049) PASS: lldb-unit :: SymbolFile/NativePDB/./SymbolFileNativePDBTests/PDBFPOProgramToDWARFExpressionTests.MultipleIndependentAssignments (1511 of 2049) UNSUPPORTED: lldb-shell :: Register/x86-ymm-read.test (1512 of 2049) PASS: lldb-api :: functionalities/unwind/zeroth_frame/TestZerothFrame.py (1513 of 2049) PASS: lldb-api :: functionalities/stats_api/TestStatisticsAPI.py (1514 of 2049) PASS: lldb-api :: functionalities/breakpoint/breakpoint_locations/TestBreakpointLocations.py (1515 of 2049) PASS: lldb-unit :: ObjectFile/Breakpad/./ObjectFileBreakpadTests/ModuleRecord.parse (1516 of 2049) PASS: lldb-api :: functionalities/inline-stepping/TestInlineStepping.py (1517 of 2049) PASS: lldb-unit :: Utility/./UtilityTests/ArgsTest.GetQuotedCommandString (1518 of 2049) PASS: lldb-api :: lang/cpp/std-function-step-into-callable/TestStdFunctionStepIntoCallable.py (1519 of 2049) PASS: lldb-api :: types/TestLongTypesExpr.py (1520 of 2049) UNSUPPORTED: lldb-api :: functionalities/darwin_log/filter/exact_match/activity-chain/TestDarwinLogFilterMatchActivityChain.py (1521 of 2049) PASS: lldb-unit :: Utility/./UtilityTests/StringListTest.ForRange (1522 of 2049) PASS: lldb-unit :: Utility/./UtilityTests/RegularExpression.Empty (1523 of 2049) PASS: lldb-unit :: Utility/./UtilityTests/ArgsTest.StringListConstructor (1524 of 2049) PASS: lldb-unit :: Host/./HostTests/SocketTest.TCPGetAddress (1525 of 2049) PASS: lldb-api :: commands/expression/rdar42038760/TestScalarURem.py (1526 of 2049) PASS: lldb-api :: lang/c/unions/TestUnionMembers.py (1527 of 2049) PASS: lldb-api :: python_api/type/TestTypeList.py (1528 of 2049) PASS: lldb-unit :: Utility/./UtilityTests/EnvironmentTest.EnvpConstruction (1529 of 2049) PASS: lldb-unit :: Process/gdb-remote/./ProcessGdbRemoteTests/GDBRemoteCommunicationClientTest.SyncThreadState (1530 of 2049) PASS: lldb-unit :: Utility/./UtilityTests/XcodeSDKTest.SDKSupportsSwift (1531 of 2049) PASS: lldb-shell :: SymbolFile/Breakpad/line-table.test (1532 of 2049) PASS: lldb-unit :: Interpreter/./InterpreterTests/CompletionTest.FileCompletionAbsolute (1533 of 2049) PASS: lldb-api :: functionalities/signal/raise/TestRaise.py (1534 of 2049) PASS: lldb-unit :: Utility/./UtilityTests/VASprintfTest.NoBufferResize (1535 of 2049) PASS: lldb-unit :: Language/Highlighting/./HighlighterTests/HighlighterTest.ClangPPDirectives (1536 of 2049) PASS: lldb-unit :: UnwindAssembly/x86/./UnwindAssemblyx86Tests/Testx86AssemblyInspectionEngine.TestPushImm (1537 of 2049) UNSUPPORTED: lldb-api :: benchmarks/stepping/TestSteppingSpeed.py (1538 of 2049) PASS: lldb-unit :: ScriptInterpreter/Lua/./ScriptInterpreterLuaTests/LuaTest.RunValid (1539 of 2049) PASS: lldb-unit :: Host/./HostTests/SocketAddressTest.GetAddressInfo (1540 of 2049) PASS: lldb-unit :: Utility/./UtilityTests/RangeTest.NotEqualInvalid (1541 of 2049) PASS: lldb-api :: tools/lldb-server/commandline/TestStubReverseConnect.py (1542 of 2049) PASS: lldb-api :: functionalities/gdb_remote_client/TestTargetXMLArch.py (1543 of 2049) PASS: lldb-api :: commands/breakpoint/command/list/TestBreakpointCommandList.py (1544 of 2049) PASS: lldb-api :: lang/c/vla/TestVLA.py (1545 of 2049) PASS: lldb-unit :: Host/./HostTests/Host.WaitStatusFormat (1546 of 2049) PASS: lldb-unit :: Utility/./UtilityTests/ConstStringTest.UpdateMangledCounterpart (1547 of 2049) PASS: lldb-shell :: SymbolFile/DWARF/apple-index-is-used.cpp (1548 of 2049) PASS: lldb-unit :: ObjectFile/ELF/./ObjectFileELFTests/ObjectFileELFTest.GetSymtab_NoSymEntryPointArmAddressClass (1549 of 2049) PASS: lldb-unit :: Utility/./UtilityTests/UriParserTest.BracketedHostnameWithColon (1550 of 2049) PASS: lldb-api :: commands/frame/var-scope/TestFrameVariableScope.py (1551 of 2049) PASS: lldb-unit :: Host/./HostTests/HostInfoTest.GetXcodeSDK (1552 of 2049) PASS: lldb-unit :: Platform/./LLDBPlatformTests/PlatformDarwinTest.TestParseVersionBuildDir (1553 of 2049) PASS: lldb-api :: lang/c/unicode/TestUnicodeSymbols.py (1554 of 2049) UNSUPPORTED: lldb-shell :: SymbolFile/PDB/func-symbols.test (1555 of 2049) PASS: lldb-api :: python_api/value/TestValueAPI.py (1556 of 2049) PASS: lldb-api :: commands/expression/dollar-in-variable/TestDollarInVariable.py (1557 of 2049) PASS: lldb-api :: commands/expression/persistent_ptr_update/TestPersistentPtrUpdate.py (1558 of 2049) PASS: lldb-shell :: SymbolFile/DWARF/debug-types-dwarf5.s (1559 of 2049) PASS: lldb-unit :: Utility/./UtilityTests/VMRange.Clear (1560 of 2049) PASS: lldb-unit :: Utility/./UtilityTests/StringExtractorTest.GetHexBytesAvail_FullString (1561 of 2049) PASS: lldb-api :: python_api/watchpoint/TestWatchpointIgnoreCount.py (1562 of 2049) PASS: lldb-unit :: Utility/./UtilityTests/StatusTest.Formatv (1563 of 2049) PASS: lldb-unit :: Expression/./ExpressionTests/ClangExpressionDeclMapTest.TestUnknownIdentifierLookup (1564 of 2049) PASS: lldb-api :: functionalities/thread/thread_exit/TestThreadExit.py (1565 of 2049) UNSUPPORTED: lldb-api :: android/platform/TestDefaultCacheLineSize.py (1566 of 2049) PASS: lldb-api :: commands/target/basic/TestTargetCommand.py (1567 of 2049) PASS: lldb-unit :: Utility/./UtilityTests/VMRange.SetEndAddress (1568 of 2049) UNSUPPORTED: lldb-shell :: SymbolFile/DWARF/debug-types-expressions.test (1569 of 2049) PASS: lldb-api :: functionalities/postmortem/elf-core/TestLinuxCore.py (1570 of 2049) PASS: lldb-api :: lang/cpp/namespace_conflicts/TestNamespaceConflicts.py (1571 of 2049) PASS: lldb-api :: lang/cpp/modules-import/TestCXXModulesImport.py (1572 of 2049) PASS: lldb-unit :: Utility/./UtilityTests/NameMatchesTest.RegularExpression (1573 of 2049) PASS: lldb-unit :: Utility/./UtilityTests/StringListTest.AppendList (1574 of 2049) PASS: lldb-unit :: Utility/./UtilityTests/StringExtractorTest.DecodeHexU8_Underflow2 (1575 of 2049) PASS: lldb-unit :: Utility/./UtilityTests/DataExtractorTest.GetULEB128_bit63 (1576 of 2049) PASS: lldb-api :: functionalities/thread/concurrent_events/TestConcurrentManyWatchpoints.py (1577 of 2049) PASS: lldb-api :: commands/expression/no-deadlock/TestExprDoesntBlock.py (1578 of 2049) PASS: lldb-api :: commands/process/launch-with-shellexpand/TestLaunchWithShellExpand.py (1579 of 2049) PASS: lldb-unit :: Utility/./UtilityTests/CompletionRequest.TestCompletionOwnership (1580 of 2049) PASS: lldb-api :: python_api/breakpoint/TestBreakpointAPI.py (1581 of 2049) PASS: lldb-api :: functionalities/data-formatter/var-in-aggregate-misuse/TestVarInAggregateMisuse.py (1582 of 2049) UNSUPPORTED: lldb-api :: commands/expression/call-restarts/TestCallThatRestarts.py (1583 of 2049) PASS: lldb-api :: lang/cpp/rvalue-references/TestRvalueReferences.py (1584 of 2049) UNSUPPORTED: lldb-api :: python_api/event/TestEvents.py (1585 of 2049) PASS: lldb-api :: lang/objc/rdar-11355592/TestRdar11355592.py (1586 of 2049) PASS: lldb-unit :: Host/./HostTests/MainLoopTest.ReadObject (1587 of 2049) PASS: lldb-shell :: Driver/TestTarget.test (1588 of 2049) PASS: lldb-shell :: ObjectFile/ELF/section-types.yaml (1589 of 2049) PASS: lldb-api :: commands/expression/import-std-module/queue/TestQueueFromStdModule.py (1590 of 2049) PASS: lldb-api :: commands/expression/completion-crash-incomplete-record/TestCompletionCrashIncompleteRecord.py (1591 of 2049) PASS: lldb-api :: commands/expression/save_jit_objects/TestSaveJITObjects.py (1592 of 2049) PASS: lldb-unit :: Process/minidump/./LLDBMinidumpTests/MinidumpParserTest.FindMemoryRangeWithFullMemoryMinidump (1593 of 2049) PASS: lldb-unit :: Host/./HostTests/NativeProcessProtocolTest.ReadMemoryWithoutTrap (1594 of 2049) PASS: lldb-api :: functionalities/data-formatter/data-formatter-stl/libcxx/variant/TestDataFormatterLibcxxVariant.py (1595 of 2049) PASS: lldb-api :: iohandler/unicode/TestUnicode.py (1596 of 2049) PASS: lldb-unit :: Utility/./UtilityTests/OptionsWithRawTest.EmptyInput (1597 of 2049) PASS: lldb-api :: lang/objc/ptr_refs/TestPtrRefsObjC.py (1598 of 2049) PASS: lldb-api :: lang/objc/unicode-string/TestUnicodeString.py (1599 of 2049) PASS: lldb-unit :: SymbolFile/DWARF/./SymbolFileDWARFTests/SymbolFileDWARFTests.TestAbbrevInvalidNULLTag (1600 of 2049) PASS: lldb-unit :: Host/./HostTests/FileSystemTest.OpenErrno (1601 of 2049) PASS: lldb-unit :: Utility/./UtilityTests/VMRange.Ordering (1602 of 2049) PASS: lldb-shell :: SymbolFile/DWARF/DW_TAG_variable-DW_AT_const_value.s (1603 of 2049) PASS: lldb-api :: commands/expression/import-std-module/vector-of-vectors/TestVectorOfVectorsFromStdModule.py (1604 of 2049) PASS: lldb-unit :: Utility/./UtilityTests/OptionsWithRawTest.QuotedSuffix (1605 of 2049) PASS: lldb-api :: functionalities/data-formatter/parray/TestPrintArray.py (1606 of 2049) UNSUPPORTED: lldb-shell :: SymbolFile/PDB/function-level-linking.test (1607 of 2049) PASS: lldb-unit :: Utility/./UtilityTests/FileSpecTest.EqualDotsWindows (1608 of 2049) PASS: lldb-shell :: SymbolFile/NativePDB/bitfields.cpp (1609 of 2049) PASS: lldb-api :: functionalities/abbreviation/TestAbbreviations.py (1610 of 2049) PASS: lldb-api :: commands/expression/argument_passing_restrictions/TestArgumentPassingRestrictions.py (1611 of 2049) PASS: lldb-unit :: ScriptInterpreter/Python/./ScriptInterpreterPythonTests/PythonDataObjectsTest.TestPythonListManipulation (1612 of 2049) PASS: lldb-api :: functionalities/thread/concurrent_events/TestConcurrentSignalWatch.py (1613 of 2049) PASS: lldb-unit :: Target/./TargetTests/ModuleCacheTest.GetAndPutUuidExists (1614 of 2049) PASS: lldb-api :: lang/cpp/auto/TestCPPAuto.py (1615 of 2049) PASS: lldb-api :: python_api/sblaunchinfo/TestSBLaunchInfo.py (1616 of 2049) PASS: lldb-unit :: Language/Highlighting/./HighlighterTests/HighlighterTest.ClangScalarLiterals (1617 of 2049) UNSUPPORTED: lldb-shell :: SymbolFile/NativePDB/stack_unwinding01.cpp (1618 of 2049) PASS: lldb-unit :: Utility/./UtilityTests/VASprintfTest.EncodingError (1619 of 2049) PASS: lldb-unit :: Symbol/./SymbolTests/LineEntryTest.GetSameLineContiguousAddressRangeOneInline (1620 of 2049) PASS: lldb-unit :: Process/gdb-remote/./ProcessGdbRemoteTests/GDBRemoteCommunicationClientTest.GetMemoryRegionInfo (1621 of 2049) PASS: lldb-unit :: Utility/./UtilityTests/ArgsTest.TestQuotedUnknownEscape (1622 of 2049) PASS: lldb-unit :: ScriptInterpreter/Python/./ScriptInterpreterPythonTests/PythonDataObjectsTest.TestTypeNameResolutionNoDot (1623 of 2049) PASS: lldb-unit :: API/./APITests/SBCommandInterpreterTest.MultiWordCommand (1624 of 2049) PASS: lldb-api :: functionalities/thread/concurrent_events/TestConcurrentWatchpointWithDelayWatchpointThreads.py (1625 of 2049) PASS: lldb-unit :: Utility/./UtilityTests/StringListTest.SplitIntoLinesEmpty (1626 of 2049) PASS: lldb-unit :: Utility/./UtilityTests/ScalarTest.Comparison (1627 of 2049) PASS: lldb-unit :: Signals/./SignalsTests/UnixSignalsTest.GetInfo (1628 of 2049) PASS: lldb-shell :: SymbolFile/Breakpad/line-table-missing-file.test (1629 of 2049) PASS: lldb-shell :: SymbolFile/DWARF/dwp.s (1630 of 2049) PASS: lldb-unit :: Language/CPlusPlus/./LanguageCPlusPlusTests/CPlusPlusLanguage.FindAlternateFunctionManglings (1631 of 2049) PASS: lldb-unit :: Symbol/./SymbolTests/TestTypeSystemClang.TestDisplayName (1632 of 2049) PASS: lldb-api :: commands/settings/TestSettings.py (1633 of 2049) UNSUPPORTED: lldb-api :: lang/c/typedef/Testtypedef.py (1634 of 2049) PASS: lldb-api :: python_api/lldbutil/iter/TestRegistersIterator.py (1635 of 2049) PASS: lldb-shell :: Driver/TestNoUseColor.test (1636 of 2049) PASS: lldb-api :: lang/c/offsetof/TestOffsetof.py (1637 of 2049) PASS: lldb-shell :: SymbolFile/NativePDB/break-by-function.cpp (1638 of 2049) PASS: lldb-unit :: Utility/./UtilityTests/SerializationRountripTest.SerializeDeserializePodReferences (1639 of 2049) PASS: lldb-api :: lang/objc/modules-update/TestClangModulesUpdate.py (1640 of 2049) PASS: lldb-api :: commands/frame/var/TestFrameVar.py (1641 of 2049) PASS: lldb-api :: commands/expression/multiline-navigation/TestMultilineNavigation.py (1642 of 2049) PASS: lldb-shell :: SymbolFile/DWARF/split-dwarf-inlining.cpp (1643 of 2049) PASS: lldb-unit :: Host/./HostTests/FileSystemTest.GetPermissions (1644 of 2049) PASS: lldb-api :: functionalities/tail_call_frames/sbapi_support/TestTailCallFrameSBAPI.py (1645 of 2049) PASS: lldb-unit :: Utility/./UtilityTests/StringListTest.InsertStringAtIndexOutOfBounds (1646 of 2049) PASS: lldb-unit :: Utility/./UtilityTests/FileSpecTest.EqualSeparator (1647 of 2049) PASS: lldb-shell :: Register/x86-64-read.test (1648 of 2049) PASS: lldb-api :: functionalities/breakpoint/scripted_bkpt/TestScriptedResolver.py (1649 of 2049) PASS: lldb-api :: commands/platform/basic/TestPlatformPython.py (1650 of 2049) PASS: lldb-unit :: Utility/./UtilityTests/RangeTest.NotEqual (1651 of 2049) PASS: lldb-api :: commands/expression/import-std-module/forward_list-dbg-info-content/TestDbgInfoContentForwardListFromStdModule.py (1652 of 2049) PASS: lldb-api :: functionalities/data-formatter/data-formatter-stl/libcxx/queue/TestDataFormatterLibcxxQueue.py (1653 of 2049) UNSUPPORTED: lldb-shell :: Register/x86-64-xmm16-read.test (1654 of 2049) PASS: lldb-api :: lang/c/local_variables/TestLocalVariables.py (1655 of 2049) UNSUPPORTED: lldb-api :: functionalities/longjmp/TestLongjmp.py (1656 of 2049) PASS: lldb-api :: functionalities/tail_call_frames/disambiguate_tail_call_seq/TestDisambiguateTailCallSeq.py (1657 of 2049) PASS: lldb-shell :: Reproducer/Functionalities/TestDataFormatter.test (1658 of 2049) PASS: lldb-api :: functionalities/data-formatter/data-formatter-stl/libcxx/forward_list/TestDataFormatterLibcxxForwardList.py (1659 of 2049) XFAIL: lldb-shell :: Unwind/prefer-debug-over-eh-frame.test (1660 of 2049) PASS: lldb-api :: functionalities/data-formatter/data-formatter-objc/nsindexpath/TestDataFormatterNSIndexPath.py (1661 of 2049) PASS: lldb-api :: lang/cpp/gmodules-templates/TestGModules.py (1662 of 2049) PASS: lldb-unit :: ScriptInterpreter/Python/./ScriptInterpreterPythonTests/PythonDataObjectsTest.TestOwnedReferences (1663 of 2049) UNSUPPORTED: lldb-shell :: SymbolFile/PDB/typedefs.test (1664 of 2049) PASS: lldb-api :: python_api/disassemble-raw-data/TestDisassemble_VST1_64.py (1665 of 2049) PASS: lldb-unit :: DataFormatter/./LLDBFormatterTests/StringPrinterTests.CxxUTF8 (1666 of 2049) PASS: lldb-unit :: Utility/./UtilityTests/RangeTest.ContainsAddrInvalid (1667 of 2049) PASS: lldb-unit :: Target/./TargetTests/MCBasedABI.MapRegisterName (1668 of 2049) PASS: lldb-unit :: Utility/./UtilityTests/RegularExpression.CopyAssignment (1669 of 2049) PASS: lldb-api :: functionalities/data-formatter/data-formatter-stl/libcxx/iterator/TestDataFormatterLibccIterator.py (1670 of 2049) UNSUPPORTED: lldb-api :: commands/expression/macros/TestMacros.py (1671 of 2049) PASS: lldb-unit :: Utility/./UtilityTests/RangeTest.ContainsEndInclusive (1672 of 2049) PASS: lldb-unit :: Expression/./ExpressionTests/DiagnosticManagerTest.PutStringMultiple (1673 of 2049) PASS: lldb-unit :: Utility/./UtilityTests/DataExtractorTest.PeekData (1674 of 2049) PASS: lldb-api :: commands/expression/dont_allow_jit/TestAllowJIT.py (1675 of 2049) PASS: lldb-unit :: Utility/./UtilityTests/LogTest.Unregister (1676 of 2049) PASS: lldb-unit :: SymbolFile/NativePDB/./SymbolFileNativePDBTests/PDBFPOProgramToDWARFExpressionTests.UnknownOp (1677 of 2049) PASS: lldb-api :: types/TestShortTypeExpr.py (1678 of 2049) PASS: lldb-shell :: SymbolFile/DWARF/debug_line-relative_path.s (1679 of 2049) PASS: lldb-api :: lang/objc/modules-auto-import/TestModulesAutoImport.py (1680 of 2049) PASS: lldb-api :: lang/c/bitfields/TestBitfields.py (1681 of 2049) PASS: lldb-unit :: Expression/./ExpressionTests/DiagnosticManagerTest.AppendMessageSubsequentDiags (1682 of 2049) PASS: lldb-unit :: Symbol/./SymbolTests/TestTypeSystemClang.TestGetBasicTypeFromName (1683 of 2049) PASS: lldb-api :: functionalities/thread/state_after_expression/TestStateAfterExpression.py (1684 of 2049) PASS: lldb-api :: functionalities/step-avoids-no-debug/TestStepNoDebug.py (1685 of 2049) PASS: lldb-api :: functionalities/deleted-executable/TestDeletedExecutable.py (1686 of 2049) PASS: lldb-unit :: UnwindAssembly/x86/./UnwindAssemblyx86Tests/Testx86AssemblyInspectionEngine.TestStackRealign32BitDisp_x86_64 (1687 of 2049) PASS: lldb-api :: lang/cpp/char1632_t/TestChar1632T.py (1688 of 2049) PASS: lldb-shell :: Unwind/eh-frame-dwarf-unwind.test (1689 of 2049) PASS: lldb-api :: functionalities/ubsan/basic/TestUbsanBasic.py (1690 of 2049) PASS: lldb-unit :: Interpreter/./InterpreterTests/OptionArgParserTest.toScriptLanguage (1691 of 2049) PASS: lldb-unit :: Host/./HostTests/HostInfoTest.GetHostname (1692 of 2049) PASS: lldb-shell :: SymbolFile/NativePDB/nested-types.cpp (1693 of 2049) PASS: lldb-unit :: Utility/./UtilityTests/DataExtractorTest.GetMaxU64_unchecked (1694 of 2049) PASS: lldb-unit :: Utility/./UtilityTests/ArgsTest.TestQuotedTrailingBackslash (1695 of 2049) PASS: lldb-unit :: Utility/./UtilityTests/EnvironmentTest.EnvpConversion (1696 of 2049) PASS: lldb-unit :: Utility/./UtilityTests/StringExtractorTest.GetHexU8_Underflow2 (1697 of 2049) PASS: lldb-shell :: ScriptInterpreter/Lua/bindings.test (1698 of 2049) PASS: lldb-unit :: Utility/./UtilityTests/OptionsWithRawTest.SingleWhitespaceInput (1699 of 2049) PASS: lldb-api :: functionalities/thread/concurrent_events/TestConcurrentSignalDelayBreak.py (1700 of 2049) PASS: lldb-api :: commands/expression/import_builtin_fileid/TestImportBuiltinFileID.py (1701 of 2049) PASS: lldb-shell :: SymbolFile/DWARF/dir-separator-no-comp-dir-relative-name.s (1702 of 2049) PASS: lldb-unit :: Utility/./UtilityTests/LogChannelTest.Enable (1703 of 2049) PASS: lldb-shell :: ObjectFile/ELF/base-address.yaml (1704 of 2049) PASS: lldb-api :: lang/objc/foundation/TestObjectDescriptionAPI.py (1705 of 2049) UNSUPPORTED: lldb-api :: linux/mix-dwo-and-regular-objects/TestMixedDwarfBinary.py (1706 of 2049) PASS: lldb-api :: functionalities/data-formatter/cstring-utf8-summary/TestCstringUnicode.py (1707 of 2049) PASS: lldb-unit :: Utility/./UtilityTests/RangeTest.DefaultConstructor (1708 of 2049) UNSUPPORTED: lldb-shell :: Register/x86-gp-write.test (1709 of 2049) PASS: lldb-shell :: SymbolFile/NativePDB/function-types-builtins.cpp (1710 of 2049) PASS: lldb-unit :: Utility/./UtilityTests/StreamTeeTest.CopyConstructor (1711 of 2049) PASS: lldb-api :: functionalities/breakpoint/breakpoint_conditions/TestBreakpointConditions.py (1712 of 2049) PASS: lldb-unit :: Utility/./UtilityTests/ArgsTest.ReplaceArgumentAtIndexShort (1713 of 2049) PASS: lldb-api :: terminal/TestEditline.py (1714 of 2049) PASS: lldb-api :: functionalities/testid/TestTestId.py (1715 of 2049) PASS: lldb-unit :: Host/./HostTests/MainLoopTest.TerminatesImmediately (1716 of 2049) PASS: lldb-shell :: Breakpoint/implicit_const_form_support.test (1717 of 2049) PASS: lldb-api :: functionalities/pointer_num_children/TestPointerNumChildren.py (1718 of 2049) PASS: lldb-shell :: Minidump/dump-all.test (1719 of 2049) UNSUPPORTED: lldb-api :: functionalities/thread/concurrent_events/TestConcurrentManySignals.py (1720 of 2049) PASS: lldb-unit :: Utility/./UtilityTests/BinaryStreamTest.PutULEB128TwoBytes (1721 of 2049) PASS: lldb-api :: api/listeners/TestListener.py (1722 of 2049) PASS: lldb-unit :: Utility/./UtilityTests/FileSpecTest.Yaml (1723 of 2049) PASS: lldb-api :: functionalities/pre_run_dylibs/TestPreRunDylibs.py (1724 of 2049) PASS: lldb-unit :: Host/./HostTests/SocketAddressTest.Set (1725 of 2049) PASS: lldb-api :: functionalities/breakpoint/breakpoint_ids/TestBreakpointIDs.py (1726 of 2049) PASS: lldb-unit :: ObjectFile/Breakpad/./ObjectFileBreakpadTests/LineRecord.parse (1727 of 2049) PASS: lldb-api :: tools/lldb-vscode/variables/TestVSCode_variables.py (1728 of 2049) UNSUPPORTED: lldb-api :: benchmarks/libcxxlist/TestBenchmarkLibcxxList.py (1729 of 2049) PASS: lldb-api :: lang/cpp/operator-overload/TestOperatorOverload.py (1730 of 2049) UNSUPPORTED: lldb-api :: lang/objc/bitfield_ivars/TestBitfieldIvars.py (1731 of 2049) PASS: lldb-unit :: Utility/./UtilityTests/StreamTest.PutCStringWithStringRef (1732 of 2049) PASS: lldb-unit :: Host/./HostTests/ProcessLaunchInfoTest.Constructor (1733 of 2049) PASS: lldb-api :: commands/process/attach/attach_denied/TestAttachDenied.py (1734 of 2049) PASS: lldb-unit :: Utility/./UtilityTests/RecordReplayTest.InstrumentedBarPtr (1735 of 2049) PASS: lldb-api :: functionalities/data-formatter/data-formatter-stl/libcxx/list/loop/TestDataFormatterLibcxxListLoop.py (1736 of 2049) PASS: lldb-unit :: Utility/./UtilityTests/VMRange.CollectionContains (1737 of 2049) PASS: lldb-unit :: Utility/./UtilityTests/SubsystemRAIITest.SubsystemWithErrorSuccess (1738 of 2049) PASS: lldb-api :: functionalities/data-formatter/data-formatter-enum-format/TestDataFormatterEnumFormat.py (1739 of 2049) PASS: lldb-shell :: Reproducer/TestCrash.test (1740 of 2049) PASS: lldb-unit :: Symbol/./SymbolTests/Type.GetTypeScopeAndBasename (1741 of 2049) UNSUPPORTED: lldb-api :: functionalities/darwin_log/filter/exact_match/subsystem/TestDarwinLogFilterMatchSubsystem.py (1742 of 2049) PASS: lldb-unit :: Utility/./UtilityTests/ArgsTest.TestSingleArg (1743 of 2049) PASS: lldb-api :: lang/objc/rdar-10967107/TestRdar10967107.py (1744 of 2049) PASS: lldb-unit :: SymbolFile/DWARF/./SymbolFileDWARFTests/XcodeSDKModuleTests.TestModuleGetXcodeSDK (1745 of 2049) PASS: lldb-unit :: Host/./HostTests/FileSystemTest.MakeAbsolute (1746 of 2049) PASS: lldb-api :: functionalities/thread/concurrent_events/TestConcurrentSignalWatchBreak.py (1747 of 2049) PASS: lldb-unit :: Utility/./UtilityTests/GeneratorTest.Create (1748 of 2049) PASS: lldb-api :: lang/objc/objc-super/TestObjCSuper.py (1749 of 2049) PASS: lldb-shell :: SymbolFile/DWARF/dir-separator-posix.s (1750 of 2049) PASS: lldb-shell :: SymbolFile/DWARF/dir-separator-no-comp-dir.s (1751 of 2049) PASS: lldb-api :: functionalities/data-formatter/summary-string-onfail/Test-rdar-9974002.py (1752 of 2049) PASS: lldb-api :: functionalities/thread/concurrent_events/TestConcurrentTwoBreakpointsOneDelaySignal.py (1753 of 2049) PASS: lldb-unit :: Utility/./UtilityTests/StringExtractorTest.GetNameColonValueContainsColon (1754 of 2049) PASS: lldb-unit :: Utility/./UtilityTests/ArgsTest.TestUnknownEscape (1755 of 2049) PASS: lldb-unit :: Utility/./UtilityTests/StringListTest.CopyListEmpty (1756 of 2049) PASS: lldb-shell :: Driver/TestCore.test (1757 of 2049) UNSUPPORTED: lldb-shell :: Register/x86-zmm-read.test (1758 of 2049) PASS: lldb-unit :: Utility/./UtilityTests/StringExtractorTest.GetU32BigEndian (1759 of 2049) PASS: lldb-api :: macosx/find-dsym/bundle-with-dot-in-filename/TestBundleWithDotInFilename.py (1760 of 2049) PASS: lldb-unit :: Core/./LLDBCoreTests/UniqueCStringMap.NoDefaultConstructor (1761 of 2049) PASS: lldb-unit :: ScriptInterpreter/Python/./ScriptInterpreterPythonTests/PythonDataObjectsTest.TestDictionaryResolutionWithDot (1762 of 2049) XFAIL: lldb-shell :: Register/x86-64-write.test (1763 of 2049) PASS: lldb-unit :: Expression/./ExpressionTests/CppModuleConfigurationTest.MissingLibCpp (1764 of 2049) PASS: lldb-shell :: ObjectFile/PECOFF/basic-info.yaml (1765 of 2049) PASS: lldb-unit :: Utility/./UtilityTests/UriParserTest.SchemeHostSeparator2 (1766 of 2049) PASS: lldb-api :: lang/objc/objc-static-method-stripped/TestObjCStaticMethodStripped.py (1767 of 2049) PASS: lldb-api :: functionalities/thread/concurrent_events/TestConcurrentTwoWatchpointsOneDelayBreakpoint.py (1768 of 2049) UNSUPPORTED: lldb-shell :: SymbolFile/PDB/pointers.test (1769 of 2049) PASS: lldb-unit :: ScriptInterpreter/Python/./ScriptInterpreterPythonTests/PythonDataObjectsTest.TestCallable (1770 of 2049) PASS: lldb-unit :: Utility/./UtilityTests/CompletionRequest.ShiftArguments (1771 of 2049) PASS: lldb-shell :: SymbolFile/DWARF/dwarf5-debug_line.s (1772 of 2049) PASS: lldb-api :: python_api/lldbutil/iter/TestLLDBIterator.py (1773 of 2049) PASS: lldb-api :: python_api/lldbutil/frame/TestFrameUtils.py (1774 of 2049) PASS: lldb-api :: python_api/process/io/TestProcessIO.py (1775 of 2049) UNSUPPORTED: lldb-api :: lang/objc/objc-dynamic-value/TestObjCDynamicValue.py (1776 of 2049) PASS: lldb-unit :: UnwindAssembly/x86/./UnwindAssemblyx86Tests/Testx86AssemblyInspectionEngine.TestSpillRegToStackViaMOVi386 (1777 of 2049) PASS: lldb-unit :: Utility/./UtilityTests/StringLexerTest.Peek (1778 of 2049) PASS: lldb-unit :: debugserver/./debugserverTests/RNBSocket.LoopBackConnectIPv4 (1779 of 2049) PASS: lldb-unit :: Utility/./UtilityTests/StatusTest.ErrorCodeConstructor (1780 of 2049) UNSUPPORTED: lldb-api :: benchmarks/startup/TestStartupDelays.py (1781 of 2049) PASS: lldb-api :: functionalities/data-formatter/compactvectors/TestCompactVectors.py (1782 of 2049) PASS: lldb-shell :: ExecControl/StopHook/stop-hook.test (1783 of 2049) PASS: lldb-unit :: Host/./HostTests/Host.GetEnvironment (1784 of 2049) PASS: lldb-unit :: ScriptInterpreter/Python/./ScriptInterpreterPythonTests/PythonDataObjectsTest.TestModuleNameResolutionNoDot (1785 of 2049) PASS: lldb-api :: functionalities/history/TestHistoryRecall.py (1786 of 2049) PASS: lldb-shell :: ObjectFile/ELF/many-sections.s (1787 of 2049) PASS: lldb-api :: functionalities/data-formatter/data-formatter-skip-summary/TestDataFormatterSkipSummary.py (1788 of 2049) PASS: lldb-api :: functionalities/data-formatter/nsarraysynth/TestNSArraySynthetic.py (1789 of 2049) PASS: lldb-api :: lang/c/struct_types/TestStructTypes.py (1790 of 2049) PASS: lldb-unit :: Utility/./UtilityTests/DataExtractorTest.GetMaxS64 (1791 of 2049) PASS: lldb-api :: tools/lldb-vscode/breakpoint/TestVSCode_setFunctionBreakpoints.py (1792 of 2049) PASS: lldb-api :: functionalities/data-formatter/setvaluefromcstring/TestSetValueFromCString.py (1793 of 2049) PASS: lldb-unit :: Expression/./ExpressionTests/DiagnosticManagerTest.GetStringPreserveOrder (1794 of 2049) PASS: lldb-api :: lang/c/function_types/TestFunctionTypes.py (1795 of 2049) PASS: lldb-shell :: SymbolFile/NativePDB/global-classes.cpp (1796 of 2049) PASS: lldb-api :: lang/cpp/signed_types/TestSignedTypes.py (1797 of 2049) PASS: lldb-api :: python_api/hello_world/TestHelloWorld.py (1798 of 2049) PASS: lldb-api :: python_api/watchpoint/condition/TestWatchpointConditionAPI.py (1799 of 2049) UNSUPPORTED: lldb-api :: lang/cpp/printf/TestPrintf.py (1800 of 2049) PASS: lldb-unit :: Utility/./UtilityTests/ArchSpecTest.YAML (1801 of 2049) PASS: lldb-unit :: Signals/./SignalsTests/UnixSignalsTest.VersionChange (1802 of 2049) PASS: lldb-api :: functionalities/asan/TestReportData.py (1803 of 2049) UNSUPPORTED: lldb-api :: functionalities/data-formatter/data-formatter-stl/libstdcpp/vbool/TestDataFormatterStdVBool.py (1804 of 2049) PASS: lldb-api :: functionalities/gdb_remote_client/TestRestartBug.py (1805 of 2049) PASS: lldb-api :: functionalities/data-formatter/data-formatter-stl/libcxx/list/TestDataFormatterLibcxxList.py (1806 of 2049) PASS: lldb-api :: lang/c/stepping/TestThreadStepping.py (1807 of 2049) PASS: lldb-unit :: UnwindAssembly/x86/./UnwindAssemblyx86Tests/Testx86AssemblyInspectionEngine.TestSpillRegToStackViaMOVx86_64 (1808 of 2049) PASS: lldb-api :: commands/process/attach-resume/TestAttachResume.py (1809 of 2049) PASS: lldb-unit :: Utility/./UtilityTests/StringExtractorTest.DecodeHexU8_InvalidHex2 (1810 of 2049) PASS: lldb-unit :: Utility/./UtilityTests/ConstStringTest.FromMidOfBufferStringRef (1811 of 2049) PASS: lldb-unit :: ScriptInterpreter/Python/./ScriptInterpreterPythonTests/PythonDataObjectsTest.TestPythonDictionaryValueEquality (1812 of 2049) PASS: lldb-api :: api/log/TestAPILog.py (1813 of 2049) PASS: lldb-unit :: Utility/./UtilityTests/OptionsWithRawTest.MultiWordSuffix (1814 of 2049) PASS: lldb-shell :: Driver/LocalLLDBInit.test (1815 of 2049) PASS: lldb-api :: functionalities/data-formatter/data-formatter-stl/libcxx/optional/TestDataFormatterLibcxxOptional.py (1816 of 2049) PASS: lldb-unit :: Utility/./UtilityTests/AnsiTerminal.Empty (1817 of 2049) PASS: lldb-api :: functionalities/asan/TestMemoryHistory.py (1818 of 2049) PASS: lldb-unit :: Utility/./UtilityTests/CompletionRequest.Constructor (1819 of 2049) PASS: lldb-unit :: Utility/./UtilityTests/UriParserTest.TypicalPortPathIPv6 (1820 of 2049) PASS: lldb-unit :: Symbol/./SymbolTests/PostfixExpression.ParseOneExpression (1821 of 2049) UNSUPPORTED: lldb-shell :: SymbolFile/PDB/variables-locations.test (1822 of 2049) PASS: lldb-api :: functionalities/recursion/TestValueObjectRecursion.py (1823 of 2049) PASS: lldb-unit :: Language/Highlighting/./HighlighterTests/HighlighterTest.ClangTrailingBackslashWithWhitespace (1824 of 2049) PASS: lldb-api :: lang/cpp/enum_types/TestCPP11EnumTypes.py (1825 of 2049) PASS: lldb-shell :: Reproducer/TestDump.test (1826 of 2049) PASS: lldb-api :: commands/watchpoints/watchpoint_size/TestWatchpointSizes.py (1827 of 2049) PASS: lldb-unit :: Utility/./UtilityTests/RangeTest.LessThanInvalid (1828 of 2049) PASS: lldb-unit :: Utility/./UtilityTests/ArchSpecTest.Compatibility (1829 of 2049) PASS: lldb-api :: functionalities/param_entry_vals/basic_entry_values/TestBasicEntryValues.py (1830 of 2049) PASS: lldb-shell :: SymbolFile/DWARF/debug_loc.s (1831 of 2049) PASS: lldb-api :: lang/cpp/char8_t/TestCxxChar8_t.py (1832 of 2049) PASS: lldb-unit :: Utility/./UtilityTests/RangeTest.LessThan (1833 of 2049) PASS: lldb-unit :: ObjectFile/PECOFF/./ObjectFilePECOFFTests/PECallFrameInfoTest.Frame_reg_eh (1834 of 2049) UNSUPPORTED: lldb-api :: tools/lldb-server/libraries-svr4/TestGdbRemoteLibrariesSvr4Support.py (1835 of 2049) PASS: lldb-api :: functionalities/gdb_remote_client/TestGDBRemoteLoad.py (1836 of 2049) PASS: lldb-unit :: Utility/./UtilityTests/ArgsTest.TestSingleQuotedArgWithSpace (1837 of 2049) PASS: lldb-unit :: Utility/./UtilityTests/StringExtractorTest.GetHexBytes_Partial (1838 of 2049) PASS: lldb-api :: functionalities/data-formatter/data-formatter-synth/TestDataFormatterSynth.py (1839 of 2049) PASS: lldb-unit :: Utility/./UtilityTests/RangeTest.DoesAdjoinOrIntersect (1840 of 2049) PASS: lldb-unit :: Signals/./SignalsTests/UnixSignalsTest.GetFilteredSignals (1841 of 2049) PASS: lldb-unit :: Utility/./UtilityTests/BinaryStreamTest.PutULEB128MaxValue (1842 of 2049) PASS: lldb-unit :: Utility/./UtilityTests/StreamTest.PutHex32ByteOrderLittle (1843 of 2049) PASS: lldb-unit :: Utility/./UtilityTests/RangeTest.SizeTypes (1844 of 2049) PASS: lldb-unit :: Process/minidump/./LLDBMinidumpTests/MinidumpParserTest.GetMemoryRegionInfoLinuxMaps (1845 of 2049) PASS: lldb-api :: python_api/sbenvironment/TestSBEnvironment.py (1846 of 2049) PASS: lldb-shell :: Breakpoint/debug_addrx.test (1847 of 2049) PASS: lldb-api :: functionalities/data-formatter/nsdictionarysynth/TestNSDictionarySynthetic.py (1848 of 2049) PASS: lldb-shell :: Quit/TestQuitExitCode30.test (1849 of 2049) PASS: lldb-api :: functionalities/inferior-assert/TestInferiorAssert.py (1850 of 2049) PASS: lldb-api :: python_api/target/TestTargetAPI.py (1851 of 2049) PASS: lldb-unit :: Utility/./UtilityTests/StringListTest.RemoveBlankLines (1852 of 2049) PASS: lldb-api :: commands/expression/namespace_local_var_same_name_obj_c/TestNamespaceLocalVarSameNameObjC.py (1853 of 2049) PASS: lldb-api :: commands/expression/import-std-module/shared_ptr/TestSharedPtrFromStdModule.py (1854 of 2049) PASS: lldb-api :: iohandler/resize/TestIOHandlerResize.py (1855 of 2049) PASS: lldb-api :: commands/watchpoints/step_over_watchpoint/TestStepOverWatchpoint.py (1856 of 2049) PASS: lldb-unit :: Utility/./UtilityTests/BinaryStreamTest.PutSLEB128OneByte (1857 of 2049) PASS: lldb-shell :: ObjectFile/ELF/gnu-debuglink.yaml (1858 of 2049) PASS: lldb-api :: lang/c/shared_lib/TestSharedLib.py (1859 of 2049) PASS: lldb-api :: lang/objc/objc-ivar-protocols/TestIvarProtocols.py (1860 of 2049) PASS: lldb-api :: lang/cpp/diamond/TestDiamond.py (1861 of 2049) PASS: lldb-api :: functionalities/fat_archives/TestFatArchives.py (1862 of 2049) PASS: lldb-shell :: SymbolFile/Breakpad/line-table-discontinuous-file-ids.test (1863 of 2049) PASS: lldb-unit :: Utility/./UtilityTests/BinaryStreamTest.PutULEB128Zero (1864 of 2049) PASS: lldb-shell :: Commands/command-target-modules-dump-sections.yaml (1865 of 2049) PASS: lldb-unit :: Process/minidump/./LLDBMinidumpTests/MinidumpParserTest.MinidumpModuleOrder (1866 of 2049) PASS: lldb-unit :: Process/minidump/./LLDBMinidumpTests/MinidumpParserTest.GetMemoryRegionInfoFromMemory64List (1867 of 2049) PASS: lldb-api :: functionalities/thread/concurrent_events/TestConcurrentTwoBreakpointsOneWatchpoint.py (1868 of 2049) PASS: lldb-unit :: Symbol/./SymbolTests/TestClangASTImporter.MetadataPropagationIndirectImport (1869 of 2049) PASS: lldb-api :: commands/log/basic/TestLogging.py (1870 of 2049) PASS: lldb-shell :: ObjectFile/ELF/short-build-id.yaml (1871 of 2049) PASS: lldb-shell :: Host/TestCustomShell.test (1872 of 2049) PASS: lldb-unit :: Symbol/./SymbolTests/TestClangASTImporter.CopyTypeTagDecl (1873 of 2049) PASS: lldb-unit :: ScriptInterpreter/Python/./ScriptInterpreterPythonTests/PythonDataObjectsTest.TestPythonByteArray (1874 of 2049) PASS: lldb-unit :: Utility/./UtilityTests/PassiveReplayTest.InstrumentedBar (1875 of 2049) PASS: lldb-api :: python_api/sbvalue_persist/TestSBValuePersist.py (1876 of 2049) PASS: lldb-unit :: Core/./LLDBCoreTests/RichManglingContextTest.SwitchProvider (1877 of 2049) UNSUPPORTED: lldb-api :: tools/lldb-server/platform-process-connect/TestPlatformProcessConnect.py (1878 of 2049) PASS: lldb-api :: functionalities/data-formatter/data-formatter-objc/TestDataFormatterObjCNSURL.py (1879 of 2049) PASS: lldb-unit :: SymbolFile/NativePDB/./SymbolFileNativePDBTests/PDBFPOProgramToDWARFExpressionTests.DependencyChain (1880 of 2049) PASS: lldb-api :: lang/objc/objc-struct-return/TestObjCStructReturn.py (1881 of 2049) PASS: lldb-unit :: Utility/./UtilityTests/RangeDataVector.FindEntryThatContains_Overlap (1882 of 2049) PASS: lldb-unit :: Utility/./UtilityTests/OptionsWithRawTest.EmptySuffixSingleWhitespace (1883 of 2049) PASS: lldb-api :: functionalities/thread/concurrent_events/TestConcurrentWatchBreak.py (1884 of 2049) PASS: lldb-unit :: Host/./HostTests/File.GetWaitableHandleFileno (1885 of 2049) PASS: lldb-unit :: Utility/./UtilityTests/StringListTest.PopBack (1886 of 2049) UNSUPPORTED: lldb-shell :: BuildScript/toolchain-clang-cl.test (1887 of 2049) PASS: lldb-api :: functionalities/signal/handle-abrt/TestHandleAbort.py (1888 of 2049) PASS: lldb-unit :: Language/Highlighting/./HighlighterTests/HighlighterTest.HighlighterSelectionPath (1889 of 2049) PASS: lldb-shell :: Reproducer/TestWorkingDir.test (1890 of 2049) PASS: lldb-api :: commands/expression/import-std-module/unique_ptr/TestUniquePtrFromStdModule.py (1891 of 2049) PASS: lldb-api :: lang/cpp/accelerator-table/TestCPPAccelerator.py (1892 of 2049) PASS: lldb-unit :: UnwindAssembly/x86/./UnwindAssemblyx86Tests/Testx86AssemblyInspectionEngine.TestSubRSP (1893 of 2049) PASS: lldb-unit :: Utility/./UtilityTests/ArgsTest.TestMultipleArgs (1894 of 2049) PASS: lldb-api :: lang/cpp/trivial_abi/TestTrivialABI.py (1895 of 2049) PASS: lldb-api :: types/TestShortType.py (1896 of 2049) PASS: lldb-api :: tools/lldb-vscode/console/TestVSCode_console.py (1897 of 2049) PASS: lldb-unit :: UnwindAssembly/x86/./UnwindAssemblyx86Tests/Testx86AssemblyInspectionEngine.TestSimplei386ugmented (1898 of 2049) PASS: lldb-unit :: Utility/./UtilityTests/UriParserTest.TypicalPortPathIPv4 (1899 of 2049) PASS: lldb-unit :: Utility/./UtilityTests/StreamTest.PutCharWhitespace (1900 of 2049) PASS: lldb-shell :: Driver/TestCommands.test (1901 of 2049) PASS: lldb-api :: lang/objc/self/TestObjCSelf.py (1902 of 2049) PASS: lldb-shell :: ObjectFile/ELF/avr-basic-info.yaml (1903 of 2049) PASS: lldb-api :: api/multiple-targets/TestMultipleTargets.py (1904 of 2049) PASS: lldb-api :: functionalities/breakpoint/hardware_breakpoints/hardware_breakpoint_on_multiple_threads/TestHWBreakMultiThread.py (1905 of 2049) PASS: lldb-shell :: SymbolFile/DWARF/find-variable-file.cpp (1906 of 2049) PASS: lldb-api :: functionalities/data-formatter/data-formatter-stl/libcxx/initializerlist/TestInitializerList.py (1907 of 2049) PASS: lldb-unit :: Utility/./UtilityTests/StreamTest.PutMaxHex64ByteOrderBig (1908 of 2049) PASS: lldb-api :: python_api/signals/TestSignalsAPI.py (1909 of 2049) PASS: lldb-shell :: ScriptInterpreter/Lua/nested_sessions.test (1910 of 2049) PASS: lldb-unit :: Language/Highlighting/./HighlighterTests/HighlighterTest.ClangCursorPosInOtherToken (1911 of 2049) PASS: lldb-shell :: Commands/command-thread-select.test (1912 of 2049) PASS: lldb-api :: types/TestLongTypes.py (1913 of 2049) PASS: lldb-unit :: Process/gdb-remote/./ProcessGdbRemoteTests/GDBRemoteClientBaseTest.SendContinueAndAsyncSignal (1914 of 2049) PASS: lldb-api :: lang/objc/blocks/TestObjCIvarsInBlocks.py (1915 of 2049) PASS: lldb-api :: lang/cpp/operators/TestCppOperators.py (1916 of 2049) PASS: lldb-unit :: Utility/./UtilityTests/DataExtractorTest.GetCStrEmpty (1917 of 2049) PASS: lldb-unit :: Process/gdb-remote/./ProcessGdbRemoteTests/GDBRemoteCommunicationClientTest.TestPacketSpeedJSON (1918 of 2049) PASS: lldb-unit :: Utility/./UtilityTests/RecordReplayTest.InstrumentedBar (1919 of 2049) PASS: lldb-api :: lang/objc/print-obj/TestPrintObj.py (1920 of 2049) PASS: lldb-unit :: Utility/./UtilityTests/StringExtractorTest.GetHexU8_Extra_NoEof (1921 of 2049) UNSUPPORTED: lldb-api :: functionalities/data-formatter/data-formatter-stl/libstdcpp/map/TestDataFormatterStdMap.py (1922 of 2049) PASS: lldb-shell :: SymbolFile/DWARF/debug-types-basic.test (1923 of 2049) PASS: lldb-unit :: Utility/./UtilityTests/Predicate.WaitForValueEqualTo (1924 of 2049) PASS: lldb-unit :: Language/Highlighting/./HighlighterTests/HighlighterTest.ClangIdentifiers (1925 of 2049) PASS: lldb-shell :: Commands/command-disassemble-process.yaml (1926 of 2049) UNSUPPORTED: lldb-shell :: ExecControl/StopHook/stop-hook-threads.test (1927 of 2049) PASS: lldb-unit :: Utility/./UtilityTests/StreamTest.ShiftOperatorStrings (1928 of 2049) PASS: lldb-api :: lang/objc/objc-ivar-stripped/TestObjCIvarStripped.py (1929 of 2049) PASS: lldb-unit :: Expression/./ExpressionTests/CppModuleConfigurationTest.Linux (1930 of 2049) PASS: lldb-api :: functionalities/breakpoint/cpp_exception/TestCPPExceptionBreakpoint.py (1931 of 2049) PASS: lldb-unit :: ScriptInterpreter/Python/./ScriptInterpreterPythonTests/PythonDataObjectsTest.TestPythonInteger (1932 of 2049) PASS: lldb-shell :: Quit/TestQuitExitCodeHexA.test (1933 of 2049) PASS: lldb-unit :: Utility/./UtilityTests/FileSpecTest.EqualDotsPosix (1934 of 2049) PASS: lldb-unit :: UnwindAssembly/PPC64/./PPC64InstEmulationTests/TestPPC64InstEmulation.TestMediumFunction (1935 of 2049) PASS: lldb-unit :: Utility/./UtilityTests/ConstStringTest.CompareStringRef (1936 of 2049) PASS: lldb-unit :: SymbolFile/DWARF/./SymbolFileDWARFTests/SymbolFileDWARFTests.TestAbbrevOrder1Start1 (1937 of 2049) PASS: lldb-shell :: SymbolFile/DWARF/array-sizes.s (1938 of 2049) PASS: lldb-api :: functionalities/exec/TestExec.py (1939 of 2049) PASS: lldb-unit :: Language/Highlighting/./HighlighterTests/HighlighterTest.DefaultHighlighterWithCursor (1940 of 2049) PASS: lldb-unit :: Process/gdb-remote/./ProcessGdbRemoteTests/GDBRemoteCommunicationServerTest.SendErrorResponse_ErrorNumber (1941 of 2049) PASS: lldb-unit :: Utility/./UtilityTests/RecordReplayTest.InstrumentedFooSameThis (1942 of 2049) PASS: lldb-api :: functionalities/thread/concurrent_events/TestConcurrentBreakpointOneDelayBreakpointThreads.py (1943 of 2049) PASS: lldb-api :: functionalities/thread/concurrent_events/TestConcurrentTwoWatchpointsOneBreakpoint.py (1944 of 2049) PASS: lldb-api :: tools/lldb-vscode/breakpoint/TestVSCode_setExceptionBreakpoints.py (1945 of 2049) PASS: lldb-unit :: Symbol/./SymbolTests/TestTypeSystemClang.TestGetEnumIntegerTypeBasicTypes (1946 of 2049) UNSUPPORTED: lldb-api :: lang/cpp/function-template-parameter-pack/TestFunctionTemplateParameterPack.py (1947 of 2049) PASS: lldb-unit :: Process/gdb-remote/./ProcessGdbRemoteTests/GDBRemoteCommunicationClientTest.SendGetMetaDataPacket (1948 of 2049) PASS: lldb-unit :: Host/./HostTests/FileSystemTest.EnumerateDirectory (1949 of 2049) PASS: lldb-unit :: Utility/./UtilityTests/AnsiTerminal.Incomplete (1950 of 2049) PASS: lldb-unit :: SymbolFile/NativePDB/./SymbolFileNativePDBTests/PDBFPOProgramToDWARFExpressionTests.InvalidOpBinary (1951 of 2049) PASS: lldb-shell :: Breakpoint/split-dwarf-5-addrbase.test (1952 of 2049) PASS: lldb-api :: functionalities/paths/TestPaths.py (1953 of 2049) PASS: lldb-api :: functionalities/thread/crash_during_step/TestCrashDuringStep.py (1954 of 2049) PASS: lldb-api :: functionalities/gdb_remote_client/TestStopPCs.py (1955 of 2049) PASS: lldb-unit :: Target/./TargetTests/StackFrameRecognizerTest.NullModuleRegex (1956 of 2049) PASS: lldb-api :: lang/objc/ivar-IMP/TestObjCiVarIMP.py (1957 of 2049) PASS: lldb-unit :: Utility/./UtilityTests/StringExtractorTest.GetHexBytesAvail_Partial (1958 of 2049) PASS: lldb-api :: lang/cpp/frame-var-anon-unions/TestFrameVariableAnonymousUnions.py (1959 of 2049) PASS: lldb-unit :: Utility/./UtilityTests/StringExtractorTest.GetHexU8_InvalidHex (1960 of 2049) PASS: lldb-shell :: SymbolFile/DWARF/find-basic-namespace.cpp (1961 of 2049) PASS: lldb-unit :: Utility/./UtilityTests/RangeTest.Copy (1962 of 2049) PASS: lldb-unit :: Utility/./UtilityTests/BinaryStreamTest.PutSLEB128SevenBytes (1963 of 2049) PASS: lldb-unit :: Utility/./UtilityTests/StreamTeeTest.SetStreamAtIndexOutOfBounds (1964 of 2049) PASS: lldb-unit :: Utility/./UtilityTests/StreamTest.ShiftOperatorChars (1965 of 2049) PASS: lldb-api :: commands/source/info/TestSourceInfo.py (1966 of 2049) PASS: lldb-unit :: Utility/./UtilityTests/TimerTest.CategoryTimesStats (1967 of 2049) PASS: lldb-api :: lang/cpp/namespace/TestNamespaceLookup.py (1968 of 2049) PASS: lldb-unit :: Process/gdb-remote/./ProcessGdbRemoteTests/GDBRemoteCommunicationClientTest.GetModulesInfo (1969 of 2049) PASS: lldb-shell :: SymbolFile/DWARF/DW_OP_piece-smaller-than-struct.s (1970 of 2049) PASS: lldb-api :: tools/lldb-server/TestGdbRemote_qThreadStopInfo.py (1971 of 2049) PASS: lldb-shell :: SymbolFile/Breakpad/unwind-via-raSearch.test (1972 of 2049) PASS: lldb-shell :: SymbolFile/DWARF/dwarf5_locations.s (1973 of 2049) PASS: lldb-api :: python_api/watchpoint/watchlocation/TestSetWatchlocation.py (1974 of 2049) PASS: lldb-api :: commands/expression/static-initializers/TestStaticInitializers.py (1975 of 2049) PASS: lldb-api :: functionalities/gdb_remote_client/TestThreadSelectionBug.py (1976 of 2049) PASS: lldb-unit :: Utility/./UtilityTests/UUIDTest.Validity (1977 of 2049) PASS: lldb-unit :: Utility/./UtilityTests/FileSpecTest.GuessPathStyle (1978 of 2049) PASS: lldb-api :: functionalities/thread/concurrent_events/TestConcurrentNWatchNBreak.py (1979 of 2049) PASS: lldb-unit :: Process/minidump/./LLDBMinidumpTests/MinidumpParserTest.MinidumpDuplicateModuleMinAddress (1980 of 2049) PASS: lldb-unit :: Process/gdb-remote/./ProcessGdbRemoteTests/GDBRemoteClientBaseTest.SendContinueAndInterrupt2PacketBug (1981 of 2049) PASS: lldb-unit :: Utility/./UtilityTests/RangeTest.Union (1982 of 2049) PASS: lldb-api :: lang/objc/objc-struct-argument/TestObjCStructArgument.py (1983 of 2049) PASS: lldb-api :: functionalities/breakpoint/debugbreak/TestDebugBreak.py (1984 of 2049) PASS: lldb-api :: macosx/indirect_symbol/TestIndirectSymbols.py (1985 of 2049) PASS: lldb-unit :: Process/gdb-remote/./ProcessGdbRemoteTests/GDBRemoteCommunicationClientTest.GetModulesInfoInvalidResponse (1986 of 2049) PASS: lldb-shell :: ScriptInterpreter/Lua/breakpoint_callback.test (1987 of 2049) PASS: lldb-unit :: Utility/./UtilityTests/StreamTest.PutBytesAsRawHex8ToMixedEndian (1988 of 2049) PASS: lldb-api :: commands/frame/diagnose/dereference-function-return/TestDiagnoseDereferenceFunctionReturn.py (1989 of 2049) PASS: lldb-unit :: Expression/./ExpressionTests/DiagnosticManagerTest.GetStringMultipleDiags (1990 of 2049) UNSUPPORTED: lldb-api :: benchmarks/continue/TestBenchmarkContinue.py (1991 of 2049) PASS: lldb-unit :: Utility/./UtilityTests/StringListTest.GetMaxStringLengthIncreasingSize (1992 of 2049) PASS: lldb-api :: functionalities/breakpoint/breakpoint_callback_command_source/TestBreakpointCallbackCommandSource.py (1993 of 2049) PASS: lldb-api :: macosx/load-kext/TestLoadKext.py (1994 of 2049) PASS: lldb-api :: commands/expression/timeout/TestCallWithTimeout.py (1995 of 2049) PASS: lldb-api :: lang/cpp/template-function/TestTemplateFunctions.py (1996 of 2049) PASS: lldb-unit :: ScriptInterpreter/Python/./ScriptInterpreterPythonTests/PythonDataObjectsTest.TestGlobalNameResolutionNoDot (1997 of 2049) PASS: lldb-api :: commands/expression/radar_9673664/TestExprHelpExamples.py (1998 of 2049) PASS: lldb-unit :: Process/minidump/./LLDBMinidumpTests/MinidumpParserTest.GetPidWow64 (1999 of 2049) PASS: lldb-api :: lang/c/strings/TestCStrings.py (2000 of 2049) PASS: lldb-api :: macosx/find-dsym/deep-bundle/TestDeepBundle.py (2001 of 2049) PASS: lldb-api :: commands/expression/call-function/TestCallStopAndContinue.py (2002 of 2049) PASS: lldb-unit :: UnwindAssembly/x86/./UnwindAssemblyx86Tests/Testx86AssemblyInspectionEngine.TestPushR14 (2003 of 2049) PASS: lldb-unit :: Utility/./UtilityTests/FileSpecTest.CopyByAppendingPathComponent (2004 of 2049) PASS: lldb-unit :: SymbolFile/NativePDB/./SymbolFileNativePDBTests/PDBFPOProgramToDWARFExpressionTests.InvalidAssignmentMultiple (2005 of 2049) PASS: lldb-unit :: ObjectFile/Breakpad/./ObjectFileBreakpadTests/FileRecord.parse (2006 of 2049) PASS: lldb-api :: commands/log/invalid-args/TestInvalidArgsLog.py (2007 of 2049) PASS: lldb-unit :: Host/./HostTests/NativeProcessProtocolTest.SetBreakpointFailVerify (2008 of 2049) PASS: lldb-unit :: Utility/./UtilityTests/StringListTest.Join (2009 of 2049) PASS: lldb-shell :: SymbolFile/NativePDB/break-by-line.cpp (2010 of 2049) PASS: lldb-api :: functionalities/inferior-crashing/recursive-inferior/TestRecursiveInferiorStep.py (2011 of 2049) PASS: lldb-unit :: Utility/./UtilityTests/VMRange.IsValid (2012 of 2049) PASS: lldb-api :: functionalities/gdb_remote_client/TestWriteMemory.py (2013 of 2049) PASS: lldb-api :: functionalities/data-formatter/data-formatter-stl/libcxx/set/TestDataFormatterLibcxxSet.py (2014 of 2049) PASS: lldb-api :: lang/cpp/this/TestCPPThis.py (2015 of 2049) PASS: lldb-unit :: SymbolFile/NativePDB/./SymbolFileNativePDBTests/PDBFPOProgramToDWARFExpressionTests.UnsupportedRASearch (2016 of 2049) PASS: lldb-api :: lang/cpp/function_refs/TestFunctionRefs.py (2017 of 2049) PASS: lldb-api :: commands/expression/unwind_expression/TestUnwindExpression.py (2018 of 2049) PASS: lldb-api :: functionalities/thread/jump/TestThreadJump.py (2019 of 2049) PASS: lldb-unit :: ScriptInterpreter/Python/./ScriptInterpreterPythonTests/PythonDataObjectsTest.TestScript (2020 of 2049) PASS: lldb-api :: functionalities/lazy-loading/TestLazyLoading.py (2021 of 2049) PASS: lldb-api :: commands/expression/import-std-module/forward_list/TestForwardListFromStdModule.py (2022 of 2049) PASS: lldb-unit :: Utility/./UtilityTests/ScalarTest.Promotion (2023 of 2049) PASS: lldb-api :: commands/expression/class_template_specialization_empty_pack/TestClassTemplateSpecializationParametersHandling.py (2024 of 2049) PASS: lldb-api :: lang/objc/objc_direct-methods/TestObjCDirectMethods.py (2025 of 2049) PASS: lldb-shell :: Commands/command-script-import.test (2026 of 2049) PASS: lldb-api :: functionalities/thread/concurrent_events/TestConcurrentCrashWithWatchpoint.py (2027 of 2049) PASS: lldb-api :: lang/cpp/unique-types/TestUniqueTypes.py (2028 of 2049) PASS: lldb-api :: functionalities/unwind/sigtramp/TestSigtrampUnwind.py (2029 of 2049) UNSUPPORTED: lldb-api :: functionalities/thread/multi_break/TestMultipleBreakpoints.py (2030 of 2049) PASS: lldb-api :: functionalities/tail_call_frames/cross_object/TestCrossObjectTailCalls.py (2031 of 2049) PASS: lldb-api :: lang/objc/objc-property/TestObjCProperty.py (2032 of 2049) PASS: lldb-api :: functionalities/data-formatter/data-formatter-stl/libcxx/vbool/TestDataFormatterLibcxxVBool.py (2033 of 2049) PASS: lldb-api :: types/TestDoubleTypesExpr.py (2034 of 2049) PASS: lldb-api :: lang/objc/objc-baseclass-sbtype/TestObjCBaseClassSBType.py (2035 of 2049) PASS: lldb-api :: lang/objc/foundation/TestConstStrings.py (2036 of 2049) PASS: lldb-api :: commands/expression/radar_9531204/TestPrintfAfterUp.py (2037 of 2049) PASS: lldb-api :: lang/objc/objc-new-syntax/TestObjCNewSyntaxDictionary.py (2038 of 2049) PASS: lldb-api :: lang/cpp/unicode-literals/TestUnicodeLiterals.py (2039 of 2049) PASS: lldb-api :: types/TestCharTypeExpr.py (2040 of 2049) PASS: lldb-api :: functionalities/set-data/TestSetData.py (2041 of 2049) PASS: lldb-api :: functionalities/tsan/cpp_global_location/TestTsanCPPGlobalLocation.py (2042 of 2049) PASS: lldb-api :: functionalities/data-formatter/data-formatter-proper-plurals/TestFormattersOneIsSingular.py (2043 of 2049) PASS: lldb-api :: functionalities/data-formatter/data-formatter-objc/TestDataFormatterObjCPlain.py (2044 of 2049) PASS: lldb-api :: lang/objc/foundation/TestObjCMethodsString.py (2045 of 2049) PASS: lldb-api :: functionalities/data-formatter/data-formatter-objc/nsstring/TestDataFormatterNSString.py (2046 of 2049) PASS: lldb-api :: commands/register/register/register_command/TestRegisters.py (2047 of 2049) PASS: lldb-api :: lang/objc/foundation/TestFoundationDisassembly.py (2048 of 2049) PASS: lldb-api :: api/multithreaded/TestMultithreaded.py (2049 of 2049) Slowest Tests: -------------------------------------------------------------------------- 169.05s: lldb-api :: lang/objc/foundation/TestFoundationDisassembly.py 97.58s: lldb-api :: tools/lldb-server/TestLldbGdbServer.py 96.71s: lldb-api :: lang/objc/hidden-ivars/TestHiddenIvars.py 86.84s: lldb-api :: lang/cpp/enum_types/TestCPP11EnumTypes.py 86.59s: lldb-api :: lang/objc/foundation/TestObjCMethods.py 74.24s: lldb-api :: lang/objc/exceptions/TestObjCExceptions.py 68.65s: lldb-api :: lang/objc/objc-new-syntax/TestObjCNewSyntaxLiteral.py 63.16s: lldb-api :: api/multithreaded/TestMultithreaded.py 61.37s: lldb-api :: lang/cpp/namespace/TestNamespaceLookup.py 60.19s: lldb-api :: types/TestLongTypesExpr.py 55.10s: lldb-api :: lang/objc/real-definition/TestRealDefinition.py 51.96s: lldb-api :: lang/objc/objc-new-syntax/TestObjCNewSyntaxArray.py 49.83s: lldb-api :: lang/objc/objc-new-syntax/TestObjCNewSyntaxDictionary.py 47.17s: lldb-api :: types/TestIntegerTypeExpr.py 44.63s: lldb-api :: types/TestLongTypes.py 43.62s: lldb-api :: lang/objc/foundation/TestObjCMethodsNSError.py 43.23s: lldb-api :: lang/objc/foundation/TestObjCMethodsString.py 38.58s: lldb-api :: tools/lldb-server/TestGdbRemoteThreadsInStopReply.py 38.36s: lldb-api :: functionalities/recursion/TestValueObjectRecursion.py 34.57s: lldb-api :: commands/settings/TestSettings.py

Hide Details

Tests Times: -------------------------------------------------------------------------- [ Range ] :: [ Percentage ] :: [ Count ] -------------------------------------------------------------------------- [160s,170s) :: [ ] :: [ 1/2049] [150s,160s) :: [ ] :: [ 0/2049] [140s,150s) :: [ ] :: [ 0/2049] [130s,140s) :: [ ] :: [ 0/2049] [120s,130s) :: [ ] :: [ 0/2049] [110s,120s) :: [ ] :: [ 0/2049] [100s,110s) :: [ ] :: [ 0/2049] [ 90s,100s) :: [ ] :: [ 2/2049] [ 80s, 90s) :: [ ] :: [ 2/2049] [ 70s, 80s) :: [ ] :: [ 1/2049] [ 60s, 70s) :: [ ] :: [ 4/2049] [ 50s, 60s) :: [ ] :: [ 3/2049] [ 40s, 50s) :: [ ] :: [ 4/2049] [ 30s, 40s) :: [ ] :: [ 5/2049] [ 20s, 30s) :: [* ] :: [ 57/2049] [ 10s, 20s) :: [** ] :: [ 151/2049] [ 0s, 10s) :: [*********************************** ] :: [1819/2049] -------------------------------------------------------------------------- ******************** Failed Tests (1): lldb-api :: tools/lldb-server/TestLldbGdbServer.py

Hide Details

Hide Details

Testing Time: 325.53s Unsupported : 132 Passed : 1910 Expectedly Failed: 6 Failed : 1 FAILED: tools/lldb/test/CMakeFiles/check-lldb-lit cd /Users/buildslave/jenkins/workspace/lldb-cmake/lldb-build/tools/lldb/test && /usr/local/Frameworks/Python.framework/Versions/3.7/bin/python3.7 /Users/buildslave/jenkins/workspace/lldb-cmake/lldb-build/./bin/llvm-lit -v --time-tests --shuffle --xunit-xml-output=/Users/buildslave/jenkins/workspace/lldb-cmake/test/results.xml -v /Users/buildslave/jenkins/workspace/lldb-cmake/lldb-build/tools/lldb/test ninja: build stopped: subcommand failed. Command failed: Command '['/usr/bin/env', 'TERM=vt100', '/usr/local/bin/ninja', '-v', 'check-lldb']' returned non-zero exit status 1. Command: ['/usr/bin/env', 'TERM=vt100', '/usr/local/bin/ninja', '-v', 'check-lldb'] [Pipeline] } [Pipeline] // timeout [Pipeline] } [Pipeline] // stage [Pipeline] stage [Pipeline] { (Trigger Downstream Jobs) Stage "Trigger Downstream Jobs" skipped due to earlier failure(s) [Pipeline] } [Pipeline] // stage [Pipeline] stage [Pipeline] { (Declarative: Post Actions) [Pipeline] scanForIssues [Clang (LLVM based)] Sleeping for 5 seconds due to JENKINS-32191... [Clang (LLVM based)] Parsing console log (workspace: '/Users/buildslave/jenkins/workspace/lldb-cmake') [Clang (LLVM based)] Successfully parsed console log [Clang (LLVM based)] -> found 2 issues (skipped 0 duplicates) [Clang (LLVM based)] Post processing issues on 'green-dragon-24' with source code encoding 'UTF-8' [Clang (LLVM based)] Creating SCM blamer to obtain author and commit information for affected files [Clang (LLVM based)] Creating SCM miner to obtain statistics for affected repository files [Clang (LLVM based)] Resolving file names for all issues in source directory '/Users/buildslave/jenkins/workspace/lldb-cmake' [Clang (LLVM based)] -> resolved paths in source directory (1 found, 0 not found) [Clang (LLVM based)] Resolving module names from module definitions (build.xml, pom.xml, or Manifest.mf files) [Clang (LLVM based)] -> resolved module names for 2 issues [Clang (LLVM based)] Resolving package names (or namespaces) by parsing the affected files [Clang (LLVM based)] -> resolved package names of 1 affected files [Clang (LLVM based)] No filter has been set, publishing all 2 issues [Clang (LLVM based)] Creating fingerprints for all affected code blocks to track issues over different builds [Clang (LLVM based)] -> created fingerprints for 2 issues (skipped 0 issues) [Clang (LLVM based)] Copying affected files to Jenkins' build folder '/Users/Shared/Jenkins/Home/jobs/lldb-cmake/builds/20734/files-with-issues' [Clang (LLVM based)] -> 1 copied, 0 not in workspace, 0 not-found, 0 with I/O error [Pipeline] junit Recording test results [Pipeline] emailext Not sending mail to unregistered user douglas.yung@sony.com because your SCM claimed this was associated with a user ID ‘douglas.yung' which your security realm does not recognize; you may need changes in your SCM plugin Not sending mail to unregistered user douglas.yung@sony.com because your SCM claimed this was associated with a user ID ‘douglas.yung' which your security realm does not recognize; you may need changes in your SCM plugin

Hide Details

Begin Pre-Send Script... Sending email to: mschifer@apple.com Ahmed Bougacha <abougacha@apple.com> Azhar Mohammed <azhar@apple.com>
[Pipeline] } [Pipeline] // stage [Pipeline] } [Pipeline] // withEnv [Pipeline] } [Pipeline] // node [Pipeline] End of Pipeline ERROR: script returned exit code 1 Finished: FAILURE