FailedConsole Output

Skipping 108 KB.. Full Log
p/bool/TestCPPBool.py (615 of 2049)
PASS: lldb-unit :: Utility/./UtilityTests/StreamTest.PutRawBytesToBigEndian (616 of 2049)
PASS: lldb-api :: commands/expression/function_template_specialization_temp_args/TestFunctionTemplateSpecializationTempArgs.py (617 of 2049)
PASS: lldb-unit :: Utility/./UtilityTests/StringExtractorTest.GetHexBytes_OddPair (618 of 2049)
PASS: lldb-api :: functionalities/thread/crash_during_step/TestCrashDuringStep.py (619 of 2049)
PASS: lldb-unit :: Utility/./UtilityTests/ScalarTest.ExtractBitfield (620 of 2049)
PASS: lldb-unit :: Process/minidump/./LLDBMinidumpTests/RegisterContextMinidump.ConvertMinidumpContext_x86_32 (621 of 2049)
PASS: lldb-unit :: Utility/./UtilityTests/StringListTest.SplitIntoLinesEmpty (622 of 2049)
XFAIL: lldb-shell :: Unwind/prefer-debug-over-eh-frame.test (623 of 2049)
PASS: lldb-api :: functionalities/postmortem/minidump-new/TestMiniDumpUUID.py (624 of 2049)
PASS: lldb-unit :: debugserver/./debugserverTests/JSON.Parse (625 of 2049)
PASS: lldb-unit :: Utility/./UtilityTests/StringListTest.CopyList (626 of 2049)
PASS: lldb-api :: lang/cpp/unicode-literals/TestUnicodeLiterals.py (627 of 2049)
PASS: lldb-unit :: Utility/./UtilityTests/RangeTest.ContainsEndInclusive (628 of 2049)
PASS: lldb-unit :: ScriptInterpreter/Python/./ScriptInterpreterPythonTests/PythonDataObjectsTest.TestPythonBoolean (629 of 2049)
PASS: lldb-api :: functionalities/abbreviation/TestAbbreviations.py (630 of 2049)
PASS: lldb-unit :: Utility/./UtilityTests/ArgsTest.ReplaceArgumentAtIndexFarOutOfRange (631 of 2049)
PASS: lldb-shell :: Host/TestCustomShell.test (632 of 2049)
PASS: lldb-unit :: debugserver/./debugserverTests/RNBSocket.LoopBackListenIPv6 (633 of 2049)
PASS: lldb-unit :: Expression/./ExpressionTests/DiagnosticManagerTest.PutStringMultiple (634 of 2049)
PASS: lldb-api :: commands/expression/import-std-module/unique_ptr-dbg-info-content/TestUniquePtrDbgInfoContent.py (635 of 2049)
PASS: lldb-api :: functionalities/gdb_remote_client/TestJLink6Armv7RegisterDefinition.py (636 of 2049)
PASS: lldb-unit :: Utility/./UtilityTests/StreamTeeTest.AppendStream (637 of 2049)
PASS: lldb-api :: commands/expression/persistent_types/TestPersistentTypes.py (638 of 2049)
PASS: lldb-api :: functionalities/breakpoint/breakpoint_conditions/TestBreakpointConditions.py (639 of 2049)
PASS: lldb-api :: macosx/indirect_symbol/TestIndirectSymbols.py (640 of 2049)
PASS: lldb-api :: functionalities/ubsan/user-expression/TestUbsanUserExpression.py (641 of 2049)
PASS: lldb-shell :: Reproducer/TestProcessList.test (642 of 2049)
PASS: lldb-unit :: Utility/./UtilityTests/DataExtractorTest.GetCStrAtEnd (643 of 2049)
PASS: lldb-unit :: Process/minidump/./LLDBMinidumpTests/MinidumpParserTest.GetThreadContext_x86_64 (644 of 2049)
PASS: lldb-unit :: Utility/./UtilityTests/CompletionRequest.FakeLastArg (645 of 2049)
UNSUPPORTED: lldb-shell :: BuildScript/toolchain-msvc.test (646 of 2049)
UNSUPPORTED: lldb-api :: functionalities/darwin_log/filter/exact_match/category/TestDarwinLogFilterMatchCategory.py (647 of 2049)
PASS: lldb-unit :: UnwindAssembly/x86/./UnwindAssemblyx86Tests/Testx86AssemblyInspectionEngine.TestPopR14 (648 of 2049)
PASS: lldb-unit :: Utility/./UtilityTests/RangeTest.EqualInvalid (649 of 2049)
PASS: lldb-unit :: Utility/./UtilityTests/FileSpecTest.EqualDotsWindows (650 of 2049)
PASS: lldb-api :: python_api/file_handle/TestFileHandle.py (651 of 2049)
UNSUPPORTED: lldb-shell :: Unwind/eh-frame-small-fde.test (652 of 2049)
UNSUPPORTED: lldb-api :: benchmarks/expression/TestRepeatedExprs.py (653 of 2049)
PASS: lldb-unit :: Utility/./UtilityTests/BinaryStreamTest.PutSLEB128Zero (654 of 2049)
PASS: lldb-unit :: Utility/./UtilityTests/DataExtractorTest.GetMaxU64_unchecked (655 of 2049)
PASS: lldb-api :: python_api/frame/inlines/TestInlinedFrame.py (656 of 2049)
PASS: lldb-api :: functionalities/thread/concurrent_events/TestConcurrentDelaySignalBreak.py (657 of 2049)
PASS: lldb-unit :: Symbol/./SymbolTests/TestTypeSystemClang.TestUnifyAccessSpecifiers (658 of 2049)
PASS: lldb-unit :: Symbol/./SymbolTests/TestTypeSystemClang.TestFunctionTemplateConstruction (659 of 2049)
PASS: lldb-unit :: SymbolFile/NativePDB/./SymbolFileNativePDBTests/PDBFPOProgramToDWARFExpressionTests.DependencyChain (660 of 2049)
PASS: lldb-unit :: Utility/./UtilityTests/RegularExpression.Match (661 of 2049)
PASS: lldb-api :: functionalities/thread/concurrent_events/TestConcurrentTwoWatchpointsOneDelayBreakpoint.py (662 of 2049)
UNSUPPORTED: lldb-api :: python_api/event/TestEvents.py (663 of 2049)
PASS: lldb-api :: commands/expression/cast_int_to_anonymous_enum/TestCastIntToAnonymousEnum.py (664 of 2049)
PASS: lldb-unit :: UnwindAssembly/x86/./UnwindAssemblyx86Tests/Testx86AssemblyInspectionEngine.TestLEAVE (665 of 2049)
PASS: lldb-shell :: Settings/TestDisassemblyFormat.test (666 of 2049)
PASS: lldb-api :: functionalities/data-formatter/data-formatter-stl/libcxx/list/TestDataFormatterLibcxxList.py (667 of 2049)
PASS: lldb-api :: lang/objc/modules-inline-functions/TestModulesInlineFunctions.py (668 of 2049)
PASS: lldb-api :: functionalities/plugins/command_plugin/TestPluginCommands.py (669 of 2049)
PASS: lldb-api :: commands/expression/codegen-crash-typedefdecl-not-in_declcontext/TestCodegenCrashTypedefDeclNotInDeclContext.py (670 of 2049)
PASS: lldb-unit :: Expression/./ExpressionTests/CppModuleConfigurationTest.LibCppV2 (671 of 2049)
PASS: lldb-api :: functionalities/breakpoint/address_breakpoints/TestBadAddressBreakpoints.py (672 of 2049)
PASS: lldb-api :: functionalities/exec/TestExec.py (673 of 2049)
PASS: lldb-shell :: Commands/command-disassemble.s (674 of 2049)
PASS: lldb-unit :: Host/./HostTests/FileSystemTest.EnumerateDirectory (675 of 2049)
PASS: lldb-api :: functionalities/tsan/thread_numbers/TestTsanThreadNumbers.py (676 of 2049)
PASS: lldb-api :: functionalities/data-formatter/compactvectors/TestCompactVectors.py (677 of 2049)
PASS: lldb-api :: functionalities/data-formatter/refpointer-recursion/TestDataFormatterRefPtrRecursion.py (678 of 2049)
PASS: lldb-shell :: SymbolFile/NativePDB/nested-types.cpp (679 of 2049)
PASS: lldb-api :: python_api/watchpoint/condition/TestWatchpointConditionAPI.py (680 of 2049)
PASS: lldb-unit :: Utility/./UtilityTests/StringListTest.SplitIntoLines (681 of 2049)
PASS: lldb-unit :: Utility/./UtilityTests/StringExtractorTest.DecodeHexU8_Exact (682 of 2049)
PASS: lldb-api :: commands/expression/namespace_local_var_same_name_cpp_and_c/TestNamespaceLocalVarSameNameCppAndC.py (683 of 2049)
PASS: lldb-unit :: ScriptInterpreter/Python/./ScriptInterpreterPythonTests/PythonDataObjectsTest.TestInstanceNameResolutionNoDot (684 of 2049)
PASS: lldb-api :: functionalities/data-formatter/data-formatter-objc/TestDataFormatterObjNSException.py (685 of 2049)
PASS: lldb-api :: functionalities/gdb_remote_client/TestNoGPacketSupported.py (686 of 2049)
PASS: lldb-api :: commands/expression/import-std-module/forward_list-dbg-info-content/TestDbgInfoContentForwardListFromStdModule.py (687 of 2049)
PASS: lldb-unit :: Language/Highlighting/./HighlighterTests/HighlighterTest.DefaultHighlighter (688 of 2049)
UNSUPPORTED: lldb-api :: functionalities/data-formatter/data-formatter-stl/libstdcpp/iterator/TestDataFormatterStdIterator.py (689 of 2049)
PASS: lldb-api :: commands/add-dsym/uuid/TestAddDsymCommand.py (690 of 2049)
PASS: lldb-api :: commands/expression/po_verbosity/TestPoVerbosity.py (691 of 2049)
PASS: lldb-unit :: Target/./TargetTests/ExecutionContextTest.GetByteOrderTarget (692 of 2049)
PASS: lldb-api :: python_api/value/empty_class/TestValueAPIEmptyClass.py (693 of 2049)
PASS: lldb-unit :: ObjectFile/Breakpad/./ObjectFileBreakpadTests/FuncRecord.parse (694 of 2049)
PASS: lldb-api :: lang/objc/print-obj/TestPrintObj.py (695 of 2049)
PASS: lldb-api :: commands/settings/TestSettings.py (696 of 2049)
UNSUPPORTED: lldb-shell :: Register/x86-gp-write.test (697 of 2049)
PASS: lldb-unit :: Utility/./UtilityTests/StringListTest.JoinNonSpace (698 of 2049)
PASS: lldb-api :: functionalities/data-formatter/data-formatter-stl/libcxx/variant/TestDataFormatterLibcxxVariant.py (699 of 2049)
PASS: lldb-api :: lang/objc/objc-baseclass-sbtype/TestObjCBaseClassSBType.py (700 of 2049)
PASS: lldb-api :: functionalities/tsan/basic/TestTsanBasic.py (701 of 2049)
PASS: lldb-shell :: SymbolFile/DWARF/apple-index-is-used.cpp (702 of 2049)
PASS: lldb-unit :: Utility/./UtilityTests/StreamTest.PutHex16ByteOrderLittle (703 of 2049)
PASS: lldb-unit :: Utility/./UtilityTests/OptionsWithRawTest.MultiWordSuffix (704 of 2049)
PASS: lldb-unit :: UnwindAssembly/x86/./UnwindAssemblyx86Tests/Testx86AssemblyInspectionEngine.TestPopR13 (705 of 2049)
PASS: lldb-api :: lang/objc/rdar-11355592/TestRdar11355592.py (706 of 2049)
PASS: lldb-unit :: Instruction/./EmulatorTests/TestAArch64Emulator.TestOverflow (707 of 2049)
PASS: lldb-unit :: ScriptInterpreter/Python/./ScriptInterpreterPythonTests/PythonDataObjectsTest.TestPythonDictionaryManipulation (708 of 2049)
PASS: lldb-api :: functionalities/thread/concurrent_events/TestConcurrentTwoBreakpointsOneWatchpoint.py (709 of 2049)
PASS: lldb-api :: lang/mixed/TestMixedLanguages.py (710 of 2049)
PASS: lldb-shell :: VSCode/TestOptions.test (711 of 2049)
UNSUPPORTED: lldb-api :: functionalities/thread/state/TestThreadStates.py (712 of 2049)
PASS: lldb-shell :: ObjectFile/ELF/short-build-id.yaml (713 of 2049)
PASS: lldb-api :: functionalities/data-formatter/data-formatter-objc/TestDataFormatterObjCPlain.py (714 of 2049)
PASS: lldb-unit :: Process/gdb-remote/./ProcessGdbRemoteTests/GDBRemoteCommunicationServerTest.SendErrorResponse_StringError (715 of 2049)
PASS: lldb-unit :: Utility/./UtilityTests/TimerTest.CategoryTimes2 (716 of 2049)
PASS: lldb-api :: tools/lldb-server/inferior-crash/TestGdbRemoteAbort.py (717 of 2049)
PASS: lldb-unit :: Utility/./UtilityTests/UriParserTest.BracketedHostnameWithPortIPv6 (718 of 2049)
PASS: lldb-api :: commands/expression/import-std-module/deque-basic/TestDequeFromStdModule.py (719 of 2049)
PASS: lldb-api :: functionalities/thread/concurrent_events/TestConcurrentBreakpointOneDelayBreakpointThreads.py (720 of 2049)
PASS: lldb-unit :: ScriptInterpreter/Python/./ScriptInterpreterPythonTests/PythonDataObjectsTest.TestModuleNameResolutionNoDot (721 of 2049)
PASS: lldb-unit :: Utility/./UtilityTests/ConstStringTest.format_provider (722 of 2049)
PASS: lldb-unit :: UnwindAssembly/x86/./UnwindAssemblyx86Tests/Testx86AssemblyInspectionEngine.TestPushESI (723 of 2049)
PASS: lldb-unit :: UnwindAssembly/x86/./UnwindAssemblyx86Tests/Testx86AssemblyInspectionEngine.TestPushRBP (724 of 2049)
PASS: lldb-unit :: Symbol/./SymbolTests/TestTypeSystemClang.TestGetTypeClassTypeOf (725 of 2049)
PASS: lldb-api :: lang/cpp/template/TestTemplateArgs.py (726 of 2049)
PASS: lldb-unit :: Language/Highlighting/./HighlighterTests/HighlighterTest.ClangStringLiterals (727 of 2049)
PASS: lldb-unit :: Host/./HostTests/SocketTest.TCPListen0ConnectAccept (728 of 2049)
PASS: lldb-api :: lang/cpp/static_methods/TestCPPStaticMethods.py (729 of 2049)
PASS: lldb-api :: macosx/order/TestOrderFile.py (730 of 2049)
PASS: lldb-unit :: ScriptInterpreter/Python/./ScriptInterpreterPythonTests/PythonDataObjectsTest.TestPythonIntegerToStr (731 of 2049)
PASS: lldb-unit :: Utility/./UtilityTests/ArgsTest.ReplaceArgumentAtIndexLonger (732 of 2049)
PASS: lldb-shell :: ObjectFile/ELF/section-overlap.yaml (733 of 2049)
PASS: lldb-unit :: Process/gdb-remote/./ProcessGdbRemoteTests/GDBRemoteCommunicationServerTest.SendErrorResponse_ErrorList (734 of 2049)
PASS: lldb-api :: functionalities/thread/concurrent_events/TestConcurrentDelayedCrashWithBreakpointWatchpoint.py (735 of 2049)
PASS: lldb-shell :: Driver/TestTarget.test (736 of 2049)
PASS: lldb-shell :: ObjectFile/ELF/PT_LOAD-empty.yaml (737 of 2049)
PASS: lldb-unit :: Utility/./UtilityTests/PassiveReplayTest.InstrumentedFooInvalid (738 of 2049)
PASS: lldb-api :: lang/objc/variadic_methods/TestVariadicMethods.py (739 of 2049)
PASS: lldb-api :: commands/expression/no-deadlock/TestExprDoesntBlock.py (740 of 2049)
PASS: lldb-shell :: Commands/command-thread-select.test (741 of 2049)
PASS: lldb-api :: functionalities/thread/concurrent_events/TestConcurrentTwoBreakpointsOneDelaySignal.py (742 of 2049)
PASS: lldb-unit :: Symbol/./SymbolTests/TestTypeSystemClang.TestGetEnumIntegerTypeBasicTypes (743 of 2049)
PASS: lldb-unit :: Utility/./UtilityTests/StreamTeeTest.SetStreamAtIndexOverwrite (744 of 2049)
PASS: lldb-unit :: Utility/./UtilityTests/SerializationRountripTest.SerializeDeserializeCStringArray (745 of 2049)
PASS: lldb-api :: lang/c/const_variables/TestConstVariables.py (746 of 2049)
PASS: lldb-api :: lang/c/offsetof/TestOffsetof.py (747 of 2049)
PASS: lldb-api :: functionalities/data-formatter/poarray/TestPrintObjectArray.py (748 of 2049)
PASS: lldb-unit :: Platform/./LLDBPlatformTests/PlatformDarwinTest.TestParseVersionBuildDir (749 of 2049)
PASS: lldb-unit :: Utility/./UtilityTests/AnsiTerminal.Incomplete (750 of 2049)
PASS: lldb-unit :: Utility/./UtilityTests/BinaryStreamTest.PutSLEB128One (751 of 2049)
PASS: lldb-api :: commands/expression/ir-interpreter-phi-nodes/TestIRInterpreterPHINodes.py (752 of 2049)
PASS: lldb-unit :: SymbolFile/NativePDB/./SymbolFileNativePDBTests/PDBFPOProgramToDWARFExpressionTests.UnsupportedRASearch (753 of 2049)
PASS: lldb-unit :: Host/./HostTests/ConnectionFileDescriptorTest.TCPGetURIv4 (754 of 2049)
PASS: lldb-api :: functionalities/gdb_remote_client/TestArmRegisterDefinition.py (755 of 2049)
PASS: lldb-shell :: Reproducer/Modules/TestModuleCXX.test (756 of 2049)
PASS: lldb-unit :: UnwindAssembly/x86/./UnwindAssemblyx86Tests/Testx86AssemblyInspectionEngine.TestPopRBPWithREX (757 of 2049)
PASS: lldb-unit :: Utility/./UtilityTests/ArgsTest.TestInsertArg (758 of 2049)
PASS: lldb-unit :: Utility/./UtilityTests/ProcessInstanceInfoMatch.Name (759 of 2049)
PASS: lldb-unit :: Utility/./UtilityTests/ArgsTest.StringListConstructor (760 of 2049)
PASS: lldb-unit :: Utility/./UtilityTests/StringExtractorTest.InitEmpty (761 of 2049)
PASS: lldb-api :: types/TestDoubleTypesExpr.py (762 of 2049)
PASS: lldb-unit :: Utility/./UtilityTests/RangeTest.Equal (763 of 2049)
PASS: lldb-unit :: Utility/./UtilityTests/StatusTest.ErrorCodeConstructor (764 of 2049)
PASS: lldb-shell :: Minidump/Windows/broken-unwind.test (765 of 2049)
PASS: lldb-shell :: Minidump/Windows/Sigsegv/sigsegv.test (766 of 2049)
PASS: lldb-unit :: Symbol/./SymbolTests/TestClangASTImporter.CopyDeclTagDecl (767 of 2049)
PASS: lldb-unit :: SymbolFile/DWARF/./SymbolFileDWARFTests/SymbolFileDWARFTests.TestAbbrevOrder1Start5 (768 of 2049)
PASS: lldb-shell :: ObjectFile/ELF/PT_LOAD-overlap.yaml (769 of 2049)
PASS: lldb-shell :: SymbolFile/DWARF/debug-names-compressed.cpp (770 of 2049)
PASS: lldb-unit :: Utility/./UtilityTests/StreamTest.AddressRangeInvalidRange (771 of 2049)
PASS: lldb-api :: functionalities/thread/concurrent_events/TestConcurrentTwoBreakpointsOneSignal.py (772 of 2049)
PASS: lldb-api :: functionalities/step_scripted/TestStepScripted.py (773 of 2049)
PASS: lldb-shell :: Quit/TestQuitExitCodeHex0.test (774 of 2049)
PASS: lldb-unit :: Utility/./UtilityTests/StringListTest.LongestCommonPrefixDuplicateElement (775 of 2049)
PASS: lldb-unit :: Utility/./UtilityTests/RecordReplayTest.InstrumentedBar (776 of 2049)
UNSUPPORTED: lldb-api :: functionalities/unwind/ehframe/TestEhFrameUnwind.py (777 of 2049)
PASS: lldb-unit :: UnwindAssembly/x86/./UnwindAssemblyx86Tests/Testx86AssemblyInspectionEngine.TestSimple64bitFrameFunction (778 of 2049)
PASS: lldb-unit :: Process/gdb-remote/./ProcessGdbRemoteTests/GDBRemoteCommunicationClientTest.GetQOffsets (779 of 2049)
PASS: lldb-shell :: SymbolFile/Breakpad/symtab-macho.test (780 of 2049)
UNSUPPORTED: lldb-shell :: SymbolFile/DWARF/debug-types-expressions.test (781 of 2049)
UNSUPPORTED: lldb-api :: linux/add-symbols/TestTargetSymbolsAddCommand.py (782 of 2049)
PASS: lldb-api :: functionalities/param_entry_vals/basic_entry_values/TestBasicEntryValues.py (783 of 2049)
PASS: lldb-api :: iohandler/unicode/TestUnicode.py (784 of 2049)
PASS: lldb-api :: functionalities/data-formatter/pyobjsynthprovider/TestPyObjSynthProvider.py (785 of 2049)
PASS: lldb-shell :: ObjectFile/MachO/symtab.yaml (786 of 2049)
PASS: lldb-unit :: Symbol/./SymbolTests/SymbolsTest.TerminateLocateExecutableSymbolFileForUnknownExecutableAndUnknownSymbolFile (787 of 2049)
PASS: lldb-unit :: Utility/./UtilityTests/StringExtractorTest.GetU64LittleEndian (788 of 2049)
PASS: lldb-unit :: UnwindAssembly/x86/./UnwindAssemblyx86Tests/Testx86AssemblyInspectionEngine.TestPushECX (789 of 2049)
PASS: lldb-unit :: Utility/./UtilityTests/StringListTest.InsertStringAtIndexMove (790 of 2049)
PASS: lldb-unit :: Utility/./UtilityTests/DataExtractorTest.GetCStrAtNullOffset (791 of 2049)
PASS: lldb-api :: lang/c/shared_lib/TestSharedLib.py (792 of 2049)
PASS: lldb-unit :: Interpreter/./InterpreterTests/CompletionTest.FileCompletionAbsolute (793 of 2049)
PASS: lldb-api :: functionalities/data-formatter/summary-string-onfail/Test-rdar-9974002.py (794 of 2049)
PASS: lldb-api :: python_api/function_symbol/TestSymbolAPI.py (795 of 2049)
PASS: lldb-api :: commands/expression/import-std-module/conflicts/TestStdModuleWithConflicts.py (796 of 2049)
PASS: lldb-api :: macosx/duplicate-archive-members/TestDuplicateMembers.py (797 of 2049)
UNSUPPORTED: lldb-shell :: Register/x86-ymm-read.test (798 of 2049)
PASS: lldb-api :: python_api/breakpoint/TestBreakpointAPI.py (799 of 2049)
PASS: lldb-shell :: ScriptInterpreter/Lua/convenience_variables.test (800 of 2049)
PASS: lldb-api :: functionalities/data-formatter/data-formatter-stl/libcxx/iterator/TestDataFormatterLibccIterator.py (801 of 2049)
PASS: lldb-shell :: Process/Optimization.test (802 of 2049)
PASS: lldb-unit :: Utility/./UtilityTests/StringLexerTest.Next (803 of 2049)
PASS: lldb-unit :: Utility/./UtilityTests/VMRange.Clear (804 of 2049)
PASS: lldb-api :: macosx/thread_suspend/TestInternalThreadSuspension.py (805 of 2049)
PASS: lldb-api :: commands/expression/import-std-module/vector/TestVectorFromStdModule.py (806 of 2049)
PASS: lldb-api :: functionalities/thread/concurrent_events/TestConcurrentNWatchNBreak.py (807 of 2049)
PASS: lldb-shell :: ScriptInterpreter/Python/sb_address_exception.test (808 of 2049)
PASS: lldb-unit :: Utility/./UtilityTests/StringExtractorTest.GetHexU8_Underflow_NoEof (809 of 2049)
PASS: lldb-unit :: Target/./TargetTests/ExecutionContextTest.GetByteOrderProcess (810 of 2049)
PASS: lldb-unit :: Symbol/./SymbolTests/TestTypeSystemClang.TestFunctionTemplateInRecordConstruction (811 of 2049)
PASS: lldb-api :: python_api/signals/TestSignalsAPI.py (812 of 2049)
PASS: lldb-unit :: ScriptInterpreter/Python/./ScriptInterpreterPythonTests/PythonDataObjectsTest.TestPythonByteArray (813 of 2049)
UNSUPPORTED: lldb-api :: linux/mix-dwo-and-regular-objects/TestMixedDwarfBinary.py (814 of 2049)
PASS: lldb-api :: functionalities/data-formatter/data-formatter-stl/libcxx/bitset/TestDataFormatterLibcxxBitset.py (815 of 2049)
PASS: lldb-api :: functionalities/process_crash_info/TestProcessCrashInfo.py (816 of 2049)
PASS: lldb-unit :: Language/Highlighting/./HighlighterTests/HighlighterTest.ClangUnterminatedString (817 of 2049)
PASS: lldb-api :: functionalities/gdb_remote_client/TestPlatformClient.py (818 of 2049)
PASS: lldb-api :: functionalities/mtc/simple/TestMTCSimple.py (819 of 2049)
PASS: lldb-unit :: Process/minidump/./LLDBMinidumpTests/MinidumpParserTest.GetMiscInfo_no_stream (820 of 2049)
PASS: lldb-unit :: Utility/./UtilityTests/StructuredDataTest.StringDump (821 of 2049)
PASS: lldb-unit :: Utility/./UtilityTests/StreamTeeTest.GetStreamAtIndexOutOfBoundsEmpty (822 of 2049)
PASS: lldb-api :: commands/frame/diagnose/inheritance/TestDiagnoseInheritance.py (823 of 2049)
UNSUPPORTED: lldb-shell :: Register/x86-zmm-read.test (824 of 2049)
PASS: lldb-unit :: UnwindAssembly/x86/./UnwindAssemblyx86Tests/Testx86AssemblyInspectionEngine.TestSubESP (825 of 2049)
PASS: lldb-unit :: Utility/./UtilityTests/CompletionRequest.Constructor (826 of 2049)
PASS: lldb-shell :: ObjectFile/PECOFF/sections.yaml (827 of 2049)
PASS: lldb-unit :: Utility/./UtilityTests/ArgsTest.TestSingleQuotedArgWithSpace (828 of 2049)
PASS: lldb-shell :: Reproducer/Functionalities/TestImageList.test (829 of 2049)
PASS: lldb-unit :: Utility/./UtilityTests/BinaryStreamTest.PutULEB128TwoBytes (830 of 2049)
PASS: lldb-shell :: SymbolFile/DWARF/dwarf5-index-is-used.cpp (831 of 2049)
PASS: lldb-unit :: Utility/./UtilityTests/RangeTest.ContainsAddrInvalid (832 of 2049)
PASS: lldb-api :: functionalities/paths/TestPaths.py (833 of 2049)
PASS: lldb-unit :: Host/./HostTests/NativeProcessProtocolTest.ReadMemoryWithoutTrap (834 of 2049)
PASS: lldb-shell :: Reproducer/Functionalities/TestDataFormatter.test (835 of 2049)
PASS: lldb-api :: functionalities/data-formatter/array_typedef/TestArrayTypedef.py (836 of 2049)
UNSUPPORTED: lldb-api :: functionalities/longjmp/TestLongjmp.py (837 of 2049)
PASS: lldb-api :: functionalities/recursion/TestValueObjectRecursion.py (838 of 2049)
PASS: lldb-api :: tools/lldb-server/TestAppleSimulatorOSType.py (839 of 2049)
PASS: lldb-unit :: Interpreter/./InterpreterTests/OptionArgParserTest.toScriptLanguage (840 of 2049)
PASS: lldb-api :: functionalities/postmortem/minidump-new/TestMiniDumpNew.py (841 of 2049)
PASS: lldb-unit :: Utility/./UtilityTests/RangeTest.NotEqual (842 of 2049)
UNSUPPORTED: lldb-shell :: SymbolFile/PDB/udt-layout.test (843 of 2049)
PASS: lldb-api :: commands/settings/quoting/TestQuoting.py (844 of 2049)
PASS: lldb-api :: functionalities/signal/raise/TestRaise.py (845 of 2049)
PASS: lldb-unit :: Utility/./UtilityTests/ArgsTest.TestQuotedTrailingBackslash (846 of 2049)
PASS: lldb-api :: python_api/frame/get-variables/TestGetVariables.py (847 of 2049)
PASS: lldb-unit :: Utility/./UtilityTests/SerializationRountripTest.SerializeDeserializeCStringArrayNullptr (848 of 2049)
PASS: lldb-unit :: ScriptInterpreter/Python/./ScriptInterpreterPythonTests/PythonDataObjectsTest.TestPythonTupleValues (849 of 2049)
PASS: lldb-unit :: Utility/./UtilityTests/PassiveReplayTest.InstrumentedBarPtr (850 of 2049)
PASS: lldb-api :: commands/expression/ir-interpreter/TestIRInterpreter.py (851 of 2049)
PASS: lldb-api :: lang/objc/foundation/TestConstStrings.py (852 of 2049)
PASS: lldb-unit :: Utility/./UtilityTests/FileSpecTest.Yaml (853 of 2049)
PASS: lldb-api :: functionalities/pre_run_dylibs/TestPreRunDylibs.py (854 of 2049)
PASS: lldb-api :: commands/frame/diagnose/dereference-function-return/TestDiagnoseDereferenceFunctionReturn.py (855 of 2049)
PASS: lldb-shell :: SymbolFile/DWARF/find-basic-type.cpp (856 of 2049)
PASS: lldb-api :: lang/objc/modules/TestObjCModules.py (857 of 2049)
PASS: lldb-unit :: Utility/./UtilityTests/SerializationRountripTest.SerializeDeserializeObjectReference (858 of 2049)
PASS: lldb-api :: tools/lldb-server/TestGdbRemote_qThreadStopInfo.py (859 of 2049)
PASS: lldb-api :: lang/c/stepping/TestThreadStepping.py (860 of 2049)
PASS: lldb-api :: functionalities/data-formatter/user-format-vs-summary/TestUserFormatVsSummary.py (861 of 2049)
PASS: lldb-api :: functionalities/show_location/TestShowLocationDwarf5.py (862 of 2049)
PASS: lldb-unit :: Utility/./UtilityTests/ConstStringTest.CompareConstString (863 of 2049)
PASS: lldb-shell :: ExecControl/StopHook/stop-hook.test (864 of 2049)
PASS: lldb-unit :: Utility/./UtilityTests/StringExtractorTest.GetHexBytesAvail_Underflow (865 of 2049)
PASS: lldb-unit :: Utility/./UtilityTests/VMRange.IsValid (866 of 2049)
PASS: lldb-unit :: UnwindAssembly/x86/./UnwindAssemblyx86Tests/Testx86AssemblyInspectionEngine.TestSimple32bitFrameFunction (867 of 2049)
PASS: lldb-unit :: Utility/./UtilityTests/AnsiTerminal.AtStart (868 of 2049)
PASS: lldb-unit :: UnwindAssembly/x86/./UnwindAssemblyx86Tests/Testx86AssemblyInspectionEngine.TestReturnDetect (869 of 2049)
PASS: lldb-unit :: Language/Highlighting/./HighlighterTests/HighlighterTest.ClangTrailingBackslashBeforeNewline (870 of 2049)
PASS: lldb-unit :: Utility/./UtilityTests/StreamTest.QuotedCString (871 of 2049)
UNSUPPORTED: lldb-api :: lang/objc/objc-dynamic-value/TestObjCDynamicValue.py (872 of 2049)
PASS: lldb-unit :: Utility/./UtilityTests/StringListTest.LongestCommonPrefix (873 of 2049)
PASS: lldb-api :: tools/lldb-server/TestGdbRemoteAttach.py (874 of 2049)
PASS: lldb-api :: commands/command/script_alias/TestCommandScriptAlias.py (875 of 2049)
PASS: lldb-unit :: Utility/./UtilityTests/StreamTest.ShiftOperatorPtr (876 of 2049)
PASS: lldb-unit :: Process/gdb-remote/./ProcessGdbRemoteTests/GDBRemoteCommunicationServerTest.SendErrorResponse_ErrorNumber (877 of 2049)
PASS: lldb-shell :: SymbolFile/DWARF/split-dwarf-inlining.cpp (878 of 2049)
PASS: lldb-api :: python_api/class_members/TestSBTypeClassMembers.py (879 of 2049)
PASS: lldb-unit :: Process/gdb-remote/./ProcessGdbRemoteTests/GDBRemoteCommunicationClientTest.SendGetMetaDataPacket (880 of 2049)
PASS: lldb-unit :: ScriptInterpreter/Python/./ScriptInterpreterPythonTests/PythonDataObjectsTest.TestOwnedReferences (881 of 2049)
PASS: lldb-api :: api/multiple-targets/TestMultipleTargets.py (882 of 2049)
PASS: lldb-unit :: Utility/./UtilityTests/XcodeSDKTest.SDKSupportsModules (883 of 2049)
PASS: lldb-unit :: Host/./HostTests/MainLoopTest.TerminatesImmediately (884 of 2049)
PASS: lldb-unit :: Utility/./UtilityTests/VASprintfTest.NoBufferResize (885 of 2049)
PASS: lldb-shell :: ObjectFile/ELF/minidebuginfo-corrupt-xz.yaml (886 of 2049)
PASS: lldb-unit :: Process/gdb-remote/./ProcessGdbRemoteTests/GDBRemoteClientBaseTest.SendContinueAndLateInterrupt (887 of 2049)
PASS: lldb-api :: functionalities/breakpoint/scripted_bkpt/TestScriptedResolver.py (888 of 2049)
PASS: lldb-api :: lang/cpp/member-and-local-vars-with-same-name/TestMembersAndLocalsWithSameName.py (889 of 2049)
PASS: lldb-unit :: Utility/./UtilityTests/OptionsWithRawTest.SingleWhitespaceInput (890 of 2049)
PASS: lldb-shell :: ScriptInterpreter/Lua/command_script_import.test (891 of 2049)
PASS: lldb-unit :: Utility/./UtilityTests/Flags.AllClear (892 of 2049)
PASS: lldb-unit :: Host/./HostTests/Host.WaitStatusFormat (893 of 2049)
PASS: lldb-unit :: SymbolFile/NativePDB/./SymbolFileNativePDBTests/PDBFPOProgramToDWARFExpressionTests.MultipleIndependentAssignments (894 of 2049)
PASS: lldb-api :: commands/reproducer/invalid-args/TestInvalidArgsReproducer.py (895 of 2049)
PASS: lldb-api :: types/TestCharTypeExpr.py (896 of 2049)
PASS: lldb-api :: functionalities/backticks/TestBackticksWithoutATarget.py (897 of 2049)
PASS: lldb-unit :: Utility/./UtilityTests/StreamTest.AddressSize (898 of 2049)
PASS: lldb-unit :: Utility/./UtilityTests/BinaryStreamTest.PutULEB128SixBytes (899 of 2049)
PASS: lldb-api :: commands/command/source/TestCommandSource.py (900 of 2049)
PASS: lldb-api :: python_api/sbvalue_persist/TestSBValuePersist.py (901 of 2049)
PASS: lldb-unit :: Host/./HostTests/SocketTest.DomainGetConnectURI (902 of 2049)
PASS: lldb-api :: macosx/thread-names/TestInterruptThreadNames.py (903 of 2049)
PASS: lldb-api :: lang/cpp/bitfields/TestCppBitfields.py (904 of 2049)
UNSUPPORTED: lldb-api :: lang/objc/rdar-12408181/TestRdar12408181.py (905 of 2049)
PASS: lldb-api :: python_api/interpreter/TestCommandInterpreterAPI.py (906 of 2049)
PASS: lldb-api :: tools/lldb-vscode/step/TestVSCode_step.py (907 of 2049)
PASS: lldb-api :: lang/c/step-target/TestStepTarget.py (908 of 2049)
PASS: lldb-unit :: Editline/./EditlineTests/EditlineTestFixture.EditlineReceivesSingleLineText (909 of 2049)
PASS: lldb-api :: python_api/sbenvironment/TestSBEnvironment.py (910 of 2049)
PASS: lldb-shell :: Reproducer/TestLuaImport.test (911 of 2049)
PASS: lldb-api :: lang/cpp/dynamic-value-same-basename/TestDynamicValueSameBase.py (912 of 2049)
PASS: lldb-api :: lang/objc/foundation/TestSymbolTable.py (913 of 2049)
PASS: lldb-unit :: Language/CPlusPlus/./LanguageCPlusPlusTests/CPlusPlusLanguage.ExtractContextAndIdentifier (914 of 2049)
PASS: lldb-shell :: ScriptInterpreter/Lua/bindings.test (915 of 2049)
PASS: lldb-api :: python_api/exprpath_synthetic/TestExprPathSynthetic.py (916 of 2049)
PASS: lldb-unit :: Symbol/./SymbolTests/TestTypeSystemClang.TestRecordHasFields (917 of 2049)
PASS: lldb-unit :: Utility/./UtilityTests/ScalarTest.Scalar_512 (918 of 2049)
PASS: lldb-api :: commands/log/invalid-args/TestInvalidArgsLog.py (919 of 2049)
PASS: lldb-unit :: Process/minidump/./LLDBMinidumpTests/MinidumpParserTest.GetMemory (920 of 2049)
UNSUPPORTED: lldb-shell :: Register/aarch64-gp-read.test (921 of 2049)
PASS: lldb-api :: functionalities/data-formatter/data-formatter-objc/nsindexpath/TestDataFormatterNSIndexPath.py (922 of 2049)
UNSUPPORTED: lldb-shell :: SymbolFile/NativePDB/local-variables.cpp (923 of 2049)
PASS: lldb-api :: tools/lldb-server/TestGdbRemoteRegisterState.py (924 of 2049)
PASS: lldb-api :: lang/objc/exceptions/TestObjCExceptions.py (925 of 2049)
PASS: lldb-unit :: Expression/./ExpressionTests/DiagnosticManagerTest.AddDiagnostic (926 of 2049)
PASS: lldb-api :: functionalities/data-formatter/data-formatter-cpp/TestDataFormatterCpp.py (927 of 2049)
PASS: lldb-api :: commands/expression/scoped_enums/TestScopedEnumType.py (928 of 2049)
PASS: lldb-unit :: Utility/./UtilityTests/StringListTest.CopyListEmpty (929 of 2049)
PASS: lldb-api :: lang/c/set_values/TestSetValues.py (930 of 2049)
PASS: lldb-shell :: Commands/CommandScriptImmediateOutput/CommandScriptImmediateOutputFile.test (931 of 2049)
PASS: lldb-api :: commands/command/nested_alias/TestNestedAlias.py (932 of 2049)
PASS: lldb-unit :: Utility/./UtilityTests/NameMatchesTest.Ignore (933 of 2049)
UNSUPPORTED: lldb-api :: functionalities/darwin_log/filter/regex/category/TestDarwinLogFilterRegexCategory.py (934 of 2049)
PASS: lldb-unit :: SymbolFile/NativePDB/./SymbolFileNativePDBTests/PDBFPOProgramToDWARFExpressionTests.MissingTargetRegister (935 of 2049)
PASS: lldb-unit :: Utility/./UtilityTests/RegularExpression.CopyAssignment (936 of 2049)
PASS: lldb-unit :: Utility/./UtilityTests/BinaryStreamTest.PutSLEB128TwoBytes (937 of 2049)
PASS: lldb-unit :: debugserver/./debugserverTests/RNBSocket.AnyListen (938 of 2049)
PASS: lldb-unit :: Utility/./UtilityTests/RangeTest.ContainsRange (939 of 2049)
PASS: lldb-shell :: ScriptInterpreter/Lua/persistent_state.test (940 of 2049)
UNSUPPORTED: lldb-shell :: Expr/TestIRMemoryMapWindows.test (941 of 2049)
PASS: lldb-api :: commands/expression/options/TestExprOptions.py (942 of 2049)
PASS: lldb-unit :: Utility/./UtilityTests/VMRange.CollectionContains (943 of 2049)
PASS: lldb-unit :: Language/Highlighting/./HighlighterTests/HighlighterTest.FallbackHighlighter (944 of 2049)
PASS: lldb-unit :: Utility/./UtilityTests/StringExtractorTest.GetHexU8_Underflow2 (945 of 2049)
PASS: lldb-shell :: SymbolFile/DWARF/debug-types-address-ranges.s (946 of 2049)
PASS: lldb-unit :: Utility/./UtilityTests/FileSpecTest.IsRelative (947 of 2049)
PASS: lldb-api :: functionalities/thread/concurrent_events/TestConcurrentBreakpointDelayBreakpointOneSignal.py (948 of 2049)
PASS: lldb-api :: functionalities/reproducers/attach/TestReproducerAttach.py (949 of 2049)
PASS: lldb-api :: functionalities/thread/concurrent_events/TestConcurrentTwoWatchpointsOneBreakpoint.py (950 of 2049)
PASS: lldb-unit :: Utility/./UtilityTests/StringListTest.RemoveBlankLines (951 of 2049)
PASS: lldb-unit :: Utility/./UtilityTests/ArgsTest.TestAppendArg (952 of 2049)
PASS: lldb-shell :: SymbolFile/DWARF/find-basic-namespace.cpp (953 of 2049)
PASS: lldb-api :: functionalities/data-formatter/ptr_ref_typedef/TestPtrRef2Typedef.py (954 of 2049)
PASS: lldb-unit :: SymbolFile/NativePDB/./SymbolFileNativePDBTests/PDBFPOProgramToDWARFExpressionTests.UnresolvedRegisterReference (955 of 2049)
PASS: lldb-api :: functionalities/tail_call_frames/cross_object/TestCrossObjectTailCalls.py (956 of 2049)
PASS: lldb-api :: python_api/lldbutil/process/TestPrintStackTraces.py (957 of 2049)
PASS: lldb-unit :: Expression/./ExpressionTests/DiagnosticManagerTest.GetStringBasic (958 of 2049)
PASS: lldb-unit :: Utility/./UtilityTests/UriParserTest.BadPort2 (959 of 2049)
PASS: lldb-unit :: Utility/./UtilityTests/ArgsTest.BareSingleQuote (960 of 2049)
PASS: lldb-api :: commands/expression/radar_9531204/TestPrintfAfterUp.py (961 of 2049)
PASS: lldb-api :: lang/cpp/namespace_conflicts/TestNamespaceConflicts.py (962 of 2049)
UNSUPPORTED: lldb-api :: tools/lldb-server/signal-filtering/TestGdbRemote_QPassSignals.py (963 of 2049)
PASS: lldb-api :: lang/cpp/breakpoint-commands/TestCPPBreakpointCommands.py (964 of 2049)
PASS: lldb-unit :: ScriptInterpreter/Python/./ScriptInterpreterPythonTests/PythonDataObjectsTest.TestCallable (965 of 2049)
PASS: lldb-unit :: Host/./HostTests/HostInfoTest.GetAugmentedArchSpec (966 of 2049)
PASS: lldb-unit :: Process/minidump/./LLDBMinidumpTests/MinidumpParserTest.FindMemoryRangeWithFullMemoryMinidump (967 of 2049)
PASS: lldb-unit :: Language/Highlighting/./HighlighterTests/HighlighterTest.ClangCursorPosBeforeOtherToken (968 of 2049)
PASS: lldb-api :: functionalities/gdb_remote_client/TestNestedRegDefinitions.py (969 of 2049)
UNSUPPORTED: lldb-api :: functionalities/darwin_log/filter/exact_match/message/TestDarwinLogFilterMatchMessage.py (970 of 2049)
PASS: lldb-api :: python_api/section/TestSectionAPI.py (971 of 2049)
PASS: lldb-shell :: Minidump/disassemble-no-module.yaml (972 of 2049)
PASS: lldb-unit :: Process/gdb-remote/./ProcessGdbRemoteTests/GDBRemoteCommunicationClientTest.SendGetDataPacket (973 of 2049)
PASS: lldb-unit :: Utility/./UtilityTests/StringExtractorTest.GetHexBytesAvail (974 of 2049)
PASS: lldb-unit :: Utility/./UtilityTests/RegisterValueTest.GetSet8 (975 of 2049)
PASS: lldb-api :: commands/expression/top-level/TestTopLevelExprs.py (976 of 2049)
PASS: lldb-shell :: SymbolFile/Breakpad/line-table-missing-file.test (977 of 2049)
PASS: lldb-unit :: UnwindAssembly/x86/./UnwindAssemblyx86Tests/Testx86AssemblyInspectionEngine.TestPushEDX (978 of 2049)
PASS: lldb-shell :: Commands/command-backtrace.test (979 of 2049)
PASS: lldb-unit :: UnwindAssembly/x86/./UnwindAssemblyx86Tests/Testx86AssemblyInspectionEngine.TestPopRBP (980 of 2049)
PASS: lldb-unit :: Target/./TargetTests/ExecutionContextTest.GetByteOrder (981 of 2049)
PASS: lldb-shell :: BuildScript/modes.test (982 of 2049)
PASS: lldb-unit :: Process/gdb-remote/./ProcessGdbRemoteTests/GDBRemoteClientBaseTest.InterruptNoResponse (983 of 2049)
PASS: lldb-unit :: Target/./TargetTests/MemoryRegionInfoTest.Formatv (984 of 2049)
UNSUPPORTED: lldb-api :: functionalities/thread/create_during_step/TestCreateDuringStep.py (985 of 2049)
PASS: lldb-api :: commands/process/attach/TestProcessAttach.py (986 of 2049)
PASS: lldb-unit :: Utility/./UtilityTests/BroadcasterTest.EventTypeHasListeners (987 of 2049)
PASS: lldb-unit :: Utility/./UtilityTests/SerializationRountripTest.SerializeDeserializePodReferences (988 of 2049)
PASS: lldb-unit :: Host/./HostTests/SocketTest.TCPListen0GetPort (989 of 2049)
PASS: lldb-unit :: Expression/./ExpressionTests/DiagnosticManagerTest.GetStringNoDiags (990 of 2049)
PASS: lldb-unit :: ScriptInterpreter/Python/./ScriptInterpreterPythonTests/PythonDataObjectsTest.TestExtractingUInt64ThroughStructuredData (991 of 2049)
PASS: lldb-api :: commands/expression/multiline-navigation/TestMultilineNavigation.py (992 of 2049)
PASS: lldb-unit :: Utility/./UtilityTests/Flags.AnySet (993 of 2049)
PASS: lldb-unit :: UnwindAssembly/x86/./UnwindAssemblyx86Tests/Testx86AssemblyInspectionEngine.TestMovRSPtoRBP (994 of 2049)
UNSUPPORTED: lldb-shell :: SymbolFile/PDB/ast-restore.test (995 of 2049)
PASS: lldb-api :: functionalities/data-formatter/data-formatter-stl/libcxx/initializerlist/TestInitializerList.py (996 of 2049)
PASS: lldb-unit :: Process/gdb-remote/./ProcessGdbRemoteTests/GDBRemoteCommunicationClientTest.GetMemoryRegionInfo (997 of 2049)
UNSUPPORTED: lldb-shell :: Register/x86-64-ymm16-write.test (998 of 2049)
PASS: lldb-api :: functionalities/gdb_remote_client/TestRestartBug.py (999 of 2049)
PASS: lldb-unit :: Utility/./UtilityTests/TimeoutTest.Construction (1000 of 2049)
PASS: lldb-unit :: Utility/./UtilityTests/LogChannelEnabledTest.LogGetLogThread (1001 of 2049)
PASS: lldb-api :: commands/target/basic/TestTargetCommand.py (1002 of 2049)
PASS: lldb-api :: commands/watchpoints/multiple_threads/TestWatchpointMultipleThreads.py (1003 of 2049)
PASS: lldb-unit :: ScriptInterpreter/Lua/./ScriptInterpreterLuaTests/ScriptInterpreterTest.Plugin (1004 of 2049)
PASS: lldb-unit :: Utility/./UtilityTests/DataExtractorTest.GetMaxS64 (1005 of 2049)
UNSUPPORTED: lldb-api :: functionalities/tty/TestTerminal.py (1006 of 2049)
PASS: lldb-api :: functionalities/thread/state_after_expression/TestStateAfterExpression.py (1007 of 2049)
PASS: lldb-api :: python_api/objc_type/TestObjCType.py (1008 of 2049)
PASS: lldb-shell :: SymbolFile/DWARF/find-variable-dwo.cpp (1009 of 2049)
PASS: lldb-unit :: Utility/./UtilityTests/GeneratorTest.GetOrCreate (1010 of 2049)
PASS: lldb-shell :: SymbolFile/NativePDB/globals-bss.cpp (1011 of 2049)
PASS: lldb-api :: commands/target/stop-hooks/TestStopHooks.py (1012 of 2049)
PASS: lldb-api :: lang/cpp/rvalue-references/TestRvalueReferences.py (1013 of 2049)
PASS: lldb-api :: lang/cpp/stl/TestStdCXXDisassembly.py (1014 of 2049)
PASS: lldb-unit :: Process/minidump/./LLDBMinidumpTests/MinidumpParserTest.GetPidWindows (1015 of 2049)
PASS: lldb-api :: commands/watchpoints/watchpoint_on_vectors/TestValueOfVectorVariable.py (1016 of 2049)
PASS: lldb-unit :: UnwindAssembly/x86/./UnwindAssemblyx86Tests/Testx86AssemblyInspectionEngine.TestPopEBX (1017 of 2049)
UNSUPPORTED: lldb-api :: linux/thread/create_during_instruction_step/TestCreateDuringInstructionStep.py (1018 of 2049)
PASS: lldb-unit :: UnwindAssembly/ARM64/./Arm64InstEmulationTests/TestArm64InstEmulation.TestSimpleDarwinFunction (1019 of 2049)
PASS: lldb-api :: functionalities/breakpoint/inlined_breakpoints/TestInlinedBreakpoints.py (1020 of 2049)
PASS: lldb-api :: commands/watchpoints/watchpoint_commands/command/TestWatchpointCommandPython.py (1021 of 2049)
PASS: lldb-unit :: Host/./HostTests/FileSystemTest.Readable (1022 of 2049)
PASS: lldb-unit :: Utility/./UtilityTests/SerializationRountripTest.SerializeDeserializePod (1023 of 2049)
PASS: lldb-shell :: SymbolFile/Breakpad/stack-cfi-arm.yaml (1024 of 2049)
PASS: lldb-unit :: Core/./LLDBCoreTests/CommunicationTest.SynchronizeWhileClosing (1025 of 2049)
PASS: lldb-unit :: Utility/./UtilityTests/StringListTest.GetSize (1026 of 2049)
PASS: lldb-shell :: SymbolFile/NativePDB/function-types-builtins.cpp (1027 of 2049)
PASS: lldb-shell :: Driver/LocalLLDBInit.test (1028 of 2049)
PASS: lldb-shell :: Reproducer/TestPythonImport.test (1029 of 2049)
PASS: lldb-unit :: Utility/./UtilityTests/StreamTest.PutHex32ByteOrderLittle (1030 of 2049)
PASS: lldb-api :: commands/expression/completion-in-lambda-and-unnamed-class/TestCompletionInLambdaAndUnnamedClass.py (1031 of 2049)
PASS: lldb-unit :: Symbol/./SymbolTests/TestClangASTImporter.DeportDeclTagDecl (1032 of 2049)
PASS: lldb-api :: lang/cpp/dynamic-value/TestCppValueCast.py (1033 of 2049)
PASS: lldb-api :: lang/cpp/function_refs/TestFunctionRefs.py (1034 of 2049)
PASS: lldb-api :: python_api/lldbutil/iter/TestLLDBIterator.py (1035 of 2049)
PASS: lldb-unit :: UnwindAssembly/x86/./UnwindAssemblyx86Tests/Testx86AssemblyInspectionEngine.TestStackRealign8BitDisp_i386 (1036 of 2049)
PASS: lldb-api :: lang/c/forward/TestForwardDeclaration.py (1037 of 2049)
PASS: lldb-api :: functionalities/gdb_remote_client/TestWasm.py (1038 of 2049)
PASS: lldb-unit :: Host/./HostTests/SocketAddressTest.GetAddressInfo (1039 of 2049)
PASS: lldb-unit :: Utility/./UtilityTests/StringExtractorTest.GetHexU8_Extra_NoEof (1040 of 2049)
PASS: lldb-shell :: SymbolFile/DWARF/inline-function-address-shared.test (1041 of 2049)
PASS: lldb-shell :: Quit/TestQuitExitCodeImplicit0.test (1042 of 2049)
PASS: lldb-unit :: Utility/./UtilityTests/EnvironmentTest.EnvpConstruction (1043 of 2049)
PASS: lldb-api :: lang/objc/objc-new-syntax/TestObjCNewSyntaxLiteral.py (1044 of 2049)
PASS: lldb-unit :: Utility/./UtilityTests/StreamTest.Indent (1045 of 2049)
UNSUPPORTED: lldb-shell :: SymbolFile/PDB/expressions.test (1046 of 2049)
PASS: lldb-unit :: Host/./HostTests/NativeProcessProtocolTest.ReadCStringFromMemory_CrossPageBoundary (1047 of 2049)
PASS: lldb-unit :: Utility/./UtilityTests/StringListTest.AppendStringStdString (1048 of 2049)
PASS: lldb-api :: tools/lldb-server/TestGdbRemoteSingleStep.py (1049 of 2049)
PASS: lldb-shell :: Process/UnsupportedLanguage.test (1050 of 2049)
PASS: lldb-unit :: Utility/./UtilityTests/BinaryStreamTest.PutSLEB128NineBytes (1051 of 2049)
PASS: lldb-api :: lang/cpp/function-qualifiers/TestCppFunctionQualifiers.py (1052 of 2049)
PASS: lldb-unit :: Utility/./UtilityTests/ProcessInstanceInfo.Dump (1053 of 2049)
PASS: lldb-api :: commands/frame/diagnose/dereference-this/TestDiagnoseDereferenceThis.py (1054 of 2049)
PASS: lldb-unit :: Utility/./UtilityTests/ProcessInstanceInfo.DumpTable (1055 of 2049)
PASS: lldb-api :: types/TestIntegerType.py (1056 of 2049)
PASS: lldb-api :: functionalities/tail_call_frames/ambiguous_tail_call_seq2/TestAmbiguousTailCallSeq2.py (1057 of 2049)
PASS: lldb-unit :: Host/./HostTests/SocketTest.TCPGetAddress (1058 of 2049)
PASS: lldb-api :: functionalities/breakpoint/source_regexp/TestSourceRegexBreakpoints.py (1059 of 2049)
PASS: lldb-unit :: Utility/./UtilityTests/StringExtractorTest.GetHexU8_Exact_NoEof (1060 of 2049)
PASS: lldb-unit :: Symbol/./SymbolTests/TestTypeSystemClang.TestOwningModule (1061 of 2049)
UNSUPPORTED: lldb-api :: functionalities/data-formatter/data-formatter-stl/libstdcpp/string/TestDataFormatterStdString.py (1062 of 2049)
UNSUPPORTED: lldb-shell :: ObjectFile/ELF/minidebuginfo-set-and-hit-breakpoint.test (1063 of 2049)
PASS: lldb-api :: lang/objc/objc-foundation-dictionary-empty/TestNSDictionary0.py (1064 of 2049)
PASS: lldb-shell :: Reproducer/TestCaptureEnvOverride.test (1065 of 2049)
PASS: lldb-unit :: Utility/./UtilityTests/VMRange.ContainsAddr (1066 of 2049)
PASS: lldb-unit :: Symbol/./SymbolTests/TestTypeSystemClang.TestGetEnumIntegerTypeInvalid (1067 of 2049)
PASS: lldb-unit :: Utility/./UtilityTests/StateTest.Formatv (1068 of 2049)
PASS: lldb-unit :: Utility/./UtilityTests/CompletionRequest.TryCompleteCurrentArgMode (1069 of 2049)
PASS: lldb-api :: commands/expression/save_jit_objects/TestSaveJITObjects.py (1070 of 2049)
PASS: lldb-api :: functionalities/postmortem/elf-core/gcore/TestGCore.py (1071 of 2049)
PASS: lldb-unit :: Symbol/./SymbolTests/TestTypeSystemClang.TestGetTypeClassNested (1072 of 2049)
PASS: lldb-unit :: ScriptInterpreter/Python/./ScriptInterpreterPythonTests/PythonDataObjectsTest.TestPythonCallableCheck (1073 of 2049)
PASS: lldb-api :: functionalities/data-formatter/data-formatter-stl/libstdcpp/unique_ptr/invalid/TestDataFormatterInvalidStdUniquePtr.py (1074 of 2049)
PASS: lldb-unit :: Utility/./UtilityTests/FileSpecTest.FormatFileSpec (1075 of 2049)
PASS: lldb-api :: lang/c/anonymous/TestAnonymous.py (1076 of 2049)
PASS: lldb-shell :: Commands/command-source.test (1077 of 2049)
PASS: lldb-api :: lang/objc/blocks/TestObjCIvarsInBlocks.py (1078 of 2049)
PASS: lldb-api :: functionalities/breakpoint/auto_continue/TestBreakpointAutoContinue.py (1079 of 2049)
PASS: lldb-api :: functionalities/thread/concurrent_events/TestConcurrentSignalDelayWatch.py (1080 of 2049)
PASS: lldb-api :: lang/objc/foundation/TestObjCMethodsString.py (1081 of 2049)
PASS: lldb-unit :: Utility/./UtilityTests/BinaryStreamTest.PutULEB128One (1082 of 2049)
PASS: lldb-unit :: Utility/./UtilityTests/LogChannelTest.Disable (1083 of 2049)
PASS: lldb-shell :: ObjectFile/wasm/stripped-debug-sections.yaml (1084 of 2049)
PASS: lldb-api :: commands/command/invalid-args/TestInvalidArgsCommand.py (1085 of 2049)
PASS: lldb-unit :: SymbolFile/DWARF/./SymbolFileDWARFTests/SymbolFileDWARFTests.TestAbbrevNullAttrValidForm (1086 of 2049)
PASS: lldb-unit :: Utility/./UtilityTests/StringExtractorTest.GetHexBytes_FullString (1087 of 2049)
PASS: lldb-shell :: Reproducer/TestFileRepro.test (1088 of 2049)
PASS: lldb-shell :: Reproducer/TestCrash.test (1089 of 2049)
PASS: lldb-shell :: ScriptInterpreter/Python/scripted_breakpoint.test (1090 of 2049)
PASS: lldb-api :: functionalities/breakpoint/move_nearest/TestMoveNearest.py (1091 of 2049)
PASS: lldb-unit :: Process/gdb-remote/./ProcessGdbRemoteTests/GDBRemoteCommunicationServerTest.SendErrorResponse_UnimplementedError (1092 of 2049)
PASS: lldb-shell :: SymbolFile/DWARF/DW_TAG_variable-DW_AT_const_value.s (1093 of 2049)
PASS: lldb-unit :: Utility/./UtilityTests/RangeTest.Slide (1094 of 2049)
PASS: lldb-unit :: Expression/./ExpressionTests/DiagnosticManagerTest.FixedExpression (1095 of 2049)
PASS: lldb-api :: commands/expression/test/TestExprs2.py (1096 of 2049)
PASS: lldb-api :: lang/objc/objc-builtin-types/TestObjCBuiltinTypes.py (1097 of 2049)
PASS: lldb-unit :: Utility/./UtilityTests/ConstStringTest.FromMidOfBufferStringRef (1098 of 2049)
PASS: lldb-shell :: Breakpoint/jitbp_elf.test (1099 of 2049)
PASS: lldb-api :: commands/expression/import-std-module/weak_ptr/TestWeakPtrFromStdModule.py (1100 of 2049)
UNSUPPORTED: lldb-api :: tools/lldb-server/TestGdbRemote_vContThreads.py (1101 of 2049)
PASS: lldb-api :: commands/expression/import-std-module/forward_list/TestForwardListFromStdModule.py (1102 of 2049)
PASS: lldb-api :: functionalities/data-formatter/data-formatter-stl/libcxx/multiset/TestDataFormatterLibcxxMultiSet.py (1103 of 2049)
PASS: lldb-api :: functionalities/thread/concurrent_events/TestConcurrentManyCrash.py (1104 of 2049)
PASS: lldb-api :: commands/expression/import-std-module/empty-module/TestEmptyStdModule.py (1105 of 2049)
PASS: lldb-shell :: Driver/TestConvenienceVariables.test (1106 of 2049)
PASS: lldb-unit :: Expression/./ExpressionTests/CppModuleConfigurationTest.MissingLibCpp (1107 of 2049)
PASS: lldb-api :: macosx/profile_vrs_detach/TestDetachVrsProfile.py (1108 of 2049)
PASS: lldb-api :: lang/cpp/unique-types/TestUniqueTypes.py (1109 of 2049)
PASS: lldb-unit :: Utility/./UtilityTests/StreamTeeTest.Write (1110 of 2049)
PASS: lldb-shell :: Reproducer/TestRelativePath.test (1111 of 2049)
PASS: lldb-unit :: Utility/./UtilityTests/StreamTest.PutHex64ByteOrderLittle (1112 of 2049)
PASS: lldb-api :: commands/watchpoints/watchpoint_commands/TestWatchpointCommands.py (1113 of 2049)
UNSUPPORTED: lldb-shell :: Process/Windows/exception_access_violation.cpp (1114 of 2049)
PASS: lldb-unit :: Utility/./UtilityTests/UriParserTest.SchemeHostSeparator (1115 of 2049)
PASS: lldb-shell :: ObjectFile/PECOFF/export-dllfunc.yaml (1116 of 2049)
PASS: lldb-api :: commands/command/script/import/TestImport.py (1117 of 2049)
PASS: lldb-unit :: Utility/./UtilityTests/XcodeSDKTest.GetSDKTypeForTriple (1118 of 2049)
PASS: lldb-api :: lang/cpp/operators/TestCppOperators.py (1119 of 2049)
PASS: lldb-api :: lang/cpp/diamond/TestDiamond.py (1120 of 2049)
PASS: lldb-unit :: Utility/./UtilityTests/LogChannelTest.List (1121 of 2049)
PASS: lldb-api :: commands/expression/context-object-objc/TestContextObjectObjc.py (1122 of 2049)
PASS: lldb-api :: lang/objc/objc-class-method/TestObjCClassMethod.py (1123 of 2049)
PASS: lldb-unit :: DataFormatter/./LLDBFormatterTests/StringPrinterTests.SwiftUTF8 (1124 of 2049)
PASS: lldb-unit :: Utility/./UtilityTests/StringExtractorTest.GetU32LittleEndian (1125 of 2049)
PASS: lldb-unit :: Host/./HostTests/HostInfoTest.GetHostname (1126 of 2049)
UNSUPPORTED: lldb-shell :: Register/arm-gp-read.test (1127 of 2049)
PASS: lldb-api :: lang/cpp/virtual-functions/TestCppVirtualFunctions.py (1128 of 2049)
PASS: lldb-shell :: SymbolFile/DWARF/debug-types-missing-signature.test (1129 of 2049)
PASS: lldb-unit :: Utility/./UtilityTests/StringListTest.GetMaxStringLengthDecreasingSize (1130 of 2049)
PASS: lldb-api :: functionalities/data-formatter/data-formatter-skip-summary/TestDataFormatterSkipSummary.py (1131 of 2049)
PASS: lldb-shell :: SymbolFile/NativePDB/function-types-classes.cpp (1132 of 2049)
PASS: lldb-shell :: Reproducer/TestGDBRemoteRepro.test (1133 of 2049)
PASS: lldb-api :: macosx/version_zero/TestGetVersionZeroVersion.py (1134 of 2049)
PASS: lldb-unit :: Utility/./UtilityTests/StringExtractorTest.DecodeHexU8_Extra (1135 of 2049)
PASS: lldb-unit :: Utility/./UtilityTests/RangeTest.DoesIntersect (1136 of 2049)
PASS: lldb-shell :: Settings/TestFrameFormatNoColor.test (1137 of 2049)
PASS: lldb-shell :: ObjectFile/ELF/netbsd-exec-8.99.30-amd64.yaml (1138 of 2049)
PASS: lldb-unit :: Language/Highlighting/./HighlighterTests/HighlighterTest.ClangCursorOutOfBounds (1139 of 2049)
PASS: lldb-unit :: Expression/./ExpressionTests/DiagnosticManagerTest.PutString (1140 of 2049)
PASS: lldb-shell :: Settings/TestSettingsSet.test (1141 of 2049)
PASS: lldb-unit :: Utility/./UtilityTests/StringLexerTest.HasAtLeast (1142 of 2049)
PASS: lldb-api :: lang/cpp/signed_types/TestSignedTypes.py (1143 of 2049)
PASS: lldb-unit :: Symbol/./SymbolTests/TestTypeSystemClang.TestGetTypeClassTypeOfExpr (1144 of 2049)
PASS: lldb-api :: lang/objc/modules-auto-import/TestModulesAutoImport.py (1145 of 2049)
PASS: lldb-api :: commands/expression/import-std-module/vector-of-vectors/TestVectorOfVectorsFromStdModule.py (1146 of 2049)
PASS: lldb-unit :: Utility/./UtilityTests/StreamTeeTest.SetStreamAtIndexOutOfBounds (1147 of 2049)
PASS: lldb-api :: functionalities/tail_call_frames/inlining_and_tail_calls/TestInliningAndTailCalls.py (1148 of 2049)
PASS: lldb-api :: iohandler/completion/TestIOHandlerCompletion.py (1149 of 2049)
PASS: lldb-unit :: Utility/./UtilityTests/RegularExpression.Valid (1150 of 2049)
PASS: lldb-unit :: Symbol/./SymbolTests/TestClangASTImporter.CompleteFwdDeclWithOtherOrigin (1151 of 2049)
PASS: lldb-shell :: SymbolFile/DWARF/childless-compile-unit.s (1152 of 2049)
PASS: lldb-api :: tools/lldb-server/TestGdbRemoteExitCode.py (1153 of 2049)
PASS: lldb-api :: lang/cpp/unsigned_types/TestUnsignedTypes.py (1154 of 2049)
PASS: lldb-api :: functionalities/tsan/cpp_global_location/TestTsanCPPGlobalLocation.py (1155 of 2049)
PASS: lldb-api :: commands/expression/import-std-module/weak_ptr-dbg-info-content/TestDbgInfoContentWeakPtrFromStdModule.py (1156 of 2049)
PASS: lldb-api :: functionalities/breakpoint/breakpoint_language/TestBreakpointLanguage.py (1157 of 2049)
PASS: lldb-unit :: Utility/./UtilityTests/Flags.AllSet (1158 of 2049)
PASS: lldb-api :: lang/cpp/this/TestCPPThis.py (1159 of 2049)
PASS: lldb-shell :: ObjectFile/ELF/build-id-case.yaml (1160 of 2049)
PASS: lldb-unit :: Utility/./UtilityTests/ArchSpecTest.YAML (1161 of 2049)
PASS: lldb-unit :: Host/./HostTests/ProcessLaunchInfoTest.Constructor (1162 of 2049)
PASS: lldb-api :: functionalities/memory/read/TestMemoryRead.py (1163 of 2049)
PASS: lldb-unit :: Utility/./UtilityTests/EnvironmentTest.EnvpConversion (1164 of 2049)
PASS: lldb-api :: functionalities/tail_call_frames/ambiguous_tail_call_seq1/TestAmbiguousTailCallSeq1.py (1165 of 2049)
PASS: lldb-api :: functionalities/rerun/TestRerun.py (1166 of 2049)
PASS: lldb-api :: functionalities/thread/concurrent_events/TestConcurrentWatchBreakDelay.py (1167 of 2049)
PASS: lldb-api :: commands/target/dump-symtab-demangle/TestDumpSymtabDemangle.py (1168 of 2049)
PASS: lldb-api :: functionalities/data-formatter/frameformat_smallstruct/TestFrameFormatSmallStruct.py (1169 of 2049)
PASS: lldb-api :: commands/expression/rdar44436068/Test128BitsInteger.py (1170 of 2049)
PASS: lldb-unit :: Language/Highlighting/./HighlighterTests/HighlighterTest.ClangCursorPosEndOfLine (1171 of 2049)
PASS: lldb-api :: types/TestFloatTypesExpr.py (1172 of 2049)
PASS: lldb-unit :: Utility/./UtilityTests/StringExtractorTest.GetNameColonValueNoSemicolon (1173 of 2049)
PASS: lldb-shell :: Unwind/trap_frame_sym_ctx.test (1174 of 2049)
PASS: lldb-unit :: Utility/./UtilityTests/UriParserTest.BracketedHostnamePort (1175 of 2049)
PASS: lldb-shell :: SymbolFile/DWARF/debug-types-line-tables.s (1176 of 2049)
PASS: lldb-api :: lang/c/enum_types/TestEnumTypes.py (1177 of 2049)
PASS: lldb-unit :: Utility/./UtilityTests/UriParserTest.SchemeHostSeparator4 (1178 of 2049)
PASS: lldb-unit :: Expression/./ExpressionTests/DiagnosticManagerTest.GetStringSeverityLabels (1179 of 2049)
PASS: lldb-unit :: Utility/./UtilityTests/SerializationRountripTest.SerializeDeserializeCStringArrayNullptrElem (1180 of 2049)
PASS: lldb-unit :: Utility/./UtilityTests/UriParserTest.BracketedHostname (1181 of 2049)
PASS: lldb-unit :: Host/./HostTests/NativeProcessProtocolTest.ReadCStringFromMemory_MaxSize (1182 of 2049)
PASS: lldb-api :: commands/expression/weak_symbols/TestWeakSymbols.py (1183 of 2049)
PASS: lldb-unit :: Utility/./UtilityTests/FileSpecTest.Equal (1184 of 2049)
PASS: lldb-unit :: UnwindAssembly/x86/./UnwindAssemblyx86Tests/Testx86AssemblyInspectionEngine.TestPushRBX (1185 of 2049)
UNSUPPORTED: lldb-api :: benchmarks/libcxxlist/TestBenchmarkLibcxxList.py (1186 of 2049)
PASS: lldb-unit :: Utility/./UtilityTests/StringExtractorTest.DecodeHexU8_Underflow (1187 of 2049)
PASS: lldb-unit :: Utility/./UtilityTests/StreamTest.AddressRange (1188 of 2049)
PASS: lldb-api :: functionalities/data-formatter/data-formatter-stl/libcxx/unique_ptr/TestDataFormatterLibcxxUniquePtr.py (1189 of 2049)
PASS: lldb-shell :: ObjectFile/wasm/embedded-debug-sections.yaml (1190 of 2049)
PASS: lldb-api :: functionalities/gdb_remote_client/TestNoWatchpointSupportInfo.py (1191 of 2049)
PASS: lldb-unit :: Utility/./UtilityTests/StreamTest.PutHex32ByteOrderBig (1192 of 2049)
PASS: lldb-api :: functionalities/data-formatter/data-formatter-stl/libcxx/vector/TestDataFormatterLibcxxVector.py (1193 of 2049)
PASS: lldb-unit :: Utility/./UtilityTests/SerializationRountripTest.SerializeDeserializePodPointers (1194 of 2049)
PASS: lldb-shell :: ObjectFile/PECOFF/invalid-export-table.yaml (1195 of 2049)
PASS: lldb-api :: functionalities/target_var/TestTargetVar.py (1196 of 2049)
PASS: lldb-api :: sample_test/TestSampleTest.py (1197 of 2049)
PASS: lldb-unit :: ObjectFile/PECOFF/./ObjectFilePECOFFTests/PECallFrameInfoTest.Frame_reg_eh (1198 of 2049)
PASS: lldb-unit :: Utility/./UtilityTests/UriParserTest.Minimal (1199 of 2049)
PASS: lldb-api :: types/TestIntegerTypeExpr.py (1200 of 2049)
PASS: lldb-shell :: Process/TestEnvironment.test (1201 of 2049)
PASS: lldb-api :: commands/expression/persistent_variables/TestPersistentVariables.py (1202 of 2049)
PASS: lldb-api :: functionalities/return-value/TestReturnValue.py (1203 of 2049)
PASS: lldb-api :: functionalities/data-formatter/dump_dynamic/TestDumpDynamic.py (1204 of 2049)
PASS: lldb-unit :: Utility/./UtilityTests/StringExtractorTest.GetHexBytesAvail_OddPair (1205 of 2049)
PASS: lldb-api :: commands/expression/test/TestExprs.py (1206 of 2049)
PASS: lldb-api :: python_api/disassemble-raw-data/TestDisassemble_VST1_64.py (1207 of 2049)
PASS: lldb-api :: macosx/dyld-trie-symbols/TestDyldTrieSymbols.py (1208 of 2049)
PASS: lldb-api :: lang/objc/objc-super/TestObjCSuper.py (1209 of 2049)
PASS: lldb-shell :: SymbolFile/DWARF/debug-types-dwarf5.s (1210 of 2049)
PASS: lldb-shell :: SymbolFile/DWARF/dir-separator-no-comp-dir-relative-name.s (1211 of 2049)
PASS: lldb-shell :: SymbolFile/DWARF/DW_TAG_basic_type_DW_ATE_UTF_nonC.ll (1212 of 2049)
PASS: lldb-unit :: Utility/./UtilityTests/StreamTest.ChangingByteOrder (1213 of 2049)
PASS: lldb-unit :: Utility/./UtilityTests/UriParserTest.MinimalPort (1214 of 2049)
UNSUPPORTED: lldb-shell :: SymbolFile/PDB/variables.test (1215 of 2049)
PASS: lldb-api :: functionalities/data-formatter/type_summary_list_arg/TestTypeSummaryListArg.py (1216 of 2049)
PASS: lldb-unit :: Symbol/./SymbolTests/PostfixExpression.ParseFPOProgram (1217 of 2049)
PASS: lldb-unit :: Utility/./UtilityTests/StreamTest.AddressPrefixAndSuffix (1218 of 2049)
PASS: lldb-unit :: Symbol/./SymbolTests/TestTypeSystemClang.TemplateArguments (1219 of 2049)
PASS: lldb-shell :: SymbolFile/DWARF/debug-types-basic.test (1220 of 2049)
PASS: lldb-unit :: Host/./HostTests/MainLoopTest.DetectsEOF (1221 of 2049)
PASS: lldb-unit :: Utility/./UtilityTests/UriParserTest.BracketedHostnameWithColon (1222 of 2049)
UNSUPPORTED: lldb-api :: functionalities/process_save_core/TestProcessSaveCore.py (1223 of 2049)
PASS: lldb-api :: lang/c/find_struct_type/TestFindStructTypes.py (1224 of 2049)
PASS: lldb-api :: functionalities/data-formatter/data-formatter-stl/libcxx/unordered/TestDataFormatterUnordered.py (1225 of 2049)
PASS: lldb-api :: functionalities/data-formatter/data-formatter-synth/TestDataFormatterSynth.py (1226 of 2049)
PASS: lldb-shell :: SymbolFile/DWARF/parallel-indexing-stress.s (1227 of 2049)
PASS: lldb-unit :: Host/./HostTests/NativeProcessProtocolTest.ReadCStringFromMemory (1228 of 2049)
PASS: lldb-unit :: SymbolFile/NativePDB/./SymbolFileNativePDBTests/PDBFPOProgramToDWARFExpressionTests.MultipleDependentAssignments (1229 of 2049)
PASS: lldb-unit :: Utility/./UtilityTests/StringExtractorTest.GetNameColonValueContainsColon (1230 of 2049)
PASS: lldb-api :: commands/expression/deleting-implicit-copy-constructor/TestDeletingImplicitCopyConstructor.py (1231 of 2049)
PASS: lldb-shell :: Expr/TestMultilineExpr.test (1232 of 2049)
PASS: lldb-unit :: Utility/./UtilityTests/LogTest.LLDB_LOG_nullptr (1233 of 2049)
PASS: lldb-unit :: Utility/./UtilityTests/BinaryStreamTest.PutULEB128SevenBytes (1234 of 2049)
PASS: lldb-unit :: Target/./TargetTests/ModuleCacheTest.GetAndPutUuidExists (1235 of 2049)
PASS: lldb-unit :: Utility/./UtilityTests/OptionsWithRawTest.ArgsButNoLeadingDash (1236 of 2049)
PASS: lldb-api :: python_api/symbol-context/TestSymbolContext.py (1237 of 2049)
PASS: lldb-unit :: Expression/./ExpressionTests/DiagnosticManagerTest.GetStringMultiline (1238 of 2049)
PASS: lldb-shell :: ObjectFile/PECOFF/section-types.yaml (1239 of 2049)
UNSUPPORTED: lldb-api :: commands/expression/call-restarts/TestCallThatRestarts.py (1240 of 2049)
PASS: lldb-api :: lang/cpp/frame-var-anon-unions/TestFrameVariableAnonymousUnions.py (1241 of 2049)
PASS: lldb-api :: functionalities/breakpoint/breakpoint_ignore_count/TestBreakpointIgnoreCount.py (1242 of 2049)
PASS: lldb-unit :: Target/./TargetTests/PathMappingListTest.RemapRoot (1243 of 2049)
UNSUPPORTED: lldb-shell :: SymbolFile/PDB/func-symbols.test (1244 of 2049)
PASS: lldb-api :: tools/lldb-server/TestGdbRemoteHostInfo.py (1245 of 2049)
PASS: lldb-api :: functionalities/abbreviation/TestCommonShortSpellings.py (1246 of 2049)
PASS: lldb-unit :: Utility/./UtilityTests/StringListTest.CopyListSingle (1247 of 2049)
PASS: lldb-shell :: Driver/TestCore.test (1248 of 2049)
PASS: lldb-api :: python_api/lldbutil/iter/TestRegistersIterator.py (1249 of 2049)
PASS: lldb-api :: commands/expression/import-std-module/deque-dbg-info-content/TestDbgInfoContentDequeFromStdModule.py (1250 of 2049)
PASS: lldb-api :: functionalities/breakpoint/breakpoint_ids/TestBreakpointIDs.py (1251 of 2049)
PASS: lldb-unit :: Language/Highlighting/./HighlighterTests/HighlighterTest.ClangOperators (1252 of 2049)
PASS: lldb-unit :: Utility/./UtilityTests/ArgsTest.GetQuotedCommandString (1253 of 2049)
PASS: lldb-unit :: SymbolFile/NativePDB/./SymbolFileNativePDBTests/PDBFPOProgramToDWARFExpressionTests.UnresolvedCyclicRegisterAssignmentReference (1254 of 2049)
PASS: lldb-api :: python_api/sbstructureddata/TestStructuredDataAPI.py (1255 of 2049)
PASS: lldb-unit :: UnwindAssembly/x86/./UnwindAssemblyx86Tests/Testx86AssemblyInspectionEngine.TestCALLNextInsn (1256 of 2049)
PASS: lldb-unit :: Utility/./UtilityTests/StringExtractorTest.GetHexBytesAvail_OddPair2 (1257 of 2049)
PASS: lldb-unit :: Process/minidump/./LLDBMinidumpTests/MinidumpParserTest.InvalidMinidump (1258 of 2049)
PASS: lldb-shell :: ObjectFile/PECOFF/sections-names.yaml (1259 of 2049)
PASS: lldb-unit :: Utility/./UtilityTests/IndexToObjectTest.ObjectForIndex (1260 of 2049)
PASS: lldb-api :: commands/watchpoints/watchpoint_events/TestWatchpointEvents.py (1261 of 2049)
PASS: lldb-api :: functionalities/thread/concurrent_events/TestConcurrentSignalNWatchNBreak.py (1262 of 2049)
PASS: lldb-api :: functionalities/thread/concurrent_events/TestConcurrentSignalDelayBreak.py (1263 of 2049)
PASS: lldb-unit :: Utility/./UtilityTests/RangeTest.DoesAdjoinOrIntersect (1264 of 2049)
UNSUPPORTED: lldb-api :: tools/intel-features/intel-pt/test/TestIntelPTSimpleBinary.py (1265 of 2049)
PASS: lldb-shell :: ObjectFile/ELF/duplicate-section.yaml (1266 of 2049)
PASS: lldb-unit :: Utility/./UtilityTests/StreamTest.PutSLEB128 (1267 of 2049)
PASS: lldb-unit :: Utility/./UtilityTests/CompletionRequest.TryCompleteCurrentArgBad (1268 of 2049)
PASS: lldb-shell :: SymbolFile/DWARF/inline-function-address.ll (1269 of 2049)
PASS: lldb-unit :: Utility/./UtilityTests/FileSpecTest.EqualDotsPosix (1270 of 2049)
PASS: lldb-api :: functionalities/breakpoint/objc/TestObjCBreakpoints.py (1271 of 2049)
PASS: lldb-api :: functionalities/memory/find/TestMemoryFind.py (1272 of 2049)
PASS: lldb-api :: functionalities/memory/cache/TestMemoryCache.py (1273 of 2049)
PASS: lldb-unit :: Utility/./UtilityTests/StatusTest.ErrorConversion (1274 of 2049)
PASS: lldb-unit :: ScriptInterpreter/Python/./ScriptInterpreterPythonTests/PythonDataObjectsTest.TestGlobalNameResolutionNoDot (1275 of 2049)
PASS: lldb-unit :: Utility/./UtilityTests/StringExtractorTest.GetHexU8_Exact (1276 of 2049)
PASS: lldb-api :: lang/objcxx/class-name-clash/TestNameClash.py (1277 of 2049)
PASS: lldb-api :: lang/cpp/breakpoint_in_member_func_w_non_primitive_params/TestBreakpointInMemberFuncWNonPrimitiveParams.py (1278 of 2049)
PASS: lldb-shell :: Minidump/dump-all.test (1279 of 2049)
PASS: lldb-unit :: Utility/./UtilityTests/AnsiTerminal.Empty (1280 of 2049)
PASS: lldb-api :: functionalities/dynamic_value_child_count/TestDynamicValueChildCount.py (1281 of 2049)
PASS: lldb-api :: commands/help/TestHelp.py (1282 of 2049)
PASS: lldb-api :: commands/platform/process/list/TestProcessList.py (1283 of 2049)
PASS: lldb-api :: macosx/find-dsym/deep-bundle/TestDeepBundle.py (1284 of 2049)
PASS: lldb-shell :: Heap/heap-cstr.test (1285 of 2049)
PASS: lldb-shell :: SymbolFile/symbol-binding.test (1286 of 2049)
PASS: lldb-api :: functionalities/plugins/python_os_plugin/TestPythonOSPlugin.py (1287 of 2049)
PASS: lldb-api :: commands/expression/dollar-in-variable/TestDollarInVariable.py (1288 of 2049)
PASS: lldb-unit :: Signals/./SignalsTests/UnixSignalsTest.VersionChange (1289 of 2049)
PASS: lldb-api :: commands/breakpoint/set/func-regex/TestBreakpointRegexError.py (1290 of 2049)
PASS: lldb-api :: lang/objc/conflicting-definition/TestConflictingDefinition.py (1291 of 2049)
PASS: lldb-shell :: SymbolFile/DWARF/anon_class_w_and_wo_export_symbols.ll (1292 of 2049)
PASS: lldb-api :: python_api/sbdata/TestSBData.py (1293 of 2049)
PASS: lldb-shell :: Reproducer/TestDiscard.test (1294 of 2049)
PASS: lldb-api :: api/log/TestAPILog.py (1295 of 2049)
PASS: lldb-unit :: ObjectFile/Breakpad/./ObjectFileBreakpadTests/InfoRecord.parse (1296 of 2049)
PASS: lldb-unit :: ObjectFile/PECOFF/./ObjectFilePECOFFTests/PECallFrameInfoTest.Basic_eh (1297 of 2049)
PASS: lldb-unit :: Utility/./UtilityTests/ArchSpecTest.OperatorBool (1298 of 2049)
PASS: lldb-api :: functionalities/data-formatter/data-formatter-proper-plurals/TestFormattersOneIsSingular.py (1299 of 2049)
PASS: lldb-shell :: SymbolFile/DWARF/find-function-regex.cpp (1300 of 2049)
PASS: lldb-unit :: Utility/./UtilityTests/SerializationRountripTest.SerializeDeserializeObjectPointer (1301 of 2049)
PASS: lldb-api :: lang/c/inlines/TestRedefinitionsInInlines.py (1302 of 2049)
PASS: lldb-unit :: Expression/./ExpressionTests/CppModuleConfigurationTest.UnknownLibCppFile (1303 of 2049)
PASS: lldb-api :: lang/cpp/exceptions/TestCPPExceptionBreakpoints.py (1304 of 2049)
PASS: lldb-unit :: ScriptInterpreter/Python/./ScriptInterpreterPythonTests/PythonDataObjectsTest.TestPythonInteger (1305 of 2049)
PASS: lldb-unit :: Platform/./LLDBPlatformTests/PlatformDarwinTest.FindComponentInPath (1306 of 2049)
PASS: lldb-unit :: Utility/./UtilityTests/StatusTest.ErrorConstructor (1307 of 2049)
PASS: lldb-unit :: Process/minidump/./LLDBMinidumpTests/MinidumpParserTest.GetMemoryRegionInfo (1308 of 2049)
PASS: lldb-api :: lang/c/shared_lib_stripped_symbols/TestSharedLibStrippedSymbols.py (1309 of 2049)
PASS: lldb-unit :: Utility/./UtilityTests/StringListTest.Assignment (1310 of 2049)
PASS: lldb-shell :: Expr/TestTypeOfDeclTypeExpr.test (1311 of 2049)
PASS: lldb-shell :: BuildScript/compiler-full-path.test (1312 of 2049)
PASS: lldb-unit :: Utility/./UtilityTests/SubsystemRAIITest.SubsystemWithErrorFailure (1313 of 2049)
PASS: lldb-api :: functionalities/thread/step_out/TestThreadStepOut.py (1314 of 2049)
PASS: lldb-unit :: Signals/./SignalsTests/UnixSignalsTest.Iteration (1315 of 2049)
PASS: lldb-api :: functionalities/gdb_remote_client/TestIOSSimulator.py (1316 of 2049)
PASS: lldb-shell :: Settings/TestFrameFormatMangling.test (1317 of 2049)
PASS: lldb-unit :: Symbol/./SymbolTests/DWARFCallFrameInfoTest.Basic_dwarf3 (1318 of 2049)
PASS: lldb-api :: functionalities/thread/thread_specific_break/TestThreadSpecificBreakpoint.py (1319 of 2049)
PASS: lldb-unit :: UnwindAssembly/ARM64/./Arm64InstEmulationTests/TestArm64InstEmulation.TestMediumDarwinFunction (1320 of 2049)
PASS: lldb-api :: commands/expression/completion/TestExprCompletion.py (1321 of 2049)
PASS: lldb-shell :: Settings/TestLineMarkerColor.test (1322 of 2049)
PASS: lldb-unit :: UnwindAssembly/PPC64/./PPC64InstEmulationTests/TestPPC64InstEmulation.TestSimpleFunction (1323 of 2049)
UNSUPPORTED: lldb-shell :: Watchpoint/netbsd-nouserdbregs.test (1324 of 2049)
PASS: lldb-shell :: SymbolFile/DWARF/find-inline-method.s (1325 of 2049)
PASS: lldb-unit :: Utility/./UtilityTests/PassiveReplayTest.InstrumentedBarRef (1326 of 2049)
PASS: lldb-unit :: Utility/./UtilityTests/StringExtractorTest.GetHexBytesAvail_FullString (1327 of 2049)
PASS: lldb-shell :: SymbolFile/DWARF/DW_OP_piece-smaller-than-struct.s (1328 of 2049)
UNSUPPORTED: lldb-api :: benchmarks/expression/TestExpressionCmd.py (1329 of 2049)
PASS: lldb-unit :: Utility/./UtilityTests/DataExtractorTest.GetULEB128_bit63 (1330 of 2049)
PASS: lldb-unit :: Interpreter/./InterpreterTests/CompletionTest.DirCompletionAbsolute (1331 of 2049)
PASS: lldb-shell :: ObjectFile/Breakpad/sections.test (1332 of 2049)
PASS: lldb-api :: functionalities/data-formatter/data-formatter-stl/libcxx/atomic/TestLibCxxAtomic.py (1333 of 2049)
PASS: lldb-api :: tools/lldb-server/TestLldbGdbServer.py (1334 of 2049)
PASS: lldb-unit :: Utility/./UtilityTests/StreamTest.ShiftOperatorChars (1335 of 2049)
PASS: lldb-shell :: SymbolFile/dissassemble-entry-point.s (1336 of 2049)
PASS: lldb-shell :: ObjectFile/PECOFF/basic-info-arm.yaml (1337 of 2049)
PASS: lldb-unit :: Utility/./UtilityTests/ArgsTest.EscapeLLDBCommandArgument (1338 of 2049)
PASS: lldb-unit :: Utility/./UtilityTests/ArchSpecTest.MergeFrom (1339 of 2049)
PASS: lldb-api :: functionalities/thread/create_after_attach/TestCreateAfterAttach.py (1340 of 2049)
PASS: lldb-api :: lang/objc/rdar-10967107/TestRdar10967107.py (1341 of 2049)
PASS: lldb-unit :: Process/gdb-remote/./ProcessGdbRemoteTests/GDBRemoteCommunicationClientTest.SendGetTraceConfigPacket (1342 of 2049)
PASS: lldb-api :: lang/cpp/operator-overload/TestOperatorOverload.py (1343 of 2049)
PASS: lldb-shell :: Breakpoint/split-dwarf5-debug-stroffsets.test (1344 of 2049)
PASS: lldb-api :: functionalities/data-formatter/stringprinter/TestStringPrinter.py (1345 of 2049)
PASS: lldb-api :: functionalities/tail_call_frames/disambiguate_tail_call_seq/TestDisambiguateTailCallSeq.py (1346 of 2049)
PASS: lldb-unit :: SymbolFile/DWARF/./SymbolFileDWARFTests/DWARFASTParserClangTests.EnsureAllDIEsInDeclContextHaveBeenParsedParsesOnlyMatchingEntries (1347 of 2049)
PASS: lldb-shell :: Minidump/memory-region.yaml (1348 of 2049)
PASS: lldb-api :: python_api/process/read-mem-cstring/TestReadMemCString.py (1349 of 2049)
PASS: lldb-api :: lang/objc/modules-cache/TestClangModulesCache.py (1350 of 2049)
PASS: lldb-shell :: ScriptInterpreter/Lua/lua.test (1351 of 2049)
PASS: lldb-api :: tools/lldb-vscode/breakpoint/TestVSCode_setFunctionBreakpoints.py (1352 of 2049)
PASS: lldb-unit :: ScriptInterpreter/Python/./ScriptInterpreterPythonTests/PythonDataObjectsTest.TestPythonDictionaryToStructuredDictionary (1353 of 2049)
PASS: lldb-unit :: Utility/./UtilityTests/StreamTeeTest.Constructor1Stream (1354 of 2049)
PASS: lldb-unit :: Utility/./UtilityTests/StreamTest.SetIndentLevel (1355 of 2049)
PASS: lldb-api :: lang/objc/foundation/TestObjCMethodsNSError.py (1356 of 2049)
PASS: lldb-unit :: Host/./HostTests/FileSystemTest.MakeAbsolute (1357 of 2049)
PASS: lldb-unit :: Utility/./UtilityTests/ArgsTest.TestMultipleArgs (1358 of 2049)
PASS: lldb-unit :: Utility/./UtilityTests/ArgsTest.ReplaceArgumentAtIndexEqual (1359 of 2049)
PASS: lldb-api :: functionalities/dead-strip/TestDeadStrip.py (1360 of 2049)
PASS: lldb-shell :: ObjectFile/ELF/compressed-sections.yaml (1361 of 2049)
PASS: lldb-api :: lang/cpp/offsetof/TestOffsetofCpp.py (1362 of 2049)
PASS: lldb-unit :: ScriptInterpreter/Python/./ScriptInterpreterPythonTests/PythonDataObjectsTest.TestGlobalNameResolutionWithDot (1363 of 2049)
PASS: lldb-shell :: SymbolFile/NativePDB/source-list.cpp (1364 of 2049)
PASS: lldb-api :: functionalities/gdb_remote_client/TestThreadSelectionBug.py (1365 of 2049)
PASS: lldb-unit :: Utility/./UtilityTests/NameMatchesTest.RegularExpression (1366 of 2049)
PASS: lldb-api :: functionalities/breakpoint/comp_dir_symlink/TestCompDirSymLink.py (1367 of 2049)
PASS: lldb-unit :: Utility/./UtilityTests/ScalarTest.GetBytes (1368 of 2049)
PASS: lldb-unit :: SymbolFile/NativePDB/./SymbolFileNativePDBTests/PDBFPOProgramToDWARFExpressionTests.UnresolvedRegisterAssignmentReference (1369 of 2049)
XFAIL: lldb-shell :: Register/x86-64-ymm-write.test (1370 of 2049)
PASS: lldb-unit :: Process/gdb-remote/./ProcessGdbRemoteTests/GDBRemoteClientBaseTest.SendContinueAndAsyncSignal (1371 of 2049)
PASS: lldb-unit :: UnwindAssembly/x86/./UnwindAssemblyx86Tests/Testx86AssemblyInspectionEngine.TestSimplex86_64Augmented (1372 of 2049)
PASS: lldb-unit :: Language/Highlighting/./HighlighterTests/HighlighterTest.Keywords (1373 of 2049)
UNSUPPORTED: lldb-api :: functionalities/thread/break_after_join/TestBreakAfterJoin.py (1374 of 2049)
PASS: lldb-api :: functionalities/breakpoint/require_hw_breakpoints/TestRequireHWBreakpoints.py (1375 of 2049)
PASS: lldb-unit :: Utility/./UtilityTests/RecordReplayTest.InstrumentedBarPtr (1376 of 2049)
PASS: lldb-api :: python_api/sbvalue_const_addrof/TestSBValueConstAddrOf.py (1377 of 2049)
UNSUPPORTED: lldb-shell :: SymbolFile/target-symbols-add-unwind.test (1378 of 2049)
PASS: lldb-api :: lang/cpp/call-function/TestCallCPPFunction.py (1379 of 2049)
PASS: lldb-shell :: Settings/TestEchoCommands.test (1380 of 2049)
PASS: lldb-api :: functionalities/data-formatter/data-formatter-objc/TestDataFormatterObjCNSURL.py (1381 of 2049)
UNSUPPORTED: lldb-api :: functionalities/darwin_log/source/debug/TestDarwinLogSourceDebug.py (1382 of 2049)
PASS: lldb-api :: lang/c/unicode/TestUnicodeSymbols.py (1383 of 2049)
PASS: lldb-api :: functionalities/stats_api/TestStatisticsAPI.py (1384 of 2049)
PASS: lldb-api :: commands/expression/call-throws/TestCallThatThrows.py (1385 of 2049)
PASS: lldb-unit :: Utility/./UtilityTests/StringExtractorTest.GetHexU8_InvalidHex (1386 of 2049)
PASS: lldb-unit :: Utility/./UtilityTests/RecordReplayTest.InstrumentedFoo (1387 of 2049)
PASS: lldb-api :: functionalities/step-avoids-no-debug/TestStepNoDebug.py (1388 of 2049)
PASS: lldb-api :: commands/process/attach/attach_denied/TestAttachDenied.py (1389 of 2049)
PASS: lldb-unit :: Utility/./UtilityTests/RangeTest.ContainsAddr (1390 of 2049)
PASS: lldb-unit :: Target/./TargetTests/PathMappingListTest.AbsoluteTests (1391 of 2049)
UNSUPPORTED: lldb-shell :: Register/x86-64-xmm16-write.test (1392 of 2049)
PASS: lldb-api :: functionalities/asan/TestMemoryHistory.py (1393 of 2049)
PASS: lldb-unit :: UnwindAssembly/x86/./UnwindAssemblyx86Tests/Testx86AssemblyInspectionEngine.TestPopEDI (1394 of 2049)
PASS: lldb-unit :: Utility/./UtilityTests/StringListTest.InsertStringAtIndexStart (1395 of 2049)
PASS: lldb-shell :: SymbolFile/DWARF/debug_ranges_and_rnglists.test (1396 of 2049)
PASS: lldb-api :: lang/cpp/covariant-return-types/TestCovariantReturnTypes.py (1397 of 2049)
PASS: lldb-shell :: SymbolFile/DWARF/dir-separator-posix.s (1398 of 2049)
UNSUPPORTED: lldb-shell :: Register/x86-64-gp-write.test (1399 of 2049)
PASS: lldb-shell :: ScriptInterpreter/Lua/independent_state.test (1400 of 2049)
PASS: lldb-shell :: SymbolFile/DWARF/dwarf5_locations.s (1401 of 2049)
PASS: lldb-unit :: Utility/./UtilityTests/LogChannelTest.Enable (1402 of 2049)
PASS: lldb-unit :: Utility/./UtilityTests/SerializationRountripTest.SerializeDeserializeCString (1403 of 2049)
PASS: lldb-unit :: Utility/./UtilityTests/RangeTest.Union (1404 of 2049)
PASS: lldb-shell :: Register/x86-64-gp-read.test (1405 of 2049)
PASS: lldb-unit :: Utility/./UtilityTests/NameMatchesTest.StartsWith (1406 of 2049)
PASS: lldb-unit :: Utility/./UtilityTests/StringListTest.LongestCommonPrefixEmpty (1407 of 2049)
PASS: lldb-api :: commands/expression/char/TestExprsChar.py (1408 of 2049)
UNSUPPORTED: lldb-api :: functionalities/thread/multi_break/TestMultipleBreakpoints.py (1409 of 2049)
PASS: lldb-unit :: UnwindAssembly/x86/./UnwindAssemblyx86Tests/Testx86AssemblyInspectionEngine.TestPopR12 (1410 of 2049)
PASS: lldb-unit :: Host/./HostTests/SocketTest.UDPGetConnectURI (1411 of 2049)
PASS: lldb-unit :: Symbol/./SymbolTests/TestTypeSystemClang.TestGetBasicTypeFromEnum (1412 of 2049)
PASS: lldb-unit :: Utility/./UtilityTests/ConstStringTest.CompareStringRef (1413 of 2049)
PASS: lldb-api :: python_api/watchpoint/watchlocation/TestTargetWatchAddress.py (1414 of 2049)
PASS: lldb-api :: functionalities/data-formatter/data-formatter-script/TestDataFormatterScript.py (1415 of 2049)
PASS: lldb-api :: lang/objc/objc-ivar-protocols/TestIvarProtocols.py (1416 of 2049)
PASS: lldb-unit :: Utility/./UtilityTests/ReproducerTest.SetCapture (1417 of 2049)
PASS: lldb-api :: functionalities/data-formatter/language_category_updates/TestDataFormatterLanguageCategoryUpdates.py (1418 of 2049)
PASS: lldb-unit :: Utility/./UtilityTests/ConstStringTest.NullAndEmptyStates (1419 of 2049)
PASS: lldb-unit :: Process/gdb-remote/./ProcessGdbRemoteTests/GDBRemoteCommunicationClientTest.SendStopTracePacket (1420 of 2049)
PASS: lldb-unit :: Host/./HostTests/NativeProcessProtocolTest.SetBreakpointFailRead (1421 of 2049)
PASS: lldb-unit :: Expression/./ExpressionTests/CppModuleConfigurationTest.LinuxLocalLibCpp (1422 of 2049)
PASS: lldb-unit :: UnwindAssembly/x86/./UnwindAssemblyx86Tests/Testx86AssemblyInspectionEngine.TestPushR14 (1423 of 2049)
PASS: lldb-api :: commands/expression/vector_of_enums/TestVectorOfEnums.py (1424 of 2049)
PASS: lldb-unit :: Symbol/./SymbolTests/TestTypeSystemClang.TestIsClangType (1425 of 2049)
PASS: lldb-api :: arm/emulation/TestEmulations.py (1426 of 2049)
PASS: lldb-api :: functionalities/var_path/TestVarPath.py (1427 of 2049)
PASS: lldb-unit :: Utility/./UtilityTests/ArgsTest.AppendArguments (1428 of 2049)
PASS: lldb-api :: terminal/TestEditline.py (1429 of 2049)
UNSUPPORTED: lldb-api :: tools/lldb-server/libraries-svr4/TestGdbRemoteLibrariesSvr4Support.py (1430 of 2049)
PASS: lldb-shell :: ObjectFile/PECOFF/symbol.yaml (1431 of 2049)
PASS: lldb-shell :: Breakpoint/debug_rnglistx_rlex.test (1432 of 2049)
PASS: lldb-unit :: Interpreter/./InterpreterTests/OptionArgParserTest.toChar (1433 of 2049)
PASS: lldb-shell :: SymbolFile/DWARF/deterministic-build.cpp (1434 of 2049)
PASS: lldb-unit :: Utility/./UtilityTests/ArgsTest.TestSingleArgWithQuotedSpace (1435 of 2049)
PASS: lldb-unit :: Utility/./UtilityTests/FileSpecTest.RemoveLastPathComponent (1436 of 2049)
PASS: lldb-unit :: Utility/./UtilityTests/StreamTest.AddressRangeSize (1437 of 2049)
PASS: lldb-unit :: Host/./HostTests/SocketTest.DecodeHostAndPort (1438 of 2049)
PASS: lldb-unit :: Symbol/./SymbolTests/TestTypeSystemClang.TestConvertAccessTypeToAccessSpecifier (1439 of 2049)
PASS: lldb-unit :: ScriptInterpreter/Python/./ScriptInterpreterPythonTests/PythonDataObjectsTest.TestPythonStringToStr (1440 of 2049)
PASS: lldb-unit :: Utility/./UtilityTests/RangeDataVector.FindEntryIndexesThatContain (1441 of 2049)
PASS: lldb-unit :: Host/./HostTests/MainLoopTest.Signal (1442 of 2049)
PASS: lldb-shell :: ObjectFile/ELF/PT_LOAD.yaml (1443 of 2049)
PASS: lldb-unit :: Utility/./UtilityTests/StringListTest.LongestCommonPrefixSingleElement (1444 of 2049)
PASS: lldb-shell :: Driver/TestHelp.test (1445 of 2049)
PASS: lldb-unit :: Process/minidump/./LLDBMinidumpTests/MinidumpParserTest.GetThreadContext_x86_32 (1446 of 2049)
UNSUPPORTED: lldb-api :: functionalities/darwin_log/filter/exact_match/subsystem/TestDarwinLogFilterMatchSubsystem.py (1447 of 2049)
PASS: lldb-unit :: Expression/./ExpressionTests/CppModuleConfigurationTest.Sysroot (1448 of 2049)
UNSUPPORTED: lldb-shell :: SymbolFile/NativePDB/typedefs.cpp (1449 of 2049)
PASS: lldb-shell :: ObjectFile/ELF/minidebuginfo-find-symbols.yaml (1450 of 2049)
PASS: lldb-api :: tools/lldb-server/TestGdbRemoteExpeditedRegisters.py (1451 of 2049)
PASS: lldb-shell :: ObjectFile/MachO/lc_build_version_notools.yaml (1452 of 2049)
PASS: lldb-unit :: Process/gdb-remote/./ProcessGdbRemoteTests/GDBRemoteCommunicationClientTest.ReadRegister (1453 of 2049)
PASS: lldb-unit :: UnwindAssembly/x86/./UnwindAssemblyx86Tests/Testx86AssemblyInspectionEngine.TestDisassemblyJunkBytes (1454 of 2049)
UNSUPPORTED: lldb-api :: functionalities/data-formatter/data-formatter-stl/libstdcpp/map/TestDataFormatterStdMap.py (1455 of 2049)
PASS: lldb-api :: sanity/TestModuleCacheSanity.py (1456 of 2049)
PASS: lldb-unit :: Utility/./UtilityTests/StringExtractorTest.GetHexU8_Underflow (1457 of 2049)
PASS: lldb-shell :: SymbolFile/DWARF/split-dwarf-multiple-cu.ll (1458 of 2049)
PASS: lldb-api :: lang/objc/radar-9691614/TestObjCMethodReturningBOOL.py (1459 of 2049)
PASS: lldb-unit :: ScriptInterpreter/Python/./ScriptInterpreterPythonTests/PythonDataObjectsTest.TestPythonString (1460 of 2049)
PASS: lldb-unit :: Core/./LLDBCoreTests/MangledTest.ResultForValidName (1461 of 2049)
PASS: lldb-api :: functionalities/memory-region/TestMemoryRegion.py (1462 of 2049)
PASS: lldb-unit :: Process/minidump/./LLDBMinidumpTests/MinidumpParserTest.GetMemoryRegionInfoFromMemory64List (1463 of 2049)
PASS: lldb-api :: lang/cpp/gmodules/TestWithModuleDebugging.py (1464 of 2049)
UNSUPPORTED: lldb-api :: commands/target/auto-install-main-executable/TestAutoInstallMainExecutable.py (1465 of 2049)
PASS: lldb-unit :: ScriptInterpreter/Python/./ScriptInterpreterPythonTests/PythonDataObjectsTest.TestTypeNameResolutionNoDot (1466 of 2049)
PASS: lldb-unit :: Utility/./UtilityTests/XcodeSDKTest.FindXcodeContentsDirectoryInPath (1467 of 2049)
PASS: lldb-shell :: Reproducer/TestDSYM.test (1468 of 2049)
PASS: lldb-unit :: Utility/./UtilityTests/GeneratorTest.Get (1469 of 2049)
PASS: lldb-unit :: Utility/./UtilityTests/XcodeSDKTest.MergeTest (1470 of 2049)
PASS: lldb-unit :: Utility/./UtilityTests/RangeTest.NotEqualInvalid (1471 of 2049)
UNSUPPORTED: lldb-api :: benchmarks/libcxxmap/TestBenchmarkLibcxxMap.py (1472 of 2049)
PASS: lldb-api :: functionalities/data-formatter/ostypeformatting/TestFormattersOsType.py (1473 of 2049)
PASS: lldb-unit :: Utility/./UtilityTests/BinaryStreamTest.PutSLEB128FourBytes (1474 of 2049)
PASS: lldb-unit :: Utility/./UtilityTests/StreamTeeTest.DefaultConstructor (1475 of 2049)
PASS: lldb-shell :: Settings/TestFrameFormatColor.test (1476 of 2049)
PASS: lldb-unit :: Utility/./UtilityTests/StreamTest.AddressNoSuffix (1477 of 2049)
PASS: lldb-shell :: SymbolFile/DWARF/debug_loc-aslr.s (1478 of 2049)
PASS: lldb-unit :: Utility/./UtilityTests/LogChannelTest.EnableOptions (1479 of 2049)
PASS: lldb-api :: commands/expression/import-std-module/queue/TestQueueFromStdModule.py (1480 of 2049)
PASS: lldb-api :: functionalities/tsan/thread_leak/TestTsanThreadLeak.py (1481 of 2049)
PASS: lldb-api :: macosx/safe-to-func-call/TestSafeFuncCalls.py (1482 of 2049)
PASS: lldb-shell :: Breakpoint/dummy-target.test (1483 of 2049)
PASS: lldb-unit :: Utility/./UtilityTests/RegularExpression.Invalid (1484 of 2049)
PASS: lldb-api :: tools/lldb-vscode/breakpoint/TestVSCode_setExceptionBreakpoints.py (1485 of 2049)
PASS: lldb-shell :: Breakpoint/case-sensitive.test (1486 of 2049)
PASS: lldb-shell :: SymbolFile/NativePDB/global-classes.cpp (1487 of 2049)
PASS: lldb-unit :: Host/./HostTests/FileSystemTest.GetPermissions (1488 of 2049)
PASS: lldb-shell :: Minidump/Windows/arm-fp-unwind.test (1489 of 2049)
PASS: lldb-unit :: Symbol/./SymbolTests/PostfixExpression.ToDWARF (1490 of 2049)
PASS: lldb-api :: lang/cpp/extern_c/TestExternCSymbols.py (1491 of 2049)
PASS: lldb-unit :: Utility/./UtilityTests/BinaryStreamTest.PutULEB128OneByte (1492 of 2049)
PASS: lldb-unit :: Symbol/./SymbolTests/TestTypeSystemClang.TestGetTypeClassDeclType (1493 of 2049)
UNSUPPORTED: lldb-api :: lang/c/typedef/Testtypedef.py (1494 of 2049)
PASS: lldb-unit :: Process/gdb-remote/./ProcessGdbRemoteTests/GDBRemoteCommunicationClientTest.SendSignalsToIgnore (1495 of 2049)
PASS: lldb-api :: commands/frame/recognizer/TestFrameRecognizer.py (1496 of 2049)
PASS: lldb-shell :: ObjectFile/ELF/gnu-debuglink.yaml (1497 of 2049)
PASS: lldb-api :: lang/cpp/global_operators/TestCppGlobalOperators.py (1498 of 2049)
PASS: lldb-shell :: Driver/TestNoUseColor.test (1499 of 2049)
PASS: lldb-api :: tools/lldb-server/TestGdbRemoteProcessInfo.py (1500 of 2049)
PASS: lldb-unit :: Utility/./UtilityTests/StreamTeeTest.Constructor2Streams (1501 of 2049)
PASS: lldb-unit :: Utility/./UtilityTests/UriParserTest.MinimalPortPath (1502 of 2049)
PASS: lldb-unit :: Utility/./UtilityTests/ProcessInstanceInfoList.Yaml (1503 of 2049)
PASS: lldb-unit :: Utility/./UtilityTests/StreamTest.PutMaxHex64ByteOrderLittle (1504 of 2049)
PASS: lldb-unit :: Core/./LLDBCoreTests/MangledTest.ResultForBlockInvocation (1505 of 2049)
PASS: lldb-shell :: SymbolFile/DWARF/debug_loc_and_loclists.s (1506 of 2049)
PASS: lldb-unit :: ScriptInterpreter/Python/./ScriptInterpreterPythonTests/PythonDataObjectsTest.TestPythonListManipulation (1507 of 2049)
PASS: lldb-unit :: UnwindAssembly/x86/./UnwindAssemblyx86Tests/Testx86AssemblyInspectionEngine.TestPushEBX (1508 of 2049)
PASS: lldb-unit :: Utility/./UtilityTests/BinaryStreamTest.PutULEB128FiveBytes (1509 of 2049)
PASS: lldb-shell :: ObjectFile/Breakpad/uuid-matching-mac.test (1510 of 2049)
PASS: lldb-unit :: Utility/./UtilityTests/UUIDTest.RelationalOperators (1511 of 2049)
UNSUPPORTED: lldb-api :: arm/breakpoint-thumb-codesection/TestBreakpointThumbCodesection.py (1512 of 2049)
PASS: lldb-shell :: ObjectFile/ELF/basic-info.yaml (1513 of 2049)
PASS: lldb-shell :: SymbolFile/DWARF/debug_ranges-missing-section.s (1514 of 2049)
PASS: lldb-api :: lang/c/struct_types/TestStructTypes.py (1515 of 2049)
UNSUPPORTED: lldb-shell :: SymbolFile/PDB/pointers.test (1516 of 2049)
PASS: lldb-unit :: Target/./TargetTests/PathMappingListTest.RelativeTests (1517 of 2049)
UNSUPPORTED: lldb-api :: functionalities/data-formatter/data-formatter-stl/libstdcpp/vbool/TestDataFormatterStdVBool.py (1518 of 2049)
PASS: lldb-unit :: Utility/./UtilityTests/ProcessInstanceInfo.DumpTable_invalidUID (1519 of 2049)
PASS: lldb-unit :: Expression/./ExpressionTests/CppModuleConfigurationTest.AmbiguousCLib (1520 of 2049)
PASS: lldb-api :: commands/gui/invalid-args/TestInvalidArgsGui.py (1521 of 2049)
PASS: lldb-unit :: Process/minidump/./LLDBMinidumpTests/MinidumpParserTest.GetThreadsAndGetThreadContext (1522 of 2049)
PASS: lldb-unit :: Utility/./UtilityTests/RangeTest.LessThan (1523 of 2049)
PASS: lldb-unit :: Utility/./UtilityTests/StringListTest.DefaultConstructor (1524 of 2049)
PASS: lldb-unit :: Host/./HostTests/FileSystemTest.GetByteSize (1525 of 2049)
PASS: lldb-shell :: Unwind/eh-frame-dwarf-unwind.test (1526 of 2049)
PASS: lldb-unit :: Utility/./UtilityTests/VMRange.ContainsRange (1527 of 2049)
PASS: lldb-api :: python_api/sbplatform/TestSBPlatform.py (1528 of 2049)
PASS: lldb-unit :: Utility/./UtilityTests/ArgsTest.TestQuotedUnknownEscape (1529 of 2049)
PASS: lldb-api :: functionalities/thread/concurrent_events/TestConcurrentCrashWithWatchpoint.py (1530 of 2049)
PASS: lldb-unit :: Utility/./UtilityTests/ScalarTest.GetValue (1531 of 2049)
PASS: lldb-unit :: Utility/./UtilityTests/StringExtractorTest.DecodeHexU8_Underflow2 (1532 of 2049)
PASS: lldb-api :: macosx/find-dsym/bundle-with-dot-in-filename/TestBundleWithDotInFilename.py (1533 of 2049)
PASS: lldb-api :: commands/gui/basic/TestGuiBasic.py (1534 of 2049)
PASS: lldb-api :: functionalities/breakpoint/breakpoint_options/TestBreakpointOptions.py (1535 of 2049)
UNSUPPORTED: lldb-shell :: SymbolFile/PDB/vbases.test (1536 of 2049)
PASS: lldb-api :: functionalities/multidebugger_commands/TestMultipleDebuggersCommands.py (1537 of 2049)
PASS: lldb-shell :: SymbolFile/DWARF/debug_rnglists.s (1538 of 2049)
PASS: lldb-unit :: Utility/./UtilityTests/StringExtractorTest.InitMisc (1539 of 2049)
PASS: lldb-unit :: UnwindAssembly/x86/./UnwindAssemblyx86Tests/Testx86AssemblyInspectionEngine.TestPushRBPWithREX (1540 of 2049)
PASS: lldb-api :: commands/frame/diagnose/complicated-expression/TestComplicatedExpression.py (1541 of 2049)
PASS: lldb-unit :: Utility/./UtilityTests/DataExtractorTest.UncommonAddressSize (1542 of 2049)
PASS: lldb-api :: commands/expression/import-std-module/list-dbg-info-content/TestDbgInfoContentListFromStdModule.py (1543 of 2049)
UNSUPPORTED: lldb-api :: commands/register/register/intel_xtended_registers/mpx_bound_violation/TestBoundViolation.py (1544 of 2049)
PASS: lldb-api :: commands/process/attach-resume/TestAttachResume.py (1545 of 2049)
PASS: lldb-unit :: Utility/./UtilityTests/StreamTest.PutPtr (1546 of 2049)
PASS: lldb-api :: commands/expression/import-std-module/shared_ptr-dbg-info-content/TestSharedPtrDbgInfoContentFromStdModule.py (1547 of 2049)
PASS: lldb-shell :: SymbolFile/DWARF/find-qualified-variable.cpp (1548 of 2049)
PASS: lldb-unit :: Utility/./UtilityTests/UriParserTest.TypicalPortPathIPv6 (1549 of 2049)
PASS: lldb-unit :: Utility/./UtilityTests/DataExtractorTest.GetCStr (1550 of 2049)
PASS: lldb-shell :: Commands/command-breakpoint-col.test (1551 of 2049)
PASS: lldb-unit :: Utility/./UtilityTests/StreamTest.AddressRangeEmptyRange (1552 of 2049)
PASS: lldb-unit :: ScriptInterpreter/Python/./ScriptInterpreterPythonTests/PythonDataObjectsTest.TestDictionaryResolutionWithDot (1553 of 2049)
PASS: lldb-unit :: Language/Highlighting/./HighlighterTests/HighlighterTest.DefaultHighlighterWithCursorOutOfBounds (1554 of 2049)
PASS: lldb-unit :: Process/gdb-remote/./ProcessGdbRemoteTests/GDBRemoteCommunicationClientTest.SyncThreadState (1555 of 2049)
PASS: lldb-shell :: SymbolFile/NativePDB/ast-functions.cpp (1556 of 2049)
UNSUPPORTED: lldb-api :: commands/expression/completion-crash-invalid-iterator/TestInvalidIteratorCompletionCrash.py (1557 of 2049)
PASS: lldb-shell :: Reproducer/TestDriverOptions.test (1558 of 2049)
PASS: lldb-unit :: Expression/./ExpressionTests/ClangHostTest.ComputeClangResourceDirectory (1559 of 2049)
PASS: lldb-api :: functionalities/signal/handle-abrt/TestHandleAbort.py (1560 of 2049)
PASS: lldb-unit :: UnwindAssembly/x86/./UnwindAssemblyx86Tests/Testx86AssemblyInspectionEngine.Testi386IgnoredRegisters (1561 of 2049)
PASS: lldb-unit :: Process/minidump/./LLDBMinidumpTests/MinidumpParserTest.GetMiscInfoWindows (1562 of 2049)
PASS: lldb-unit :: Host/./HostTests/File.GetStreamFromDescriptor (1563 of 2049)
PASS: lldb-api :: lang/cpp/incomplete-types/TestCppIncompleteTypes.py (1564 of 2049)
PASS: lldb-unit :: Utility/./UtilityTests/StringListTest.JoinSingle (1565 of 2049)
PASS: lldb-api :: lang/c/modules/TestCModules.py (1566 of 2049)
PASS: lldb-api :: functionalities/data-formatter/data-formatter-objc/TestDataFormatterObjCNSData.py (1567 of 2049)
PASS: lldb-api :: tools/lldb-vscode/variables/TestVSCode_variables.py (1568 of 2049)
PASS: lldb-shell :: Quit/TestQuitExitCodeTooManyArgs.test (1569 of 2049)
PASS: lldb-api :: functionalities/data-formatter/data-formatter-stl/libcxx/tuple/TestDataFormatterLibcxxTuple.py (1570 of 2049)
PASS: lldb-api :: linux/builtin_trap/TestBuiltinTrap.py (1571 of 2049)
PASS: lldb-api :: lang/cpp/chained-calls/TestCppChainedCalls.py (1572 of 2049)
PASS: lldb-shell :: Driver/TestProcessAttach.test (1573 of 2049)
PASS: lldb-api :: commands/register/register/register_command/TestRegisters.py (1574 of 2049)
PASS: lldb-api :: functionalities/data-formatter/hexcaps/TestDataFormatterHexCaps.py (1575 of 2049)
PASS: lldb-shell :: ScriptInterpreter/Lua/nested_sessions.test (1576 of 2049)
PASS: lldb-api :: functionalities/data-formatter/data-formatter-objc/TestDataFormatterObjCNSDate.py (1577 of 2049)
PASS: lldb-unit :: debugserver/./debugserverTests/RNBSocket.LoopBackConnectIPv6 (1578 of 2049)
PASS: lldb-api :: macosx/function-starts/TestFunctionStarts.py (1579 of 2049)
PASS: lldb-unit :: Utility/./UtilityTests/FileSpecTest.GetPath (1580 of 2049)
PASS: lldb-unit :: Symbol/./SymbolTests/Type.GetTypeScopeAndBasename (1581 of 2049)
PASS: lldb-api :: macosx/queues/TestQueues.py (1582 of 2049)
PASS: lldb-unit :: ScriptInterpreter/Lua/./ScriptInterpreterLuaTests/ScriptInterpreterTest.ExecuteOneLine (1583 of 2049)
PASS: lldb-unit :: Utility/./UtilityTests/FileSpecTest.AppendPathComponent (1584 of 2049)
PASS: lldb-unit :: Utility/./UtilityTests/StringListTest.JoinEmpty (1585 of 2049)
PASS: lldb-api :: driver/batch_mode/TestBatchMode.py (1586 of 2049)
PASS: lldb-unit :: Symbol/./SymbolTests/TestClangASTImporter.MetadataPropagationAfterCopying (1587 of 2049)
UNSUPPORTED: lldb-shell :: Register/x86-gp-read.test (1588 of 2049)
PASS: lldb-shell :: BuildScript/toolchain-clang.test (1589 of 2049)
PASS: lldb-unit :: Utility/./UtilityTests/StreamTeeTest.CopyConstructor (1590 of 2049)
PASS: lldb-shell :: ObjectFile/wasm/basic.yaml (1591 of 2049)
PASS: lldb-unit :: Utility/./UtilityTests/BinaryStreamTest.PutULEB128ThreeBytes (1592 of 2049)
PASS: lldb-api :: commands/expression/static-initializers/TestStaticInitializers.py (1593 of 2049)
PASS: lldb-api :: lang/objc/objc-property/TestObjCProperty.py (1594 of 2049)
PASS: lldb-unit :: ScriptInterpreter/Lua/./ScriptInterpreterLuaTests/LuaTest.RunValid (1595 of 2049)
PASS: lldb-api :: functionalities/deleted-executable/TestDeletedExecutable.py (1596 of 2049)
UNSUPPORTED: lldb-api :: benchmarks/startup/TestStartupDelays.py (1597 of 2049)
PASS: lldb-api :: functionalities/jitloader_gdb/TestJITLoaderGDB.py (1598 of 2049)
PASS: lldb-api :: lang/objc/ivar-IMP/TestObjCiVarIMP.py (1599 of 2049)
PASS: lldb-unit :: Expression/./ExpressionTests/DWARFExpression.DW_OP_pick (1600 of 2049)
PASS: lldb-api :: commands/expression/expr-in-syscall/TestExpressionInSyscall.py (1601 of 2049)
PASS: lldb-api :: functionalities/thread/concurrent_events/TestConcurrentBreakpointsDelayedBreakpointOneWatchpoint.py (1602 of 2049)
UNSUPPORTED: lldb-shell :: SymbolFile/PDB/type-quals.test (1603 of 2049)
PASS: lldb-shell :: SymbolFile/DWARF/find-basic-function.cpp (1604 of 2049)
PASS: lldb-api :: commands/process/launch/TestProcessLaunch.py (1605 of 2049)
PASS: lldb-api :: functionalities/plugins/python_os_plugin/stepping_plugin_threads/TestOSPluginStepping.py (1606 of 2049)
PASS: lldb-api :: commands/quit/TestQuit.py (1607 of 2049)
PASS: lldb-shell :: SymbolFile/DWARF/dir-separator-no-comp-dir.s (1608 of 2049)
UNSUPPORTED: lldb-shell :: BuildScript/toolchain-clang-cl.test (1609 of 2049)
PASS: lldb-shell :: SymbolFile/NativePDB/bitfields.cpp (1610 of 2049)
PASS: lldb-api :: functionalities/postmortem/mach-core/TestMachCore.py (1611 of 2049)
PASS: lldb-unit :: Utility/./UtilityTests/AnsiTerminal.AtEnd (1612 of 2049)
PASS: lldb-unit :: Utility/./UtilityTests/StringListTest.ShiftMove (1613 of 2049)
PASS: lldb-shell :: Settings/TestDisableColor.test (1614 of 2049)
PASS: lldb-unit :: Utility/./UtilityTests/AnsiTerminal.Unknown (1615 of 2049)
PASS: lldb-api :: tools/lldb-server/inferior-crash/TestGdbRemoteSegFault.py (1616 of 2049)
PASS: lldb-api :: commands/process/launch-with-shellexpand/TestLaunchWithShellExpand.py (1617 of 2049)
PASS: lldb-unit :: Host/./HostTests/FileSystemTest.EmptyTest (1618 of 2049)
PASS: lldb-shell :: Recognizer/assert.test (1619 of 2049)
PASS: lldb-api :: functionalities/data-formatter/data-formatter-objc/TestDataFormatterObjCCF.py (1620 of 2049)
PASS: lldb-api :: functionalities/non-overlapping-index-variable-i/TestIndexVariable.py (1621 of 2049)
PASS: lldb-unit :: Host/./HostTests/SocketTest.TCPGetConnectURI (1622 of 2049)
PASS: lldb-unit :: Language/Highlighting/./HighlighterTests/HighlighterTest.HighlighterSelectionPath (1623 of 2049)
PASS: lldb-api :: lang/cpp/overloaded-functions/TestOverloadedFunctions.py (1624 of 2049)
PASS: lldb-unit :: Utility/./UtilityTests/ArgsTest.TestTrailingBackslash (1625 of 2049)
PASS: lldb-api :: macosx/lc-note/kern-ver-str/TestKernVerStrLCNOTE.py (1626 of 2049)
PASS: lldb-api :: commands/expression/two-files/TestObjCTypeQueryFromOtherCompileUnit.py (1627 of 2049)
PASS: lldb-unit :: Utility/./UtilityTests/ReproducerTest.SetReplay (1628 of 2049)
PASS: lldb-api :: lang/objc/modules-compile-error/TestModulesCompileError.py (1629 of 2049)
PASS: lldb-unit :: Host/./HostTests/NativeProcessProtocolTest.SetBreakpointFailVerify (1630 of 2049)
PASS: lldb-unit :: Expression/./ExpressionTests/DiagnosticManagerTest.AppendMessageAttachToLastDiag (1631 of 2049)
PASS: lldb-unit :: Utility/./UtilityTests/StringLexerTest.NextIf (1632 of 2049)
PASS: lldb-api :: lang/c/function_types/TestFunctionTypes.py (1633 of 2049)
PASS: lldb-unit :: Utility/./UtilityTests/StreamTest.PutCharWhitespace (1634 of 2049)
PASS: lldb-unit :: Core/./LLDBCoreTests/UniqueCStringMap.NoDefaultConstructor (1635 of 2049)
PASS: lldb-api :: commands/frame/diagnose/array/TestArray.py (1636 of 2049)
PASS: lldb-unit :: Utility/./UtilityTests/SerializationRountripTest.SerializeDeserializeCStringNull (1637 of 2049)
PASS: lldb-api :: lang/objc/global_ptrs/TestGlobalObjects.py (1638 of 2049)
PASS: lldb-shell :: Reproducer/Functionalities/TestExpressionEvaluation.test (1639 of 2049)
PASS: lldb-unit :: Symbol/./SymbolTests/TestTypeSystemClang.TestGetBasicTypeFromName (1640 of 2049)
PASS: lldb-api :: lang/objc/objc-struct-argument/TestObjCStructArgument.py (1641 of 2049)
PASS: lldb-api :: functionalities/data-formatter/data-formatter-advanced/TestDataFormatterAdv.py (1642 of 2049)
PASS: lldb-unit :: Host/./HostTests/FileSystemTest.OpenErrno (1643 of 2049)
PASS: lldb-unit :: Expression/./ExpressionTests/CppModuleConfigurationTest.AmbiguousLibCpp (1644 of 2049)
PASS: lldb-unit :: Utility/./UtilityTests/StringListTest.SplitIntoLinesSingleTrailingCR (1645 of 2049)
UNSUPPORTED: lldb-api :: linux/sepdebugsymlink/TestTargetSymbolsSepDebugSymlink.py (1646 of 2049)
PASS: lldb-unit :: Utility/./UtilityTests/VASprintfTest.EncodingError (1647 of 2049)
PASS: lldb-api :: tools/lldb-server/register-reading/TestGdbRemoteGPacket.py (1648 of 2049)
PASS: lldb-api :: lang/cpp/class_types/TestClassTypesDisassembly.py (1649 of 2049)
PASS: lldb-unit :: Process/minidump/./LLDBMinidumpTests/RegisterContextMinidump.CheckRegisterContextMinidump_ARM (1650 of 2049)
PASS: lldb-unit :: Symbol/./SymbolTests/TestTypeSystemClang.TestNotDeletingUserCopyCstrDueToMoveCStr (1651 of 2049)
PASS: lldb-api :: lang/cpp/global_variables/TestCPPGlobalVariables.py (1652 of 2049)
PASS: lldb-unit :: Utility/./UtilityTests/LogChannelEnabledTest.LogThread (1653 of 2049)
PASS: lldb-unit :: Utility/./UtilityTests/StringListTest.SetSize (1654 of 2049)
PASS: lldb-api :: commands/frame/var/TestFrameVar.py (1655 of 2049)
PASS: lldb-unit :: Language/Highlighting/./HighlighterTests/HighlighterTest.ClangCursorPosAfterOtherToken (1656 of 2049)
PASS: lldb-unit :: Expression/./ExpressionTests/DWARFExpression.DW_OP_piece (1657 of 2049)
PASS: lldb-unit :: Symbol/./SymbolTests/DWARFCallFrameInfoTest.Basic_dwarf4 (1658 of 2049)
PASS: lldb-unit :: Utility/./UtilityTests/StringListTest.JoinThree (1659 of 2049)
PASS: lldb-unit :: Process/minidump/./LLDBMinidumpTests/MinidumpParserTest.GetLinuxProcStatus (1660 of 2049)
PASS: lldb-api :: functionalities/thread/backtrace_limit/TestBacktraceLimit.py (1661 of 2049)
PASS: lldb-unit :: Process/minidump/./LLDBMinidumpTests/MinidumpParserTest.GetPid (1662 of 2049)
PASS: lldb-api :: lang/cpp/char8_t/TestCxxChar8_t.py (1663 of 2049)
PASS: lldb-unit :: Host/./HostTests/NativeProcessProtocolTest.SetBreakpoint (1664 of 2049)
PASS: lldb-unit :: Symbol/./SymbolTests/TestTypeSystemClang.TestBuiltinTypeForEncodingAndBitSize (1665 of 2049)
PASS: lldb-unit :: UnwindAssembly/x86/./UnwindAssemblyx86Tests/Testx86AssemblyInspectionEngine.TestPopESI (1666 of 2049)
PASS: lldb-api :: functionalities/thread/concurrent_events/TestConcurrentSignalWatchBreak.py (1667 of 2049)
PASS: lldb-api :: lang/objcxx/hide-runtime-values/TestObjCXXHideRuntimeValues.py (1668 of 2049)
PASS: lldb-unit :: Utility/./UtilityTests/ListenerTest.GetEventImmediate (1669 of 2049)
PASS: lldb-api :: types/TestDoubleTypes.py (1670 of 2049)
PASS: lldb-unit :: Utility/./UtilityTests/UriParserTest.TypicalPortPathIPv4 (1671 of 2049)
PASS: lldb-api :: functionalities/pointer_num_children/TestPointerNumChildren.py (1672 of 2049)
PASS: lldb-api :: functionalities/thread/concurrent_events/TestConcurrentDelaySignalWatch.py (1673 of 2049)
PASS: lldb-api :: commands/breakpoint/command/list/TestBreakpointCommandList.py (1674 of 2049)
PASS: lldb-unit :: Utility/./UtilityTests/OptionsWithRawTest.QuotedSuffix (1675 of 2049)
UNSUPPORTED: lldb-shell :: SymbolFile/DWARF/split-dwarf-expression-eval-bug.cpp (1676 of 2049)
PASS: lldb-unit :: Utility/./UtilityTests/StreamTest.PutHex16ByteOrderBig (1677 of 2049)
PASS: lldb-api :: functionalities/data-formatter/data-formatter-synthval/TestDataFormatterSynthVal.py (1678 of 2049)
PASS: lldb-unit :: SymbolFile/NativePDB/./SymbolFileNativePDBTests/PDBFPOProgramToDWARFExpressionTests.InvalidAssignmentSingle (1679 of 2049)
PASS: lldb-shell :: BuildScript/script-args.test (1680 of 2049)
PASS: lldb-shell :: ObjectFile/PECOFF/disassemble-thumb.yaml (1681 of 2049)
PASS: lldb-unit :: UnwindAssembly/x86/./UnwindAssemblyx86Tests/Testx86AssemblyInspectionEngine.TestPushEAX (1682 of 2049)
PASS: lldb-unit :: Language/Highlighting/./HighlighterTests/HighlighterTest.ClangCommas (1683 of 2049)
PASS: lldb-shell :: SymbolFile/Breakpad/line-table.test (1684 of 2049)
PASS: lldb-api :: lang/objc/modules-incomplete/TestIncompleteModules.py (1685 of 2049)
PASS: lldb-api :: functionalities/tsan/global_location/TestTsanGlobalLocation.py (1686 of 2049)
PASS: lldb-unit :: Utility/./UtilityTests/DataExtractorTest.PeekData (1687 of 2049)
PASS: lldb-unit :: ObjectFile/Breakpad/./ObjectFileBreakpadTests/LineRecord.parse (1688 of 2049)
PASS: lldb-api :: functionalities/archives/TestBSDArchives.py (1689 of 2049)
PASS: lldb-shell :: Quit/TestQuitExitCodeHexA.test (1690 of 2049)
PASS: lldb-unit :: Expression/./ExpressionTests/CppModuleConfigurationTest.Linux (1691 of 2049)
PASS: lldb-unit :: Utility/./UtilityTests/DataExtractorTest.GetCStrEmpty (1692 of 2049)
UNSUPPORTED: lldb-shell :: Register/x86-64-ymm16-read.test (1693 of 2049)
PASS: lldb-api :: commands/expression/call-function/TestCallStopAndContinue.py (1694 of 2049)
PASS: lldb-unit :: UnwindAssembly/x86/./UnwindAssemblyx86Tests/Testx86AssemblyInspectionEngine.TestSpillRegToStackViaMOVi386 (1695 of 2049)
PASS: lldb-api :: python_api/value/change_values/TestChangeValueAPI.py (1696 of 2049)
PASS: lldb-shell :: SymbolFile/DWARF/debug_line-relative_path.s (1697 of 2049)
PASS: lldb-api :: commands/expression/fixits/TestFixIts.py (1698 of 2049)
PASS: lldb-unit :: Target/./TargetTests/RemoteAwarePlatformTest.TestResolveExecutabelOnClientByPlatform (1699 of 2049)
PASS: lldb-shell :: SymbolFile/DWARF/DW_OP_piece-struct.s (1700 of 2049)
PASS: lldb-api :: lang/objc/foundation/TestRuntimeTypes.py (1701 of 2049)
PASS: lldb-unit :: UnwindAssembly/x86/./UnwindAssemblyx86Tests/Testx86AssemblyInspectionEngine.TestPushR15 (1702 of 2049)
PASS: lldb-api :: commands/watchpoints/watchpoint_size/TestWatchpointSizes.py (1703 of 2049)
PASS: lldb-unit :: Core/./LLDBCoreTests/StreamCallbackTest.Callback (1704 of 2049)
PASS: lldb-unit :: Disassembler/./DisassemblerTests/TestArm64Disassembly.TestArmv81Instruction (1705 of 2049)
PASS: lldb-api :: commands/expression/result_numbering/TestResultNumbering.py (1706 of 2049)
PASS: lldb-unit :: Symbol/./SymbolTests/LineEntryTest.GetSameLineContiguousAddressRangeOneInline (1707 of 2049)
PASS: lldb-api :: commands/expression/multiline-completion/TestMultilineCompletion.py (1708 of 2049)
PASS: lldb-api :: functionalities/thread_plan/TestThreadPlanCommands.py (1709 of 2049)
PASS: lldb-api :: tools/lldb-vscode/attach/TestVSCode_attach.py (1710 of 2049)
PASS: lldb-unit :: Symbol/./SymbolTests/TestClangASTImporter.CopyTypeTagDecl (1711 of 2049)
PASS: lldb-unit :: Utility/./UtilityTests/LogChannelEnabledTest.LogVerboseThread (1712 of 2049)
PASS: lldb-api :: macosx/nslog/TestDarwinNSLogOutput.py (1713 of 2049)
PASS: lldb-unit :: Utility/./UtilityTests/StringLexerTest.PutBack (1714 of 2049)
PASS: lldb-unit :: SymbolFile/NativePDB/./SymbolFileNativePDBTests/PDBFPOProgramToDWARFExpressionTests.SingleAssignmentRegisterRef (1715 of 2049)
PASS: lldb-shell :: ScriptInterpreter/None/none.test (1716 of 2049)
PASS: lldb-unit :: Utility/./UtilityTests/DataExtractorTest.GetMaxU64 (1717 of 2049)
PASS: lldb-api :: tools/lldb-server/commandline/TestStubSetSID.py (1718 of 2049)
PASS: lldb-api :: functionalities/data-formatter/data-formatter-stl/libcxx/map/TestDataFormatterLibccMap.py (1719 of 2049)
PASS: lldb-unit :: UnwindAssembly/x86/./UnwindAssemblyx86Tests/Testx86AssemblyInspectionEngine.Test32BitOnlyInstruction (1720 of 2049)
PASS: lldb-unit :: Host/./HostTests/SocketAddressTest.Set (1721 of 2049)
PASS: lldb-unit :: API/./APITests/SBCommandInterpreterTest.SingleWordCommand (1722 of 2049)
PASS: lldb-api :: functionalities/object-file/TestImageListMultiArchitecture.py (1723 of 2049)
PASS: lldb-api :: commands/frame/diagnose/dereference-argument/TestDiagnoseDereferenceArgument.py (1724 of 2049)
PASS: lldb-api :: lang/objc/objc-ivar-offsets/TestObjCIvarOffsets.py (1725 of 2049)
PASS: lldb-api :: lang/cpp/gmodules-templates/TestGModules.py (1726 of 2049)
PASS: lldb-api :: functionalities/breakpoint/breakpoint_command/TestRegexpBreakCommand.py (1727 of 2049)
UNSUPPORTED: lldb-api :: functionalities/darwin_log/filter/exact_match/activity/TestDarwinLogFilterMatchActivity.py (1728 of 2049)
PASS: lldb-shell :: SymbolFile/DWARF/DW_AT_low_pc-addrx.s (1729 of 2049)
PASS: lldb-unit :: Language/Highlighting/./HighlighterTests/HighlighterTest.ClangEmptyInput (1730 of 2049)
PASS: lldb-unit :: Utility/./UtilityTests/XcodeSDKTest.ParseTest (1731 of 2049)
PASS: lldb-api :: functionalities/inferior-changed/TestInferiorChanged.py (1732 of 2049)
PASS: lldb-unit :: Utility/./UtilityTests/StringListTest.ShiftStdString (1733 of 2049)
PASS: lldb-unit :: Utility/./UtilityTests/StreamTest.PutMaxHex64ByteOrderBig (1734 of 2049)
PASS: lldb-api :: python_api/debugger/TestDebuggerAPI.py (1735 of 2049)
PASS: lldb-unit :: Utility/./UtilityTests/OptionsWithRawTest.EmptySuffix (1736 of 2049)
PASS: lldb-unit :: Utility/./UtilityTests/UriParserTest.SchemeHostSeparator3 (1737 of 2049)
PASS: lldb-unit :: SymbolFile/DWARF/./SymbolFileDWARFTests/SymbolFileDWARFTests.TestAbbrevOutOfOrder (1738 of 2049)
PASS: lldb-unit :: Utility/./UtilityTests/StringListTest.LongestCommonPrefixNoPrefix (1739 of 2049)
PASS: lldb-api :: commands/expression/unwind_expression/TestUnwindExpression.py (1740 of 2049)
PASS: lldb-shell :: SymbolFile/Breakpad/symtab.test (1741 of 2049)
PASS: lldb-api :: functionalities/conditional_break/TestConditionalBreak.py (1742 of 2049)
PASS: lldb-api :: commands/expression/invalid-args/TestInvalidArgsExpression.py (1743 of 2049)
PASS: lldb-shell :: Reproducer/TestReuseDirectory.test (1744 of 2049)
PASS: lldb-unit :: Utility/./UtilityTests/BinaryStreamTest.PutULEB128MaxValue (1745 of 2049)
PASS: lldb-unit :: ScriptInterpreter/Python/./ScriptInterpreterPythonTests/PythonDataObjectsTest.TestPythonTupleInitializerList2 (1746 of 2049)
PASS: lldb-api :: functionalities/tail_call_frames/thread_step_out_message/TestArtificialFrameStepOutMessage.py (1747 of 2049)
PASS: lldb-unit :: Language/Highlighting/./HighlighterTests/HighlighterTest.ClangCursorPosInOtherToken (1748 of 2049)
UNSUPPORTED: lldb-api :: lang/cpp/printf/TestPrintf.py (1749 of 2049)
PASS: lldb-api :: python_api/watchpoint/TestWatchpointIgnoreCount.py (1750 of 2049)
PASS: lldb-shell :: ObjectFile/ELF/section-permissions.yaml (1751 of 2049)
PASS: lldb-unit :: UnwindAssembly/ARM64/./Arm64InstEmulationTests/TestArm64InstEmulation.TestRegisterDoubleSpills (1752 of 2049)
PASS: lldb-unit :: Process/minidump/./LLDBMinidumpTests/MinidumpParserTest.GetFilteredModuleList (1753 of 2049)
PASS: lldb-unit :: Interpreter/./InterpreterTests/CompletionTest.DirCompletionUsername (1754 of 2049)
PASS: lldb-api :: sanity/TestSettingSkipping.py (1755 of 2049)
PASS: lldb-unit :: ObjectFile/Breakpad/./ObjectFileBreakpadTests/StackCFIRecord.parse (1756 of 2049)
PASS: lldb-api :: functionalities/breakpoint/step_over_breakpoint/TestStepOverBreakpoint.py (1757 of 2049)
PASS: lldb-unit :: Utility/./UtilityTests/StreamTest.PutBytesAsRawHex8ToMixedEndian (1758 of 2049)
PASS: lldb-unit :: Utility/./UtilityTests/ArgsTest.ReplaceArgumentAtIndexShort (1759 of 2049)
PASS: lldb-api :: functionalities/breakpoint/debugbreak/TestDebugBreak.py (1760 of 2049)
UNSUPPORTED: lldb-api :: arm/breakpoint-it/TestBreakpointIt.py (1761 of 2049)
PASS: lldb-api :: functionalities/gdb_remote_client/TestWriteMemory.py (1762 of 2049)
PASS: lldb-api :: commands/expression/unicode-in-variable/TestUnicodeInVariable.py (1763 of 2049)
PASS: lldb-unit :: Utility/./UtilityTests/RangeDataVector.CustomSort (1764 of 2049)
PASS: lldb-shell :: SymbolFile/Breakpad/unwind-via-stack-win.test (1765 of 2049)
PASS: lldb-shell :: SymbolFile/DWARF/dwp.s (1766 of 2049)
PASS: lldb-api :: commands/expression/namespace_local_var_same_name_obj_c/TestNamespaceLocalVarSameNameObjC.py (1767 of 2049)
PASS: lldb-api :: functionalities/breakpoint/hardware_breakpoints/hardware_breakpoint_on_multiple_threads/TestHWBreakMultiThread.py (1768 of 2049)
PASS: lldb-unit :: Utility/./UtilityTests/RegularExpression.Empty (1769 of 2049)
PASS: lldb-unit :: Target/./TargetTests/MCBasedABI.MapRegisterName (1770 of 2049)
PASS: lldb-api :: functionalities/gdb_remote_client/TestGDBRemoteLoad.py (1771 of 2049)
PASS: lldb-unit :: Utility/./UtilityTests/ScalarTest.CastOperations (1772 of 2049)
UNSUPPORTED: lldb-shell :: Unwind/unwind-plan-dwarf-dump.test (1773 of 2049)
PASS: lldb-api :: commands/target/create-deps/TestTargetCreateDeps.py (1774 of 2049)
PASS: lldb-unit :: Utility/./UtilityTests/OptionsWithRawTest.TerminatedQuote (1775 of 2049)
PASS: lldb-unit :: Utility/./UtilityTests/StringExtractorTest.GetHexU8_Underflow2_NoEof (1776 of 2049)
PASS: lldb-api :: functionalities/thread/concurrent_events/TestConcurrentTwoBreakpointThreads.py (1777 of 2049)
PASS: lldb-api :: functionalities/load_unload/TestLoadUnload.py (1778 of 2049)
PASS: lldb-api :: functionalities/data-formatter/data-formatter-objc/nsstring/TestDataFormatterNSString.py (1779 of 2049)
PASS: lldb-api :: functionalities/thread/concurrent_events/TestConcurrentDelayedCrashWithBreakpointSignal.py (1780 of 2049)
PASS: lldb-api :: lang/c/blocks/TestBlocks.py (1781 of 2049)
PASS: lldb-api :: functionalities/postmortem/elf-core/TestLinuxCore.py (1782 of 2049)
PASS: lldb-unit :: UnwindAssembly/x86/./UnwindAssemblyx86Tests/Testx86AssemblyInspectionEngine.TestSimplei386ugmented (1783 of 2049)
PASS: lldb-unit :: Disassembler/./DisassemblerTests/TestArmv7Disassembly.TestCortexFPDisass (1784 of 2049)
PASS: lldb-shell :: SymbolFile/DWARF/find-basic-variable.cpp (1785 of 2049)
PASS: lldb-unit :: DataFormatter/./LLDBFormatterTests/StringPrinterTests.CxxASCII (1786 of 2049)
PASS: lldb-api :: functionalities/tail_call_frames/disambiguate_call_site/TestDisambiguateCallSite.py (1787 of 2049)
UNSUPPORTED: lldb-api :: lang/cpp/static_members/TestCPPStaticMembers.py (1788 of 2049)
PASS: lldb-api :: functionalities/postmortem/netbsd-core/TestNetBSDCore.py (1789 of 2049)
PASS: lldb-api :: functionalities/data-formatter/data-formatter-stl/libcxx/multimap/TestDataFormatterLibccMultiMap.py (1790 of 2049)
PASS: lldb-api :: functionalities/ubsan/basic/TestUbsanBasic.py (1791 of 2049)
PASS: lldb-unit :: Utility/./UtilityTests/TildeExpressionResolver.ResolveFullPath (1792 of 2049)
PASS: lldb-api :: python_api/disassemble-raw-data/TestDisassembleRawData.py (1793 of 2049)
PASS: lldb-unit :: Utility/./UtilityTests/UserIDResolver.GetUserName (1794 of 2049)
PASS: lldb-api :: python_api/get-value-32bit-int/TestGetValue32BitInt.py (1795 of 2049)
PASS: lldb-unit :: Utility/./UtilityTests/ConstStringTest.UpdateMangledCounterpart (1796 of 2049)
PASS: lldb-unit :: Process/gdb-remote/./ProcessGdbRemoteTests/GDBRemoteCommunicationClientTest.SendStartTracePacket (1797 of 2049)
PASS: lldb-unit :: ObjectFile/ELF/./ObjectFileELFTests/ObjectFileELFTest.GetSymtab_NoSymEntryPointArmAddressClass (1798 of 2049)
PASS: lldb-shell :: Commands/CommandScriptImmediateOutput/CommandScriptImmediateOutputConsole.test (1799 of 2049)
PASS: lldb-unit :: Utility/./UtilityTests/CompletionRequest.DuplicateFilteringWithComments (1800 of 2049)
PASS: lldb-shell :: SymbolFile/DWARF/debug_loclists-dwo.s (1801 of 2049)
PASS: lldb-unit :: Signals/./SignalsTests/UnixSignalsTest.GetInfo (1802 of 2049)
PASS: lldb-api :: functionalities/postmortem/wow64_minidump/TestWow64MiniDump.py (1803 of 2049)
PASS: lldb-api :: python_api/formatters/TestFormattersSBAPI.py (1804 of 2049)
PASS: lldb-shell :: ObjectFile/wasm/unified-debug-sections.yaml (1805 of 2049)
PASS: lldb-api :: lang/c/tls_globals/TestTlsGlobals.py (1806 of 2049)
PASS: lldb-api :: functionalities/process_group/TestChangeProcessGroup.py (1807 of 2049)
PASS: lldb-api :: functionalities/unwind/noreturn/module-end/TestNoReturnModuleEnd.py (1808 of 2049)
PASS: lldb-unit :: Utility/./UtilityTests/NameMatchesTest.Contains (1809 of 2049)
PASS: lldb-unit :: ObjectFile/Breakpad/./ObjectFileBreakpadTests/PublicRecord.parse (1810 of 2049)
PASS: lldb-shell :: SymbolFile/DWARF/DW_AT_loclists_base.s (1811 of 2049)
PASS: lldb-api :: functionalities/gdb_remote_client/TestRecognizeBreakpoint.py (1812 of 2049)
PASS: lldb-api :: functionalities/postmortem/minidump/TestMiniDump.py (1813 of 2049)
PASS: lldb-unit :: Host/./HostTests/NativeProcessProtocolTest.SetBreakpointFailWrite (1814 of 2049)
PASS: lldb-unit :: Language/CPlusPlus/./LanguageCPlusPlusTests/CPlusPlusLanguage.MethodNameParsing (1815 of 2049)
PASS: lldb-unit :: Utility/./UtilityTests/StringExtractorTest.GetHexBytes_Partial (1816 of 2049)
PASS: lldb-unit :: Utility/./UtilityTests/NameMatchesTest.Equals (1817 of 2049)
PASS: lldb-api :: python_api/thread/TestThreadAPI.py (1818 of 2049)
PASS: lldb-unit :: Utility/./UtilityTests/StringListTest.GetMaxStringLengthEmpty (1819 of 2049)
PASS: lldb-unit :: SymbolFile/NativePDB/./SymbolFileNativePDBTests/PDBFPOProgramToDWARFExpressionTests.UnresolvedDependentCyclicRegisterAssignmentReference (1820 of 2049)
PASS: lldb-api :: lang/cpp/class_types/TestClassTypes.py (1821 of 2049)
PASS: lldb-unit :: tools/lldb-server/tests/./LLDBServerTests/TestBase.LaunchModePreservesEnvironment (1822 of 2049)
PASS: lldb-unit :: Utility/./UtilityTests/TimeoutTest.Format (1823 of 2049)
FAIL: lldb-api :: lang/objc/objc++/TestObjCXX.py (1824 of 2049)
******************** TEST 'lldb-api :: lang/objc/objc++/TestObjCXX.py' FAILED ********************
Script:
--
/usr/local/Frameworks/Python.framework/Versions/3.7/bin/python3.7 /Users/buildslave/jenkins/workspace/lldb-cmake/llvm-project/lldb/test/API/dotest.py --arch x86_64 -s /Users/buildslave/jenkins/workspace/lldb-cmake/lldb-build/lldb-test-traces -S nm -u CXXFLAGS -u CFLAGS --codesign-identity lldb_codesign --server /Users/buildslave/jenkins/workspace/lldb-cmake/lldb-build/./bin/debugserver --arch x86_64 --build-dir /Users/buildslave/jenkins/workspace/lldb-cmake/lldb-build/lldb-test-build.noindex -s=/Users/buildslave/jenkins/workspace/lldb-cmake/test/logs -t --env TERM=vt100 --env LLVM_LIBS_DIR=/Users/buildslave/jenkins/workspace/lldb-cmake/lldb-build/./lib --build-dir /Users/buildslave/jenkins/workspace/lldb-cmake/lldb-build/lldb-test-build.noindex --lldb-module-cache-dir /Users/buildslave/jenkins/workspace/lldb-cmake/lldb-build/lldb-test-build.noindex/module-cache-lldb/lldb-api --clang-module-cache-dir /Users/buildslave/jenkins/workspace/lldb-cmake/lldb-build/lldb-test-build.noindex/module-cache-clang/lldb-api --executable /Users/buildslave/jenkins/workspace/lldb-cmake/lldb-build/./bin/lldb --compiler /Users/buildslave/jenkins/workspace/lldb-cmake/lldb-build/./bin/clang --dsymutil /Users/buildslave/jenkins/workspace/lldb-cmake/lldb-build/./bin/dsymutil --filecheck /Users/buildslave/jenkins/workspace/lldb-cmake/lldb-build/./bin/FileCheck --lldb-libs-dir /Users/buildslave/jenkins/workspace/lldb-cmake/lldb-build/./lib /Users/buildslave/jenkins/workspace/lldb-cmake/llvm-project/lldb/test/API/lang/objc/objc++ -p TestObjCXX.py
--
Exit Code: 1

Hide Details

Command Output (stdout): -- lldb version 11.0.99 clang revision 059ba74bb6f6166ca7c1783ef81dd37a5209b758 llvm revision 059ba74bb6f6166ca7c1783ef81dd37a5209b758 LLDB library dir: /Users/buildslave/jenkins/workspace/lldb-cmake/lldb-build/bin LLDB import library dir: /Users/buildslave/jenkins/workspace/lldb-cmake/lldb-build/./lib libstdcxx tests will not be run because: Don't know how to build with libstdcxx on macosx Skipping following debug info categories: ['dwo']

Hide Details

-- Command Output (stderr): --

Hide Details

Session logs for test failures/errors/unexpected successes will go into directory '/Users/buildslave/jenkins/workspace/lldb-cmake/test/logs' Change dir to: /Users/buildslave/jenkins/workspace/lldb-cmake/llvm-project/lldb/test/API/lang/objc/objc++ runCmd: settings clear -all output:

Hide Details

runCmd: settings set symbols.enable-external-lookup false output:

Hide Details

runCmd: settings set target.auto-apply-fixits false output:

Hide Details

runCmd: settings set plugin.process.gdb-remote.packet-timeout 60 output:

Hide Details

runCmd: settings set symbols.clang-modules-cache-path "/Users/buildslave/jenkins/workspace/lldb-cmake/lldb-build/lldb-test-build.noindex/module-cache-lldb/lldb-api" output:

Hide Details

runCmd: settings set use-color false output:

Hide Details

runCmd: setting set target.prefer-dynamic-value no-dynamic-values output:

Hide Details

runCmd: file /Users/buildslave/jenkins/workspace/lldb-cmake/lldb-build/lldb-test-build.noindex/lang/objc/objc++/TestObjCXX.test_break_dsym/a.out output: Current executable set to '/Users/buildslave/jenkins/workspace/lldb-cmake/lldb-build/lldb-test-build.noindex/lang/objc/objc++/TestObjCXX.test_break_dsym/a.out' (x86_64).

Hide Details

Hide Details

runCmd: breakpoint set -p "breakpoint 1" output: Breakpoint 1: where = a.out`main + 62 at main.mm:18:5, address = 0x0000000100000f9e

Hide Details

Hide Details

Expecting pattern: ^Breakpoint (?P<bpno>[0-9]+): (?P<num_locations>[0-9]+) locations\.$ Not matched

Hide Details

Expecting pattern: ^Breakpoint (?P<bpno>[0-9]+): (?P<num_locations>no) locations \(pending\)\. Not matched

Hide Details

Expecting pattern: ^Breakpoint (?P<bpno>[0-9]+): where = (?P<module>.*)`(?P<symbol>[+\-]{0,1}[^+]+)( \+ (?P<offset>[0-9]+)){0,1}( \[inlined\] (?P<inline_symbol>.*)){0,1} at (?P<file>[^:]+):(?P<line_no>[0-9]+)(?P<column>(:[0-9]+)?), address = (?P<address>0x[0-9a-fA-F]+)$ Matched

Hide Details

runCmd: run output: Process 12763 stopped * thread #1, queue = 'com.apple.main-thread', stop reason = breakpoint 1.1 frame #0: 0x0000000100000f9e a.out`main(argc=1, argv=0x00007ffeefbff7b8) at main.mm:18:5 15 { 16 F* f = [F new]; 17 f->f = 3; -> 18 return 0; // breakpoint 1 ^ 19 }

Hide Details

Process 12763 launched: '/Users/buildslave/jenkins/workspace/lldb-cmake/lldb-build/lldb-test-build.noindex/lang/objc/objc++/TestObjCXX.test_break_dsym/a.out' (x86_64)

Hide Details

Hide Details

runCmd: expr f->f output: (int) $0 = 3

Hide Details

Hide Details

Expecting sub string: = 3 Matched

Hide Details

<bound method SBProcess.Kill of <lldb.SBProcess; proxy of <Swig Object of type 'lldb::SBProcess *' at 0x10353e300> >>: success

Hide Details

PASS: LLDB (/Users/buildslave/jenkins/workspace/lldb-cmake/lldb-build/bin/clang-11-x86_64) :: test_break_dsym (TestObjCXX.ObjCXXTestCase) runCmd: settings clear -all output:

Hide Details

runCmd: settings set symbols.enable-external-lookup false output:

Hide Details

runCmd: settings set target.auto-apply-fixits false output:

Hide Details

runCmd: settings set plugin.process.gdb-remote.packet-timeout 60 output:

Hide Details

runCmd: settings set symbols.clang-modules-cache-path "/Users/buildslave/jenkins/workspace/lldb-cmake/lldb-build/lldb-test-build.noindex/module-cache-lldb/lldb-api" output:

Hide Details

runCmd: settings set use-color false output:

Hide Details

runCmd: setting set target.prefer-dynamic-value no-dynamic-values output:

Hide Details

runCmd: file /Users/buildslave/jenkins/workspace/lldb-cmake/lldb-build/lldb-test-build.noindex/lang/objc/objc++/TestObjCXX.test_break_dwarf/a.out output: Current executable set to '/Users/buildslave/jenkins/workspace/lldb-cmake/lldb-build/lldb-test-build.noindex/lang/objc/objc++/TestObjCXX.test_break_dwarf/a.out' (x86_64).

Hide Details

Hide Details

runCmd: breakpoint set -p "breakpoint 1" output: Breakpoint 1: where = a.out`main + 62 at main.mm:18:5, address = 0x0000000100000f9e

Hide Details

Hide Details

Expecting pattern: ^Breakpoint (?P<bpno>[0-9]+): (?P<num_locations>[0-9]+) locations\.$ Not matched

Hide Details

Expecting pattern: ^Breakpoint (?P<bpno>[0-9]+): (?P<num_locations>no) locations \(pending\)\. Not matched

Hide Details

Expecting pattern: ^Breakpoint (?P<bpno>[0-9]+): where = (?P<module>.*)`(?P<symbol>[+\-]{0,1}[^+]+)( \+ (?P<offset>[0-9]+)){0,1}( \[inlined\] (?P<inline_symbol>.*)){0,1} at (?P<file>[^:]+):(?P<line_no>[0-9]+)(?P<column>(:[0-9]+)?), address = (?P<address>0x[0-9a-fA-F]+)$ Matched

Hide Details

runCmd: run runCmd failed! error: shell expansion failed (reason: timed out waiting for shell command to complete). consider launching with 'process launch'.

Hide Details

Hide Details

Command 'run' failed!

Hide Details

FAIL: LLDB (/Users/buildslave/jenkins/workspace/lldb-cmake/lldb-build/bin/clang-11-x86_64) :: test_break_dwarf (TestObjCXX.ObjCXXTestCase) UNSUPPORTED: LLDB (/Users/buildslave/jenkins/workspace/lldb-cmake/lldb-build/bin/clang-11-x86_64) :: test_break_dwo (TestObjCXX.ObjCXXTestCase) (test case does not fall in any category of interest for this run) runCmd: settings clear -all output:

Hide Details

runCmd: settings set symbols.enable-external-lookup false output:

Hide Details

runCmd: settings set target.auto-apply-fixits false output:

Hide Details

runCmd: settings set plugin.process.gdb-remote.packet-timeout 60 output:

Hide Details

runCmd: settings set symbols.clang-modules-cache-path "/Users/buildslave/jenkins/workspace/lldb-cmake/lldb-build/lldb-test-build.noindex/module-cache-lldb/lldb-api" output:

Hide Details

runCmd: settings set use-color false output:

Hide Details

runCmd: setting set target.prefer-dynamic-value no-dynamic-values output:

Hide Details

runCmd: file /Users/buildslave/jenkins/workspace/lldb-cmake/lldb-build/lldb-test-build.noindex/lang/objc/objc++/TestObjCXX.test_break_gmodules/a.out output: Current executable set to '/Users/buildslave/jenkins/workspace/lldb-cmake/lldb-build/lldb-test-build.noindex/lang/objc/objc++/TestObjCXX.test_break_gmodules/a.out' (x86_64).

Hide Details

Hide Details

runCmd: breakpoint set -p "breakpoint 1" output: Breakpoint 1: where = a.out`main + 62 at main.mm:18:5, address = 0x0000000100000f9e

Hide Details

Hide Details

Expecting pattern: ^Breakpoint (?P<bpno>[0-9]+): (?P<num_locations>[0-9]+) locations\.$ Not matched

Hide Details

Expecting pattern: ^Breakpoint (?P<bpno>[0-9]+): (?P<num_locations>no) locations \(pending\)\. Not matched

Hide Details

Expecting pattern: ^Breakpoint (?P<bpno>[0-9]+): where = (?P<module>.*)`(?P<symbol>[+\-]{0,1}[^+]+)( \+ (?P<offset>[0-9]+)){0,1}( \[inlined\] (?P<inline_symbol>.*)){0,1} at (?P<file>[^:]+):(?P<line_no>[0-9]+)(?P<column>(:[0-9]+)?), address = (?P<address>0x[0-9a-fA-F]+)$ Matched

Hide Details

runCmd: run output: Process 16801 stopped * thread #1, queue = 'com.apple.main-thread', stop reason = breakpoint 1.1 frame #0: 0x0000000100000f9e a.out`main(argc=1, argv=0x00007ffeefbff7b8) at main.mm:18:5 15 { 16 F* f = [F new]; 17 f->f = 3; -> 18 return 0; // breakpoint 1 ^ 19 }

Hide Details

Process 16801 launched: '/Users/buildslave/jenkins/workspace/lldb-cmake/lldb-build/lldb-test-build.noindex/lang/objc/objc++/TestObjCXX.test_break_gmodules/a.out' (x86_64)

Hide Details

Hide Details

runCmd: expr f->f output: (int) $0 = 3

Hide Details

Hide Details

Expecting sub string: = 3 Matched

Hide Details

<bound method SBProcess.Kill of <lldb.SBProcess; proxy of <Swig Object of type 'lldb::SBProcess *' at 0x103383ae0> >>: success

Hide Details

PASS: LLDB (/Users/buildslave/jenkins/workspace/lldb-cmake/lldb-build/bin/clang-11-x86_64) :: test_break_gmodules (TestObjCXX.ObjCXXTestCase) Restore dir to: /Users/buildslave/jenkins/workspace/lldb-cmake/lldb-build/tools/lldb/test ====================================================================== FAIL: test_break_dwarf (TestObjCXX.ObjCXXTestCase) Test ivars of Objective-C++ classes ---------------------------------------------------------------------- Traceback (most recent call last): File "/Users/buildslave/jenkins/workspace/lldb-cmake/llvm-project/lldb/packages/Python/lldbsuite/test/lldbtest.py", line 1767, in test_method return attrvalue(self) File "/Users/buildslave/jenkins/workspace/lldb-cmake/llvm-project/lldb/test/API/lang/objc/objc++/TestObjCXX.py", line 30, in test_break self.runCmd("run", RUN_SUCCEEDED) File "/Users/buildslave/jenkins/workspace/lldb-cmake/llvm-project/lldb/packages/Python/lldbsuite/test/lldbtest.py", line 2092, in runCmd msg if (msg) else CMD_MSG(cmd)) AssertionError: False is not True : Process is launched successfully Error output: error: shell expansion failed (reason: timed out waiting for shell command to complete). consider launching with 'process launch'.

Hide Details

Config=x86_64-/Users/buildslave/jenkins/workspace/lldb-cmake/lldb-build/bin/clang-11 ---------------------------------------------------------------------- Ran 4 tests in 22.392s

Hide Details

RESULT: FAILED (2 passes, 1 failures, 0 errors, 1 skipped, 0 expected failures, 0 unexpected successes)

Hide Details

--

Hide Details

******************** PASS: lldb-unit :: Utility/./UtilityTests/ArgsTest.GetArgumentArrayRef (1825 of 2049) PASS: lldb-api :: commands/expression/import-std-module/sysroot/TestStdModuleSysroot.py (1826 of 2049) PASS: lldb-api :: lang/cpp/multiple-inheritance/TestCppMultipleInheritance.py (1827 of 2049) PASS: lldb-unit :: Utility/./UtilityTests/UriParserTest.Empty (1828 of 2049) PASS: lldb-api :: functionalities/data-formatter/var-in-aggregate-misuse/TestVarInAggregateMisuse.py (1829 of 2049) PASS: lldb-shell :: Commands/command-script-import.test (1830 of 2049) PASS: lldb-unit :: Utility/./UtilityTests/ArchSpecTest.TestParseMachCPUDashSubtypeTripleExtra (1831 of 2049) PASS: lldb-shell :: ScriptInterpreter/Lua/breakpoint_callback.test (1832 of 2049) PASS: lldb-shell :: SymbolFile/DWARF/dwarf5-partial-index.cpp (1833 of 2049) PASS: lldb-unit :: Utility/./UtilityTests/RangeTest.ContainsEndInclusiveInvalid (1834 of 2049) UNSUPPORTED: lldb-shell :: SymbolFile/PDB/function-nested-block.test (1835 of 2049) PASS: lldb-api :: tools/lldb-server/TestGdbRemoteThreadsInStopReply.py (1836 of 2049) PASS: lldb-api :: python_api/process/io/TestProcessIO.py (1837 of 2049) PASS: lldb-unit :: SymbolFile/NativePDB/./SymbolFileNativePDBTests/PDBFPOProgramToDWARFExpressionTests.InvalidOpBinary (1838 of 2049) PASS: lldb-unit :: Utility/./UtilityTests/Flags.GetBitSize (1839 of 2049) PASS: lldb-api :: lang/objc/foundation/TestObjectDescriptionAPI.py (1840 of 2049) PASS: lldb-api :: functionalities/unwind/zeroth_frame/TestZerothFrame.py (1841 of 2049) PASS: lldb-shell :: Reproducer/Functionalities/TestStepping.test (1842 of 2049) PASS: lldb-shell :: Driver/TestRepl.test (1843 of 2049) PASS: lldb-api :: functionalities/breakpoint/consecutive_breakpoints/TestConsecutiveBreakpoints.py (1844 of 2049) UNSUPPORTED: lldb-shell :: Register/x86-64-zmm-read.test (1845 of 2049) PASS: lldb-unit :: Expression/./ExpressionTests/DiagnosticManagerTest.PutStringSeverities (1846 of 2049) PASS: lldb-api :: lang/cpp/nested-class-other-compilation-unit/TestNestedClassWithParentInAnotherCU.py (1847 of 2049) PASS: lldb-unit :: Utility/./UtilityTests/StringListTest.Clear (1848 of 2049) PASS: lldb-unit :: Host/./HostTests/Host.GetEnvironment (1849 of 2049) PASS: lldb-unit :: Utility/./UtilityTests/UUIDTest.StringConverion (1850 of 2049) PASS: lldb-api :: tools/lldb-vscode/breakpoint/TestVSCode_setBreakpoints.py (1851 of 2049) PASS: lldb-unit :: Utility/./UtilityTests/BinaryStreamTest.PutSLEB128SevenBytes (1852 of 2049) PASS: lldb-api :: lang/c/step_over_no_deadlock/TestStepOverDoesntBlock.py (1853 of 2049) PASS: lldb-api :: lang/cpp/template-function/TestTemplateFunctions.py (1854 of 2049) PASS: lldb-api :: lang/cpp/auto/TestCPPAuto.py (1855 of 2049) PASS: lldb-unit :: Utility/./UtilityTests/StringListTest.InsertStringAtIndexOutOfBounds (1856 of 2049) PASS: lldb-shell :: Commands/command-disassemble-process.yaml (1857 of 2049) PASS: lldb-unit :: Utility/./UtilityTests/ListenerTest.GetEventWait (1858 of 2049) UNSUPPORTED: lldb-shell :: SymbolFile/PDB/compilands.test (1859 of 2049) PASS: lldb-api :: functionalities/inferior-crashing/recursive-inferior/TestRecursiveInferior.py (1860 of 2049) PASS: lldb-api :: functionalities/data-formatter/data-formatter-stl/libcxx/optional/TestDataFormatterLibcxxOptional.py (1861 of 2049) PASS: lldb-api :: commands/expression/calculator_mode/TestCalculatorMode.py (1862 of 2049) PASS: lldb-api :: commands/settings/use_source_cache/TestUseSourceCache.py (1863 of 2049) PASS: lldb-unit :: Symbol/./SymbolTests/LineEntryTest.GetSameLineContiguousAddressRangeNestedInline (1864 of 2049) PASS: lldb-api :: functionalities/breakpoint/breakpoint_command/TestBreakpointCommand.py (1865 of 2049) PASS: lldb-shell :: Breakpoint/debug_rnglist_basic.test (1866 of 2049) PASS: lldb-shell :: Breakpoint/debug_rnglist_offset_pair.test (1867 of 2049) PASS: lldb-api :: lang/cpp/lambdas/TestLambdas.py (1868 of 2049) PASS: lldb-api :: macosx/universal/TestUniversal.py (1869 of 2049) UNSUPPORTED: lldb-shell :: ExecControl/StopHook/stop-hook-threads.test (1870 of 2049) UNSUPPORTED: lldb-shell :: SymbolFile/PDB/function-level-linking.test (1871 of 2049) PASS: lldb-api :: functionalities/data-formatter/vector-types/TestVectorTypesFormatting.py (1872 of 2049) PASS: lldb-unit :: Utility/./UtilityTests/UriParserTest.PortOverflow (1873 of 2049) PASS: lldb-unit :: Utility/./UtilityTests/StreamTest.PutHex8 (1874 of 2049) PASS: lldb-unit :: ObjectFile/PECOFF/./ObjectFilePECOFFTests/PECallFrameInfoTest.Chained_eh (1875 of 2049) PASS: lldb-api :: commands/expression/pr35310/TestExprsBug35310.py (1876 of 2049) PASS: lldb-api :: commands/watchpoints/hello_watchpoint/TestMyFirstWatchpoint.py (1877 of 2049) UNSUPPORTED: lldb-api :: commands/watchpoints/multi_watchpoint_slots/TestWatchpointMultipleSlots.py (1878 of 2049) PASS: lldb-unit :: Utility/./UtilityTests/StreamTest.PutCStringWithStringRef (1879 of 2049) PASS: lldb-unit :: Utility/./UtilityTests/StreamTeeTest.GetStreamAtIndexOutOfBounds (1880 of 2049) UNSUPPORTED: lldb-api :: functionalities/data-formatter/data-formatter-stl/libstdcpp/list/TestDataFormatterStdList.py (1881 of 2049) PASS: lldb-unit :: Host/./HostTests/MainLoopTest.UnmonitoredSignal (1882 of 2049) PASS: lldb-api :: functionalities/thread/concurrent_events/TestConcurrentTwoWatchpointsOneSignal.py (1883 of 2049) PASS: lldb-api :: lang/objc/objc-ivar-stripped/TestObjCIvarStripped.py (1884 of 2049) PASS: lldb-api :: lang/cpp/scope/TestCppScope.py (1885 of 2049) PASS: lldb-unit :: Utility/./UtilityTests/StringListTest.GetMaxStringLengthMixed (1886 of 2049) PASS: lldb-unit :: Core/./LLDBCoreTests/RichManglingContextTest.FromCxxMethodName (1887 of 2049) PASS: lldb-api :: functionalities/completion/TestCompletion.py (1888 of 2049) PASS: lldb-api :: lang/objc/objc-checker/TestObjCCheckers.py (1889 of 2049) PASS: lldb-unit :: DataFormatter/./LLDBFormatterTests/FormatManagerTests.CompatibleLangs (1890 of 2049) PASS: lldb-shell :: SymbolFile/Breakpad/line-table-edgecases.test (1891 of 2049) PASS: lldb-api :: commands/expression/import-std-module/basic/TestImportStdModule.py (1892 of 2049) PASS: lldb-shell :: SymbolFile/Breakpad/line-table-mixed-path-styles.test (1893 of 2049) PASS: lldb-api :: commands/disassemble/basic/TestDisassembleBreakpoint.py (1894 of 2049) PASS: lldb-api :: lang/cpp/nsimport/TestCppNsImport.py (1895 of 2049) PASS: lldb-api :: functionalities/thread/num_threads/TestNumThreads.py (1896 of 2049) PASS: lldb-shell :: ObjectFile/PECOFF/basic-info-arm64.yaml (1897 of 2049) UNSUPPORTED: lldb-api :: benchmarks/continue/TestBenchmarkContinue.py (1898 of 2049) PASS: lldb-unit :: Process/minidump/./LLDBMinidumpTests/MinidumpParserTest.GetMemoryRegionInfoFromMemoryList (1899 of 2049) PASS: lldb-unit :: SymbolFile/NativePDB/./SymbolFileNativePDBTests/PDBFPOProgramToDWARFExpressionTests.InvalidAssignmentMultiple (1900 of 2049) PASS: lldb-api :: functionalities/breakpoint/breakpoint_callback_command_source/TestBreakpointCallbackCommandSource.py (1901 of 2049) PASS: lldb-shell :: Breakpoint/ppc64-localentry.test (1902 of 2049) PASS: lldb-unit :: Utility/./UtilityTests/SharedCluster.ClusterManager (1903 of 2049) PASS: lldb-shell :: SymbolFile/DWARF/dwo-type-in-main-file.s (1904 of 2049) PASS: lldb-shell :: SymbolFile/Breakpad/unwind-via-raSearch.test (1905 of 2049) PASS: lldb-shell :: SymbolFile/DWARF/dwarf5-atomic.s (1906 of 2049) PASS: lldb-unit :: ScriptInterpreter/Python/./ScriptInterpreterPythonTests/PythonDataObjectsTest.TestPythonTupleInitializerList (1907 of 2049) PASS: lldb-unit :: ScriptInterpreter/Python/./ScriptInterpreterPythonTests/PythonDataObjectsTest.TestPythonListValueEquality (1908 of 2049) PASS: lldb-unit :: Utility/./UtilityTests/ArgsTest.TestArgv (1909 of 2049) PASS: lldb-api :: terminal/TestSTTYBeforeAndAfter.py (1910 of 2049) PASS: lldb-api :: functionalities/type_lookup/TestTypeLookup.py (1911 of 2049) PASS: lldb-unit :: Expression/./ExpressionTests/DiagnosticManagerTest.HasFixits (1912 of 2049) PASS: lldb-unit :: Utility/./UtilityTests/Flags.Test (1913 of 2049) PASS: lldb-unit :: Utility/./UtilityTests/RangeDataVector.FindEntryThatContains (1914 of 2049) PASS: lldb-unit :: Utility/./UtilityTests/UriParserTest.MinimalPath (1915 of 2049) PASS: lldb-unit :: Utility/./UtilityTests/BinaryStreamTest.PutULEB128FourBytes (1916 of 2049) PASS: lldb-shell :: Breakpoint/debug_addrx.test (1917 of 2049) PASS: lldb-api :: commands/frame/language/TestGuessLanguage.py (1918 of 2049) PASS: lldb-shell :: Expr/TestIRMemoryMap.test (1919 of 2049) PASS: lldb-api :: functionalities/data-formatter/data-formatter-ptr-to-array/TestPtrToArrayFormatting.py (1920 of 2049) PASS: lldb-api :: commands/expression/import-std-module/vector-dbg-info-content/TestDbgInfoContentVectorFromStdModule.py (1921 of 2049) PASS: lldb-unit :: debugserver/./debugserverTests/RNBSocket.LoopBackListenIPv4 (1922 of 2049) PASS: lldb-api :: lang/objc/foundation/TestObjCMethodsNSArray.py (1923 of 2049) PASS: lldb-unit :: Utility/./UtilityTests/TimerTest.CategoryTimesNested (1924 of 2049) PASS: lldb-api :: lang/objc/objc-static-method-stripped/TestObjCStaticMethodStripped.py (1925 of 2049) PASS: lldb-api :: lang/objc/objc-stepping/TestObjCStepping.py (1926 of 2049) PASS: lldb-unit :: Utility/./UtilityTests/RangeTest.SlideZero (1927 of 2049) PASS: lldb-api :: functionalities/data-formatter/format-propagation/TestFormatPropagation.py (1928 of 2049) PASS: lldb-api :: commands/watchpoints/watchpoint_commands/command/TestWatchpointCommandLLDB.py (1929 of 2049) PASS: lldb-api :: functionalities/tsan/multiple/TestTsanMultiple.py (1930 of 2049) UNSUPPORTED: lldb-shell :: SymbolFile/PDB/class-layout.test (1931 of 2049) PASS: lldb-unit :: Utility/./UtilityTests/StringListTest.ForRange (1932 of 2049) PASS: lldb-unit :: ScriptInterpreter/Python/./ScriptInterpreterPythonTests/PythonDataObjectsTest.TestPythonCallableInvoke (1933 of 2049) PASS: lldb-api :: python_api/watchpoint/watchlocation/TestSetWatchlocation.py (1934 of 2049) UNSUPPORTED: lldb-api :: benchmarks/stepping/TestSteppingSpeed.py (1935 of 2049) UNSUPPORTED: lldb-api :: functionalities/data-formatter/data-formatter-stl/libstdcpp/tuple/TestDataFormatterStdTuple.py (1936 of 2049) PASS: lldb-api :: lang/cpp/class_static/TestStaticVariables.py (1937 of 2049) PASS: lldb-unit :: Utility/./UtilityTests/GeneratorTest.Create (1938 of 2049) PASS: lldb-api :: lang/c/conflicting-symbol/TestConflictingSymbol.py (1939 of 2049) PASS: lldb-shell :: Quit/TestQuitExitCode-30.test (1940 of 2049) PASS: lldb-unit :: Expression/./ExpressionTests/CppModuleConfigurationTest.UnrelatedLibrary (1941 of 2049) PASS: lldb-api :: functionalities/type_completion/TestTypeCompletion.py (1942 of 2049) PASS: lldb-shell :: ObjectFile/ELF/PT_LOAD-overlap-PT_TLS.yaml (1943 of 2049) PASS: lldb-api :: functionalities/data-formatter/typedef_array/TestTypedefArray.py (1944 of 2049) PASS: lldb-unit :: Expression/./ExpressionTests/DiagnosticManagerTest.AppendMessageSubsequentDiags (1945 of 2049) UNSUPPORTED: lldb-api :: functionalities/unwind/standard/TestStandardUnwind.py (1946 of 2049) PASS: lldb-api :: python_api/frame/TestFrames.py (1947 of 2049) PASS: lldb-api :: functionalities/data-formatter/data-formatter-categories/TestDataFormatterCategories.py (1948 of 2049) PASS: lldb-unit :: Utility/./UtilityTests/SubsystemRAIITest.NormalSubsystem (1949 of 2049) PASS: lldb-unit :: debugserver/./debugserverTests/RNBSocket.LoopBackConnectIPv4 (1950 of 2049) PASS: lldb-api :: api/listeners/TestListener.py (1951 of 2049) PASS: lldb-api :: lang/objc/modules-update/TestClangModulesUpdate.py (1952 of 2049) UNSUPPORTED: lldb-api :: functionalities/thread/concurrent_events/TestConcurrentManySignals.py (1953 of 2049) PASS: lldb-api :: commands/expression/formatters/TestFormatters.py (1954 of 2049) PASS: lldb-api :: commands/watchpoints/watchpoint_set_command/TestWatchLocationWithWatchSet.py (1955 of 2049) PASS: lldb-shell :: Quit/TestQuitExitCode30.test (1956 of 2049) PASS: lldb-api :: lang/cpp/class-template-parameter-pack/TestClassTemplateParameterPack.py (1957 of 2049) PASS: lldb-unit :: Utility/./UtilityTests/OptionsWithRawTest.EmptyArgsOnlySuffix (1958 of 2049) PASS: lldb-unit :: Utility/./UtilityTests/ArgsTest.Yaml (1959 of 2049) PASS: lldb-unit :: Symbol/./SymbolTests/TestTypeSystemClang.TestDisplayName (1960 of 2049) PASS: lldb-unit :: SymbolFile/NativePDB/./SymbolFileNativePDBTests/PDBFPOProgramToDWARFExpressionTests.UnknownOp (1961 of 2049) PASS: lldb-unit :: Utility/./UtilityTests/ScalarTest.LongLongAssigmentOperator (1962 of 2049) PASS: lldb-unit :: UnwindAssembly/x86/./UnwindAssemblyx86Tests/Testx86AssemblyInspectionEngine.TestPushEBP (1963 of 2049) PASS: lldb-unit :: UnwindAssembly/x86/./UnwindAssemblyx86Tests/Testx86AssemblyInspectionEngine.TestAddESP (1964 of 2049) PASS: lldb-unit :: SymbolFile/DWARF/./SymbolFileDWARFTests/SymbolFileDWARFTests.TestAbilitiesForDWARF (1965 of 2049) PASS: lldb-unit :: Utility/./UtilityTests/StreamTeeTest.Flush (1966 of 2049) PASS: lldb-unit :: Breakpoint/./LLDBBreakpointTests/BreakpointIDTest.StringIsBreakpointName (1967 of 2049) PASS: lldb-unit :: Utility/./UtilityTests/StreamTest.PutRawBytesToLittleEndian (1968 of 2049) PASS: lldb-unit :: Utility/./UtilityTests/OptionsWithRawTest.SingleWordSuffix (1969 of 2049) PASS: lldb-api :: api/check_public_api_headers/TestPublicAPIHeaders.py (1970 of 2049) PASS: lldb-unit :: Process/gdb-remote/./ProcessGdbRemoteTests/GDBRemoteCommunicationClientTest.TestPacketSpeedJSON (1971 of 2049) PASS: lldb-api :: lang/c/global_variables/TestGlobalVariables.py (1972 of 2049) PASS: lldb-api :: functionalities/wrong_commands/TestWrongCommands.py (1973 of 2049) PASS: lldb-api :: lang/c/register_variables/TestRegisterVariables.py (1974 of 2049) PASS: lldb-unit :: Utility/./UtilityTests/StringLexerTest.Peek (1975 of 2049) PASS: lldb-unit :: Expression/./ExpressionTests/ClangExpressionDeclMapTest.TestPersistentDeclLookup (1976 of 2049) PASS: lldb-api :: functionalities/data-formatter/data-formatter-smart-array/TestDataFormatterSmartArray.py (1977 of 2049) PASS: lldb-api :: python_api/value_var_update/TestValueVarUpdate.py (1978 of 2049) XFAIL: lldb-shell :: SymbolFile/DWARF/find-type-in-function.cpp (1979 of 2049) PASS: lldb-shell :: SymbolFile/DWARF/win-i386-line-table.s (1980 of 2049) PASS: lldb-api :: commands/expression/call-function/TestCallUserDefinedFunction.py (1981 of 2049) PASS: lldb-api :: commands/watchpoints/watchpoint_count/TestWatchpointCount.py (1982 of 2049) PASS: lldb-shell :: SymbolFile/DWARF/dwarf5-debug_line.s (1983 of 2049) UNSUPPORTED: lldb-api :: functionalities/darwin_log/filter/regex/activity-chain/TestDarwinLogFilterRegexActivityChain.py (1984 of 2049) PASS: lldb-shell :: Reproducer/TestMultipleTargets.test (1985 of 2049) PASS: lldb-unit :: Utility/./UtilityTests/Predicate.WaitForValueEqualTo (1986 of 2049) PASS: lldb-shell :: ObjectFile/MachO/lc_version_min.yaml (1987 of 2049) PASS: lldb-unit :: Utility/./UtilityTests/StringLexerTest.NextIfList (1988 of 2049) PASS: lldb-unit :: SymbolFile/DWARF/./SymbolFileDWARFTests/SymbolFileDWARFTests.ParseArangesNonzeroSegmentSize (1989 of 2049) PASS: lldb-unit :: Utility/./UtilityTests/RangeTest.DefaultConstructor (1990 of 2049) UNSUPPORTED: lldb-api :: functionalities/darwin_log/filter/regex/subsystem/TestDarwinLogFilterRegexSubsystem.py (1991 of 2049) PASS: lldb-shell :: Settings/TestModuleCacheSanity.test (1992 of 2049) PASS: lldb-api :: functionalities/breakpoint/cpp/TestCPPBreakpointLocations.py (1993 of 2049) PASS: lldb-api :: lang/objc/objc-struct-return/TestObjCStructReturn.py (1994 of 2049) PASS: lldb-unit :: Utility/./UtilityTests/RangeTest.SetRangeBase (1995 of 2049) PASS: lldb-shell :: ObjectFile/ELF/section-addresses.yaml (1996 of 2049) PASS: lldb-api :: functionalities/gdb_remote_client/TestStopPCs.py (1997 of 2049) PASS: lldb-unit :: Utility/./UtilityTests/DataExtractorTest.GetSLEB128_bit63 (1998 of 2049) UNSUPPORTED: lldb-api :: api/multiple-debuggers/TestMultipleDebuggers.py (1999 of 2049) PASS: lldb-unit :: ScriptInterpreter/Python/./ScriptInterpreterPythonTests/PythonDataObjectsTest.TestObjectAttributes (2000 of 2049) PASS: lldb-api :: lang/cpp/stl/TestSTL.py (2001 of 2049) PASS: lldb-api :: functionalities/optimized_code/TestNoASanExceptionAfterEvalOP_piece.py (2002 of 2049) PASS: lldb-api :: macosx/add-dsym/TestAddDsymMidExecutionCommand.py (2003 of 2049) PASS: lldb-unit :: UnwindAssembly/ARM64/./Arm64InstEmulationTests/TestArm64InstEmulation.TestCFARegisterTrackedAcrossJumps (2004 of 2049) PASS: lldb-api :: functionalities/gdb_remote_client/TestqOffsets.py (2005 of 2049) PASS: lldb-unit :: Language/Highlighting/./HighlighterTests/HighlighterTest.Colons (2006 of 2049) PASS: lldb-unit :: Language/Highlighting/./HighlighterTests/HighlighterTest.ClangTrailingBackslashWithWhitespace (2007 of 2049) PASS: lldb-api :: types/TestCharType.py (2008 of 2049) PASS: lldb-unit :: Language/Highlighting/./HighlighterTests/HighlighterTest.ClangScalarLiterals (2009 of 2049) PASS: lldb-shell :: ObjectFile/ELF/PT_LOAD-overlap-section.yaml (2010 of 2049) PASS: lldb-api :: lang/objc/foundation/TestFoundationDisassembly.py (2011 of 2049) PASS: lldb-unit :: Utility/./UtilityTests/UriParserTest.SchemeHostSeparator2 (2012 of 2049) PASS: lldb-shell :: Commands/command-regex-delete.test (2013 of 2049) PASS: lldb-api :: commands/expression/inline-namespace/TestInlineNamespace.py (2014 of 2049) PASS: lldb-api :: tools/lldb-server/commandline/TestStubReverseConnect.py (2015 of 2049) PASS: lldb-api :: lang/c/stepping/TestStepAndBreakpoints.py (2016 of 2049) PASS: lldb-api :: commands/watchpoints/multiple_hits/TestMultipleHits.py (2017 of 2049) PASS: lldb-api :: lang/c/local_variables/TestLocalVariables.py (2018 of 2049) PASS: lldb-api :: commands/expression/completion-crash-incomplete-record/TestCompletionCrashIncompleteRecord.py (2019 of 2049) PASS: lldb-unit :: Utility/./UtilityTests/BinaryStreamTest.PutULEB128EightBytes (2020 of 2049) PASS: lldb-unit :: Utility/./UtilityTests/EventTest.DumpEventDataBytes (2021 of 2049) PASS: lldb-shell :: Minidump/breakpad-symbols.test (2022 of 2049) PASS: lldb-api :: functionalities/data-formatter/data-formatter-stl/libcxx/forward_list/TestDataFormatterLibcxxForwardList.py (2023 of 2049) PASS: lldb-unit :: Utility/./UtilityTests/StreamTest.PutStringAsRawHex8 (2024 of 2049) UNSUPPORTED: lldb-api :: functionalities/thread/thread_specific_break_plus_condition/TestThreadSpecificBpPlusCondition.py (2025 of 2049) PASS: lldb-api :: functionalities/postmortem/elf-core/thread_crash/TestLinuxCoreThreads.py (2026 of 2049) PASS: lldb-shell :: Reproducer/TestWorkingDir.test (2027 of 2049) UNSUPPORTED: lldb-api :: lang/cpp/function-template-parameter-pack/TestFunctionTemplateParameterPack.py (2028 of 2049) PASS: lldb-api :: functionalities/data-formatter/data-formatter-named-summaries/TestDataFormatterNamedSummaries.py (2029 of 2049) PASS: lldb-api :: lang/objc/ptr_refs/TestPtrRefsObjC.py (2030 of 2049) PASS: lldb-api :: commands/expression/entry-bp/TestExprEntryBP.py (2031 of 2049) PASS: lldb-api :: functionalities/data-formatter/data-formatter-objc/cmtime/TestDataFormatterCMTime.py (2032 of 2049) PASS: lldb-api :: functionalities/data-formatter/boolreference/TestFormattersBoolRefPtr.py (2033 of 2049) PASS: lldb-api :: functionalities/thread/concurrent_events/TestConcurrentCrashWithBreak.py (2034 of 2049) PASS: lldb-api :: functionalities/thread/concurrent_events/TestConcurrentWatchBreak.py (2035 of 2049) PASS: lldb-api :: lang/cpp/symbols/TestSymbols.py (2036 of 2049) PASS: lldb-api :: lang/objc/modules-app-update/TestClangModulesAppUpdate.py (2037 of 2049) PASS: lldb-api :: lang/objc/hidden-ivars/TestHiddenIvars.py (2038 of 2049) PASS: lldb-api :: lang/objc/objc-optimized/TestObjcOptimized.py (2039 of 2049) PASS: lldb-api :: functionalities/data-formatter/nssetsynth/TestNSSetSynthetic.py (2040 of 2049) PASS: lldb-api :: commands/expression/call-function/TestCallStdStringFunction.py (2041 of 2049) PASS: lldb-api :: lang/c/vla/TestVLA.py (2042 of 2049) UNSUPPORTED: lldb-api :: lang/objc/bitfield_ivars/TestBitfieldIvars.py (2043 of 2049) PASS: lldb-api :: types/TestLongTypesExpr.py (2044 of 2049) PASS: lldb-api :: functionalities/thread/backtrace_all/TestBacktraceAll.py (2045 of 2049) PASS: lldb-api :: lang/objc/objc-new-syntax/TestObjCNewSyntaxDictionary.py (2046 of 2049) PASS: lldb-api :: lang/objc/foundation/TestObjCMethods.py (2047 of 2049) PASS: lldb-api :: lang/cpp/namespace/TestNamespaceLookup.py (2048 of 2049) PASS: lldb-api :: lang/cpp/enum_types/TestCPP11EnumTypes.py (2049 of 2049) Slowest Tests: -------------------------------------------------------------------------- 161.30s: lldb-api :: lang/objc/foundation/TestFoundationDisassembly.py 103.07s: lldb-api :: tools/lldb-server/TestLldbGdbServer.py 93.37s: lldb-api :: lang/objc/hidden-ivars/TestHiddenIvars.py 81.76s: lldb-api :: lang/objc/exceptions/TestObjCExceptions.py 71.36s: lldb-api :: api/multithreaded/TestMultithreaded.py 65.67s: lldb-api :: lang/objc/foundation/TestObjCMethods.py 64.01s: lldb-api :: lang/objc/objc-new-syntax/TestObjCNewSyntaxLiteral.py 61.36s: lldb-api :: types/TestLongTypesExpr.py 56.39s: lldb-api :: lang/cpp/enum_types/TestCPP11EnumTypes.py 51.98s: lldb-api :: lang/objc/foundation/TestObjCMethodsNSError.py 51.22s: lldb-api :: lang/objc/real-definition/TestRealDefinition.py 47.88s: lldb-api :: lang/objc/objc-new-syntax/TestObjCNewSyntaxArray.py 44.46s: lldb-api :: lang/objc/foundation/TestObjCMethodsString.py 44.42s: lldb-api :: lang/cpp/namespace/TestNamespaceLookup.py 43.69s: lldb-api :: functionalities/recursion/TestValueObjectRecursion.py 42.54s: lldb-api :: tools/lldb-server/TestGdbRemoteThreadsInStopReply.py 42.53s: lldb-api :: types/TestIntegerTypeExpr.py 40.60s: lldb-api :: types/TestLongTypes.py 39.94s: lldb-api :: lang/objc/objc-new-syntax/TestObjCNewSyntaxDictionary.py 38.77s: lldb-api :: functionalities/tsan/multiple/TestTsanMultiple.py

Hide Details

Tests Times: -------------------------------------------------------------------------- [ Range ] :: [ Percentage ] :: [ Count ] -------------------------------------------------------------------------- [160s,170s) :: [ ] :: [ 1/2049] [150s,160s) :: [ ] :: [ 0/2049] [140s,150s) :: [ ] :: [ 0/2049] [130s,140s) :: [ ] :: [ 0/2049] [120s,130s) :: [ ] :: [ 0/2049] [110s,120s) :: [ ] :: [ 0/2049] [100s,110s) :: [ ] :: [ 1/2049] [ 90s,100s) :: [ ] :: [ 1/2049] [ 80s, 90s) :: [ ] :: [ 1/2049] [ 70s, 80s) :: [ ] :: [ 1/2049] [ 60s, 70s) :: [ ] :: [ 3/2049] [ 50s, 60s) :: [ ] :: [ 4/2049] [ 40s, 50s) :: [ ] :: [ 8/2049] [ 30s, 40s) :: [ ] :: [ 13/2049] [ 20s, 30s) :: [* ] :: [ 62/2049] [ 10s, 20s) :: [*** ] :: [ 163/2049] [ 0s, 10s) :: [********************************** ] :: [1791/2049] -------------------------------------------------------------------------- ******************** Failed Tests (1): lldb-api :: lang/objc/objc++/TestObjCXX.py

Hide Details

Hide Details

Testing Time: 362.77s Unsupported : 132 Passed : 1910 Expectedly Failed: 6 Failed : 1 FAILED: tools/lldb/test/CMakeFiles/check-lldb-lit cd /Users/buildslave/jenkins/workspace/lldb-cmake/lldb-build/tools/lldb/test && /usr/local/Frameworks/Python.framework/Versions/3.7/bin/python3.7 /Users/buildslave/jenkins/workspace/lldb-cmake/lldb-build/./bin/llvm-lit -v --time-tests --shuffle --xunit-xml-output=/Users/buildslave/jenkins/workspace/lldb-cmake/test/results.xml -v /Users/buildslave/jenkins/workspace/lldb-cmake/lldb-build/tools/lldb/test ninja: build stopped: subcommand failed. Command failed: Command '['/usr/bin/env', 'TERM=vt100', '/usr/local/bin/ninja', '-v', 'check-lldb']' returned non-zero exit status 1. Command: ['/usr/bin/env', 'TERM=vt100', '/usr/local/bin/ninja', '-v', 'check-lldb'] [Pipeline] } [Pipeline] // timeout [Pipeline] } [Pipeline] // stage [Pipeline] stage [Pipeline] { (Trigger Downstream Jobs) Stage "Trigger Downstream Jobs" skipped due to earlier failure(s) [Pipeline] } [Pipeline] // stage [Pipeline] stage [Pipeline] { (Declarative: Post Actions) [Pipeline] scanForIssues [Clang (LLVM based)] Sleeping for 5 seconds due to JENKINS-32191... [Clang (LLVM based)] Parsing console log (workspace: '/Users/buildslave/jenkins/workspace/lldb-cmake') [Clang (LLVM based)] Successfully parsed console log [Clang (LLVM based)] -> found 0 issues (skipped 0 duplicates) [Clang (LLVM based)] Skipping post processing [Clang (LLVM based)] No filter has been set, publishing all 0 issues [Pipeline] junit Recording test results [Pipeline] emailext

Hide Details

Begin Pre-Send Script... Sending email to: mschifer@apple.com Ahmed Bougacha <abougacha@apple.com> Azhar Mohammed <azhar@apple.com>
[Pipeline] } [Pipeline] // stage [Pipeline] } [Pipeline] // withEnv [Pipeline] } [Pipeline] // node [Pipeline] End of Pipeline ERROR: script returned exit code 1 Finished: FAILURE