FailedConsole Output

Skipping 349 KB.. Full Log
/ScriptInterpreterLuaTests/LuaTest.RunValid (930 of 2049)
UNSUPPORTED: lldb-api :: tools/lldb-vscode/completions/TestVSCode_completions.py (931 of 2049)
PASS: lldb-unit :: Utility/./UtilityTests/DataExtractorTest.PeekData (932 of 2049)
PASS: lldb-api :: lang/c/enum_types/TestEnumTypes.py (933 of 2049)
UNSUPPORTED: lldb-api :: functionalities/darwin_log/format/TestDarwinLogMessageFormat.py (934 of 2049)
PASS: lldb-api :: functionalities/thread/concurrent_events/TestConcurrentTwoWatchpointsOneBreakpoint.py (935 of 2049)
PASS: lldb-api :: python_api/name_lookup/TestNameLookup.py (936 of 2049)
PASS: lldb-api :: functionalities/thread/concurrent_events/TestConcurrentTwoBreakpointThreads.py (937 of 2049)
PASS: lldb-shell :: ObjectFile/ELF/section-addresses.yaml (938 of 2049)
PASS: lldb-unit :: Host/./HostTests/Host.WaitStatusFormat (939 of 2049)
PASS: lldb-unit :: Expression/./ExpressionTests/ClangExpressionDeclMapTest.TestPersistentDeclLookup (940 of 2049)
PASS: lldb-api :: functionalities/breakpoint/breakpoint_names/TestBreakpointNames.py (941 of 2049)
PASS: lldb-unit :: Expression/./ExpressionTests/ClangHostTest.MacOSX (942 of 2049)
PASS: lldb-api :: lang/cpp/limit-debug-info/TestWithLimitDebugInfo.py (943 of 2049)
PASS: lldb-unit :: Process/minidump/./LLDBMinidumpTests/MinidumpParserTest.GetArchitectureWindows (944 of 2049)
PASS: lldb-unit :: Host/./HostTests/MainLoopTest.UnmonitoredSignal (945 of 2049)
PASS: lldb-api :: lang/cpp/lambdas/TestLambdas.py (946 of 2049)
PASS: lldb-api :: commands/watchpoints/watchpoint_set_command/TestWatchLocationWithWatchSet.py (947 of 2049)
PASS: lldb-api :: functionalities/thread/concurrent_events/TestConcurrentSignalNWatchNBreak.py (948 of 2049)
UNSUPPORTED: lldb-api :: python_api/event/TestEvents.py (949 of 2049)
PASS: lldb-unit :: Utility/./UtilityTests/ArgsTest.ReplaceArgumentAtIndexShort (950 of 2049)
PASS: lldb-unit :: Utility/./UtilityTests/RecordReplayTest.InstrumentedBarPtr (951 of 2049)
PASS: lldb-shell :: Minidump/memory-region.yaml (952 of 2049)
PASS: lldb-shell :: SymbolFile/DWARF/debug-types-line-tables.s (953 of 2049)
PASS: lldb-api :: commands/expression/test/TestExprs.py (954 of 2049)
PASS: lldb-unit :: UnwindAssembly/x86/./UnwindAssemblyx86Tests/Testx86AssemblyInspectionEngine.TestPushEBX (955 of 2049)
PASS: lldb-api :: macosx/find-app-in-bundle/TestFindAppInBundle.py (956 of 2049)
PASS: lldb-unit :: Language/Highlighting/./HighlighterTests/HighlighterTest.ClangEmptyInput (957 of 2049)
PASS: lldb-unit :: Utility/./UtilityTests/RangeTest.Equal (958 of 2049)
PASS: lldb-api :: commands/command/invalid-args/TestInvalidArgsCommand.py (959 of 2049)
PASS: lldb-api :: lang/objc/ivar-IMP/TestObjCiVarIMP.py (960 of 2049)
PASS: lldb-shell :: Quit/TestQuitExitCode0.test (961 of 2049)
PASS: lldb-shell :: SymbolFile/NativePDB/function-types-calling-conv.cpp (962 of 2049)
PASS: lldb-unit :: UnwindAssembly/ARM64/./Arm64InstEmulationTests/TestArm64InstEmulation.TestSimpleDarwinFunction (963 of 2049)
PASS: lldb-unit :: Utility/./UtilityTests/BinaryStreamTest.PutULEB128MaxValue (964 of 2049)
PASS: lldb-shell :: SymbolFile/DWARF/find-variable-file.cpp (965 of 2049)
PASS: lldb-unit :: Symbol/./SymbolTests/TestTypeSystemClang.TestNotDeletingUserCopyCstrDueToMoveCStr (966 of 2049)
PASS: lldb-api :: functionalities/gdb_remote_client/TestJLink6Armv7RegisterDefinition.py (967 of 2049)
PASS: lldb-shell :: ObjectFile/PECOFF/symbol.yaml (968 of 2049)
UNSUPPORTED: lldb-shell :: Register/x86-ymm-write.test (969 of 2049)
PASS: lldb-api :: functionalities/data-formatter/data-formatter-named-summaries/TestDataFormatterNamedSummaries.py (970 of 2049)
PASS: lldb-unit :: Utility/./UtilityTests/PassiveReplayTest.InstrumentedFoo (971 of 2049)
PASS: lldb-api :: tools/lldb-vscode/coreFile/TestVSCode_coreFile.py (972 of 2049)
PASS: lldb-unit :: Utility/./UtilityTests/SubsystemRAIITest.NormalSubsystem (973 of 2049)
PASS: lldb-shell :: Minidump/dump-all.test (974 of 2049)
PASS: lldb-unit :: Utility/./UtilityTests/StreamTest.PutCStringWithStringRef (975 of 2049)
PASS: lldb-shell :: SymbolFile/DWARF/DW_AT_low_pc-addrx.s (976 of 2049)
PASS: lldb-unit :: Host/./HostTests/ConnectionFileDescriptorTest.TCPGetURIv4 (977 of 2049)
PASS: lldb-api :: functionalities/asan/TestMemoryHistory.py (978 of 2049)
PASS: lldb-unit :: Language/Highlighting/./HighlighterTests/HighlighterTest.ClangCommas (979 of 2049)
PASS: lldb-unit :: ObjectFile/PECOFF/./ObjectFilePECOFFTests/PECallFrameInfoTest.Chained_eh (980 of 2049)
PASS: lldb-unit :: Host/./HostTests/NativeProcessProtocolTest.ReadCStringFromMemory_CrossPageBoundary (981 of 2049)
PASS: lldb-api :: python_api/objc_type/TestObjCType.py (982 of 2049)
PASS: lldb-api :: commands/expression/call-throws/TestCallThatThrows.py (983 of 2049)
PASS: lldb-unit :: Language/Highlighting/./HighlighterTests/HighlighterTest.ClangCursorOutOfBounds (984 of 2049)
PASS: lldb-api :: commands/expression/expr-in-syscall/TestExpressionInSyscall.py (985 of 2049)
PASS: lldb-api :: tools/lldb-vscode/launch/TestVSCode_launch.py (986 of 2049)
PASS: lldb-api :: lang/c/step_over_no_deadlock/TestStepOverDoesntBlock.py (987 of 2049)
PASS: lldb-api :: iohandler/resize/TestIOHandlerResize.py (988 of 2049)
UNSUPPORTED: lldb-shell :: SymbolFile/target-symbols-add-unwind.test (989 of 2049)
PASS: lldb-shell :: ObjectFile/ELF/section-permissions.yaml (990 of 2049)
PASS: lldb-unit :: Utility/./UtilityTests/StringExtractorTest.DecodeHexU8_Exact (991 of 2049)
PASS: lldb-unit :: Core/./LLDBCoreTests/SourceFileCache.FindSourceFileNotFound (992 of 2049)
PASS: lldb-api :: commands/watchpoints/watchpoint_commands/command/TestWatchpointCommandLLDB.py (993 of 2049)
PASS: lldb-api :: tools/lldb-server/register-reading/TestGdbRemoteGPacket.py (994 of 2049)
PASS: lldb-api :: functionalities/plugins/command_plugin/TestPluginCommands.py (995 of 2049)
PASS: lldb-api :: functionalities/thread/num_threads/TestNumThreads.py (996 of 2049)
PASS: lldb-unit :: Utility/./UtilityTests/DataExtractorTest.GetSLEB128_bit63 (997 of 2049)
PASS: lldb-api :: functionalities/type_lookup/TestTypeLookup.py (998 of 2049)
PASS: lldb-unit :: UnwindAssembly/x86/./UnwindAssemblyx86Tests/Testx86AssemblyInspectionEngine.TestPopESI (999 of 2049)
PASS: lldb-unit :: Utility/./UtilityTests/ConstStringTest.CompareStringRef (1000 of 2049)
PASS: lldb-unit :: debugserver/./debugserverTests/RNBSocket.LoopBackConnectIPv6 (1001 of 2049)
PASS: lldb-shell :: SymbolFile/DWARF/parallel-indexing-stress.s (1002 of 2049)
PASS: lldb-unit :: SymbolFile/NativePDB/./SymbolFileNativePDBTests/PDBFPOProgramToDWARFExpressionTests.UnresolvedRegisterAssignmentReference (1003 of 2049)
PASS: lldb-api :: functionalities/tail_call_frames/cross_object/TestCrossObjectTailCalls.py (1004 of 2049)
PASS: lldb-api :: commands/expression/import_base_class_when_class_has_derived_member/TestImportBaseClassWhenClassHasDerivedMember.py (1005 of 2049)
PASS: lldb-shell :: SymbolFile/DWARF/dwarf5-partial-index.cpp (1006 of 2049)
PASS: lldb-unit :: Symbol/./SymbolTests/PostfixExpression.ParseOneExpression (1007 of 2049)
PASS: lldb-api :: functionalities/breakpoint/breakpoint_ids/TestBreakpointIDs.py (1008 of 2049)
PASS: lldb-unit :: Utility/./UtilityTests/StringListTest.Assignment (1009 of 2049)
PASS: lldb-unit :: Utility/./UtilityTests/StreamTeeTest.AppendStream (1010 of 2049)
PASS: lldb-api :: functionalities/breakpoint/breakpoint_set_restart/TestBreakpointSetRestart.py (1011 of 2049)
PASS: lldb-unit :: Language/Highlighting/./HighlighterTests/HighlighterTest.ClangCursorPosInOtherToken (1012 of 2049)
PASS: lldb-unit :: ScriptInterpreter/Python/./ScriptInterpreterPythonTests/PythonDataObjectsTest.TestDictionaryResolutionWithDot (1013 of 2049)
PASS: lldb-unit :: Utility/./UtilityTests/Flags.GetBitSize (1014 of 2049)
PASS: lldb-unit :: Utility/./UtilityTests/VASprintfTest.BufferResize (1015 of 2049)
PASS: lldb-api :: commands/expression/import-std-module/forward_list-dbg-info-content/TestDbgInfoContentForwardListFromStdModule.py (1016 of 2049)
PASS: lldb-shell :: SymbolFile/NativePDB/s_constant.cpp (1017 of 2049)
PASS: lldb-api :: functionalities/tail_call_frames/unambiguous_sequence/TestUnambiguousTailCalls.py (1018 of 2049)
UNSUPPORTED: lldb-shell :: Breakpoint/case-insensitive.test (1019 of 2049)
PASS: lldb-unit :: Utility/./UtilityTests/StreamTeeTest.DefaultConstructor (1020 of 2049)
PASS: lldb-unit :: Utility/./UtilityTests/BinaryStreamTest.PutSLEB128Zero (1021 of 2049)
PASS: lldb-unit :: Symbol/./SymbolTests/DWARFCallFrameInfoTest.Basic_eh (1022 of 2049)
PASS: lldb-shell :: SymbolFile/DWARF/DW_AT_loclists_base.s (1023 of 2049)
PASS: lldb-unit :: Utility/./UtilityTests/UUIDTest.SetFromStringRef (1024 of 2049)
PASS: lldb-unit :: debugserver/./debugserverTests/JSON.Parse (1025 of 2049)
PASS: lldb-unit :: Utility/./UtilityTests/Flags.AllClear (1026 of 2049)
PASS: lldb-unit :: Utility/./UtilityTests/StringListTest.GetMaxStringLengthEmpty (1027 of 2049)
PASS: lldb-api :: lang/cpp/dynamic-value/TestCppValueCast.py (1028 of 2049)
PASS: lldb-shell :: SymbolFile/DWARF/find-method.cpp (1029 of 2049)
PASS: lldb-shell :: Driver/TestRepl.test (1030 of 2049)
PASS: lldb-unit :: Utility/./UtilityTests/ArgsTest.AppendArguments (1031 of 2049)
PASS: lldb-shell :: SymbolFile/DWARF/dir-separator-no-comp-dir.s (1032 of 2049)
PASS: lldb-unit :: Language/Highlighting/./HighlighterTests/HighlighterTest.Colons (1033 of 2049)
PASS: lldb-unit :: Utility/./UtilityTests/ScalarTest.RightShiftOperator (1034 of 2049)
PASS: lldb-api :: functionalities/thread/concurrent_events/TestConcurrentCrashWithWatchpoint.py (1035 of 2049)
PASS: lldb-shell :: SymbolFile/DWARF/module-ownership.mm (1036 of 2049)
PASS: lldb-unit :: SymbolFile/DWARF/./SymbolFileDWARFTests/SymbolFileDWARFTests.ParseArangesNonzeroSegmentSize (1037 of 2049)
PASS: lldb-unit :: Target/./TargetTests/ExecutionContextTest.GetByteOrderTarget (1038 of 2049)
PASS: lldb-unit :: Target/./TargetTests/MemoryRegionInfoTest.Formatv (1039 of 2049)
PASS: lldb-api :: commands/reproducer/invalid-args/TestInvalidArgsReproducer.py (1040 of 2049)
PASS: lldb-unit :: Core/./LLDBCoreTests/RichManglingContextTest.IPDRealloc (1041 of 2049)
PASS: lldb-api :: lang/c/anonymous/TestAnonymous.py (1042 of 2049)
PASS: lldb-unit :: Utility/./UtilityTests/DataExtractorTest.GetCStrEmpty (1043 of 2049)
PASS: lldb-unit :: ObjectFile/ELF/./ObjectFileELFTests/ObjectFileELFTest.SectionsResolveConsistently (1044 of 2049)
PASS: lldb-unit :: Utility/./UtilityTests/LogTest.Unregister (1045 of 2049)
PASS: lldb-unit :: UnwindAssembly/PPC64/./PPC64InstEmulationTests/TestPPC64InstEmulation.TestSimpleFunction (1046 of 2049)
PASS: lldb-unit :: Utility/./UtilityTests/StringLexerTest.GetUnlexed (1047 of 2049)
PASS: lldb-unit :: Utility/./UtilityTests/StreamTest.PutCharWhitespace (1048 of 2049)
PASS: lldb-unit :: Utility/./UtilityTests/StringListTest.JoinMultiCharSeparator (1049 of 2049)
PASS: lldb-api :: python_api/sbplatform/TestSBPlatform.py (1050 of 2049)
PASS: lldb-api :: api/log/TestAPILog.py (1051 of 2049)
PASS: lldb-api :: terminal/TestEditline.py (1052 of 2049)
PASS: lldb-api :: commands/disassemble/basic/TestDisassembleBreakpoint.py (1053 of 2049)
PASS: lldb-shell :: SymbolFile/DWARF/split-dwarf-inlining.cpp (1054 of 2049)
PASS: lldb-api :: commands/expression/call-function/TestCallStdStringFunction.py (1055 of 2049)
PASS: lldb-api :: lang/cpp/unsigned_types/TestUnsignedTypes.py (1056 of 2049)
PASS: lldb-unit :: Utility/./UtilityTests/BinaryStreamTest.PutSLEB128FiveBytes (1057 of 2049)
PASS: lldb-unit :: Process/gdb-remote/./ProcessGdbRemoteTests/GDBRemoteCommunicationClientTest.SendStopTracePacket (1058 of 2049)
PASS: lldb-api :: commands/platform/process/list/TestProcessList.py (1059 of 2049)
PASS: lldb-shell :: SymbolFile/NativePDB/ast-types.cpp (1060 of 2049)
PASS: lldb-shell :: SymbolFile/symbol-binding.test (1061 of 2049)
UNSUPPORTED: lldb-shell :: SymbolFile/PDB/variables-locations.test (1062 of 2049)
PASS: lldb-unit :: Utility/./UtilityTests/Predicate.WaitForValueEqualTo (1063 of 2049)
PASS: lldb-api :: functionalities/data-formatter/synthupdate/TestSyntheticFilterRecompute.py (1064 of 2049)
PASS: lldb-shell :: Driver/LocalLLDBInit.test (1065 of 2049)
PASS: lldb-unit :: SymbolFile/NativePDB/./SymbolFileNativePDBTests/PDBFPOProgramToDWARFExpressionTests.InvalidAssignmentSingle (1066 of 2049)
PASS: lldb-unit :: Host/./HostTests/SocketTest.DomainListenConnectAccept (1067 of 2049)
PASS: lldb-unit :: Utility/./UtilityTests/ScalarTest.Equality (1068 of 2049)
PASS: lldb-unit :: Utility/./UtilityTests/RangeDataVector.FindEntryThatContains (1069 of 2049)
PASS: lldb-unit :: UnwindAssembly/x86/./UnwindAssemblyx86Tests/Testx86AssemblyInspectionEngine.TestLEAVE (1070 of 2049)
PASS: lldb-unit :: Utility/./UtilityTests/DataExtractorTest.GetBitfield (1071 of 2049)
PASS: lldb-api :: functionalities/data-formatter/data-formatter-objc/TestDataFormatterObjCExpr.py (1072 of 2049)
PASS: lldb-api :: functionalities/data-formatter/data-formatter-stl/libcxx/tuple/TestDataFormatterLibcxxTuple.py (1073 of 2049)
PASS: lldb-unit :: Utility/./UtilityTests/StringLexerTest.NextIfList (1074 of 2049)
PASS: lldb-api :: commands/frame/diagnose/array/TestArray.py (1075 of 2049)
PASS: lldb-unit :: Utility/./UtilityTests/StringExtractorTest.GetHexU8_Underflow_NoEof (1076 of 2049)
PASS: lldb-shell :: Breakpoint/debug_rnglist_basic.test (1077 of 2049)
PASS: lldb-api :: macosx/function-starts/TestFunctionStarts.py (1078 of 2049)
PASS: lldb-api :: sanity/TestSettingSkipping.py (1079 of 2049)
PASS: lldb-api :: commands/process/attach/TestProcessAttach.py (1080 of 2049)
PASS: lldb-unit :: Utility/./UtilityTests/ArgsTest.GetArgumentArrayRef (1081 of 2049)
PASS: lldb-unit :: Utility/./UtilityTests/StringListTest.AppendStringCString (1082 of 2049)
PASS: lldb-unit :: Utility/./UtilityTests/FileSpecTest.Match (1083 of 2049)
UNSUPPORTED: lldb-api :: functionalities/data-formatter/data-formatter-stl/libstdcpp/vbool/TestDataFormatterStdVBool.py (1084 of 2049)
UNSUPPORTED: lldb-shell :: Register/aarch64-fp-read.test (1085 of 2049)
PASS: lldb-unit :: Language/CPlusPlus/./LanguageCPlusPlusTests/CPlusPlusLanguage.MethodNameParsing (1086 of 2049)
PASS: lldb-api :: tools/lldb-server/TestGdbRemoteProcessInfo.py (1087 of 2049)
PASS: lldb-unit :: Utility/./UtilityTests/FileSpecTest.EqualDotsWindows (1088 of 2049)
PASS: lldb-unit :: Disassembler/./DisassemblerTests/TestArmv7Disassembly.TestCortexFPDisass (1089 of 2049)
PASS: lldb-api :: functionalities/data-formatter/typedef_array/TestTypedefArray.py (1090 of 2049)
PASS: lldb-shell :: ObjectFile/MachO/lc_version_min.yaml (1091 of 2049)
PASS: lldb-unit :: Host/./HostTests/FileSystemTest.Exists (1092 of 2049)
PASS: lldb-unit :: Expression/./ExpressionTests/DWARFExpression.DW_OP_piece (1093 of 2049)
PASS: lldb-shell :: Reproducer/Functionalities/TestDataFormatter.test (1094 of 2049)
PASS: lldb-shell :: Driver/TestCommands.test (1095 of 2049)
PASS: lldb-unit :: ScriptInterpreter/Python/./ScriptInterpreterPythonTests/PythonDataObjectsTest.TestGlobalNameResolutionWithDot (1096 of 2049)
PASS: lldb-unit :: Utility/./UtilityTests/BinaryStreamTest.PutULEB128EightBytes (1097 of 2049)
PASS: lldb-unit :: Utility/./UtilityTests/GeneratorTest.Create (1098 of 2049)
PASS: lldb-unit :: Utility/./UtilityTests/OptionsWithRawTest.QuotedSuffix (1099 of 2049)
PASS: lldb-unit :: Interpreter/./InterpreterTests/OptionArgParserTest.toScriptLanguage (1100 of 2049)
PASS: lldb-unit :: ScriptInterpreter/Python/./ScriptInterpreterPythonTests/PythonDataObjectsTest.TestPythonIntegerToStructuredInteger (1101 of 2049)
PASS: lldb-api :: functionalities/data-formatter/data-formatter-stl/libcxx/unique_ptr/TestDataFormatterLibcxxUniquePtr.py (1102 of 2049)
PASS: lldb-unit :: SymbolFile/DWARF/./SymbolFileDWARFTests/SymbolFileDWARFTests.TestAbilitiesForDWARF (1103 of 2049)
PASS: lldb-shell :: SymbolFile/DWARF/dwp-debug-types.s (1104 of 2049)
PASS: lldb-shell :: SymbolFile/DWARF/childless-compile-unit.s (1105 of 2049)
PASS: lldb-unit :: Core/./LLDBCoreTests/MangledTest.EmptyForInvalidName (1106 of 2049)
PASS: lldb-unit :: Expression/./ExpressionTests/DiagnosticManagerTest.PutStringSeverities (1107 of 2049)
PASS: lldb-unit :: Symbol/./SymbolTests/TestTypeSystemClang.TestConvertAccessTypeToAccessSpecifier (1108 of 2049)
UNSUPPORTED: lldb-shell :: SymbolFile/PDB/enums-layout.test (1109 of 2049)
PASS: lldb-api :: functionalities/data-formatter/data-formatter-stl/libcxx/bitset/TestDataFormatterLibcxxBitset.py (1110 of 2049)
PASS: lldb-api :: functionalities/set-data/TestSetData.py (1111 of 2049)
PASS: lldb-unit :: Utility/./UtilityTests/UriParserTest.MinimalPort (1112 of 2049)
PASS: lldb-unit :: ScriptInterpreter/Python/./ScriptInterpreterPythonTests/PythonDataObjectsTest.TestResetting (1113 of 2049)
PASS: lldb-unit :: Utility/./UtilityTests/OptionsWithRawTest.EmptySuffix (1114 of 2049)
PASS: lldb-api :: python_api/sbtype_typeclass/TestSBTypeTypeClass.py (1115 of 2049)
PASS: lldb-api :: lang/cpp/function_refs/TestFunctionRefs.py (1116 of 2049)
PASS: lldb-api :: commands/watchpoints/watchpoint_disable/TestWatchpointDisable.py (1117 of 2049)
PASS: lldb-unit :: Utility/./UtilityTests/StreamTeeTest.SetStreamAtIndexOverwrite (1118 of 2049)
UNSUPPORTED: lldb-api :: functionalities/darwin_log/source/debug/TestDarwinLogSourceDebug.py (1119 of 2049)
PASS: lldb-api :: functionalities/backticks/TestBackticksWithoutATarget.py (1120 of 2049)
PASS: lldb-api :: lang/c/unicode/TestUnicodeSymbols.py (1121 of 2049)
PASS: lldb-unit :: Language/Highlighting/./HighlighterTests/HighlighterTest.ClangCursorPosEndOfLine (1122 of 2049)
PASS: lldb-api :: functionalities/data-formatter/data-formatter-objc/TestDataFormatterObjCNSDate.py (1123 of 2049)
PASS: lldb-unit :: Utility/./UtilityTests/StreamTest.PutStringAsRawHex8 (1124 of 2049)
PASS: lldb-unit :: Utility/./UtilityTests/BinaryStreamTest.PutSLEB128TwoBytes (1125 of 2049)
PASS: lldb-api :: python_api/lldbutil/TestSwigVersion.py (1126 of 2049)
PASS: lldb-unit :: Utility/./UtilityTests/BinaryStreamTest.PutSLEB128EightBytes (1127 of 2049)
UNSUPPORTED: lldb-api :: functionalities/process_save_core/TestProcessSaveCore.py (1128 of 2049)
PASS: lldb-unit :: Utility/./UtilityTests/UriParserTest.BracketedHostname (1129 of 2049)
PASS: lldb-unit :: Process/gdb-remote/./ProcessGdbRemoteTests/GDBRemoteCommunicationClientTest.SendGetTraceConfigPacket (1130 of 2049)
PASS: lldb-unit :: Utility/./UtilityTests/RangeTest.NotEqual (1131 of 2049)
PASS: lldb-unit :: Host/./HostTests/NativeProcessProtocolTest.ReadCStringFromMemory_MaxSize (1132 of 2049)
PASS: lldb-unit :: ObjectFile/Breakpad/./ObjectFileBreakpadTests/PublicRecord.parse (1133 of 2049)
PASS: lldb-shell :: ObjectFile/ELF/PT_LOAD-overlap-section.yaml (1134 of 2049)
PASS: lldb-shell :: Minidump/Windows/find-module.test (1135 of 2049)
PASS: lldb-unit :: Process/minidump/./LLDBMinidumpTests/MinidumpParserTest.GetThreadContext_x86_64 (1136 of 2049)
PASS: lldb-shell :: Settings/TestFrameFormatNoColor.test (1137 of 2049)
PASS: lldb-unit :: Utility/./UtilityTests/AnsiTerminal.Twice (1138 of 2049)
PASS: lldb-api :: lang/c/conflicting-symbol/TestConflictingSymbol.py (1139 of 2049)
PASS: lldb-unit :: Host/./HostTests/HostInfoTest.GetHostname (1140 of 2049)
PASS: lldb-unit :: Signals/./SignalsTests/UnixSignalsTest.Iteration (1141 of 2049)
PASS: lldb-shell :: BuildScript/toolchain-clang.test (1142 of 2049)
PASS: lldb-api :: lang/objc/objc-static-method/TestObjCStaticMethod.py (1143 of 2049)
PASS: lldb-unit :: UnwindAssembly/x86/./UnwindAssemblyx86Tests/Testx86AssemblyInspectionEngine.TestAddESP (1144 of 2049)
PASS: lldb-api :: python_api/hello_world/TestHelloWorld.py (1145 of 2049)
PASS: lldb-api :: sample_test/TestSampleTest.py (1146 of 2049)
PASS: lldb-unit :: ObjectFile/ELF/./ObjectFileELFTests/ObjectFileELFTest.GetSymtab_NoSymEntryPointArmThumbAddressClass (1147 of 2049)
PASS: lldb-unit :: Utility/./UtilityTests/XcodeSDKTest.MergeTest (1148 of 2049)
PASS: lldb-api :: commands/platform/basic/TestPlatformCommand.py (1149 of 2049)
PASS: lldb-unit :: Utility/./UtilityTests/StreamTest.PutCString (1150 of 2049)
UNSUPPORTED: lldb-api :: lang/cpp/printf/TestPrintf.py (1151 of 2049)
PASS: lldb-unit :: Signals/./SignalsTests/UnixSignalsTest.GetFilteredSignals (1152 of 2049)
PASS: lldb-unit :: Utility/./UtilityTests/ArgsTest.EscapeLLDBCommandArgument (1153 of 2049)
UNSUPPORTED: lldb-shell :: SymbolFile/NativePDB/typedefs.cpp (1154 of 2049)
PASS: lldb-api :: lang/cpp/template-function/TestTemplateFunctions.py (1155 of 2049)
PASS: lldb-api :: functionalities/paths/TestPaths.py (1156 of 2049)
PASS: lldb-shell :: Minidump/memory-region-from-module.yaml (1157 of 2049)
PASS: lldb-api :: commands/frame/diagnose/bad-reference/TestBadReference.py (1158 of 2049)
PASS: lldb-api :: commands/command/history/TestCommandHistory.py (1159 of 2049)
PASS: lldb-unit :: Utility/./UtilityTests/LogChannelEnabledTest.LogThread (1160 of 2049)
PASS: lldb-api :: functionalities/dead-strip/TestDeadStrip.py (1161 of 2049)
PASS: lldb-unit :: ScriptInterpreter/Python/./ScriptInterpreterPythonTests/PythonDataObjectsTest.TestPythonCallableCheck (1162 of 2049)
UNSUPPORTED: lldb-api :: functionalities/data-formatter/data-formatter-stl/libstdcpp/smart_ptr/TestDataFormatterStdSmartPtr.py (1163 of 2049)
PASS: lldb-shell :: SymbolFile/DWARF/find-basic-type.cpp (1164 of 2049)
PASS: lldb-shell :: Unwind/thread-step-out-ret-addr-check.test (1165 of 2049)
PASS: lldb-unit :: Utility/./UtilityTests/BinaryStreamTest.PutULEB128One (1166 of 2049)
PASS: lldb-shell :: SymbolFile/dissassemble-entry-point.s (1167 of 2049)
PASS: lldb-unit :: Utility/./UtilityTests/StringListTest.InsertStringAtIndexOutOfBounds (1168 of 2049)
PASS: lldb-api :: macosx/DBGSourcePathRemapping/TestDSYMSourcePathRemapping.py (1169 of 2049)
PASS: lldb-unit :: Expression/./ExpressionTests/CppModuleConfigurationTest.Sysroot (1170 of 2049)
PASS: lldb-unit :: Host/./HostTests/SocketAddressTest.GetAddressInfo (1171 of 2049)
PASS: lldb-unit :: DataFormatter/./LLDBFormatterTests/StringPrinterTests.CxxASCII (1172 of 2049)
PASS: lldb-unit :: UnwindAssembly/ARM64/./Arm64InstEmulationTests/TestArm64InstEmulation.TestRegisterDoubleSpills (1173 of 2049)
PASS: lldb-unit :: Utility/./UtilityTests/StringExtractorTest.GetNameColonValueNoColon (1174 of 2049)
PASS: lldb-unit :: UnwindAssembly/x86/./UnwindAssemblyx86Tests/Testx86AssemblyInspectionEngine.TestCALLNextInsn (1175 of 2049)
PASS: lldb-api :: functionalities/data-formatter/hexcaps/TestDataFormatterHexCaps.py (1176 of 2049)
PASS: lldb-shell :: SymbolFile/DWARF/debug-line-basic.s (1177 of 2049)
PASS: lldb-shell :: SymbolFile/DWARF/debug_ranges-missing-section.s (1178 of 2049)
PASS: lldb-shell :: Register/x86-64-read.test (1179 of 2049)
PASS: lldb-shell :: ObjectFile/ELF/many-sections.s (1180 of 2049)
PASS: lldb-unit :: Utility/./UtilityTests/StreamTest.PutChar (1181 of 2049)
PASS: lldb-unit :: DataFormatter/./LLDBFormatterTests/StringPrinterTests.SwiftUTF8 (1182 of 2049)
PASS: lldb-unit :: Utility/./UtilityTests/StringExtractorTest.GetHexU8_Extra (1183 of 2049)
PASS: lldb-unit :: Utility/./UtilityTests/ProcessInstanceInfo.DumpTable (1184 of 2049)
PASS: lldb-api :: commands/expression/import-std-module/weak_ptr-dbg-info-content/TestDbgInfoContentWeakPtrFromStdModule.py (1185 of 2049)
PASS: lldb-unit :: Utility/./UtilityTests/AnsiTerminal.WhiteSpace (1186 of 2049)
PASS: lldb-unit :: Utility/./UtilityTests/BinaryStreamTest.PutULEB128TwoBytes (1187 of 2049)
PASS: lldb-unit :: Utility/./UtilityTests/StringExtractorTest.GetNameColonValueContainsColon (1188 of 2049)
PASS: lldb-api :: lang/objc/foundation/TestObjCMethods.py (1189 of 2049)
PASS: lldb-shell :: Commands/command-regex-delete.test (1190 of 2049)
PASS: lldb-unit :: Utility/./UtilityTests/RecordReplayTest.InstrumentedFooSameThis (1191 of 2049)
PASS: lldb-unit :: ScriptInterpreter/Python/./ScriptInterpreterPythonTests/PythonDataObjectsTest.TestPythonTupleToStructuredList (1192 of 2049)
PASS: lldb-api :: functionalities/inferior-crashing/recursive-inferior/TestRecursiveInferiorStep.py (1193 of 2049)
PASS: lldb-api :: python_api/debugger/TestDebuggerAPI.py (1194 of 2049)
PASS: lldb-unit :: Utility/./UtilityTests/StringListTest.GetSize (1195 of 2049)
PASS: lldb-shell :: SymbolFile/NativePDB/function-types-classes.cpp (1196 of 2049)
PASS: lldb-unit :: Process/gdb-remote/./ProcessGdbRemoteTests/GDBRemoteCommunicationClientTest.SendSignalsToIgnore (1197 of 2049)
UNSUPPORTED: lldb-shell :: Register/x86-ymm-read.test (1198 of 2049)
PASS: lldb-unit :: Utility/./UtilityTests/SerializationRountripTest.SerializeDeserializeCStringArrayNullptrElem (1199 of 2049)
PASS: lldb-api :: types/TestIntegerType.py (1200 of 2049)
UNSUPPORTED: lldb-api :: api/multiple-debuggers/TestMultipleDebuggers.py (1201 of 2049)
PASS: lldb-api :: commands/expression/rdar42038760/TestScalarURem.py (1202 of 2049)
PASS: lldb-shell :: SymbolFile/NativePDB/function-types-builtins.cpp (1203 of 2049)
PASS: lldb-api :: lang/cpp/class_types/TestClassTypes.py (1204 of 2049)
PASS: lldb-api :: lang/c/function_types/TestFunctionTypes.py (1205 of 2049)
PASS: lldb-unit :: UnwindAssembly/x86/./UnwindAssemblyx86Tests/Testx86AssemblyInspectionEngine.TestPopR15 (1206 of 2049)
PASS: lldb-api :: functionalities/data-formatter/data-formatter-python-synth/TestDataFormatterPythonSynth.py (1207 of 2049)
PASS: lldb-api :: functionalities/data-formatter/data-formatter-globals/TestDataFormatterGlobals.py (1208 of 2049)
PASS: lldb-unit :: UnwindAssembly/x86/./UnwindAssemblyx86Tests/Testx86AssemblyInspectionEngine.TestDisassemblyMidFunctionEpilogues (1209 of 2049)
PASS: lldb-shell :: ObjectFile/Breakpad/sections.test (1210 of 2049)
PASS: lldb-api :: commands/expression/two-files/TestObjCTypeQueryFromOtherCompileUnit.py (1211 of 2049)
PASS: lldb-api :: functionalities/unwind/noreturn/TestNoreturnUnwind.py (1212 of 2049)
PASS: lldb-unit :: Symbol/./SymbolTests/Type.GetTypeScopeAndBasename (1213 of 2049)
PASS: lldb-unit :: Core/./LLDBCoreTests/UniqueCStringMap.NoDefaultConstructor (1214 of 2049)
PASS: lldb-unit :: Utility/./UtilityTests/PassiveReplayTest.InstrumentedBar (1215 of 2049)
PASS: lldb-api :: macosx/duplicate-archive-members/TestDuplicateMembers.py (1216 of 2049)
PASS: lldb-api :: lang/objc/modules-hash-mismatch/TestClangModulesHashMismatch.py (1217 of 2049)
PASS: lldb-unit :: SymbolFile/DWARF/./SymbolFileDWARFTests/SymbolFileDWARFTests.TestAbbrevInvalidNULLTag (1218 of 2049)
PASS: lldb-api :: commands/process/attach-resume/TestAttachResume.py (1219 of 2049)
PASS: lldb-shell :: ScriptInterpreter/Lua/persistent_state.test (1220 of 2049)
PASS: lldb-unit :: Utility/./UtilityTests/StringListTest.ForRangeEmpty (1221 of 2049)
PASS: lldb-api :: functionalities/data-formatter/varscript_formatting/TestDataFormatterVarScriptFormatting.py (1222 of 2049)
PASS: lldb-unit :: Utility/./UtilityTests/BinaryStreamTest.PutULEB128ThreeBytes (1223 of 2049)
PASS: lldb-api :: macosx/save_crashlog/TestSaveCrashlog.py (1224 of 2049)
PASS: lldb-api :: functionalities/multiword-commands/TestMultiWordCommands.py (1225 of 2049)
PASS: lldb-api :: functionalities/thread/concurrent_events/TestConcurrentDelayedCrashWithBreakpointSignal.py (1226 of 2049)
PASS: lldb-api :: tools/lldb-server/TestGdbRemote_vCont.py (1227 of 2049)
PASS: lldb-unit :: Symbol/./SymbolTests/TestClangASTImporter.MetadataPropagationAfterCopying (1228 of 2049)
PASS: lldb-unit :: Utility/./UtilityTests/VMRange.Reset (1229 of 2049)
PASS: lldb-shell :: ObjectFile/Breakpad/sections-trailing-func.test (1230 of 2049)
PASS: lldb-unit :: Utility/./UtilityTests/BinaryStreamTest.PutULEB128OneByte (1231 of 2049)
PASS: lldb-api :: functionalities/data-formatter/ostypeformatting/TestFormattersOsType.py (1232 of 2049)
PASS: lldb-unit :: Utility/./UtilityTests/Flags.Test (1233 of 2049)
PASS: lldb-api :: functionalities/thread/exit_during_break/TestExitDuringBreak.py (1234 of 2049)
PASS: lldb-unit :: Symbol/./SymbolTests/TestTypeSystemClang.AddMethodToObjCObjectType (1235 of 2049)
PASS: lldb-unit :: Utility/./UtilityTests/LogChannelEnabledTest.LogGetLogThread (1236 of 2049)
PASS: lldb-api :: lang/cpp/class_static/TestStaticVariables.py (1237 of 2049)
PASS: lldb-unit :: Utility/./UtilityTests/UriParserTest.BracketedHostnameWithColon (1238 of 2049)
PASS: lldb-shell :: SymbolFile/DWARF/DW_TAG_variable-DW_AT_const_value.s (1239 of 2049)
PASS: lldb-unit :: SymbolFile/NativePDB/./SymbolFileNativePDBTests/PDBFPOProgramToDWARFExpressionTests.MultipleDependentAssignments (1240 of 2049)
PASS: lldb-api :: lang/objc/rdar-11355592/TestRdar11355592.py (1241 of 2049)
PASS: lldb-unit :: Host/./HostTests/MainLoopTest.Signal (1242 of 2049)
PASS: lldb-api :: functionalities/signal/TestSendSignal.py (1243 of 2049)
PASS: lldb-unit :: Utility/./UtilityTests/ConstStringTest.UpdateMangledCounterpart (1244 of 2049)
PASS: lldb-unit :: Utility/./UtilityTests/StreamTeeTest.CopyConstructor (1245 of 2049)
PASS: lldb-unit :: Utility/./UtilityTests/NameMatchesTest.EndsWith (1246 of 2049)
UNSUPPORTED: lldb-api :: benchmarks/frame_variable/TestFrameVariableResponse.py (1247 of 2049)
PASS: lldb-api :: functionalities/data-formatter/data-formatter-objc/TestDataFormatterObjCNSContainer.py (1248 of 2049)
PASS: lldb-api :: commands/target/dump-symtab-demangle/TestDumpSymtabDemangle.py (1249 of 2049)
PASS: lldb-shell :: Reproducer/Functionalities/TestStepping.test (1250 of 2049)
PASS: lldb-unit :: Utility/./UtilityTests/UriParserTest.SchemeHostSeparator4 (1251 of 2049)
PASS: lldb-api :: lang/cpp/std-function-step-into-callable/TestStdFunctionStepIntoCallable.py (1252 of 2049)
PASS: lldb-unit :: Symbol/./SymbolTests/TestTypeSystemClang.TestIsClangType (1253 of 2049)
PASS: lldb-unit :: Expression/./ExpressionTests/DiagnosticManagerTest.FixedExpression (1254 of 2049)
PASS: lldb-api :: lang/cpp/member-and-local-vars-with-same-name/TestMembersAndLocalsWithSameName.py (1255 of 2049)
PASS: lldb-api :: commands/expression/char/TestExprsChar.py (1256 of 2049)
PASS: lldb-unit :: Utility/./UtilityTests/EnvironmentTest.EnvpConversion (1257 of 2049)
PASS: lldb-api :: lang/cpp/static_methods/TestCPPStaticMethods.py (1258 of 2049)
PASS: lldb-unit :: UnwindAssembly/x86/./UnwindAssemblyx86Tests/Testx86AssemblyInspectionEngine.TestSpillRegToStackViaMOVi386 (1259 of 2049)
PASS: lldb-unit :: tools/lldb-server/tests/./LLDBServerTests/TestBase.LaunchModePreservesEnvironment (1260 of 2049)
PASS: lldb-unit :: Symbol/./SymbolTests/TestTypeSystemClang.TestRemoveFastQualifiers (1261 of 2049)
PASS: lldb-api :: lang/objc/ptr_refs/TestPtrRefsObjC.py (1262 of 2049)
PASS: lldb-shell :: ObjectFile/ELF/base-address.yaml (1263 of 2049)
PASS: lldb-api :: lang/objc/objc-new-syntax/TestObjCNewSyntaxArray.py (1264 of 2049)
UNSUPPORTED: lldb-shell :: SymbolFile/NativePDB/local-variables.cpp (1265 of 2049)
PASS: lldb-unit :: Target/./TargetTests/MCBasedABI.MapRegisterName (1266 of 2049)
UNSUPPORTED: lldb-shell :: Register/x86-64-zmm-write.test (1267 of 2049)
PASS: lldb-unit :: Utility/./UtilityTests/XcodeSDKTest.FindXcodeContentsDirectoryInPath (1268 of 2049)
PASS: lldb-unit :: Process/minidump/./LLDBMinidumpTests/MinidumpParserTest.GetArchitecture (1269 of 2049)
PASS: lldb-unit :: Utility/./UtilityTests/StreamTeeTest.GetStreamAtIndexOutOfBounds (1270 of 2049)
UNSUPPORTED: lldb-api :: lang/objc/rdar-12408181/TestRdar12408181.py (1271 of 2049)
PASS: lldb-api :: commands/expression/import_builtin_fileid/TestImportBuiltinFileID.py (1272 of 2049)
PASS: lldb-api :: commands/expression/diagnostics/TestExprDiagnostics.py (1273 of 2049)
PASS: lldb-unit :: Utility/./UtilityTests/StringExtractorTest.GetHexU8_Underflow2_NoEof (1274 of 2049)
PASS: lldb-api :: functionalities/inferior-crashing/TestInferiorCrashing.py (1275 of 2049)
PASS: lldb-api :: functionalities/gdb_remote_client/TestGDBRemoteLoad.py (1276 of 2049)
PASS: lldb-shell :: Breakpoint/jitbp_elf.test (1277 of 2049)
PASS: lldb-unit :: Host/./HostTests/MainLoopTest.TerminatesImmediately (1278 of 2049)
UNSUPPORTED: lldb-api :: commands/watchpoints/multi_watchpoint_slots/TestWatchpointMultipleSlots.py (1279 of 2049)
PASS: lldb-unit :: Expression/./ExpressionTests/ClangHostTest.ComputeClangResourceDirectory (1280 of 2049)
PASS: lldb-api :: commands/target/stop-hooks/TestStopHooks.py (1281 of 2049)
PASS: lldb-api :: commands/expression/calculator_mode/TestCalculatorMode.py (1282 of 2049)
PASS: lldb-api :: functionalities/thread/concurrent_events/TestConcurrentDelayedCrashWithBreakpointWatchpoint.py (1283 of 2049)
PASS: lldb-shell :: Minidump/Windows/arm-fp-unwind.test (1284 of 2049)
PASS: lldb-api :: commands/process/attach/attach_denied/TestAttachDenied.py (1285 of 2049)
PASS: lldb-unit :: Utility/./UtilityTests/DataExtractorTest.GetCStr (1286 of 2049)
UNSUPPORTED: lldb-api :: commands/target/auto-install-main-executable/TestAutoInstallMainExecutable.py (1287 of 2049)
PASS: lldb-unit :: Utility/./UtilityTests/StringListTest.GetMaxStringLengthMixed (1288 of 2049)
PASS: lldb-unit :: UnwindAssembly/ARM64/./Arm64InstEmulationTests/TestArm64InstEmulation.TestFramelessThreeEpilogueFunction (1289 of 2049)
PASS: lldb-unit :: Utility/./UtilityTests/ProcessInstanceInfo.DumpTable_invalidUID (1290 of 2049)
PASS: lldb-api :: lang/objc/print-obj/TestPrintObj.py (1291 of 2049)
UNSUPPORTED: lldb-shell :: SymbolFile/PDB/class-layout.test (1292 of 2049)
PASS: lldb-api :: tools/lldb-vscode/breakpoint/TestVSCode_setFunctionBreakpoints.py (1293 of 2049)
PASS: lldb-unit :: Utility/./UtilityTests/VMRange.ContainsAddr (1294 of 2049)
PASS: lldb-unit :: Utility/./UtilityTests/ConstStringTest.FromMidOfBufferStringRef (1295 of 2049)
PASS: lldb-api :: functionalities/gdb_remote_client/TestNoWatchpointSupportInfo.py (1296 of 2049)
PASS: lldb-shell :: Driver/TestSingleQuote.test (1297 of 2049)
PASS: lldb-unit :: Utility/./UtilityTests/SerializationRountripTest.SerializeDeserializeCString (1298 of 2049)
PASS: lldb-api :: functionalities/gdb_remote_client/TestArmRegisterDefinition.py (1299 of 2049)
PASS: lldb-unit :: Utility/./UtilityTests/RangeDataVector.FindEntryIndexesThatContain (1300 of 2049)
PASS: lldb-shell :: ScriptInterpreter/Python/crashlog.test (1301 of 2049)
PASS: lldb-shell :: SymbolFile/Breakpad/line-table-mixed-path-styles.test (1302 of 2049)
PASS: lldb-api :: commands/settings/TestSettings.py (1303 of 2049)
PASS: lldb-api :: functionalities/breakpoint/scripted_bkpt/TestScriptedResolver.py (1304 of 2049)
PASS: lldb-api :: lang/cpp/bitfields/TestCppBitfields.py (1305 of 2049)
PASS: lldb-unit :: Utility/./UtilityTests/FileSpecTest.PrependPathComponent (1306 of 2049)
PASS: lldb-unit :: SymbolFile/NativePDB/./SymbolFileNativePDBTests/PDBFPOProgramToDWARFExpressionTests.InvalidOpBinary (1307 of 2049)
PASS: lldb-unit :: UnwindAssembly/x86/./UnwindAssemblyx86Tests/Testx86AssemblyInspectionEngine.TestPushEDX (1308 of 2049)
UNSUPPORTED: lldb-api :: functionalities/data-formatter/data-formatter-stl/libstdcpp/unique_ptr/TestDataFormatterStdUniquePtr.py (1309 of 2049)
PASS: lldb-unit :: Process/gdb-remote/./ProcessGdbRemoteTests/GDBRemoteCommunicationClientTest.WriteRegisterNoSuffix (1310 of 2049)
PASS: lldb-unit :: Host/./HostTests/NativeProcessProtocolTest.ReadMemoryWithoutTrap (1311 of 2049)
PASS: lldb-api :: functionalities/tail_call_frames/disambiguate_tail_call_seq/TestDisambiguateTailCallSeq.py (1312 of 2049)
PASS: lldb-unit :: Symbol/./SymbolTests/TestTypeSystemClang.TestDisplayName (1313 of 2049)
PASS: lldb-shell :: ObjectFile/wasm/basic.yaml (1314 of 2049)
PASS: lldb-api :: functionalities/data-formatter/data-formatter-stl/libcxx/vector/TestDataFormatterLibcxxVector.py (1315 of 2049)
PASS: lldb-api :: tools/lldb-vscode/variables/TestVSCode_variables.py (1316 of 2049)
PASS: lldb-shell :: Settings/TestDisableColor.test (1317 of 2049)
PASS: lldb-unit :: Process/minidump/./LLDBMinidumpTests/MinidumpParserTest.GetThreadContext_x86_32_wow64 (1318 of 2049)
PASS: lldb-unit :: Utility/./UtilityTests/StringListTest.AppendList (1319 of 2049)
PASS: lldb-api :: functionalities/breakpoint/cpp/TestCPPBreakpointLocations.py (1320 of 2049)
PASS: lldb-unit :: Utility/./UtilityTests/FileSpecTest.IsRelative (1321 of 2049)
PASS: lldb-shell :: SymbolFile/DWARF/debug-types-missing-signature.test (1322 of 2049)
PASS: lldb-api :: types/TestFloatTypes.py (1323 of 2049)
PASS: lldb-api :: functionalities/thread/concurrent_events/TestConcurrentSignalDelayBreak.py (1324 of 2049)
PASS: lldb-unit :: Language/Highlighting/./HighlighterTests/HighlighterTest.ClangPreserveNewLine (1325 of 2049)
PASS: lldb-unit :: Utility/./UtilityTests/StringLexerTest.PutBack (1326 of 2049)
PASS: lldb-unit :: Utility/./UtilityTests/StreamTest.Indent (1327 of 2049)
PASS: lldb-shell :: Reproducer/TestProcessList.test (1328 of 2049)
PASS: lldb-unit :: Process/minidump/./LLDBMinidumpTests/MinidumpParserTest.GetExceptionStream (1329 of 2049)
PASS: lldb-api :: lang/cpp/thread_local/TestThreadLocal.py (1330 of 2049)
PASS: lldb-unit :: Host/./HostTests/NativeProcessProtocolTest.SetBreakpointFailWrite (1331 of 2049)
PASS: lldb-api :: lang/cpp/nsimport/TestCppNsImport.py (1332 of 2049)
PASS: lldb-api :: macosx/order/TestOrderFile.py (1333 of 2049)
PASS: lldb-unit :: Utility/./UtilityTests/ArgsTest.DoubleQuotedItem (1334 of 2049)
PASS: lldb-unit :: Utility/./UtilityTests/ArgsTest.TestSingleArgWithQuotedSpace (1335 of 2049)
PASS: lldb-api :: functionalities/tail_call_frames/cross_dso/TestCrossDSOTailCalls.py (1336 of 2049)
PASS: lldb-unit :: Utility/./UtilityTests/OptionsWithRawTest.SingleWordSuffix (1337 of 2049)
PASS: lldb-unit :: Language/Highlighting/./HighlighterTests/HighlighterTest.ClangScalarLiterals (1338 of 2049)
PASS: lldb-unit :: Process/gdb-remote/./ProcessGdbRemoteTests/GDBRemoteClientBaseTest.SendContinueAndAsyncPacket (1339 of 2049)
PASS: lldb-api :: sample_test/TestSampleInlineTest.py (1340 of 2049)
PASS: lldb-unit :: Utility/./UtilityTests/StreamTest.PutSLEB128 (1341 of 2049)
PASS: lldb-api :: types/TestFloatTypesExpr.py (1342 of 2049)
PASS: lldb-unit :: Utility/./UtilityTests/StringExtractorTest.GetHexBytes_FullString (1343 of 2049)
PASS: lldb-unit :: Language/Highlighting/./HighlighterTests/HighlighterTest.ClangCursorPosBeforeOtherToken (1344 of 2049)
PASS: lldb-unit :: Utility/./UtilityTests/StringExtractorTest.GetHexU8_Underflow2 (1345 of 2049)
PASS: lldb-api :: macosx/version_zero/TestGetVersionZeroVersion.py (1346 of 2049)
PASS: lldb-shell :: SymbolFile/DWARF/debug_rnglists.s (1347 of 2049)
PASS: lldb-api :: functionalities/data-formatter/data-formatter-objc/TestDataFormatterObjCNSBundle.py (1348 of 2049)
PASS: lldb-shell :: Quit/TestQuitExitCodeHex0.test (1349 of 2049)
PASS: lldb-unit :: ScriptInterpreter/Python/./ScriptInterpreterPythonTests/PythonDataObjectsTest.TestPythonString (1350 of 2049)
PASS: lldb-api :: commands/expression/import-std-module/vector-of-vectors/TestVectorOfVectorsFromStdModule.py (1351 of 2049)
PASS: lldb-api :: lang/objc/objc-foundation-dictionary-empty/TestNSDictionary0.py (1352 of 2049)
PASS: lldb-unit :: Utility/./UtilityTests/StreamTeeTest.SetStreamAtIndexOutOfBounds (1353 of 2049)
UNSUPPORTED: lldb-api :: commands/expression/macros/TestMacros.py (1354 of 2049)
PASS: lldb-unit :: Symbol/./SymbolTests/DWARFCallFrameInfoTest.Basic_dwarf4 (1355 of 2049)
PASS: lldb-api :: commands/expression/call-function/TestCallUserDefinedFunction.py (1356 of 2049)
PASS: lldb-unit :: Platform/./LLDBPlatformTests/PlatformDarwinTest.TestParseVersionBuildDir (1357 of 2049)
PASS: lldb-api :: functionalities/thread/exit_during_step/TestExitDuringStep.py (1358 of 2049)
PASS: lldb-api :: commands/expression/import-std-module/list/TestListFromStdModule.py (1359 of 2049)
PASS: lldb-shell :: SymbolFile/Breakpad/unwind-via-stack-win.test (1360 of 2049)
PASS: lldb-shell :: Commands/command-source.test (1361 of 2049)
PASS: lldb-shell :: Driver/TestTarget.test (1362 of 2049)
PASS: lldb-unit :: Process/gdb-remote/./ProcessGdbRemoteTests/GDBRemoteCommunicationClientTest.SaveRestoreRegistersNoSuffix (1363 of 2049)
PASS: lldb-unit :: Utility/./UtilityTests/ProcessInstanceInfo.Yaml (1364 of 2049)
PASS: lldb-api :: macosx/queues/TestQueues.py (1365 of 2049)
PASS: lldb-api :: commands/command/script/import/rdar-12586188/TestRdar12586188.py (1366 of 2049)
PASS: lldb-unit :: Host/./HostTests/FileSystemTest.MakeAbsolute (1367 of 2049)
PASS: lldb-unit :: Target/./TargetTests/ExecutionContextTest.GetByteOrderProcess (1368 of 2049)
PASS: lldb-api :: lang/cpp/template/TestTemplateArgs.py (1369 of 2049)
UNSUPPORTED: lldb-api :: tools/lldb-server/libraries-svr4/TestGdbRemoteLibrariesSvr4Support.py (1370 of 2049)
PASS: lldb-api :: lang/objc/foundation/TestObjCMethodsNSError.py (1371 of 2049)
PASS: lldb-api :: functionalities/data-formatter/data-formatter-proper-plurals/TestFormattersOneIsSingular.py (1372 of 2049)
PASS: lldb-shell :: Breakpoint/debug_addrx.test (1373 of 2049)
PASS: lldb-api :: lang/cpp/multiple-inheritance/TestCppMultipleInheritance.py (1374 of 2049)
PASS: lldb-api :: commands/watchpoints/watchpoint_commands/TestWatchpointCommands.py (1375 of 2049)
PASS: lldb-unit :: ScriptInterpreter/Python/./ScriptInterpreterPythonTests/PythonDataObjectsTest.TestPythonStringToStructuredString (1376 of 2049)
PASS: lldb-unit :: UnwindAssembly/ARM64/./Arm64InstEmulationTests/TestArm64InstEmulation.TestCFARegisterTrackedAcrossJumps (1377 of 2049)
PASS: lldb-api :: functionalities/data-formatter/array_typedef/TestArrayTypedef.py (1378 of 2049)
PASS: lldb-unit :: Utility/./UtilityTests/StringListTest.SplitIntoLines (1379 of 2049)
PASS: lldb-unit :: Utility/./UtilityTests/CompletionRequest.TryCompleteCurrentArgBad (1380 of 2049)
PASS: lldb-unit :: Breakpoint/./LLDBBreakpointTests/BreakpointIDTest.StringIsBreakpointName (1381 of 2049)
PASS: lldb-unit :: SymbolFile/NativePDB/./SymbolFileNativePDBTests/PDBFPOProgramToDWARFExpressionTests.MultipleIndependentAssignments (1382 of 2049)
PASS: lldb-unit :: Utility/./UtilityTests/BinaryStreamTest.PutULEB128Zero (1383 of 2049)
PASS: lldb-unit :: Utility/./UtilityTests/RangeTest.DoesIntersect (1384 of 2049)
PASS: lldb-api :: functionalities/completion/TestCompletion.py (1385 of 2049)
PASS: lldb-shell :: Settings/TestSettingsWrite.test (1386 of 2049)
PASS: lldb-unit :: Utility/./UtilityTests/StringExtractorTest.DecodeHexU8_InvalidHex (1387 of 2049)
PASS: lldb-unit :: Utility/./UtilityTests/SerializationRountripTest.SerializeDeserializePodPointers (1388 of 2049)
PASS: lldb-unit :: Utility/./UtilityTests/StreamTest.AddressPrefixAndSuffix (1389 of 2049)
UNSUPPORTED: lldb-api :: commands/expression/call-restarts/TestCallThatRestarts.py (1390 of 2049)
PASS: lldb-api :: lang/objc/objc-property/TestObjCProperty.py (1391 of 2049)
PASS: lldb-api :: commands/target/create-no-such-arch/TestNoSuchArch.py (1392 of 2049)
PASS: lldb-api :: functionalities/data-formatter/data-formatter-objc/cmtime/TestDataFormatterCMTime.py (1393 of 2049)
PASS: lldb-api :: types/TestShortType.py (1394 of 2049)
PASS: lldb-api :: functionalities/thread/thread_exit/TestThreadExit.py (1395 of 2049)
PASS: lldb-unit :: Utility/./UtilityTests/FileSpecTest.EqualSeparator (1396 of 2049)
PASS: lldb-unit :: debugserver/./debugserverTests/RNBSocket.AnyListen (1397 of 2049)
PASS: lldb-api :: commands/watchpoints/watchpoint_size/TestWatchpointSizes.py (1398 of 2049)
PASS: lldb-api :: macosx/add-dsym/TestAddDsymMidExecutionCommand.py (1399 of 2049)
PASS: lldb-unit :: Utility/./UtilityTests/FileSpecTest.AppendPathComponent (1400 of 2049)
PASS: lldb-api :: api/command-return-object/TestSBCommandReturnObject.py (1401 of 2049)
PASS: lldb-unit :: UnwindAssembly/x86/./UnwindAssemblyx86Tests/Testx86AssemblyInspectionEngine.TestPopR13 (1402 of 2049)
PASS: lldb-api :: functionalities/pre_run_dylibs/TestPreRunDylibs.py (1403 of 2049)
PASS: lldb-api :: lang/cpp/virtual-functions/TestCppVirtualFunctions.py (1404 of 2049)
PASS: lldb-unit :: UnwindAssembly/x86/./UnwindAssemblyx86Tests/Testx86AssemblyInspectionEngine.TestPushR14 (1405 of 2049)
PASS: lldb-api :: python_api/exprpath_synthetic/TestExprPathSynthetic.py (1406 of 2049)
PASS: lldb-api :: lang/objc/radar-9691614/TestObjCMethodReturningBOOL.py (1407 of 2049)
PASS: lldb-shell :: Reproducer/Functionalities/TestExpressionEvaluation.test (1408 of 2049)
PASS: lldb-api :: lang/objc/foundation/TestFoundationDisassembly.py (1409 of 2049)
PASS: lldb-shell :: Driver/TestProcessAttach.test (1410 of 2049)
PASS: lldb-unit :: Host/./HostTests/SocketTest.TCPGetConnectURI (1411 of 2049)
PASS: lldb-unit :: Utility/./UtilityTests/StringListTest.PopBack (1412 of 2049)
PASS: lldb-unit :: Utility/./UtilityTests/StatusTest.Formatv (1413 of 2049)
UNSUPPORTED: lldb-api :: benchmarks/turnaround/TestCompileRunToBreakpointTurnaround.py (1414 of 2049)
PASS: lldb-shell :: SymbolFile/DWARF/debug_rnglists-dwo.s (1415 of 2049)
PASS: lldb-unit :: UnwindAssembly/x86/./UnwindAssemblyx86Tests/Testx86AssemblyInspectionEngine.TestPushECX (1416 of 2049)
PASS: lldb-api :: macosx/find-dsym/bundle-with-dot-in-filename/TestBundleWithDotInFilename.py (1417 of 2049)
XFAIL: lldb-shell :: Register/x86-64-ymm-write.test (1418 of 2049)
PASS: lldb-unit :: SymbolFile/NativePDB/./SymbolFileNativePDBTests/PDBFPOProgramToDWARFExpressionTests.UnresolvedDependentCyclicRegisterAssignmentReference (1419 of 2049)
PASS: lldb-unit :: Process/gdb-remote/./ProcessGdbRemoteTests/GDBRemoteClientBaseTest.SendPacketAndReceiveResponseWithOutputSupport (1420 of 2049)
PASS: lldb-api :: python_api/watchpoint/condition/TestWatchpointConditionAPI.py (1421 of 2049)
PASS: lldb-api :: commands/expression/call-function/TestCallStopAndContinue.py (1422 of 2049)
PASS: lldb-shell :: SymbolFile/DWARF/clang-ast-from-dwarf-unamed-and-anon-structs.cpp (1423 of 2049)
FAIL: lldb-api :: functionalities/archives/TestBSDArchives.py (1424 of 2049)
******************** TEST 'lldb-api :: functionalities/archives/TestBSDArchives.py' FAILED ********************
Script:
--
/usr/local/Frameworks/Python.framework/Versions/3.7/bin/python3.7 /Users/buildslave/jenkins/workspace/lldb-cmake/llvm-project/lldb/test/API/dotest.py --arch x86_64 -s /Users/buildslave/jenkins/workspace/lldb-cmake/lldb-build/lldb-test-traces -S nm -u CXXFLAGS -u CFLAGS --codesign-identity lldb_codesign --server /Users/buildslave/jenkins/workspace/lldb-cmake/lldb-build/./bin/debugserver --arch x86_64 --build-dir /Users/buildslave/jenkins/workspace/lldb-cmake/lldb-build/lldb-test-build.noindex -s=/Users/buildslave/jenkins/workspace/lldb-cmake/test/logs -t --env TERM=vt100 --env LLVM_LIBS_DIR=/Users/buildslave/jenkins/workspace/lldb-cmake/lldb-build/./lib --build-dir /Users/buildslave/jenkins/workspace/lldb-cmake/lldb-build/lldb-test-build.noindex --lldb-module-cache-dir /Users/buildslave/jenkins/workspace/lldb-cmake/lldb-build/lldb-test-build.noindex/module-cache-lldb/lldb-api --clang-module-cache-dir /Users/buildslave/jenkins/workspace/lldb-cmake/lldb-build/lldb-test-build.noindex/module-cache-clang/lldb-api --executable /Users/buildslave/jenkins/workspace/lldb-cmake/lldb-build/./bin/lldb --compiler /Users/buildslave/jenkins/workspace/lldb-cmake/lldb-build/./bin/clang --dsymutil /Users/buildslave/jenkins/workspace/lldb-cmake/lldb-build/./bin/dsymutil --filecheck /Users/buildslave/jenkins/workspace/lldb-cmake/lldb-build/./bin/FileCheck --lldb-libs-dir /Users/buildslave/jenkins/workspace/lldb-cmake/lldb-build/./lib /Users/buildslave/jenkins/workspace/lldb-cmake/llvm-project/lldb/test/API/functionalities/archives -p TestBSDArchives.py
--
Exit Code: 1

Hide Details

Command Output (stdout): -- lldb version 11.0.99 clang revision 059ba74bb6f6166ca7c1783ef81dd37a5209b758 llvm revision 059ba74bb6f6166ca7c1783ef81dd37a5209b758 LLDB library dir: /Users/buildslave/jenkins/workspace/lldb-cmake/lldb-build/bin LLDB import library dir: /Users/buildslave/jenkins/workspace/lldb-cmake/lldb-build/./lib libstdcxx tests will not be run because: Don't know how to build with libstdcxx on macosx Skipping following debug info categories: ['dwo']

Hide Details

-- Command Output (stderr): --

Hide Details

Session logs for test failures/errors/unexpected successes will go into directory '/Users/buildslave/jenkins/workspace/lldb-cmake/test/logs' Change dir to: /Users/buildslave/jenkins/workspace/lldb-cmake/llvm-project/lldb/test/API/functionalities/archives runCmd: settings clear -all output:

Hide Details

runCmd: settings set symbols.enable-external-lookup false output:

Hide Details

runCmd: settings set target.auto-apply-fixits false output:

Hide Details

runCmd: settings set plugin.process.gdb-remote.packet-timeout 60 output:

Hide Details

runCmd: settings set symbols.clang-modules-cache-path "/Users/buildslave/jenkins/workspace/lldb-cmake/lldb-build/lldb-test-build.noindex/module-cache-lldb/lldb-api" output:

Hide Details

runCmd: settings set use-color false output:

Hide Details

runCmd: setting set target.prefer-dynamic-value no-dynamic-values output:

Hide Details

runCmd: file /Users/buildslave/jenkins/workspace/lldb-cmake/lldb-build/lldb-test-build.noindex/functionalities/archives/TestBSDArchives.test_dsym/a.out output: Current executable set to '/Users/buildslave/jenkins/workspace/lldb-cmake/lldb-build/lldb-test-build.noindex/functionalities/archives/TestBSDArchives.test_dsym/a.out' (x86_64).

Hide Details

Hide Details

runCmd: breakpoint set -f "a.c" -l 5 output: Breakpoint 1: where = a.out`a + 19 at a.c:5:12, address = 0x0000000100000f03

Hide Details

Hide Details

Expecting pattern: ^Breakpoint (?P<bpno>[0-9]+): (?P<num_locations>[0-9]+) locations\.$ Not matched

Hide Details

Expecting pattern: ^Breakpoint (?P<bpno>[0-9]+): (?P<num_locations>no) locations \(pending\)\. Not matched

Hide Details

Expecting pattern: ^Breakpoint (?P<bpno>[0-9]+): where = (?P<module>.*)`(?P<symbol>[+\-]{0,1}[^+]+)( \+ (?P<offset>[0-9]+)){0,1}( \[inlined\] (?P<inline_symbol>.*)){0,1} at (?P<file>[^:]+):(?P<line_no>[0-9]+)(?P<column>(:[0-9]+)?), address = (?P<address>0x[0-9a-fA-F]+)$ Matched

Hide Details

runCmd: run runCmd failed! error: shell expansion failed (reason: timed out waiting for shell command to complete). consider launching with 'process launch'.

Hide Details

Hide Details

Command 'run' failed!

Hide Details

FAIL: LLDB (/Users/buildslave/jenkins/workspace/lldb-cmake/lldb-build/bin/clang-11-x86_64) :: test_dsym (TestBSDArchives.BSDArchivesTestCase) runCmd: settings clear -all output:

Hide Details

runCmd: settings set symbols.enable-external-lookup false output:

Hide Details

runCmd: settings set target.auto-apply-fixits false output:

Hide Details

runCmd: settings set plugin.process.gdb-remote.packet-timeout 60 output:

Hide Details

runCmd: settings set symbols.clang-modules-cache-path "/Users/buildslave/jenkins/workspace/lldb-cmake/lldb-build/lldb-test-build.noindex/module-cache-lldb/lldb-api" output:

Hide Details

runCmd: settings set use-color false output:

Hide Details

runCmd: setting set target.prefer-dynamic-value no-dynamic-values output:

Hide Details

runCmd: file /Users/buildslave/jenkins/workspace/lldb-cmake/lldb-build/lldb-test-build.noindex/functionalities/archives/TestBSDArchives.test_dwarf/a.out output: Current executable set to '/Users/buildslave/jenkins/workspace/lldb-cmake/lldb-build/lldb-test-build.noindex/functionalities/archives/TestBSDArchives.test_dwarf/a.out' (x86_64).

Hide Details

Hide Details

runCmd: breakpoint set -f "a.c" -l 5 output: Breakpoint 1: where = a.out`a + 19 at a.c:5:12, address = 0x0000000100000f03

Hide Details

Hide Details

Expecting pattern: ^Breakpoint (?P<bpno>[0-9]+): (?P<num_locations>[0-9]+) locations\.$ Not matched

Hide Details

Expecting pattern: ^Breakpoint (?P<bpno>[0-9]+): (?P<num_locations>no) locations \(pending\)\. Not matched

Hide Details

Expecting pattern: ^Breakpoint (?P<bpno>[0-9]+): where = (?P<module>.*)`(?P<symbol>[+\-]{0,1}[^+]+)( \+ (?P<offset>[0-9]+)){0,1}( \[inlined\] (?P<inline_symbol>.*)){0,1} at (?P<file>[^:]+):(?P<line_no>[0-9]+)(?P<column>(:[0-9]+)?), address = (?P<address>0x[0-9a-fA-F]+)$ Matched

Hide Details

runCmd: run output: Process 1801 stopped * thread #1, queue = 'com.apple.main-thread', stop reason = breakpoint 1.1 frame #0: 0x0000000100000f03 a.out`a(arg=1) at a.c:5:12 2 3 int a(int arg) { 4 int result = arg + __a_global; -> 5 return result; // Set file and line breakpoint inside a(). ^ 6 } 7 8 int aa(int arg1) {

Hide Details

Process 1801 launched: '/Users/buildslave/jenkins/workspace/lldb-cmake/lldb-build/lldb-test-build.noindex/functionalities/archives/TestBSDArchives.test_dwarf/a.out' (x86_64)

Hide Details

Hide Details

runCmd: thread list output: Process 1801 stopped * thread #1: tid = 0x3896737, 0x0000000100000f03 a.out`a(arg=1) at a.c:5:12, queue = 'com.apple.main-thread', stop reason = breakpoint 1.1

Hide Details

Hide Details

Expecting sub string: stopped Matched

Hide Details

Expecting sub string: stop reason = breakpoint Matched

Hide Details

runCmd: frame variable output: (int) arg = 1 (int) result = 2

Hide Details

Hide Details

Expecting sub string: (int) arg = 1 Matched

Hide Details

runCmd: frame variable __a_global output: (int) __a_global = 1

Hide Details

Hide Details

Expecting sub string: (int) __a_global = 1 Matched

Hide Details

runCmd: breakpoint set -n "b" output: Breakpoint 2: where = a.out`b + 7 at b.c:4:18, address = 0x0000000100000f37

Hide Details

Hide Details

Expecting pattern: ^Breakpoint (?P<bpno>[0-9]+): (?P<num_locations>[0-9]+) locations\.$ Not matched

Hide Details

Expecting pattern: ^Breakpoint (?P<bpno>[0-9]+): (?P<num_locations>no) locations \(pending\)\. Not matched

Hide Details

Expecting pattern: ^Breakpoint (?P<bpno>[0-9]+): where = (?P<module>.*)`(?P<symbol>[+\-]{0,1}[^+]+)( \+ (?P<offset>[0-9]+)){0,1}( \[inlined\] (?P<inline_symbol>.*)){0,1} at (?P<file>[^:]+):(?P<line_no>[0-9]+)(?P<column>(:[0-9]+)?), address = (?P<address>0x[0-9a-fA-F]+)$ Matched

Hide Details

runCmd: continue output: Process 1801 resuming Process 1801 stopped * thread #1, queue = 'com.apple.main-thread', stop reason = breakpoint 2.1 frame #0: 0x0000000100000f37 a.out`b(arg=2) at b.c:4:18 1 static int __b_global = 2; 2 3 int b(int arg) { -> 4 int result = arg + __b_global; ^ 5 return result; 6 } 7

Hide Details

Hide Details

Hide Details

runCmd: thread list output: Process 1801 stopped * thread #1: tid = 0x3896737, 0x0000000100000f37 a.out`b(arg=2) at b.c:4:18, queue = 'com.apple.main-thread', stop reason = breakpoint 2.1

Hide Details

Hide Details

Expecting sub string: stopped Matched

Hide Details

Expecting sub string: stop reason = breakpoint Matched

Hide Details

runCmd: frame variable output: (int) arg = 2 (int) result = 992936132

Hide Details

Hide Details

Expecting sub string: (int) arg = 2 Matched

Hide Details

runCmd: frame variable __b_global output: (int) __b_global = 2

Hide Details

Hide Details

Expecting sub string: (int) __b_global = 2 Matched

Hide Details

<bound method SBProcess.Kill of <lldb.SBProcess; proxy of <Swig Object of type 'lldb::SBProcess *' at 0x106ec3bd0> >>: success

Hide Details

PASS: LLDB (/Users/buildslave/jenkins/workspace/lldb-cmake/lldb-build/bin/clang-11-x86_64) :: test_dwarf (TestBSDArchives.BSDArchivesTestCase) UNSUPPORTED: LLDB (/Users/buildslave/jenkins/workspace/lldb-cmake/lldb-build/bin/clang-11-x86_64) :: test_dwo (TestBSDArchives.BSDArchivesTestCase) (test case does not fall in any category of interest for this run) runCmd: settings clear -all output:

Hide Details

runCmd: settings set symbols.enable-external-lookup false output:

Hide Details

runCmd: settings set target.auto-apply-fixits false output:

Hide Details

runCmd: settings set plugin.process.gdb-remote.packet-timeout 60 output:

Hide Details

runCmd: settings set symbols.clang-modules-cache-path "/Users/buildslave/jenkins/workspace/lldb-cmake/lldb-build/lldb-test-build.noindex/module-cache-lldb/lldb-api" output:

Hide Details

runCmd: settings set use-color false output:

Hide Details

runCmd: setting set target.prefer-dynamic-value no-dynamic-values output:

Hide Details

runCmd: file /Users/buildslave/jenkins/workspace/lldb-cmake/lldb-build/lldb-test-build.noindex/functionalities/archives/TestBSDArchives.test_gmodules/a.out output: Current executable set to '/Users/buildslave/jenkins/workspace/lldb-cmake/lldb-build/lldb-test-build.noindex/functionalities/archives/TestBSDArchives.test_gmodules/a.out' (x86_64).

Hide Details

Hide Details

runCmd: breakpoint set -f "a.c" -l 5 output: Breakpoint 1: where = a.out`a + 19 at a.c:5:12, address = 0x0000000100000f03

Hide Details

Hide Details

Expecting pattern: ^Breakpoint (?P<bpno>[0-9]+): (?P<num_locations>[0-9]+) locations\.$ Not matched

Hide Details

Expecting pattern: ^Breakpoint (?P<bpno>[0-9]+): (?P<num_locations>no) locations \(pending\)\. Not matched

Hide Details

Expecting pattern: ^Breakpoint (?P<bpno>[0-9]+): where = (?P<module>.*)`(?P<symbol>[+\-]{0,1}[^+]+)( \+ (?P<offset>[0-9]+)){0,1}( \[inlined\] (?P<inline_symbol>.*)){0,1} at (?P<file>[^:]+):(?P<line_no>[0-9]+)(?P<column>(:[0-9]+)?), address = (?P<address>0x[0-9a-fA-F]+)$ Matched

Hide Details

runCmd: run output: Process 2504 stopped * thread #1, queue = 'com.apple.main-thread', stop reason = breakpoint 1.1 frame #0: 0x0000000100000f03 a.out`a(arg=1) at a.c:5:12 2 3 int a(int arg) { 4 int result = arg + __a_global; -> 5 return result; // Set file and line breakpoint inside a(). ^ 6 } 7 8 int aa(int arg1) {

Hide Details

Process 2504 launched: '/Users/buildslave/jenkins/workspace/lldb-cmake/lldb-build/lldb-test-build.noindex/functionalities/archives/TestBSDArchives.test_gmodules/a.out' (x86_64)

Hide Details

Hide Details

runCmd: thread list output: Process 2504 stopped * thread #1: tid = 0x3896d2c, 0x0000000100000f03 a.out`a(arg=1) at a.c:5:12, queue = 'com.apple.main-thread', stop reason = breakpoint 1.1

Hide Details

Hide Details

Expecting sub string: stopped Matched

Hide Details

Expecting sub string: stop reason = breakpoint Matched

Hide Details

runCmd: frame variable output: (int) arg = 1 (int) result = 2

Hide Details

Hide Details

Expecting sub string: (int) arg = 1 Matched

Hide Details

runCmd: frame variable __a_global output: (int) __a_global = 1

Hide Details

Hide Details

Expecting sub string: (int) __a_global = 1 Matched

Hide Details

runCmd: breakpoint set -n "b" output: Breakpoint 2: where = a.out`b + 7 at b.c:4:18, address = 0x0000000100000f37

Hide Details

Hide Details

Expecting pattern: ^Breakpoint (?P<bpno>[0-9]+): (?P<num_locations>[0-9]+) locations\.$ Not matched

Hide Details

Expecting pattern: ^Breakpoint (?P<bpno>[0-9]+): (?P<num_locations>no) locations \(pending\)\. Not matched

Hide Details

Expecting pattern: ^Breakpoint (?P<bpno>[0-9]+): where = (?P<module>.*)`(?P<symbol>[+\-]{0,1}[^+]+)( \+ (?P<offset>[0-9]+)){0,1}( \[inlined\] (?P<inline_symbol>.*)){0,1} at (?P<file>[^:]+):(?P<line_no>[0-9]+)(?P<column>(:[0-9]+)?), address = (?P<address>0x[0-9a-fA-F]+)$ Matched

Hide Details

runCmd: continue output: Process 2504 resuming Process 2504 stopped * thread #1, queue = 'com.apple.main-thread', stop reason = breakpoint 2.1 frame #0: 0x0000000100000f37 a.out`b(arg=2) at b.c:4:18 1 static int __b_global = 2; 2 3 int b(int arg) { -> 4 int result = arg + __b_global; ^ 5 return result; 6 } 7

Hide Details

Hide Details

Hide Details

runCmd: thread list output: Process 2504 stopped * thread #1: tid = 0x3896d2c, 0x0000000100000f37 a.out`b(arg=2) at b.c:4:18, queue = 'com.apple.main-thread', stop reason = breakpoint 2.1

Hide Details

Hide Details

Expecting sub string: stopped Matched

Hide Details

Expecting sub string: stop reason = breakpoint Matched

Hide Details

runCmd: frame variable output: (int) arg = 2 (int) result = 909574304

Hide Details

Hide Details

Expecting sub string: (int) arg = 2 Matched

Hide Details

runCmd: frame variable __b_global output: (int) __b_global = 2

Hide Details

Hide Details

Expecting sub string: (int) __b_global = 2 Matched

Hide Details

<bound method SBProcess.Kill of <lldb.SBProcess; proxy of <Swig Object of type 'lldb::SBProcess *' at 0x107026990> >>: success

Hide Details

PASS: LLDB (/Users/buildslave/jenkins/workspace/lldb-cmake/lldb-build/bin/clang-11-x86_64) :: test_gmodules (TestBSDArchives.BSDArchivesTestCase) Restore dir to: /Users/buildslave/jenkins/workspace/lldb-cmake/lldb-build/tools/lldb/test ====================================================================== FAIL: test_dsym (TestBSDArchives.BSDArchivesTestCase) Break inside a() and b() defined within libfoo.a. ---------------------------------------------------------------------- Traceback (most recent call last): File "/Users/buildslave/jenkins/workspace/lldb-cmake/llvm-project/lldb/packages/Python/lldbsuite/test/lldbtest.py", line 1767, in test_method return attrvalue(self) File "/Users/buildslave/jenkins/workspace/lldb-cmake/llvm-project/lldb/packages/Python/lldbsuite/test/decorators.py", line 110, in wrapper func(*args, **kwargs) File "/Users/buildslave/jenkins/workspace/lldb-cmake/llvm-project/lldb/test/API/functionalities/archives/TestBSDArchives.py", line 36, in test self.runCmd("run", RUN_SUCCEEDED) File "/Users/buildslave/jenkins/workspace/lldb-cmake/llvm-project/lldb/packages/Python/lldbsuite/test/lldbtest.py", line 2092, in runCmd msg if (msg) else CMD_MSG(cmd)) AssertionError: False is not True : Process is launched successfully Error output: error: shell expansion failed (reason: timed out waiting for shell command to complete). consider launching with 'process launch'.

Hide Details

Config=x86_64-/Users/buildslave/jenkins/workspace/lldb-cmake/lldb-build/bin/clang-11 ---------------------------------------------------------------------- Ran 4 tests in 14.708s

Hide Details

RESULT: FAILED (2 passes, 1 failures, 0 errors, 1 skipped, 0 expected failures, 0 unexpected successes)

Hide Details

--

Hide Details

******************** PASS: lldb-unit :: Utility/./UtilityTests/StringListTest.LongestCommonPrefixDuplicateElement (1425 of 2049) PASS: lldb-unit :: Expression/./ExpressionTests/DiagnosticManagerTest.HasFixits (1426 of 2049) PASS: lldb-unit :: Utility/./UtilityTests/StreamTest.PutRawBytesToMixedEndian (1427 of 2049) PASS: lldb-unit :: Language/Highlighting/./HighlighterTests/HighlighterTest.DefaultHighlighterWithCursor (1428 of 2049) PASS: lldb-shell :: Expr/TestTypeOfDeclTypeExpr.test (1429 of 2049) PASS: lldb-api :: functionalities/data-formatter/data-formatter-stl/libcxx/queue/TestDataFormatterLibcxxQueue.py (1430 of 2049) PASS: lldb-shell :: SymbolFile/DWARF/debug_aranges-empty-section.s (1431 of 2049) PASS: lldb-api :: functionalities/memory-region/TestMemoryRegion.py (1432 of 2049) PASS: lldb-unit :: Utility/./UtilityTests/NameMatchesTest.Contains (1433 of 2049) PASS: lldb-unit :: Process/gdb-remote/./ProcessGdbRemoteTests/GDBRemoteCommunicationServerTest.SendErrorResponse_ErrorList (1434 of 2049) PASS: lldb-api :: commands/expression/import-std-module/sysroot/TestStdModuleSysroot.py (1435 of 2049) PASS: lldb-unit :: Utility/./UtilityTests/AnsiTerminal.Empty (1436 of 2049) PASS: lldb-api :: lang/objc/modules-incomplete/TestIncompleteModules.py (1437 of 2049) PASS: lldb-unit :: Utility/./UtilityTests/StringExtractorTest.GetHexBytes_Partial (1438 of 2049) PASS: lldb-unit :: Utility/./UtilityTests/RangeTest.LessThan (1439 of 2049) PASS: lldb-api :: functionalities/wrong_commands/TestWrongCommands.py (1440 of 2049) UNSUPPORTED: lldb-api :: functionalities/darwin_log/filter/regex/activity/TestDarwinLogFilterRegexActivity.py (1441 of 2049) PASS: lldb-api :: lang/cpp/this/TestCPPThis.py (1442 of 2049) PASS: lldb-api :: commands/watchpoints/hello_watchpoint/TestMyFirstWatchpoint.py (1443 of 2049) PASS: lldb-unit :: Utility/./UtilityTests/StringListTest.JoinThree (1444 of 2049) PASS: lldb-shell :: SymbolFile/Breakpad/line-table-edgecases.test (1445 of 2049) PASS: lldb-unit :: Expression/./ExpressionTests/DiagnosticManagerTest.AppendMessageAttachToLastDiag (1446 of 2049) PASS: lldb-api :: macosx/universal/TestUniversal.py (1447 of 2049) PASS: lldb-unit :: Utility/./UtilityTests/TimerTest.CategoryTimes2 (1448 of 2049) PASS: lldb-api :: lang/objc/objc-runtime-ivars/TestRuntimeIvars.py (1449 of 2049) PASS: lldb-api :: lang/objcxx/cxx-bridged-po/TestObjCXXBridgedPO.py (1450 of 2049) PASS: lldb-unit :: Utility/./UtilityTests/StringListTest.InsertStringAtIndexMove (1451 of 2049) PASS: lldb-api :: lang/cpp/overloaded-functions/TestOverloadedFunctions.py (1452 of 2049) PASS: lldb-api :: lang/cpp/call-function/TestCallCPPFunction.py (1453 of 2049) PASS: lldb-unit :: Expression/./ExpressionTests/DWARFExpression.DW_OP_stack_value (1454 of 2049) PASS: lldb-unit :: UnwindAssembly/ARM64/./Arm64InstEmulationTests/TestArm64InstEmulation.TestRegisterSavedTwice (1455 of 2049) PASS: lldb-api :: functionalities/data-formatter/data-formatter-disabling/TestDataFormatterDisabling.py (1456 of 2049) PASS: lldb-shell :: Driver/TestHelp.test (1457 of 2049) PASS: lldb-unit :: Symbol/./SymbolTests/TestClangASTImporter.MetadataPropagation (1458 of 2049) PASS: lldb-unit :: Utility/./UtilityTests/ArgsTest.ReplaceArgumentAtIndexLonger (1459 of 2049) PASS: lldb-shell :: Unwind/eh-frame-dwarf-unwind.test (1460 of 2049) PASS: lldb-unit :: Utility/./UtilityTests/ScalarTest.CastOperations (1461 of 2049) UNSUPPORTED: lldb-api :: commands/register/register/intel_xtended_registers/mpx_bound_violation/TestBoundViolation.py (1462 of 2049) PASS: lldb-shell :: Minidump/breakpad-symbols.test (1463 of 2049) PASS: lldb-shell :: ObjectFile/PECOFF/sections-names.yaml (1464 of 2049) PASS: lldb-unit :: Utility/./UtilityTests/UriParserTest.Empty (1465 of 2049) PASS: lldb-unit :: Utility/./UtilityTests/StringListTest.CopyList (1466 of 2049) PASS: lldb-api :: functionalities/gdb_remote_client/TestqOffsets.py (1467 of 2049) PASS: lldb-api :: lang/cpp/namespace_definitions/TestNamespaceDefinitions.py (1468 of 2049) PASS: lldb-shell :: SymbolFile/DWARF/debug-types-basic.test (1469 of 2049) PASS: lldb-unit :: Utility/./UtilityTests/SubsystemRAIITest.SubsystemWithErrorSuccess (1470 of 2049) PASS: lldb-unit :: Utility/./UtilityTests/XcodeSDKTest.SDKSupportsModules (1471 of 2049) PASS: lldb-unit :: ObjectFile/PECOFF/./ObjectFilePECOFFTests/PECallFrameInfoTest.Basic_eh (1472 of 2049) PASS: lldb-shell :: SymbolFile/DWARF/anon_class_w_and_wo_export_symbols.ll (1473 of 2049) PASS: lldb-api :: commands/expression/call-function/TestCallBuiltinFunction.py (1474 of 2049) PASS: lldb-api :: functionalities/thread/concurrent_events/TestConcurrentManyWatchpoints.py (1475 of 2049) PASS: lldb-shell :: ObjectFile/PECOFF/invalid-export-table.yaml (1476 of 2049) PASS: lldb-unit :: Utility/./UtilityTests/ScalarTest.Division (1477 of 2049) UNSUPPORTED: lldb-shell :: SymbolFile/PDB/vbases.test (1478 of 2049) PASS: lldb-unit :: Utility/./UtilityTests/LogChannelTest.EnableOptions (1479 of 2049) PASS: lldb-unit :: Utility/./UtilityTests/UriParserTest.SchemeHostSeparator (1480 of 2049) PASS: lldb-unit :: ObjectFile/Breakpad/./ObjectFileBreakpadTests/StackCFIRecord.parse (1481 of 2049) PASS: lldb-api :: commands/expression/cast_int_to_anonymous_enum/TestCastIntToAnonymousEnum.py (1482 of 2049) PASS: lldb-unit :: ObjectFile/ELF/./ObjectFileELFTests/ObjectFileELFTest.GetModuleSpecifications_EarlySectionHeaders (1483 of 2049) PASS: lldb-shell :: SymbolFile/DWARF/debug_line-relative_path.s (1484 of 2049) PASS: lldb-api :: lang/cpp/frame-var-anon-unions/TestFrameVariableAnonymousUnions.py (1485 of 2049) PASS: lldb-unit :: Host/./HostTests/NativeProcessProtocolTest.SetBreakpointFailRead (1486 of 2049) PASS: lldb-unit :: Symbol/./SymbolTests/TestTypeSystemClang.TestGetEnumIntegerTypeInvalid (1487 of 2049) PASS: lldb-shell :: SymbolFile/DWARF/find-basic-namespace.cpp (1488 of 2049) PASS: lldb-api :: functionalities/data-formatter/data-formatter-enum-format/TestDataFormatterEnumFormat.py (1489 of 2049) PASS: lldb-api :: functionalities/inferior-crashing/TestInferiorCrashingStep.py (1490 of 2049) PASS: lldb-shell :: SymbolFile/DWARF/win-i386-line-table.s (1491 of 2049) UNSUPPORTED: lldb-api :: functionalities/darwin_log/source/info/TestDarwinLogSourceInfo.py (1492 of 2049) PASS: lldb-unit :: Utility/./UtilityTests/StringListTest.ShiftCString (1493 of 2049) PASS: lldb-api :: commands/expression/timeout/TestCallWithTimeout.py (1494 of 2049) PASS: lldb-unit :: Utility/./UtilityTests/ConstStringTest.format_provider (1495 of 2049) PASS: lldb-unit :: Target/./TargetTests/PathMappingListTest.RelativeTests (1496 of 2049) PASS: lldb-unit :: Utility/./UtilityTests/ScalarTest.Scalar_512 (1497 of 2049) PASS: lldb-api :: lang/objc/hidden-ivars/TestHiddenIvars.py (1498 of 2049) PASS: lldb-api :: functionalities/jitloader_gdb/TestJITLoaderGDB.py (1499 of 2049) PASS: lldb-unit :: Utility/./UtilityTests/VMRange.SetEndAddress (1500 of 2049) PASS: lldb-api :: functionalities/deleted-executable/TestDeletedExecutable.py (1501 of 2049) PASS: lldb-unit :: Symbol/./SymbolTests/TestTypeSystemClang.TestBuiltinTypeForEncodingAndBitSize (1502 of 2049) PASS: lldb-api :: functionalities/breakpoint/breakpoint_command/TestRegexpBreakCommand.py (1503 of 2049) UNSUPPORTED: lldb-api :: functionalities/darwin_log/filter/exact_match/message/TestDarwinLogFilterMatchMessage.py (1504 of 2049) PASS: lldb-unit :: Utility/./UtilityTests/TimeoutTest.Construction (1505 of 2049) PASS: lldb-api :: functionalities/thread/concurrent_events/TestConcurrentBreakpointDelayBreakpointOneSignal.py (1506 of 2049) PASS: lldb-unit :: Utility/./UtilityTests/ScalarTest.ComparisonFloat (1507 of 2049) PASS: lldb-api :: lang/c/register_variables/TestRegisterVariables.py (1508 of 2049) PASS: lldb-unit :: Utility/./UtilityTests/PassiveReplayTest.InstrumentedBarRef (1509 of 2049) PASS: lldb-shell :: ObjectFile/ELF/PT_TLS-overlap-PT_LOAD.yaml (1510 of 2049) PASS: lldb-unit :: UnwindAssembly/x86/./UnwindAssemblyx86Tests/Testx86AssemblyInspectionEngine.TestPopEBX (1511 of 2049) PASS: lldb-shell :: ScriptInterpreter/Lua/independent_state.test (1512 of 2049) PASS: lldb-unit :: Utility/./UtilityTests/StringLexerTest.NextIf (1513 of 2049) PASS: lldb-unit :: Utility/./UtilityTests/ReproducerTest.SetCapture (1514 of 2049) PASS: lldb-shell :: SymbolFile/Breakpad/stack-cfi-parsing.test (1515 of 2049) PASS: lldb-shell :: ScriptInterpreter/Lua/convenience_variables.test (1516 of 2049) PASS: lldb-unit :: Utility/./UtilityTests/RangeTest.ContainsAddr (1517 of 2049) PASS: lldb-shell :: SymbolFile/NativePDB/disassembly.cpp (1518 of 2049) PASS: lldb-unit :: Utility/./UtilityTests/RangeTest.LessThanInvalid (1519 of 2049) PASS: lldb-api :: commands/expression/import-std-module/vector-dbg-info-content/TestDbgInfoContentVectorFromStdModule.py (1520 of 2049) PASS: lldb-shell :: SymbolFile/DWARF/debug_loc-aslr.s (1521 of 2049) PASS: lldb-api :: lang/cpp/gmodules-templates/TestGModules.py (1522 of 2049) PASS: lldb-unit :: Symbol/./SymbolTests/Type.CompilerContextPattern (1523 of 2049) PASS: lldb-api :: functionalities/data-formatter/frameformat_smallstruct/TestFrameFormatSmallStruct.py (1524 of 2049) PASS: lldb-unit :: Utility/./UtilityTests/StreamTest.PutBytesAsRawHex8ToBigEndian (1525 of 2049) PASS: lldb-unit :: Utility/./UtilityTests/LogTest.LLDB_LOG_nullptr (1526 of 2049) PASS: lldb-api :: lang/objc/objc-ivar-offsets/TestObjCIvarOffsets.py (1527 of 2049) PASS: lldb-api :: python_api/get-value-32bit-int/TestGetValue32BitInt.py (1528 of 2049) PASS: lldb-shell :: Reproducer/TestCrash.test (1529 of 2049) PASS: lldb-api :: functionalities/tail_call_frames/disambiguate_paths_to_common_sink/TestDisambiguatePathsToCommonSink.py (1530 of 2049) PASS: lldb-api :: functionalities/gdb_remote_client/TestRegDefinitionInParts.py (1531 of 2049) PASS: lldb-api :: functionalities/thread/concurrent_events/TestConcurrentCrashWithWatchpointBreakpointSignal.py (1532 of 2049) PASS: lldb-shell :: Commands/CommandScriptImmediateOutput/CommandScriptImmediateOutputConsole.test (1533 of 2049) PASS: lldb-unit :: UnwindAssembly/x86/./UnwindAssemblyx86Tests/Testx86AssemblyInspectionEngine.Test32bitFramelessBigStackFrame (1534 of 2049) PASS: lldb-api :: functionalities/data-formatter/stringprinter/TestStringPrinter.py (1535 of 2049) PASS: lldb-unit :: Utility/./UtilityTests/RangeTest.Copy (1536 of 2049) PASS: lldb-unit :: SymbolFile/NativePDB/./SymbolFileNativePDBTests/PDBFPOProgramToDWARFExpressionTests.UnsupportedRASearch (1537 of 2049) PASS: lldb-api :: functionalities/data-formatter/vector-types/TestVectorTypesFormatting.py (1538 of 2049) PASS: lldb-shell :: Settings/TestStopCommandSourceOnError.test (1539 of 2049) PASS: lldb-api :: commands/expression/import-std-module/basic/TestImportStdModule.py (1540 of 2049) PASS: lldb-api :: lang/objc/orderedset/TestOrderedSet.py (1541 of 2049) PASS: lldb-unit :: Utility/./UtilityTests/StringExtractorTest.DecodeHexU8_Underflow2 (1542 of 2049) PASS: lldb-unit :: Utility/./UtilityTests/StringListTest.ShiftStdString (1543 of 2049) PASS: lldb-api :: lang/objc/modules-inline-functions/TestModulesInlineFunctions.py (1544 of 2049) UNSUPPORTED: lldb-api :: commands/expression/completion-crash-invalid-iterator/TestInvalidIteratorCompletionCrash.py (1545 of 2049) PASS: lldb-api :: functionalities/breakpoint/move_nearest/TestMoveNearest.py (1546 of 2049) PASS: lldb-unit :: tools/lldb-server/tests/./LLDBServerTests/TestBase.DebugserverEnv (1547 of 2049) UNSUPPORTED: lldb-api :: benchmarks/libcxxmap/TestBenchmarkLibcxxMap.py (1548 of 2049) PASS: lldb-api :: functionalities/inline-stepping/TestInlineStepping.py (1549 of 2049) PASS: lldb-unit :: Utility/./UtilityTests/StringExtractorTest.GetU32BigEndian (1550 of 2049) PASS: lldb-unit :: Host/./HostTests/SocketTest.TCPListen0GetPort (1551 of 2049) PASS: lldb-unit :: Target/./TargetTests/PathMappingListTest.AbsoluteTests (1552 of 2049) PASS: lldb-unit :: Utility/./UtilityTests/AnsiTerminal.KnownPrefix (1553 of 2049) PASS: lldb-unit :: Process/minidump/./LLDBMinidumpTests/MinidumpParserTest.FindMemoryRangeWithFullMemoryMinidump (1554 of 2049) PASS: lldb-unit :: Utility/./UtilityTests/StreamTest.PutHex64ByteOrderBig (1555 of 2049) UNSUPPORTED: lldb-shell :: SymbolFile/PDB/ast-restore.test (1556 of 2049) PASS: lldb-unit :: Utility/./UtilityTests/StreamTest.PutCharNull (1557 of 2049) PASS: lldb-api :: functionalities/data-formatter/nssetsynth/TestNSSetSynthetic.py (1558 of 2049) PASS: lldb-api :: python_api/symbol-context/two-files/TestSymbolContextTwoFiles.py (1559 of 2049) PASS: lldb-unit :: Expression/./ExpressionTests/CppModuleConfigurationTest.Xcode (1560 of 2049) PASS: lldb-unit :: Utility/./UtilityTests/SerializationRountripTest.SerializeDeserializePodReferences (1561 of 2049) PASS: lldb-unit :: Utility/./UtilityTests/FileSpecTest.EqualDotsPosixRoot (1562 of 2049) PASS: lldb-api :: python_api/sbvalue_persist/TestSBValuePersist.py (1563 of 2049) PASS: lldb-unit :: Symbol/./SymbolTests/TestClangASTImporter.CanImportInvalidType (1564 of 2049) PASS: lldb-unit :: Utility/./UtilityTests/StringLexerTest.AdvanceIf (1565 of 2049) PASS: lldb-api :: functionalities/thread/concurrent_events/TestConcurrentManyBreakpoints.py (1566 of 2049) PASS: lldb-unit :: Utility/./UtilityTests/OptionsWithRawTest.WhitespaceInput (1567 of 2049) PASS: lldb-api :: commands/expression/inline-namespace/TestInlineNamespace.py (1568 of 2049) PASS: lldb-api :: commands/expression/codegen-crash-typedefdecl-not-in_declcontext/TestCodegenCrashTypedefDeclNotInDeclContext.py (1569 of 2049) PASS: lldb-shell :: SymbolFile/DWARF/gnu-style-compression.cpp (1570 of 2049) PASS: lldb-api :: commands/watchpoints/watchpoint_commands/command/TestWatchpointCommandPython.py (1571 of 2049) PASS: lldb-unit :: Expression/./ExpressionTests/CppModuleConfigurationTest.AmbiguousLibCpp (1572 of 2049) PASS: lldb-api :: commands/watchpoints/step_over_watchpoint/TestStepOverWatchpoint.py (1573 of 2049) PASS: lldb-unit :: Utility/./UtilityTests/GeneratorTest.Get (1574 of 2049) PASS: lldb-shell :: SymbolFile/Breakpad/line-table.test (1575 of 2049) PASS: lldb-shell :: SymbolFile/DWARF/dwp.s (1576 of 2049) PASS: lldb-api :: functionalities/lazy-loading/TestLazyLoading.py (1577 of 2049) PASS: lldb-shell :: SymbolFile/NativePDB/nested-types.cpp (1578 of 2049) PASS: lldb-unit :: Process/gdb-remote/./ProcessGdbRemoteTests/GDBRemoteCommunicationClientTest.GetModulesInfo_UUID20 (1579 of 2049) PASS: lldb-unit :: Utility/./UtilityTests/Flags.IsClear (1580 of 2049) PASS: lldb-shell :: SymbolFile/DWARF/dwarf5-index-is-used.cpp (1581 of 2049) UNSUPPORTED: lldb-api :: tools/lldb-server/TestGdbRemote_vContThreads.py (1582 of 2049) PASS: lldb-unit :: Host/./HostTests/SocketTest.TCPGetAddress (1583 of 2049) PASS: lldb-unit :: Utility/./UtilityTests/ProcessInfoTest.Constructor (1584 of 2049) PASS: lldb-unit :: ScriptInterpreter/Lua/./ScriptInterpreterLuaTests/LuaTest.RunInvalid (1585 of 2049) PASS: lldb-api :: functionalities/gdb_remote_client/TestGDBRemoteClient.py (1586 of 2049) PASS: lldb-unit :: UnwindAssembly/x86/./UnwindAssemblyx86Tests/Testx86AssemblyInspectionEngine.Testi386IgnoredRegisters (1587 of 2049) PASS: lldb-api :: commands/expression/import-std-module/shared_ptr/TestSharedPtrFromStdModule.py (1588 of 2049) PASS: lldb-api :: functionalities/breakpoint/breakpoint_command/TestBreakpointCommand.py (1589 of 2049) PASS: lldb-shell :: ObjectFile/ELF/minidebuginfo-find-symbols.yaml (1590 of 2049) PASS: lldb-api :: lang/c/local_types/TestUseClosestType.py (1591 of 2049) PASS: lldb-api :: python_api/default-constructor/TestDefaultConstructorForAPIObjects.py (1592 of 2049) PASS: lldb-shell :: Reproducer/TestLuaImport.test (1593 of 2049) PASS: lldb-unit :: Utility/./UtilityTests/StreamTest.PutHex8 (1594 of 2049) PASS: lldb-unit :: Utility/./UtilityTests/StreamTest.PutPtr (1595 of 2049) PASS: lldb-unit :: Utility/./UtilityTests/ConstStringTest.YAML (1596 of 2049) UNSUPPORTED: lldb-api :: functionalities/thread/thread_specific_break_plus_condition/TestThreadSpecificBpPlusCondition.py (1597 of 2049) PASS: lldb-api :: python_api/formatters/TestFormattersSBAPI.py (1598 of 2049) PASS: lldb-unit :: Utility/./UtilityTests/TimerTest.CategoryTimes (1599 of 2049) PASS: lldb-shell :: Quit/TestQuitExitCodeTooManyArgs.test (1600 of 2049) PASS: lldb-api :: commands/add-dsym/uuid/TestAddDsymCommand.py (1601 of 2049) PASS: lldb-unit :: Utility/./UtilityTests/RangeTest.Constructor (1602 of 2049) PASS: lldb-api :: tools/lldb-server/TestGdbRemoteHostInfo.py (1603 of 2049) PASS: lldb-unit :: Expression/./ExpressionTests/CppModuleConfigurationTest.MissingLibCpp (1604 of 2049) UNSUPPORTED: lldb-api :: functionalities/darwin_log/filter/exact_match/category/TestDarwinLogFilterMatchCategory.py (1605 of 2049) PASS: lldb-api :: lang/objc/global_ptrs/TestGlobalObjects.py (1606 of 2049) PASS: lldb-api :: commands/expression/xvalue/TestXValuePrinting.py (1607 of 2049) UNSUPPORTED: lldb-shell :: Register/aarch64-gp-read.test (1608 of 2049) PASS: lldb-api :: macosx/thread_suspend/TestInternalThreadSuspension.py (1609 of 2049) PASS: lldb-unit :: Utility/./UtilityTests/DataExtractorTest.GetULEB128_bit63 (1610 of 2049) PASS: lldb-api :: lang/objc/single-entry-dictionary/TestObjCSingleEntryDictionary.py (1611 of 2049) PASS: lldb-shell :: ObjectFile/PECOFF/basic-info.yaml (1612 of 2049) PASS: lldb-shell :: ObjectFile/ELF/aarch64-relocations.yaml (1613 of 2049) PASS: lldb-api :: functionalities/tsan/basic/TestTsanBasic.py (1614 of 2049) PASS: lldb-api :: functionalities/gdb_remote_client/TestTargetXMLArch.py (1615 of 2049) PASS: lldb-shell :: ObjectFile/ELF/section-types-edgecases.yaml (1616 of 2049) PASS: lldb-unit :: Utility/./UtilityTests/StringExtractorTest.GetU64LittleEndian (1617 of 2049) UNSUPPORTED: lldb-api :: benchmarks/stepping/TestSteppingSpeed.py (1618 of 2049) PASS: lldb-unit :: Symbol/./SymbolTests/TestTypeSystemClang.TestGetTypeClassTypeOfExpr (1619 of 2049) PASS: lldb-api :: commands/expression/persistent_variables/TestPersistentVariables.py (1620 of 2049) PASS: lldb-api :: functionalities/data-formatter/parray/TestPrintArray.py (1621 of 2049) PASS: lldb-unit :: Utility/./UtilityTests/ArgsTest.BareSingleQuote (1622 of 2049) PASS: lldb-api :: macosx/indirect_symbol/TestIndirectSymbols.py (1623 of 2049) UNSUPPORTED: lldb-shell :: Register/arm-gp-read.test (1624 of 2049) PASS: lldb-api :: functionalities/exec/TestExec.py (1625 of 2049) PASS: lldb-unit :: Utility/./UtilityTests/RangeTest.DefaultConstructor (1626 of 2049) PASS: lldb-api :: lang/cpp/namespace/TestNamespace.py (1627 of 2049) PASS: lldb-unit :: UnwindAssembly/x86/./UnwindAssemblyx86Tests/Testx86AssemblyInspectionEngine.TestPopEDI (1628 of 2049) PASS: lldb-unit :: Process/gdb-remote/./ProcessGdbRemoteTests/GDBRemoteClientBaseTest.SendContinueAndLateInterrupt (1629 of 2049) PASS: lldb-api :: lang/objc/foundation/TestObjectDescriptionAPI.py (1630 of 2049) PASS: lldb-api :: commands/expression/rdar44436068/Test128BitsInteger.py (1631 of 2049) PASS: lldb-api :: lang/cpp/function-qualifiers/TestCppFunctionQualifiers.py (1632 of 2049) PASS: lldb-api :: functionalities/thread/concurrent_events/TestConcurrentBreakpointOneDelayBreakpointThreads.py (1633 of 2049) PASS: lldb-api :: commands/expression/po_verbosity/TestPoVerbosity.py (1634 of 2049) UNSUPPORTED: lldb-shell :: SymbolFile/PDB/func-symbols.test (1635 of 2049) PASS: lldb-unit :: UnwindAssembly/x86/./UnwindAssemblyx86Tests/Testx86AssemblyInspectionEngine.TestPushR15 (1636 of 2049) PASS: lldb-unit :: Utility/./UtilityTests/StatusTest.ErrorConstructor (1637 of 2049) PASS: lldb-api :: commands/disassemble/basic/TestFrameDisassemble.py (1638 of 2049) PASS: lldb-unit :: Utility/./UtilityTests/StringListTest.AppendListCStringArrayEmpty (1639 of 2049) PASS: lldb-api :: commands/expression/import-std-module/forward_list/TestForwardListFromStdModule.py (1640 of 2049) PASS: lldb-shell :: SymbolFile/DWARF/DW_TAG_basic_type_DW_ATE_UTF_nonC.ll (1641 of 2049) PASS: lldb-shell :: Commands/command-script-import.test (1642 of 2049) PASS: lldb-unit :: UnwindAssembly/x86/./UnwindAssemblyx86Tests/Testx86AssemblyInspectionEngine.TestPushESI (1643 of 2049) PASS: lldb-api :: functionalities/postmortem/elf-core/thread_crash/TestLinuxCoreThreads.py (1644 of 2049) PASS: lldb-unit :: Utility/./UtilityTests/StreamTeeTest.GetStreamAtIndexOutOfBoundsEmpty (1645 of 2049) PASS: lldb-shell :: Settings/TestFrameFormatMangling.test (1646 of 2049) PASS: lldb-api :: functionalities/breakpoint/serialize/TestBreakpointSerialization.py (1647 of 2049) PASS: lldb-api :: functionalities/data-formatter/format-propagation/TestFormatPropagation.py (1648 of 2049) PASS: lldb-unit :: Utility/./UtilityTests/StringListTest.RemoveBlankLines (1649 of 2049) PASS: lldb-unit :: Symbol/./SymbolTests/TestTypeSystemClang.TestGetTypeClassTypeOf (1650 of 2049) PASS: lldb-api :: commands/expression/deleting-implicit-copy-constructor/TestDeletingImplicitCopyConstructor.py (1651 of 2049) PASS: lldb-shell :: Recognizer/assert.test (1652 of 2049) PASS: lldb-unit :: UnwindAssembly/x86/./UnwindAssemblyx86Tests/Testx86AssemblyInspectionEngine.TestPopEBP (1653 of 2049) PASS: lldb-shell :: Breakpoint/implicit_const_form_support.test (1654 of 2049) PASS: lldb-unit :: Language/Highlighting/./HighlighterTests/HighlighterTest.ClangComments (1655 of 2049) PASS: lldb-unit :: UnwindAssembly/x86/./UnwindAssemblyx86Tests/Testx86AssemblyInspectionEngine.TestStackRealign32BitDisp_x86_64 (1656 of 2049) PASS: lldb-api :: functionalities/data-formatter/data-formatter-objc/nsstring/TestDataFormatterNSString.py (1657 of 2049) UNSUPPORTED: lldb-api :: functionalities/thread/create_during_step/TestCreateDuringStep.py (1658 of 2049) PASS: lldb-shell :: ObjectFile/PECOFF/basic-info-arm64.yaml (1659 of 2049) PASS: lldb-api :: commands/expression/persist_objc_pointeetype/TestPersistObjCPointeeType.py (1660 of 2049) PASS: lldb-api :: lang/objc/objc-baseclass-sbtype/TestObjCBaseClassSBType.py (1661 of 2049) PASS: lldb-api :: lang/cpp/covariant-return-types/TestCovariantReturnTypes.py (1662 of 2049) PASS: lldb-api :: lang/c/unions/TestUnionMembers.py (1663 of 2049) PASS: lldb-unit :: Process/gdb-remote/./ProcessGdbRemoteTests/GDBRemoteCommunicationServerTest.SendErrorResponse_StringError (1664 of 2049) PASS: lldb-api :: commands/platform/basic/TestPlatformPython.py (1665 of 2049) PASS: lldb-unit :: Utility/./UtilityTests/StreamTest.PutHex16ByteOrderLittle (1666 of 2049) PASS: lldb-api :: commands/expression/argument_passing_restrictions/TestArgumentPassingRestrictions.py (1667 of 2049) PASS: lldb-api :: commands/expression/completion/TestExprCompletion.py (1668 of 2049) PASS: lldb-shell :: SymbolFile/DWARF/dwo-type-in-main-file.s (1669 of 2049) PASS: lldb-unit :: Interpreter/./InterpreterTests/CompletionTest.DirCompletionUsername (1670 of 2049) PASS: lldb-unit :: ScriptInterpreter/Python/./ScriptInterpreterPythonTests/PythonDataObjectsTest.TestOwnedReferences (1671 of 2049) PASS: lldb-api :: functionalities/load_unload/TestLoadUnload.py (1672 of 2049) PASS: lldb-api :: commands/expression/issue_11588/Test11588.py (1673 of 2049) PASS: lldb-shell :: SymbolFile/NativePDB/break-by-line.cpp (1674 of 2049) PASS: lldb-shell :: Breakpoint/dummy-target.test (1675 of 2049) PASS: lldb-unit :: Host/./HostTests/File.GetWaitableHandleFileno (1676 of 2049) PASS: lldb-unit :: Utility/./UtilityTests/VMRange.CollectionContains (1677 of 2049) UNSUPPORTED: lldb-shell :: Register/x86-64-xmm16-write.test (1678 of 2049) PASS: lldb-shell :: Settings/TestLineMarkerColor.test (1679 of 2049) PASS: lldb-api :: commands/expression/function_template_specialization_temp_args/TestFunctionTemplateSpecializationTempArgs.py (1680 of 2049) PASS: lldb-unit :: Utility/./UtilityTests/FileSpecTest.RemoveLastPathComponent (1681 of 2049) PASS: lldb-api :: commands/command/delete/TestCommandDelete.py (1682 of 2049) PASS: lldb-api :: commands/expression/weak_symbols/TestWeakSymbols.py (1683 of 2049) PASS: lldb-unit :: Utility/./UtilityTests/UserIDResolver.GetUserName (1684 of 2049) PASS: lldb-unit :: Utility/./UtilityTests/RangeDataVector.FindEntryThatContains_Overlap (1685 of 2049) PASS: lldb-unit :: Expression/./ExpressionTests/DiagnosticManagerTest.AddDiagnostic (1686 of 2049) PASS: lldb-api :: python_api/frame/inlines/TestInlinedFrame.py (1687 of 2049) PASS: lldb-api :: lang/objc/modules-auto-import/TestModulesAutoImport.py (1688 of 2049) PASS: lldb-shell :: ObjectFile/ELF/PT_LOAD-overlap.yaml (1689 of 2049) PASS: lldb-unit :: Utility/./UtilityTests/ArgsTest.ReplaceArgumentAtIndexFarOutOfRange (1690 of 2049) PASS: lldb-shell :: Reproducer/TestVersionCheck.test (1691 of 2049) PASS: lldb-unit :: UnwindAssembly/x86/./UnwindAssemblyx86Tests/Testx86AssemblyInspectionEngine.Test64bitFramelessBigStackFrame (1692 of 2049) PASS: lldb-shell :: ObjectFile/PECOFF/export-dllfunc.yaml (1693 of 2049) PASS: lldb-api :: python_api/signals/TestSignalsAPI.py (1694 of 2049) PASS: lldb-api :: tools/lldb-server/TestLldbGdbServer.py (1695 of 2049) PASS: lldb-unit :: Symbol/./SymbolTests/TestTypeSystemClang.TestRecordHasFields (1696 of 2049) PASS: lldb-unit :: ScriptInterpreter/Python/./ScriptInterpreterPythonTests/PythonDataObjectsTest.TestGlobalNameResolutionNoDot (1697 of 2049) PASS: lldb-unit :: Utility/./UtilityTests/ArgsTest.TestAppendArg (1698 of 2049) PASS: lldb-unit :: Utility/./UtilityTests/StringListTest.LongestCommonPrefixEmpty (1699 of 2049) PASS: lldb-unit :: Utility/./UtilityTests/RangeTest.Slide (1700 of 2049) PASS: lldb-api :: functionalities/data-formatter/synthcapping/TestSyntheticCapping.py (1701 of 2049) PASS: lldb-api :: lang/cpp/signed_types/TestSignedTypes.py (1702 of 2049) PASS: lldb-unit :: Process/minidump/./LLDBMinidumpTests/MinidumpParserTest.MinidumpDuplicateModuleMinAddress (1703 of 2049) PASS: lldb-shell :: SymbolFile/DWARF/debug-types-signature-loop.s (1704 of 2049) PASS: lldb-shell :: SymbolFile/NativePDB/globals-fundamental.cpp (1705 of 2049) PASS: lldb-api :: tools/lldb-server/TestGdbRemoteExitCode.py (1706 of 2049) UNSUPPORTED: lldb-shell :: SymbolFile/PDB/udt-layout.test (1707 of 2049) PASS: lldb-unit :: Process/gdb-remote/./ProcessGdbRemoteTests/GDBRemoteClientBaseTest.SendContinueAndInterrupt (1708 of 2049) PASS: lldb-unit :: Host/./HostTests/HostInfoTest.GetAugmentedArchSpec (1709 of 2049) PASS: lldb-shell :: SymbolFile/NativePDB/global-classes.cpp (1710 of 2049) PASS: lldb-unit :: Utility/./UtilityTests/ArgsTest.Yaml (1711 of 2049) PASS: lldb-api :: python_api/module_section/TestModuleAndSection.py (1712 of 2049) PASS: lldb-api :: functionalities/thread/concurrent_events/TestConcurrentTwoWatchpointsOneSignal.py (1713 of 2049) PASS: lldb-api :: python_api/interpreter/TestRunCommandInterpreterAPI.py (1714 of 2049) UNSUPPORTED: lldb-api :: functionalities/signal/handle-segv/TestHandleSegv.py (1715 of 2049) PASS: lldb-api :: functionalities/tsan/global_location/TestTsanGlobalLocation.py (1716 of 2049) PASS: lldb-api :: commands/expression/no-deadlock/TestExprDoesntBlock.py (1717 of 2049) PASS: lldb-unit :: SymbolFile/DWARF/./SymbolFileDWARFTests/SymbolFileDWARFTests.TestAbbrevNullAttrValidForm (1718 of 2049) PASS: lldb-unit :: UnwindAssembly/x86/./UnwindAssemblyx86Tests/Testx86AssemblyInspectionEngine.TestPushEBP (1719 of 2049) PASS: lldb-unit :: Utility/./UtilityTests/ScalarTest.Comparison (1720 of 2049) PASS: lldb-api :: commands/expression/entry-bp/TestExprEntryBP.py (1721 of 2049) PASS: lldb-api :: iohandler/unicode/TestUnicode.py (1722 of 2049) PASS: lldb-api :: functionalities/postmortem/netbsd-core/TestNetBSDCore.py (1723 of 2049) PASS: lldb-shell :: ObjectFile/ELF/PT_LOAD-empty.yaml (1724 of 2049) PASS: lldb-shell :: Driver/TestNoUseColor.test (1725 of 2049) PASS: lldb-unit :: ObjectFile/PECOFF/./ObjectFilePECOFFTests/PECallFrameInfoTest.Frame_reg_eh (1726 of 2049) UNSUPPORTED: lldb-shell :: Watchpoint/netbsd-nouserdbregs.test (1727 of 2049) PASS: lldb-api :: lang/cpp/exceptions/TestCPPExceptionBreakpoints.py (1728 of 2049) PASS: lldb-unit :: Core/./LLDBCoreTests/MangledTest.NameIndexes_FindFunctionSymbols (1729 of 2049) PASS: lldb-shell :: SymbolFile/Breakpad/symtab.test (1730 of 2049) PASS: lldb-shell :: SymbolFile/DWARF/find-function-regex.cpp (1731 of 2049) PASS: lldb-api :: tools/lldb-vscode/console/TestVSCode_console.py (1732 of 2049) PASS: lldb-api :: commands/expression/persistent_types/TestNestedPersistentTypes.py (1733 of 2049) PASS: lldb-unit :: Symbol/./SymbolTests/TestTypeSystemClang.TestGetTypeClassNested (1734 of 2049) PASS: lldb-unit :: Host/./HostTests/FileSystemTest.FileAndDirectoryComponents (1735 of 2049) PASS: lldb-unit :: Language/Highlighting/./HighlighterTests/HighlighterTest.ClangCursorPosAfterOtherToken (1736 of 2049) PASS: lldb-unit :: Utility/./UtilityTests/SubsystemRAIITest.SubsystemWithErrorFailure (1737 of 2049) PASS: lldb-shell :: ScriptInterpreter/Python/sb_address_exception.test (1738 of 2049) PASS: lldb-unit :: Utility/./UtilityTests/XcodeSDKTest.ParseTest (1739 of 2049) PASS: lldb-api :: commands/expression/options/TestExprOptions.py (1740 of 2049) PASS: lldb-api :: macosx/nslog/TestDarwinNSLogOutput.py (1741 of 2049) PASS: lldb-shell :: ObjectFile/ELF/netbsd-exec-8.99.30-amd64.yaml (1742 of 2049) PASS: lldb-api :: lang/objc/modules-app-update/TestClangModulesAppUpdate.py (1743 of 2049) PASS: lldb-api :: functionalities/breakpoint/inlined_breakpoints/TestInlinedBreakpoints.py (1744 of 2049) PASS: lldb-api :: functionalities/data-formatter/data-formatter-synth/TestDataFormatterSynth.py (1745 of 2049) PASS: lldb-unit :: Utility/./UtilityTests/RangeTest.ContainsEndInclusive (1746 of 2049) PASS: lldb-api :: lang/cpp/type_lookup/TestCppTypeLookup.py (1747 of 2049) PASS: lldb-unit :: Host/./HostTests/ConnectionFileDescriptorTest.TCPGetURIv6 (1748 of 2049) PASS: lldb-api :: commands/expression/import-std-module/queue/TestQueueFromStdModule.py (1749 of 2049) PASS: lldb-shell :: Reproducer/Modules/TestModuleCXX.test (1750 of 2049) PASS: lldb-api :: functionalities/gdb_remote_client/TestPlatformClient.py (1751 of 2049) PASS: lldb-api :: functionalities/data-formatter/data-formatter-stl/libcxx/optional/TestDataFormatterLibcxxOptional.py (1752 of 2049) PASS: lldb-unit :: Utility/./UtilityTests/ArchSpecTest.TestSetTriple (1753 of 2049) PASS: lldb-api :: lang/cpp/accelerator-table/TestCPPAccelerator.py (1754 of 2049) PASS: lldb-api :: functionalities/load_using_paths/TestLoadUsingPaths.py (1755 of 2049) PASS: lldb-api :: lang/objc/direct-dispatch-step/TestObjCDirectDispatchStepping.py (1756 of 2049) PASS: lldb-api :: commands/expression/multiline-completion/TestMultilineCompletion.py (1757 of 2049) PASS: lldb-api :: functionalities/testid/TestTestId.py (1758 of 2049) PASS: lldb-api :: commands/breakpoint/set/func-regex/TestBreakpointRegexError.py (1759 of 2049) PASS: lldb-shell :: Minidump/Windows/broken-unwind.test (1760 of 2049) PASS: lldb-unit :: Utility/./UtilityTests/OptionsWithRawTest.EmptySuffixSingleWhitespace (1761 of 2049) PASS: lldb-api :: functionalities/breakpoint/step_over_breakpoint/TestStepOverBreakpoint.py (1762 of 2049) PASS: lldb-unit :: Utility/./UtilityTests/StreamTest.AddressEmptyPrefix (1763 of 2049) UNSUPPORTED: lldb-api :: android/platform/TestDefaultCacheLineSize.py (1764 of 2049) PASS: lldb-unit :: Editline/./EditlineTests/EditlineTestFixture.EditlineReceivesMultiLineText (1765 of 2049) PASS: lldb-api :: lang/cpp/stl/TestSTL.py (1766 of 2049) PASS: lldb-shell :: ObjectFile/wasm/unified-debug-sections.yaml (1767 of 2049) UNSUPPORTED: lldb-shell :: Register/x86-64-ymm16-read.test (1768 of 2049) PASS: lldb-shell :: ObjectFile/PECOFF/basic-info-arm.yaml (1769 of 2049) PASS: lldb-unit :: Utility/./UtilityTests/RangeDataVector.FindEntryIndexesThatContain_Overlap (1770 of 2049) PASS: lldb-api :: lang/c/const_variables/TestConstVariables.py (1771 of 2049) PASS: lldb-unit :: Core/./LLDBCoreTests/SourceFileCache.FindSourceFileFound (1772 of 2049) UNSUPPORTED: lldb-api :: macosx/macabi/TestMacABImacOSFramework.py (1773 of 2049) PASS: lldb-shell :: ScriptInterpreter/Lua/watchpoint_callback.test (1774 of 2049) PASS: lldb-shell :: Expr/TestMultilineExpr.test (1775 of 2049) PASS: lldb-unit :: Utility/./UtilityTests/VASprintfTest.EncodingError (1776 of 2049) PASS: lldb-api :: python_api/value/change_values/TestChangeValueAPI.py (1777 of 2049) PASS: lldb-api :: lang/objc/objc-dyn-sbtype/TestObjCDynamicSBType.py (1778 of 2049) PASS: lldb-unit :: Utility/./UtilityTests/BinaryStreamTest.PutSLEB128SevenBytes (1779 of 2049) PASS: lldb-api :: functionalities/step_scripted/TestStepScripted.py (1780 of 2049) UNSUPPORTED: lldb-api :: lang/objc/bitfield_ivars/TestBitfieldIvars.py (1781 of 2049) PASS: lldb-unit :: Utility/./UtilityTests/StringListTest.SetSize (1782 of 2049) UNSUPPORTED: lldb-shell :: SymbolFile/DWARF/debug-types-expressions.test (1783 of 2049) PASS: lldb-unit :: ScriptInterpreter/Python/./ScriptInterpreterPythonTests/PythonDataObjectsTest.TestRun (1784 of 2049) PASS: lldb-api :: functionalities/data-formatter/data-formatter-skip-summary/TestDataFormatterSkipSummary.py (1785 of 2049) PASS: lldb-api :: commands/expression/unicode-in-variable/TestUnicodeInVariable.py (1786 of 2049) PASS: lldb-api :: lang/objc/objc-super/TestObjCSuper.py (1787 of 2049) PASS: lldb-unit :: Utility/./UtilityTests/BinaryStreamTest.PutULEB128FourBytes (1788 of 2049) PASS: lldb-api :: lang/cpp/breakpoint_in_member_func_w_non_primitive_params/TestBreakpointInMemberFuncWNonPrimitiveParams.py (1789 of 2049) PASS: lldb-unit :: Utility/./UtilityTests/XcodeSDKTest.SDKSupportsSwift (1790 of 2049) PASS: lldb-unit :: UnwindAssembly/x86/./UnwindAssemblyx86Tests/Testx86AssemblyInspectionEngine.TestPushRBPWithREX (1791 of 2049) PASS: lldb-api :: commands/frame/diagnose/inheritance/TestDiagnoseInheritance.py (1792 of 2049) PASS: lldb-shell :: ScriptInterpreter/None/none.test (1793 of 2049) PASS: lldb-unit :: Utility/./UtilityTests/VMRange.ContainsRange (1794 of 2049) PASS: lldb-unit :: Utility/./UtilityTests/ScalarTest.LongLongAssigmentOperator (1795 of 2049) PASS: lldb-unit :: Symbol/./SymbolTests/TestTypeSystemClang.TestGetBasicTypeFromName (1796 of 2049) PASS: lldb-unit :: Utility/./UtilityTests/VASprintfTest.NoBufferResize (1797 of 2049) PASS: lldb-api :: lang/cpp/global_operators/TestCppGlobalOperators.py (1798 of 2049) PASS: lldb-api :: commands/expression/import-std-module/conflicts/TestStdModuleWithConflicts.py (1799 of 2049) PASS: lldb-unit :: Utility/./UtilityTests/StreamTest.ShiftOperatorChars (1800 of 2049) UNSUPPORTED: lldb-shell :: ObjectFile/ELF/minidebuginfo-no-lzma.yaml (1801 of 2049) PASS: lldb-api :: lang/objc/objc_direct-methods/TestObjCDirectMethods.py (1802 of 2049) PASS: lldb-api :: functionalities/data-formatter/data-formatter-stl/libstdcpp/unique_ptr/invalid/TestDataFormatterInvalidStdUniquePtr.py (1803 of 2049) PASS: lldb-unit :: Utility/./UtilityTests/AnsiTerminal.Incomplete (1804 of 2049) UNSUPPORTED: lldb-shell :: Unwind/eh-frame-small-fde.test (1805 of 2049) PASS: lldb-api :: lang/cpp/offsetof/TestOffsetofCpp.py (1806 of 2049) PASS: lldb-shell :: Breakpoint/single-file-split-dwarf.test (1807 of 2049) PASS: lldb-unit :: Utility/./UtilityTests/StringListTest.GetMaxStringLengthIncreasingSize (1808 of 2049) PASS: lldb-unit :: Expression/./ExpressionTests/CppModuleConfigurationTest.UnknownLibCppFile (1809 of 2049) PASS: lldb-unit :: Utility/./UtilityTests/CompletionRequest.TryCompleteCurrentArgGood (1810 of 2049) PASS: lldb-api :: functionalities/thread/crash_during_step/TestCrashDuringStep.py (1811 of 2049) PASS: lldb-unit :: SymbolFile/NativePDB/./SymbolFileNativePDBTests/PDBFPOProgramToDWARFExpressionTests.MissingTargetRegister (1812 of 2049) PASS: lldb-unit :: Host/./HostTests/SocketTest.DomainGetConnectURI (1813 of 2049) PASS: lldb-api :: functionalities/data-formatter/language_category_updates/TestDataFormatterLanguageCategoryUpdates.py (1814 of 2049) PASS: lldb-unit :: Utility/./UtilityTests/StringExtractorTest.GetU32LittleEndian (1815 of 2049) PASS: lldb-shell :: ScriptInterpreter/Lua/command_script_import.test (1816 of 2049) PASS: lldb-api :: python_api/lldbutil/iter/TestRegistersIterator.py (1817 of 2049) PASS: lldb-api :: lang/objc/exceptions/TestObjCExceptions.py (1818 of 2049) PASS: lldb-unit :: UnwindAssembly/x86/./UnwindAssemblyx86Tests/Testx86AssemblyInspectionEngine.TestPopRBPWithREX (1819 of 2049) PASS: lldb-api :: functionalities/type_completion/TestTypeCompletion.py (1820 of 2049) PASS: lldb-api :: commands/expression/multiline-navigation/TestMultilineNavigation.py (1821 of 2049) PASS: lldb-api :: functionalities/thread/concurrent_events/TestConcurrentBreakpointsDelayedBreakpointOneWatchpoint.py (1822 of 2049) UNSUPPORTED: lldb-api :: benchmarks/expression/TestRepeatedExprs.py (1823 of 2049) PASS: lldb-shell :: Register/x86-64-gp-read.test (1824 of 2049) PASS: lldb-unit :: Utility/./UtilityTests/OptionsWithRawTest.EmptyInput (1825 of 2049) PASS: lldb-shell :: SymbolFile/DWARF/compilercontext.ll (1826 of 2049) PASS: lldb-shell :: Reproducer/Functionalities/TestImageList.test (1827 of 2049) PASS: lldb-unit :: Utility/./UtilityTests/StreamTest.PutNHex8 (1828 of 2049) PASS: lldb-unit :: Utility/./UtilityTests/RecordReplayTest.InstrumentedBar (1829 of 2049) UNSUPPORTED: lldb-api :: linux/mix-dwo-and-regular-objects/TestMixedDwarfBinary.py (1830 of 2049) PASS: lldb-unit :: Utility/./UtilityTests/StringListTest.SplitIntoLinesSingleTrailingCR (1831 of 2049) PASS: lldb-unit :: Process/minidump/./LLDBMinidumpTests/MinidumpParserTest.GetFilteredModuleList (1832 of 2049) PASS: lldb-api :: lang/c/find_struct_type/TestFindStructTypes.py (1833 of 2049) PASS: lldb-shell :: SymbolFile/DWARF/find-inline-method.s (1834 of 2049) PASS: lldb-api :: lang/objc/foundation/TestObjCMethodsNSArray.py (1835 of 2049) PASS: lldb-api :: commands/expression/invalid-args/TestInvalidArgsExpression.py (1836 of 2049) PASS: lldb-api :: functionalities/breakpoint/global_constructor/TestBreakpointInGlobalConstructor.py (1837 of 2049) PASS: lldb-unit :: Utility/./UtilityTests/OptionsWithRawTest.SingleWhitespaceInput (1838 of 2049) PASS: lldb-unit :: Utility/./UtilityTests/Flags.AnySet (1839 of 2049) PASS: lldb-shell :: SymbolFile/DWARF/dwarf5_locations.s (1840 of 2049) PASS: lldb-api :: functionalities/thread/concurrent_events/TestConcurrentTwoWatchpointsOneDelayBreakpoint.py (1841 of 2049) UNSUPPORTED: lldb-api :: functionalities/darwin_log/filter/regex/message/TestDarwinLogFilterRegexMessage.py (1842 of 2049) PASS: lldb-unit :: Utility/./UtilityTests/StreamTest.PutRawBytesToLittleEndian (1843 of 2049) PASS: lldb-unit :: Utility/./UtilityTests/ArgsTest.TestArgv (1844 of 2049) PASS: lldb-shell :: Reproducer/TestDump.test (1845 of 2049) PASS: lldb-unit :: ScriptInterpreter/Python/./ScriptInterpreterPythonTests/PythonDataObjectsTest.TestExtractingUInt64ThroughStructuredData (1846 of 2049) PASS: lldb-unit :: ObjectFile/Breakpad/./ObjectFileBreakpadTests/FuncRecord.parse (1847 of 2049) PASS: lldb-unit :: ScriptInterpreter/Python/./ScriptInterpreterPythonTests/PythonDataObjectsTest.TestPythonStringToStr (1848 of 2049) PASS: lldb-unit :: Utility/./UtilityTests/RangeDataVector.CustomSort (1849 of 2049) PASS: lldb-unit :: Core/./LLDBCoreTests/MangledTest.ResultForBlockInvocation (1850 of 2049) PASS: lldb-api :: commands/frame/diagnose/dereference-this/TestDiagnoseDereferenceThis.py (1851 of 2049) PASS: lldb-unit :: ScriptInterpreter/Python/./ScriptInterpreterPythonTests/PythonDataObjectsTest.TestPythonBoolean (1852 of 2049) PASS: lldb-unit :: Process/minidump/./LLDBMinidumpTests/MinidumpParserTest.GetMemoryRegionInfoFromMemory64List (1853 of 2049) PASS: lldb-api :: functionalities/memory/cache/TestMemoryCache.py (1854 of 2049) PASS: lldb-unit :: Language/Highlighting/./HighlighterTests/HighlighterTest.ClangPPDirectives (1855 of 2049) PASS: lldb-api :: lang/objc/rdar-10967107/TestRdar10967107.py (1856 of 2049) PASS: lldb-unit :: Utility/./UtilityTests/RegularExpression.Invalid (1857 of 2049) PASS: lldb-unit :: Utility/./UtilityTests/EventTest.DumpEventDataBytes (1858 of 2049) PASS: lldb-unit :: Utility/./UtilityTests/OptionsWithRawTest.LeadingSpaceArgs (1859 of 2049) PASS: lldb-unit :: Utility/./UtilityTests/RangeTest.SlideZero (1860 of 2049) PASS: lldb-unit :: Utility/./UtilityTests/StreamTest.AddressPrefix (1861 of 2049) PASS: lldb-api :: tools/lldb-vscode/stackTrace/TestVSCode_stackTrace.py (1862 of 2049) PASS: lldb-shell :: ObjectFile/ELF/section-overlap.yaml (1863 of 2049) UNSUPPORTED: lldb-shell :: Register/x86-64-zmm-read.test (1864 of 2049) PASS: lldb-api :: python_api/type/TestTypeList.py (1865 of 2049) PASS: lldb-api :: lang/cpp/operators/TestCppOperators.py (1866 of 2049) UNSUPPORTED: lldb-shell :: SymbolFile/PDB/type-quals.test (1867 of 2049) PASS: lldb-api :: functionalities/stats_api/TestStatisticsAPI.py (1868 of 2049) PASS: lldb-shell :: BuildScript/script-args.test (1869 of 2049) PASS: lldb-unit :: Process/gdb-remote/./ProcessGdbRemoteTests/GDBRemoteCommunicationClientTest.ReadRegister (1870 of 2049) PASS: lldb-shell :: SymbolFile/Breakpad/unwind-via-stack-cfi.test (1871 of 2049) UNSUPPORTED: lldb-shell :: SymbolFile/PDB/compilands.test (1872 of 2049) PASS: lldb-unit :: SymbolFile/DWARF/./SymbolFileDWARFTests/SymbolFileDWARFTests.TestAbbrevValidAttrNullForm (1873 of 2049) PASS: lldb-api :: python_api/frame/TestFrames.py (1874 of 2049) PASS: lldb-shell :: Settings/TestModuleCacheSanity.test (1875 of 2049) PASS: lldb-unit :: ScriptInterpreter/Python/./ScriptInterpreterPythonTests/PythonDataObjectsTest.TestCallable (1876 of 2049) PASS: lldb-api :: lang/c/stepping/TestStepAndBreakpoints.py (1877 of 2049) UNSUPPORTED: lldb-api :: functionalities/darwin_log/filter/exact_match/subsystem/TestDarwinLogFilterMatchSubsystem.py (1878 of 2049) PASS: lldb-unit :: Utility/./UtilityTests/RangeTest.ContainsAddrInvalid (1879 of 2049) PASS: lldb-api :: tools/lldb-server/commandline/TestStubSetSID.py (1880 of 2049) PASS: lldb-api :: commands/statistics/basic/TestStats.py (1881 of 2049) PASS: lldb-unit :: Process/minidump/./LLDBMinidumpTests/MinidumpParserTest.InvalidMinidump (1882 of 2049) PASS: lldb-unit :: Utility/./UtilityTests/BinaryStreamTest.PutULEB128FiveBytes (1883 of 2049) PASS: lldb-unit :: Utility/./UtilityTests/DataExtractorTest.GetCStrAtEnd (1884 of 2049) PASS: lldb-unit :: Utility/./UtilityTests/StateTest.Formatv (1885 of 2049) PASS: lldb-api :: python_api/process/read-mem-cstring/TestReadMemCString.py (1886 of 2049) PASS: lldb-unit :: Host/./HostTests/FileSystemTest.EmptyTest (1887 of 2049) UNSUPPORTED: lldb-api :: tools/intel-features/intel-pt/test/TestIntelPTSimpleBinary.py (1888 of 2049) PASS: lldb-shell :: ObjectFile/ELF/basic-info.yaml (1889 of 2049) PASS: lldb-unit :: Utility/./UtilityTests/ArgsTest.GetQuotedCommandString (1890 of 2049) PASS: lldb-api :: lang/cpp/bool/TestCPPBool.py (1891 of 2049) PASS: lldb-unit :: UnwindAssembly/x86/./UnwindAssemblyx86Tests/Testx86AssemblyInspectionEngine.TestDisassemblyJunkBytes (1892 of 2049) PASS: lldb-api :: python_api/sbvalue_const_addrof/TestSBValueConstAddrOf.py (1893 of 2049) PASS: lldb-api :: lang/cpp/global_variables/TestCPPGlobalVariables.py (1894 of 2049) PASS: lldb-shell :: ObjectFile/ELF/avr-basic-info.yaml (1895 of 2049) PASS: lldb-api :: lang/c/offsetof/TestOffsetof.py (1896 of 2049) PASS: lldb-unit :: UnwindAssembly/x86/./UnwindAssemblyx86Tests/Testx86AssemblyInspectionEngine.TestPushRBP (1897 of 2049) UNSUPPORTED: lldb-shell :: Register/x86-64-ymm16-write.test (1898 of 2049) PASS: lldb-api :: functionalities/data-formatter/refpointer-recursion/TestDataFormatterRefPtrRecursion.py (1899 of 2049) PASS: lldb-unit :: Expression/./ExpressionTests/DiagnosticManagerTest.GetStringMultiline (1900 of 2049) PASS: lldb-api :: functionalities/gdb_remote_client/TestWasm.py (1901 of 2049) PASS: lldb-shell :: Commands/command-regex-unalias.test (1902 of 2049) PASS: lldb-api :: commands/help/TestHelp.py (1903 of 2049) PASS: lldb-unit :: Utility/./UtilityTests/RangeTest.ContainsRangeStartingFromZero (1904 of 2049) PASS: lldb-api :: functionalities/data-formatter/data-formatter-stl/libcxx/string/TestDataFormatterLibcxxString.py (1905 of 2049) PASS: lldb-api :: lang/c/step-target/TestStepTarget.py (1906 of 2049) PASS: lldb-api :: lang/objc/objc-checker/TestObjCCheckers.py (1907 of 2049) PASS: lldb-unit :: UnwindAssembly/x86/./UnwindAssemblyx86Tests/Testx86AssemblyInspectionEngine.TestPushRBX (1908 of 2049) UNSUPPORTED: lldb-shell :: SymbolFile/PDB/typedefs.test (1909 of 2049) PASS: lldb-unit :: Process/gdb-remote/./ProcessGdbRemoteTests/GDBRemoteCommunicationServerTest.SendErrorResponse_UnimplementedError (1910 of 2049) PASS: lldb-api :: functionalities/signal/handle-abrt/TestHandleAbort.py (1911 of 2049) PASS: lldb-unit :: Host/./HostTests/ProcessLaunchInfoTest.Constructor (1912 of 2049) PASS: lldb-unit :: Utility/./UtilityTests/StringExtractorTest.GetU64BigEndian (1913 of 2049) PASS: lldb-unit :: Target/./TargetTests/RemoteAwarePlatformTest.TestResolveExecutabelOnClientByPlatform (1914 of 2049) PASS: lldb-api :: commands/quit/TestQuit.py (1915 of 2049) PASS: lldb-api :: functionalities/breakpoint/require_hw_breakpoints/TestRequireHWBreakpoints.py (1916 of 2049) PASS: lldb-unit :: Expression/./ExpressionTests/DiagnosticManagerTest.PutStringMultiple (1917 of 2049) PASS: lldb-unit :: Utility/./UtilityTests/StringExtractorTest.GetHexBytesAvail (1918 of 2049) PASS: lldb-api :: commands/frame/diagnose/dereference-function-return/TestDiagnoseDereferenceFunctionReturn.py (1919 of 2049) PASS: lldb-shell :: SymbolFile/NativePDB/globals-bss.cpp (1920 of 2049) PASS: lldb-api :: types/TestRecursiveTypes.py (1921 of 2049) PASS: lldb-api :: functionalities/tsan/thread_leak/TestTsanThreadLeak.py (1922 of 2049) PASS: lldb-unit :: Utility/./UtilityTests/Flags.AnyClear (1923 of 2049) PASS: lldb-unit :: Utility/./UtilityTests/RangeTest.SetRangeBase (1924 of 2049) PASS: lldb-api :: commands/apropos/with-process/TestAproposWithProcess.py (1925 of 2049) PASS: lldb-shell :: SymbolFile/DWARF/debug_loclists-dwo.s (1926 of 2049) UNSUPPORTED: lldb-shell :: Register/x86-zmm-write.test (1927 of 2049) PASS: lldb-unit :: UnwindAssembly/x86/./UnwindAssemblyx86Tests/Testx86AssemblyInspectionEngine.TestPushImm (1928 of 2049) UNSUPPORTED: lldb-api :: functionalities/breakpoint/breakpoint_in_delayslot/TestAvoidBreakpointInDelaySlot.py (1929 of 2049) PASS: lldb-unit :: Utility/./UtilityTests/SerializationRountripTest.SerializeDeserializeCStringArray (1930 of 2049) PASS: lldb-unit :: Symbol/./SymbolTests/TestTypeSystemClang.TestOwningModule (1931 of 2049) PASS: lldb-api :: functionalities/data-formatter/ptr_ref_typedef/TestPtrRef2Typedef.py (1932 of 2049) PASS: lldb-unit :: Language/Highlighting/./HighlighterTests/HighlighterTest.FallbackHighlighter (1933 of 2049) PASS: lldb-api :: commands/expression/scoped_enums/TestScopedEnumType.py (1934 of 2049) PASS: lldb-unit :: Utility/./UtilityTests/IndexToObjectTest.ObjectForIndex (1935 of 2049) PASS: lldb-unit :: ObjectFile/Breakpad/./ObjectFileBreakpadTests/ModuleRecord.parse (1936 of 2049) PASS: lldb-unit :: UnwindAssembly/x86/./UnwindAssemblyx86Tests/Testx86AssemblyInspectionEngine.TestSimplei386ugmented (1937 of 2049) PASS: lldb-unit :: Utility/./UtilityTests/LogChannelTest.Enable (1938 of 2049) PASS: lldb-api :: functionalities/thread/concurrent_events/TestConcurrentTwoBreakpointsOneDelaySignal.py (1939 of 2049) PASS: lldb-api :: lang/cpp/nested-class-other-compilation-unit/TestNestedClassWithParentInAnotherCU.py (1940 of 2049) PASS: lldb-api :: commands/frame/language/TestGuessLanguage.py (1941 of 2049) PASS: lldb-api :: functionalities/data-formatter/data-formatter-stl/libcxx/initializerlist/TestInitializerList.py (1942 of 2049) PASS: lldb-shell :: SymbolFile/DWARF/debug_ranges.s (1943 of 2049) PASS: lldb-api :: macosx/safe-to-func-call/TestSafeFuncCalls.py (1944 of 2049) PASS: lldb-unit :: UnwindAssembly/x86/./UnwindAssemblyx86Tests/Testx86AssemblyInspectionEngine.TestReturnDetect (1945 of 2049) PASS: lldb-shell :: ObjectFile/PECOFF/uuid.yaml (1946 of 2049) PASS: lldb-shell :: Reproducer/TestDiscard.test (1947 of 2049) PASS: lldb-api :: python_api/thread/TestThreadAPI.py (1948 of 2049) PASS: lldb-shell :: SymbolFile/Breakpad/unwind-via-raSearch.test (1949 of 2049) PASS: lldb-api :: commands/expression/completion-crash-incomplete-record/TestCompletionCrashIncompleteRecord.py (1950 of 2049) PASS: lldb-api :: functionalities/tail_call_frames/thread_step_out_message/TestArtificialFrameStepOutMessage.py (1951 of 2049) PASS: lldb-unit :: Utility/./UtilityTests/CompletionRequest.Constructor (1952 of 2049) PASS: lldb-unit :: Symbol/./SymbolTests/TestTypeSystemClang.TestGetEnumIntegerTypeUnexpectedType (1953 of 2049) PASS: lldb-unit :: ScriptInterpreter/Python/./ScriptInterpreterPythonTests/PythonDataObjectsTest.TestTypeNameResolutionNoDot (1954 of 2049) PASS: lldb-unit :: UnwindAssembly/x86/./UnwindAssemblyx86Tests/Testx86AssemblyInspectionEngine.TestPushR13 (1955 of 2049) PASS: lldb-api :: lang/objcxx/class-name-clash/TestNameClash.py (1956 of 2049) PASS: lldb-api :: functionalities/tail_call_frames/disambiguate_call_site/TestDisambiguateCallSite.py (1957 of 2049) PASS: lldb-unit :: Utility/./UtilityTests/OptionsWithRawTest.UnterminatedQuote (1958 of 2049) PASS: lldb-api :: functionalities/data-formatter/data-formatter-stl/libcxx/list/loop/TestDataFormatterLibcxxListLoop.py (1959 of 2049) PASS: lldb-api :: lang/c/blocks/TestBlocks.py (1960 of 2049) PASS: lldb-api :: types/TestDoubleTypes.py (1961 of 2049) PASS: lldb-api :: commands/watchpoints/multiple_threads/TestWatchpointMultipleThreads.py (1962 of 2049) PASS: lldb-unit :: Utility/./UtilityTests/TimeoutTest.Format (1963 of 2049) PASS: lldb-unit :: Process/gdb-remote/./ProcessGdbRemoteTests/GDBRemoteCommunicationServerTest.SendErrorResponse_ErrorNumber (1964 of 2049) UNSUPPORTED: lldb-api :: lang/cpp/static_members/TestCPPStaticMembers.py (1965 of 2049) PASS: lldb-unit :: Utility/./UtilityTests/StatusTest.ErrorCodeConstructor (1966 of 2049) PASS: lldb-api :: commands/expression/static-initializers/TestStaticInitializers.py (1967 of 2049) PASS: lldb-unit :: Process/minidump/./LLDBMinidumpTests/MinidumpParserTest.GetThreadsAndGetThreadContext (1968 of 2049) PASS: lldb-unit :: Editline/./EditlineTests/EditlineTestFixture.EditlineReceivesSingleLineText (1969 of 2049) PASS: lldb-shell :: Expr/TestIRMemoryMap.test (1970 of 2049) PASS: lldb-unit :: Utility/./UtilityTests/VMRange.IsValid (1971 of 2049) PASS: lldb-api :: functionalities/breakpoint/breakpoint_locations/TestBreakpointLocations.py (1972 of 2049) PASS: lldb-unit :: Process/minidump/./LLDBMinidumpTests/MinidumpParserTest.GetMemoryRegionInfoLinuxMaps (1973 of 2049) UNSUPPORTED: lldb-api :: linux/sepdebugsymlink/TestTargetSymbolsSepDebugSymlink.py (1974 of 2049) PASS: lldb-api :: python_api/watchpoint/TestWatchpointIter.py (1975 of 2049) PASS: lldb-api :: functionalities/data-formatter/type_summary_list_script/TestTypeSummaryListScript.py (1976 of 2049) PASS: lldb-unit :: Target/./TargetTests/ExecutionContextTest.GetByteOrder (1977 of 2049) PASS: lldb-api :: commands/watchpoints/watchpoint_on_vectors/TestValueOfVectorVariable.py (1978 of 2049) PASS: lldb-unit :: Language/Highlighting/./HighlighterTests/HighlighterTest.ClangCursorPos (1979 of 2049) PASS: lldb-unit :: Utility/./UtilityTests/AnsiTerminal.Unknown (1980 of 2049) PASS: lldb-api :: commands/apropos/basic/TestApropos.py (1981 of 2049) PASS: lldb-api :: python_api/frame/get-variables/TestGetVariables.py (1982 of 2049) PASS: lldb-api :: functionalities/breakpoint/breakpoint_ignore_count/TestBreakpointIgnoreCount.py (1983 of 2049) PASS: lldb-unit :: Utility/./UtilityTests/RegularExpression.CopyAssignment (1984 of 2049) PASS: lldb-unit :: Host/./HostTests/NativeProcessProtocolTest.ReadCStringFromMemory (1985 of 2049) PASS: lldb-api :: python_api/lldbutil/process/TestPrintStackTraces.py (1986 of 2049) PASS: lldb-unit :: Utility/./UtilityTests/BinaryStreamTest.PutSLEB128SixBytes (1987 of 2049) PASS: lldb-shell :: Driver/TestPositionalArgs.test (1988 of 2049) XFAIL: lldb-shell :: SymbolFile/DWARF/find-type-in-function.cpp (1989 of 2049) UNSUPPORTED: lldb-shell :: Unwind/unwind-plan-dwarf-dump.test (1990 of 2049) PASS: lldb-unit :: Utility/./UtilityTests/StringListTest.GetMaxStringLengthEqualSize (1991 of 2049) PASS: lldb-unit :: Symbol/./SymbolTests/TestTypeSystemClang.TestGetBasicTypeFromEnum (1992 of 2049) PASS: lldb-unit :: Utility/./UtilityTests/BinaryStreamTest.PutULEB128SevenBytes (1993 of 2049) PASS: lldb-api :: commands/expression/ignore-artificial-constructors/TestIgnoreArtificialConstructors.py (1994 of 2049) PASS: lldb-unit :: Utility/./UtilityTests/FileSpecTest.GetPath (1995 of 2049) PASS: lldb-api :: commands/expression/import-std-module/empty-module/TestEmptyStdModule.py (1996 of 2049) PASS: lldb-unit :: Process/gdb-remote/./ProcessGdbRemoteTests/GDBRemoteClientBaseTest.SendContinueAndAsyncSignal (1997 of 2049) PASS: lldb-api :: lang/cpp/llvm-style/TestLLVMStyle.py (1998 of 2049) PASS: lldb-unit :: Utility/./UtilityTests/UriParserTest.BadPort (1999 of 2049) PASS: lldb-unit :: UnwindAssembly/x86/./UnwindAssemblyx86Tests/Testx86AssemblyInspectionEngine.Test64bitFramelessSmallStackFrame (2000 of 2049) PASS: lldb-shell :: SymbolFile/DWARF/debug_loc.s (2001 of 2049) PASS: lldb-shell :: Process/TestEnvironment.test (2002 of 2049) PASS: lldb-unit :: Symbol/./SymbolTests/LineEntryTest.GetSameLineContiguousAddressRangeOneInline (2003 of 2049) PASS: lldb-unit :: Utility/./UtilityTests/ArchSpecTest.YAML (2004 of 2049) PASS: lldb-unit :: Utility/./UtilityTests/UserIDResolver.GetGroupName (2005 of 2049) PASS: lldb-shell :: Settings/TestSettingsSet.test (2006 of 2049) PASS: lldb-api :: functionalities/data-formatter/data-formatter-stl/libcxx/unordered/TestDataFormatterUnordered.py (2007 of 2049) PASS: lldb-api :: functionalities/data-formatter/data-formatter-stl/libcxx/forward_list/TestDataFormatterLibcxxForwardList.py (2008 of 2049) PASS: lldb-unit :: Target/./TargetTests/StackFrameRecognizerTest.NullModuleRegex (2009 of 2049) PASS: lldb-shell :: Reproducer/TestPythonImport.test (2010 of 2049) PASS: lldb-api :: lang/c/tls_globals/TestTlsGlobals.py (2011 of 2049) PASS: lldb-api :: lang/cpp/constructors/TestCppConstructors.py (2012 of 2049) FAIL: lldb-shell :: Reproducer/TestMultipleTargets.test (2013 of 2049) ******************** TEST 'lldb-shell :: Reproducer/TestMultipleTargets.test' FAILED ******************** Script: -- : 'RUN: at line 5'; /Users/buildslave/jenkins/workspace/lldb-cmake/lldb-build/bin/clang --target=specify-a-target-or-use-a-_host-substitution --target=x86_64-apple-darwin18.0.0 -isysroot /Applications/Xcode.app/Contents/Developer/Platforms/MacOSX.platform/Developer/SDKs/MacOSX.sdk -fmodules-cache-path=/Users/buildslave/jenkins/workspace/lldb-cmake/lldb-build/lldb-test-build.noindex/module-cache-clang/lldb-shell /Users/buildslave/jenkins/workspace/lldb-cmake/llvm-project/lldb/test/Shell/Reproducer/Inputs/simple.c -g -o /Users/buildslave/jenkins/workspace/lldb-cmake/lldb-build/tools/lldb/test/Reproducer/Output/TestMultipleTargets.test.tmp.out : 'RUN: at line 7'; rm -rf /Users/buildslave/jenkins/workspace/lldb-cmake/lldb-build/tools/lldb/test/Reproducer/Output/TestMultipleTargets.test.tmp.repro : 'RUN: at line 8'; /Users/buildslave/jenkins/workspace/lldb-cmake/lldb-build/bin/lldb --no-lldbinit -S /Users/buildslave/jenkins/workspace/lldb-cmake/lldb-build/tools/lldb/test/Shell/lit-lldb-init -x -b --capture --capture-path /Users/buildslave/jenkins/workspace/lldb-cmake/lldb-build/tools/lldb/test/Reproducer/Output/TestMultipleTargets.test.tmp.repro -o 'target create /Users/buildslave/jenkins/workspace/lldb-cmake/lldb-build/tools/lldb/test/Reproducer/Output/TestMultipleTargets.test.tmp.out' -o 'target create /Users/buildslave/jenkins/workspace/lldb-cmake/lldb-build/tools/lldb/test/Reproducer/Output/TestMultipleTargets.test.tmp.out' -s /Users/buildslave/jenkins/workspace/lldb-cmake/llvm-project/lldb/test/Shell/Reproducer/Inputs/MultipleTargetsCapture.in | /Users/buildslave/jenkins/workspace/lldb-cmake/lldb-build/bin/FileCheck /Users/buildslave/jenkins/workspace/lldb-cmake/llvm-project/lldb/test/Shell/Reproducer/TestMultipleTargets.test --check-prefix CHECK --check-prefix CAPTURE : 'RUN: at line 9'; env FOO=BAR /Users/buildslave/jenkins/workspace/lldb-cmake/lldb-build/bin/lldb --no-lldbinit -S /Users/buildslave/jenkins/workspace/lldb-cmake/lldb-build/tools/lldb/test/Shell/lit-lldb-init --replay /Users/buildslave/jenkins/workspace/lldb-cmake/lldb-build/tools/lldb/test/Reproducer/Output/TestMultipleTargets.test.tmp.repro | /Users/buildslave/jenkins/workspace/lldb-cmake/lldb-build/bin/FileCheck /Users/buildslave/jenkins/workspace/lldb-cmake/llvm-project/lldb/test/Shell/Reproducer/TestMultipleTargets.test --check-prefix CHECK --check-prefix REPLAY -- Exit Code: 1

Hide Details

Command Output (stderr): -- clang-11: warning: argument unused during compilation: '-fmodules-cache-path=/Users/buildslave/jenkins/workspace/lldb-cmake/lldb-build/lldb-test-build.noindex/module-cache-clang/lldb-shell' [-Wunused-command-line-argument] error: shell expansion failed (reason: timed out waiting for shell command to complete). consider launching with 'process launch'. /Users/buildslave/jenkins/workspace/lldb-cmake/llvm-project/lldb/test/Shell/Reproducer/TestMultipleTargets.test:11:10: error: CHECK: expected string not found in input # CHECK: Process [[TARGET0:[0-9]+]] stopped ^ <stdin>:1:1: note: scanning from here (lldb) command source -s 0 '/Users/buildslave/jenkins/workspace/lldb-cmake/lldb-build/tools/lldb/test/Shell/lit-lldb-init' ^ <stdin>:5:26: note: possible intended match here (lldb) settings set plugin.process.gdb-remote.packet-timeout 60 ^

Hide Details

--

Hide Details

******************** UNSUPPORTED: lldb-shell :: Register/x86-64-xmm16-read.test (2014 of 2049) PASS: lldb-unit :: Process/gdb-remote/./ProcessGdbRemoteTests/GDBRemoteCommunicationClientTest.GetModulesInfo (2015 of 2049) PASS: lldb-shell :: ObjectFile/ELF/short-build-id.yaml (2016 of 2049) UNSUPPORTED: lldb-api :: tools/lldb-server/TestGdbRemoteAuxvSupport.py (2017 of 2049) PASS: lldb-unit :: UnwindAssembly/x86/./UnwindAssemblyx86Tests/Testx86AssemblyInspectionEngine.TestSpArithx86_64Augmented (2018 of 2049) PASS: lldb-unit :: UnwindAssembly/x86/./UnwindAssemblyx86Tests/Testx86AssemblyInspectionEngine.TestPushR12 (2019 of 2049) PASS: lldb-unit :: Process/minidump/./LLDBMinidumpTests/MinidumpParserTest.GetMemory (2020 of 2049) UNSUPPORTED: lldb-api :: functionalities/thread/multi_break/TestMultipleBreakpoints.py (2021 of 2049) PASS: lldb-unit :: UnwindAssembly/x86/./UnwindAssemblyx86Tests/Testx86AssemblyInspectionEngine.TestStackRealignMSVC_i386 (2022 of 2049) PASS: lldb-api :: commands/expression/save_jit_objects/TestSaveJITObjects.py (2023 of 2049) UNSUPPORTED: lldb-shell :: SymbolFile/PDB/function-level-linking.test (2024 of 2049) PASS: lldb-unit :: Utility/./UtilityTests/CompletionRequest.DuplicateFiltering (2025 of 2049) PASS: lldb-unit :: Utility/./UtilityTests/ScalarTest.GetBytes (2026 of 2049) PASS: lldb-api :: python_api/section/TestSectionAPI.py (2027 of 2049) PASS: lldb-api :: functionalities/thread/jump/TestThreadJump.py (2028 of 2049) PASS: lldb-api :: functionalities/dynamic_value_child_count/TestDynamicValueChildCount.py (2029 of 2049) PASS: lldb-api :: functionalities/avoids-fd-leak/TestFdLeak.py (2030 of 2049) UNSUPPORTED: lldb-api :: lang/c/typedef/Testtypedef.py (2031 of 2049) PASS: lldb-api :: lang/cpp/chained-calls/TestCppChainedCalls.py (2032 of 2049) PASS: lldb-api :: tools/lldb-server/TestGdbRemoteRegisterState.py (2033 of 2049) PASS: lldb-api :: lang/cpp/namespace_conflicts/TestNamespaceConflicts.py (2034 of 2049) PASS: lldb-api :: lang/objc/objc-stepping/TestObjCStepping.py (2035 of 2049) PASS: lldb-api :: lang/objc/objc++/TestObjCXX.py (2036 of 2049) PASS: lldb-api :: functionalities/thread/concurrent_events/TestConcurrentManyCrash.py (2037 of 2049) PASS: lldb-api :: commands/gui/basic/TestGuiBasic.py (2038 of 2049) PASS: lldb-api :: functionalities/data-formatter/data-formatter-stl/libcxx/multiset/TestDataFormatterLibcxxMultiSet.py (2039 of 2049) PASS: lldb-api :: commands/frame/recognizer/TestFrameRecognizer.py (2040 of 2049) PASS: lldb-api :: functionalities/data-formatter/setvaluefromcstring/TestSetValueFromCString.py (2041 of 2049) FAIL: lldb-api :: functionalities/data-formatter/data-formatter-objc/nsindexpath/TestDataFormatterNSIndexPath.py (2042 of 2049) ******************** TEST 'lldb-api :: functionalities/data-formatter/data-formatter-objc/nsindexpath/TestDataFormatterNSIndexPath.py' FAILED ******************** Script: -- /usr/local/Frameworks/Python.framework/Versions/3.7/bin/python3.7 /Users/buildslave/jenkins/workspace/lldb-cmake/llvm-project/lldb/test/API/dotest.py --arch x86_64 -s /Users/buildslave/jenkins/workspace/lldb-cmake/lldb-build/lldb-test-traces -S nm -u CXXFLAGS -u CFLAGS --codesign-identity lldb_codesign --server /Users/buildslave/jenkins/workspace/lldb-cmake/lldb-build/./bin/debugserver --arch x86_64 --build-dir /Users/buildslave/jenkins/workspace/lldb-cmake/lldb-build/lldb-test-build.noindex -s=/Users/buildslave/jenkins/workspace/lldb-cmake/test/logs -t --env TERM=vt100 --env LLVM_LIBS_DIR=/Users/buildslave/jenkins/workspace/lldb-cmake/lldb-build/./lib --build-dir /Users/buildslave/jenkins/workspace/lldb-cmake/lldb-build/lldb-test-build.noindex --lldb-module-cache-dir /Users/buildslave/jenkins/workspace/lldb-cmake/lldb-build/lldb-test-build.noindex/module-cache-lldb/lldb-api --clang-module-cache-dir /Users/buildslave/jenkins/workspace/lldb-cmake/lldb-build/lldb-test-build.noindex/module-cache-clang/lldb-api --executable /Users/buildslave/jenkins/workspace/lldb-cmake/lldb-build/./bin/lldb --compiler /Users/buildslave/jenkins/workspace/lldb-cmake/lldb-build/./bin/clang --dsymutil /Users/buildslave/jenkins/workspace/lldb-cmake/lldb-build/./bin/dsymutil --filecheck /Users/buildslave/jenkins/workspace/lldb-cmake/lldb-build/./bin/FileCheck --lldb-libs-dir /Users/buildslave/jenkins/workspace/lldb-cmake/lldb-build/./lib /Users/buildslave/jenkins/workspace/lldb-cmake/llvm-project/lldb/test/API/functionalities/data-formatter/data-formatter-objc/nsindexpath -p TestDataFormatterNSIndexPath.py -- Exit Code: 1

Hide Details

Command Output (stdout): -- lldb version 11.0.99 clang revision 059ba74bb6f6166ca7c1783ef81dd37a5209b758 llvm revision 059ba74bb6f6166ca7c1783ef81dd37a5209b758 LLDB library dir: /Users/buildslave/jenkins/workspace/lldb-cmake/lldb-build/bin LLDB import library dir: /Users/buildslave/jenkins/workspace/lldb-cmake/lldb-build/./lib libstdcxx tests will not be run because: Don't know how to build with libstdcxx on macosx Skipping following debug info categories: ['dwo']

Hide Details

-- Command Output (stderr): --

Hide Details

Session logs for test failures/errors/unexpected successes will go into directory '/Users/buildslave/jenkins/workspace/lldb-cmake/test/logs' Change dir to: /Users/buildslave/jenkins/workspace/lldb-cmake/llvm-project/lldb/test/API/functionalities/data-formatter/data-formatter-objc/nsindexpath runCmd: settings clear -all output:

Hide Details

runCmd: settings set symbols.enable-external-lookup false output:

Hide Details

runCmd: settings set target.auto-apply-fixits false output:

Hide Details

runCmd: settings set plugin.process.gdb-remote.packet-timeout 60 output:

Hide Details

runCmd: settings set symbols.clang-modules-cache-path "/Users/buildslave/jenkins/workspace/lldb-cmake/lldb-build/lldb-test-build.noindex/module-cache-lldb/lldb-api" output:

Hide Details

runCmd: settings set use-color false output:

Hide Details

runCmd: setting set target.prefer-dynamic-value no-dynamic-values output:

Hide Details

runCmd: file /Users/buildslave/jenkins/workspace/lldb-cmake/lldb-build/lldb-test-build.noindex/functionalities/data-formatter/data-formatter-objc/nsindexpath/TestDataFormatterNSIndexPath.test_nsindexpath_with_run_command_dsym/a.out output: Current executable set to '/Users/buildslave/jenkins/workspace/lldb-cmake/lldb-build/lldb-test-build.noindex/functionalities/data-formatter/data-formatter-objc/nsindexpath/TestDataFormatterNSIndexPath.test_nsindexpath_with_run_command_dsym/a.out' (x86_64).

Hide Details

Hide Details

runCmd: breakpoint set -f "main.m" -l 15 output: Breakpoint 1: where = a.out`main + 301 at main.m:15:22, address = 0x0000000100000e9d

Hide Details

Hide Details

Expecting pattern: ^Breakpoint (?P<bpno>[0-9]+): (?P<num_locations>[0-9]+) locations\.$ Not matched

Hide Details

Expecting pattern: ^Breakpoint (?P<bpno>[0-9]+): (?P<num_locations>no) locations \(pending\)\. Not matched

Hide Details

Expecting pattern: ^Breakpoint (?P<bpno>[0-9]+): where = (?P<module>.*)`(?P<symbol>[+\-]{0,1}[^+]+)( \+ (?P<offset>[0-9]+)){0,1}( \[inlined\] (?P<inline_symbol>.*)){0,1} at (?P<file>[^:]+):(?P<line_no>[0-9]+)(?P<column>(:[0-9]+)?), address = (?P<address>0x[0-9a-fA-F]+)$ Matched

Hide Details

runCmd: run runCmd failed! error: shell expansion failed (reason: timed out waiting for shell command to complete). consider launching with 'process launch'.

Hide Details

Hide Details

Command 'run' failed!

Hide Details

FAIL: LLDB (/Users/buildslave/jenkins/workspace/lldb-cmake/lldb-build/bin/clang-11-x86_64) :: test_nsindexpath_with_run_command_dsym (TestDataFormatterNSIndexPath.NSIndexPathDataFormatterTestCase) runCmd: settings clear -all output:

Hide Details

runCmd: settings set symbols.enable-external-lookup false output:

Hide Details

runCmd: settings set target.auto-apply-fixits false output:

Hide Details

runCmd: settings set plugin.process.gdb-remote.packet-timeout 60 output:

Hide Details

runCmd: settings set symbols.clang-modules-cache-path "/Users/buildslave/jenkins/workspace/lldb-cmake/lldb-build/lldb-test-build.noindex/module-cache-lldb/lldb-api" output:

Hide Details

runCmd: settings set use-color false output:

Hide Details

runCmd: setting set target.prefer-dynamic-value no-dynamic-values output:

Hide Details

runCmd: file /Users/buildslave/jenkins/workspace/lldb-cmake/lldb-build/lldb-test-build.noindex/functionalities/data-formatter/data-formatter-objc/nsindexpath/TestDataFormatterNSIndexPath.test_nsindexpath_with_run_command_dwarf/a.out output: Current executable set to '/Users/buildslave/jenkins/workspace/lldb-cmake/lldb-build/lldb-test-build.noindex/functionalities/data-formatter/data-formatter-objc/nsindexpath/TestDataFormatterNSIndexPath.test_nsindexpath_with_run_command_dwarf/a.out' (x86_64).

Hide Details

Hide Details

runCmd: breakpoint set -f "main.m" -l 15 output: Breakpoint 1: where = a.out`main + 301 at main.m:15:22, address = 0x0000000100000e9d

Hide Details

Hide Details

Expecting pattern: ^Breakpoint (?P<bpno>[0-9]+): (?P<num_locations>[0-9]+) locations\.$ Not matched

Hide Details

Expecting pattern: ^Breakpoint (?P<bpno>[0-9]+): (?P<num_locations>no) locations \(pending\)\. Not matched

Hide Details

Expecting pattern: ^Breakpoint (?P<bpno>[0-9]+): where = (?P<module>.*)`(?P<symbol>[+\-]{0,1}[^+]+)( \+ (?P<offset>[0-9]+)){0,1}( \[inlined\] (?P<inline_symbol>.*)){0,1} at (?P<file>[^:]+):(?P<line_no>[0-9]+)(?P<column>(:[0-9]+)?), address = (?P<address>0x[0-9a-fA-F]+)$ Matched

Hide Details

runCmd: run output: Process 46532 stopped * thread #1, queue = 'com.apple.main-thread', stop reason = breakpoint 1.1 frame #0: 0x0000000100000e9d a.out`main(argc=1, argv=0x00007ffeefbff708) at main.m:15:22 12 NSIndexPath* indexPath4 = [NSIndexPath indexPathWithIndexes:values length:4]; 13 NSIndexPath* indexPath5 = [NSIndexPath indexPathWithIndexes:values length:5]; 14 -> 15 NSLog(@"%@", indexPath1); // break here ^ 16 NSLog(@"%@", indexPath2); 17 NSLog(@"%@", indexPath3); 18 NSLog(@"%@", indexPath4);

Hide Details

Process 46532 launched: '/Users/buildslave/jenkins/workspace/lldb-cmake/lldb-build/lldb-test-build.noindex/functionalities/data-formatter/data-formatter-objc/nsindexpath/TestDataFormatterNSIndexPath.test_nsindexpath_with_run_command_dwarf/a.out' (x86_64)

Hide Details

Hide Details

runCmd: thread list output: Process 46532 stopped * thread #1: tid = 0x38adea4, 0x0000000100000e9d a.out`main(argc=1, argv=0x00007ffeefbff708) at main.m:15:22, queue = 'com.apple.main-thread', stop reason = breakpoint 1.1

Hide Details

Hide Details

Expecting sub string: stopped Matched

Hide Details

Expecting sub string: stop reason = breakpoint Matched

Hide Details

Adding tearDown hook: def cleanup(): self.runCmd('type format clear', check=False) self.runCmd('type summary clear', check=False) self.runCmd('type synth clear', check=False)

Hide Details

Hide Details

runCmd: frame variable --ptr-depth=1 -d run -- indexPath1 output: (NSIndexPath *) indexPath1 = 0xc4b7c8f7e3ec34d7 { [0] = 1 }

Hide Details

Hide Details

Expecting sub string: [0] = 1 Matched

Hide Details

runCmd: frame variable --ptr-depth=1 -d run -- indexPath2 output: (NSIndexPath *) indexPath2 = 0xc4b7c8f7e7ec3557 { [0] = 1 [1] = 2 }

Hide Details

Hide Details

Expecting sub string: [0] = 1 Matched

Hide Details

Expecting sub string: [1] = 2 Matched

Hide Details

runCmd: frame variable --ptr-depth=1 -d run -- indexPath3 output: (NSIndexPath *) indexPath3 = 0xc4b7c837e7ec35d7 { [0] = 1 [1] = 2 [2] = 3 }

Hide Details

Hide Details

Expecting sub string: [0] = 1 Matched

Hide Details

Expecting sub string: [1] = 2 Matched

Hide Details

Expecting sub string: [2] = 3 Matched

Hide Details

runCmd: frame variable --ptr-depth=1 -d run -- indexPath4 output: (NSIndexPath *) indexPath4 = 0xc497c837e7ec3657 { [0] = 1 [1] = 2 [2] = 3 [3] = 4 }

Hide Details

Hide Details

Expecting sub string: [0] = 1 Matched

Hide Details

Expecting sub string: [1] = 2 Matched

Hide Details

Expecting sub string: [2] = 3 Matched

Hide Details

Expecting sub string: [3] = 4 Matched

Hide Details

runCmd: frame variable --ptr-depth=1 -d run -- indexPath5 output: (NSIndexPath *) indexPath5 = 0x00000001003056f0 { [0] = 1 [1] = 2 [2] = 3 [3] = 4 [4] = 5 }

Hide Details

Hide Details

Expecting sub string: [0] = 1 Matched

Hide Details

Expecting sub string: [1] = 2 Matched

Hide Details

Expecting sub string: [2] = 3 Matched

Hide Details

Expecting sub string: [3] = 4 Matched

Hide Details

Expecting sub string: [4] = 5 Matched

Hide Details

runCmd: expression --ptr-depth=1 -d run -- indexPath1 output: (NSIndexPath *) $0 = 0xc4b7c8f7e3ec34d7 { [0] = 1 }

Hide Details

Hide Details

Expecting sub string: [0] = 1 Matched

Hide Details

runCmd: expression --ptr-depth=1 -d run -- indexPath2 output: (NSIndexPath *) $1 = 0xc4b7c8f7e7ec3557 { [0] = 1 [1] = 2 }

Hide Details

Hide Details

Expecting sub string: [0] = 1 Matched

Hide Details

Expecting sub string: [1] = 2 Matched

Hide Details

runCmd: expression --ptr-depth=1 -d run -- indexPath3 output: (NSIndexPath *) $2 = 0xc4b7c837e7ec35d7 { [0] = 1 [1] = 2 [2] = 3 }

Hide Details

Hide Details

Expecting sub string: [0] = 1 Matched

Hide Details

Expecting sub string: [1] = 2 Matched

Hide Details

Expecting sub string: [2] = 3 Matched

Hide Details

runCmd: expression --ptr-depth=1 -d run -- indexPath4 output: (NSIndexPath *) $3 = 0xc497c837e7ec3657 { [0] = 1 [1] = 2 [2] = 3 [3] = 4 }

Hide Details

Hide Details

Expecting sub string: [0] = 1 Matched

Hide Details

Expecting sub string: [1] = 2 Matched

Hide Details

Expecting sub string: [2] = 3 Matched

Hide Details

Expecting sub string: [3] = 4 Matched

Hide Details

runCmd: expression --ptr-depth=1 -d run -- indexPath5 output: (NSIndexPath *) $4 = 0x00000001003056f0 { [0] = 1 [1] = 2 [2] = 3 [3] = 4 [4] = 5 }

Hide Details

Hide Details

Expecting sub string: [0] = 1 Matched

Hide Details

Expecting sub string: [1] = 2 Matched

Hide Details

Expecting sub string: [2] = 3 Matched

Hide Details

Expecting sub string: [3] = 4 Matched

Hide Details

Expecting sub string: [4] = 5 Matched

Hide Details

<bound method SBProcess.Kill of <lldb.SBProcess; proxy of <Swig Object of type 'lldb::SBProcess *' at 0x10a049bd0> >>: success

Hide Details

Executing tearDown hook: def cleanup(): self.runCmd('type format clear', check=False) self.runCmd('type summary clear', check=False) self.runCmd('type synth clear', check=False)

Hide Details

Hide Details

runCmd: type format clear check of return status not required output:

Hide Details

runCmd: type summary clear check of return status not required output:

Hide Details

runCmd: type synth clear check of return status not required output:

Hide Details

PASS: LLDB (/Users/buildslave/jenkins/workspace/lldb-cmake/lldb-build/bin/clang-11-x86_64) :: test_nsindexpath_with_run_command_dwarf (TestDataFormatterNSIndexPath.NSIndexPathDataFormatterTestCase) UNSUPPORTED: LLDB (/Users/buildslave/jenkins/workspace/lldb-cmake/lldb-build/bin/clang-11-x86_64) :: test_nsindexpath_with_run_command_dwo (TestDataFormatterNSIndexPath.NSIndexPathDataFormatterTestCase) (test case does not fall in any category of interest for this run) runCmd: settings clear -all output:

Hide Details

runCmd: settings set symbols.enable-external-lookup false output:

Hide Details

runCmd: settings set target.auto-apply-fixits false output:

Hide Details

runCmd: settings set plugin.process.gdb-remote.packet-timeout 60 output:

Hide Details

runCmd: settings set symbols.clang-modules-cache-path "/Users/buildslave/jenkins/workspace/lldb-cmake/lldb-build/lldb-test-build.noindex/module-cache-lldb/lldb-api" output:

Hide Details

runCmd: settings set use-color false output:

Hide Details

runCmd: setting set target.prefer-dynamic-value no-dynamic-values output:

Hide Details

runCmd: file /Users/buildslave/jenkins/workspace/lldb-cmake/lldb-build/lldb-test-build.noindex/functionalities/data-formatter/data-formatter-objc/nsindexpath/TestDataFormatterNSIndexPath.test_nsindexpath_with_run_command_gmodules/a.out output: Current executable set to '/Users/buildslave/jenkins/workspace/lldb-cmake/lldb-build/lldb-test-build.noindex/functionalities/data-formatter/data-formatter-objc/nsindexpath/TestDataFormatterNSIndexPath.test_nsindexpath_with_run_command_gmodules/a.out' (x86_64).

Hide Details

Hide Details

runCmd: breakpoint set -f "main.m" -l 15 output: Breakpoint 1: where = a.out`main + 301 at main.m:15:22, address = 0x0000000100000e9d

Hide Details

Hide Details

Expecting pattern: ^Breakpoint (?P<bpno>[0-9]+): (?P<num_locations>[0-9]+) locations\.$ Not matched

Hide Details

Expecting pattern: ^Breakpoint (?P<bpno>[0-9]+): (?P<num_locations>no) locations \(pending\)\. Not matched

Hide Details

Expecting pattern: ^Breakpoint (?P<bpno>[0-9]+): where = (?P<module>.*)`(?P<symbol>[+\-]{0,1}[^+]+)( \+ (?P<offset>[0-9]+)){0,1}( \[inlined\] (?P<inline_symbol>.*)){0,1} at (?P<file>[^:]+):(?P<line_no>[0-9]+)(?P<column>(:[0-9]+)?), address = (?P<address>0x[0-9a-fA-F]+)$ Matched

Hide Details

runCmd: run output: Process 46952 stopped * thread #1, queue = 'com.apple.main-thread', stop reason = breakpoint 1.1 frame #0: 0x0000000100000e9d a.out`main(argc=1, argv=0x00007ffeefbff708) at main.m:15:22 12 NSIndexPath* indexPath4 = [NSIndexPath indexPathWithIndexes:values length:4]; 13 NSIndexPath* indexPath5 = [NSIndexPath indexPathWithIndexes:values length:5]; 14 -> 15 NSLog(@"%@", indexPath1); // break here ^ 16 NSLog(@"%@", indexPath2); 17 NSLog(@"%@", indexPath3); 18 NSLog(@"%@", indexPath4);

Hide Details

Process 46952 launched: '/Users/buildslave/jenkins/workspace/lldb-cmake/lldb-build/lldb-test-build.noindex/functionalities/data-formatter/data-formatter-objc/nsindexpath/TestDataFormatterNSIndexPath.test_nsindexpath_with_run_command_gmodules/a.out' (x86_64)

Hide Details

Hide Details

runCmd: thread list output: Process 46952 stopped * thread #1: tid = 0x38ae381, 0x0000000100000e9d a.out`main(argc=1, argv=0x00007ffeefbff708) at main.m:15:22, queue = 'com.apple.main-thread', stop reason = breakpoint 1.1

Hide Details

Hide Details

Expecting sub string: stopped Matched

Hide Details

Expecting sub string: stop reason = breakpoint Matched

Hide Details

Adding tearDown hook: def cleanup(): self.runCmd('type format clear', check=False) self.runCmd('type summary clear', check=False) self.runCmd('type synth clear', check=False)

Hide Details

Hide Details

runCmd: frame variable --ptr-depth=1 -d run -- indexPath1 output: (NSIndexPath *) indexPath1 = 0x607f51c7209d4a37 { [0] = 1 }

Hide Details

Hide Details

Expecting sub string: [0] = 1 Matched

Hide Details

runCmd: frame variable --ptr-depth=1 -d run -- indexPath2 output: (NSIndexPath *) indexPath2 = 0x607f51c7249d4bb7 { [0] = 1 [1] = 2 }

Hide Details

Hide Details

Expecting sub string: [0] = 1 Matched

Hide Details

Expecting sub string: [1] = 2 Matched

Hide Details

runCmd: frame variable --ptr-depth=1 -d run -- indexPath3 output: (NSIndexPath *) indexPath3 = 0x607f5107249d4b37 { [0] = 1 [1] = 2 [2] = 3 }

Hide Details

Hide Details

Expecting sub string: [0] = 1 Matched

Hide Details

Expecting sub string: [1] = 2 Matched

Hide Details

Expecting sub string: [2] = 3 Matched

Hide Details

runCmd: frame variable --ptr-depth=1 -d run -- indexPath4 output: (NSIndexPath *) indexPath4 = 0x605f5107249d48b7 { [0] = 1 [1] = 2 [2] = 3 [3] = 4 }

Hide Details

Hide Details

Expecting sub string: [0] = 1 Matched

Hide Details

Expecting sub string: [1] = 2 Matched

Hide Details

Expecting sub string: [2] = 3 Matched

Hide Details

Expecting sub string: [3] = 4 Matched

Hide Details

runCmd: frame variable --ptr-depth=1 -d run -- indexPath5 output: (NSIndexPath *) indexPath5 = 0x00000001003056f0 { [0] = 1 [1] = 2 [2] = 3 [3] = 4 [4] = 5 }

Hide Details

Hide Details

Expecting sub string: [0] = 1 Matched

Hide Details

Expecting sub string: [1] = 2 Matched

Hide Details

Expecting sub string: [2] = 3 Matched

Hide Details

Expecting sub string: [3] = 4 Matched

Hide Details

Expecting sub string: [4] = 5 Matched

Hide Details

runCmd: expression --ptr-depth=1 -d run -- indexPath1 output: (NSIndexPath *) $0 = 0x607f51c7209d4a37 { [0] = 1 }

Hide Details

Hide Details

Expecting sub string: [0] = 1 Matched

Hide Details

runCmd: expression --ptr-depth=1 -d run -- indexPath2 output: (NSIndexPath *) $1 = 0x607f51c7249d4bb7 { [0] = 1 [1] = 2 }

Hide Details

Hide Details

Expecting sub string: [0] = 1 Matched

Hide Details

Expecting sub string: [1] = 2 Matched

Hide Details

runCmd: expression --ptr-depth=1 -d run -- indexPath3 output: (NSIndexPath *) $2 = 0x607f5107249d4b37 { [0] = 1 [1] = 2 [2] = 3 }

Hide Details

Hide Details

Expecting sub string: [0] = 1 Matched

Hide Details

Expecting sub string: [1] = 2 Matched

Hide Details

Expecting sub string: [2] = 3 Matched

Hide Details

runCmd: expression --ptr-depth=1 -d run -- indexPath4 output: (NSIndexPath *) $3 = 0x605f5107249d48b7 { [0] = 1 [1] = 2 [2] = 3 [3] = 4 }

Hide Details

Hide Details

Expecting sub string: [0] = 1 Matched

Hide Details

Expecting sub string: [1] = 2 Matched

Hide Details

Expecting sub string: [2] = 3 Matched

Hide Details

Expecting sub string: [3] = 4 Matched

Hide Details

runCmd: expression --ptr-depth=1 -d run -- indexPath5 output: (NSIndexPath *) $4 = 0x00000001003056f0 { [0] = 1 [1] = 2 [2] = 3 [3] = 4 [4] = 5 }

Hide Details

Hide Details

Expecting sub string: [0] = 1 Matched

Hide Details

Expecting sub string: [1] = 2 Matched

Hide Details

Expecting sub string: [2] = 3 Matched

Hide Details

Expecting sub string: [3] = 4 Matched

Hide Details

Expecting sub string: [4] = 5 Matched

Hide Details

<bound method SBProcess.Kill of <lldb.SBProcess; proxy of <Swig Object of type 'lldb::SBProcess *' at 0x10a05b660> >>: success

Hide Details

Executing tearDown hook: def cleanup(): self.runCmd('type format clear', check=False) self.runCmd('type summary clear', check=False) self.runCmd('type synth clear', check=False)

Hide Details

Hide Details

runCmd: type format clear check of return status not required output:

Hide Details

runCmd: type summary clear check of return status not required output:

Hide Details

runCmd: type synth clear check of return status not required output:

Hide Details

PASS: LLDB (/Users/buildslave/jenkins/workspace/lldb-cmake/lldb-build/bin/clang-11-x86_64) :: test_nsindexpath_with_run_command_gmodules (TestDataFormatterNSIndexPath.NSIndexPathDataFormatterTestCase) Restore dir to: /Users/buildslave/jenkins/workspace/lldb-cmake/lldb-build/tools/lldb/test ====================================================================== FAIL: test_nsindexpath_with_run_command_dsym (TestDataFormatterNSIndexPath.NSIndexPathDataFormatterTestCase) Test formatters for NSIndexPath. ---------------------------------------------------------------------- Traceback (most recent call last): File "/Users/buildslave/jenkins/workspace/lldb-cmake/llvm-project/lldb/packages/Python/lldbsuite/test/lldbtest.py", line 1767, in test_method return attrvalue(self) File "/Users/buildslave/jenkins/workspace/lldb-cmake/llvm-project/lldb/packages/Python/lldbsuite/test/decorators.py", line 110, in wrapper func(*args, **kwargs) File "/Users/buildslave/jenkins/workspace/lldb-cmake/llvm-project/lldb/packages/Python/lldbsuite/test/decorators.py", line 110, in wrapper func(*args, **kwargs) File "/Users/buildslave/jenkins/workspace/lldb-cmake/llvm-project/lldb/test/API/functionalities/data-formatter/data-formatter-objc/nsindexpath/TestDataFormatterNSIndexPath.py", line 48, in test_nsindexpath_with_run_command self.appkit_tester_impl(self.nsindexpath_data_formatter_commands) File "/Users/buildslave/jenkins/workspace/lldb-cmake/llvm-project/lldb/test/API/functionalities/data-formatter/data-formatter-objc/nsindexpath/TestDataFormatterNSIndexPath.py", line 25, in appkit_tester_impl self.runCmd("run", RUN_SUCCEEDED) File "/Users/buildslave/jenkins/workspace/lldb-cmake/llvm-project/lldb/packages/Python/lldbsuite/test/lldbtest.py", line 2092, in runCmd msg if (msg) else CMD_MSG(cmd)) AssertionError: False is not True : Process is launched successfully Error output: error: shell expansion failed (reason: timed out waiting for shell command to complete). consider launching with 'process launch'.

Hide Details

Config=x86_64-/Users/buildslave/jenkins/workspace/lldb-cmake/lldb-build/bin/clang-11 ---------------------------------------------------------------------- Ran 4 tests in 24.694s

Hide Details

RESULT: FAILED (2 passes, 1 failures, 0 errors, 1 skipped, 0 expected failures, 0 unexpected successes)

Hide Details

--

Hide Details

******************** PASS: lldb-api :: functionalities/data-formatter/data-formatter-objc/TestDataFormatterObjCNSError.py (2043 of 2049) PASS: lldb-api :: commands/expression/import-std-module/vector/TestVectorFromStdModule.py (2044 of 2049) PASS: lldb-api :: lang/objcxx/hide-runtime-values/TestObjCXXHideRuntimeValues.py (2045 of 2049) PASS: lldb-api :: lang/objc/modules/TestObjCModules.py (2046 of 2049) PASS: lldb-api :: lang/cpp/namespace/TestNamespaceLookup.py (2047 of 2049) PASS: lldb-api :: lang/cpp/enum_types/TestCPP11EnumTypes.py (2048 of 2049) PASS: lldb-api :: lang/objc/objc-new-syntax/TestObjCNewSyntaxLiteral.py (2049 of 2049) Slowest Tests: -------------------------------------------------------------------------- 184.34s: lldb-api :: lang/objc/foundation/TestFoundationDisassembly.py 105.75s: lldb-api :: tools/lldb-server/TestLldbGdbServer.py 97.13s: lldb-api :: lang/objc/hidden-ivars/TestHiddenIvars.py 94.95s: lldb-api :: lang/objc/foundation/TestObjCMethods.py 85.46s: lldb-api :: api/multithreaded/TestMultithreaded.py 84.36s: lldb-api :: lang/objc/exceptions/TestObjCExceptions.py 74.36s: lldb-api :: lang/cpp/enum_types/TestCPP11EnumTypes.py 59.37s: lldb-api :: lang/objc/foundation/TestObjCMethodsString.py 59.14s: lldb-api :: lang/objc/objc-new-syntax/TestObjCNewSyntaxDictionary.py 58.70s: lldb-api :: lang/cpp/namespace/TestNamespaceLookup.py 57.57s: lldb-api :: types/TestLongTypes.py 55.58s: lldb-api :: types/TestLongTypesExpr.py 54.15s: lldb-api :: lang/objc/objc-new-syntax/TestObjCNewSyntaxLiteral.py 53.16s: lldb-api :: lang/objc/real-definition/TestRealDefinition.py 49.16s: lldb-api :: lang/objc/objc-new-syntax/TestObjCNewSyntaxArray.py 46.93s: lldb-api :: lang/objc/forward-decl/TestForwardDecl.py 44.87s: lldb-api :: types/TestIntegerTypeExpr.py 44.32s: lldb-api :: lang/objc/foundation/TestObjCMethodsNSError.py 39.06s: lldb-api :: functionalities/inferior-crashing/TestInferiorCrashingStep.py 38.31s: lldb-api :: lang/c/anonymous/TestAnonymous.py

Hide Details

Tests Times: -------------------------------------------------------------------------- [ Range ] :: [ Percentage ] :: [ Count ] -------------------------------------------------------------------------- [180s,190s) :: [ ] :: [ 1/2049] [170s,180s) :: [ ] :: [ 0/2049] [160s,170s) :: [ ] :: [ 0/2049] [150s,160s) :: [ ] :: [ 0/2049] [140s,150s) :: [ ] :: [ 0/2049] [130s,140s) :: [ ] :: [ 0/2049] [120s,130s) :: [ ] :: [ 0/2049] [110s,120s) :: [ ] :: [ 0/2049] [100s,110s) :: [ ] :: [ 2/2049] [ 90s,100s) :: [ ] :: [ 1/2049] [ 80s, 90s) :: [ ] :: [ 2/2049] [ 70s, 80s) :: [ ] :: [ 1/2049] [ 60s, 70s) :: [ ] :: [ 3/2049] [ 50s, 60s) :: [ ] :: [ 5/2049] [ 40s, 50s) :: [ ] :: [ 4/2049] [ 30s, 40s) :: [ ] :: [ 16/2049] [ 20s, 30s) :: [* ] :: [ 64/2049] [ 10s, 20s) :: [*** ] :: [ 167/2049] [ 0s, 10s) :: [********************************** ] :: [1783/2049] -------------------------------------------------------------------------- ******************** Failed Tests (5): lldb-api :: functionalities/data-formatter/nsdictionarysynth/TestNSDictionarySynthetic.py lldb-api :: types/TestCharType.py lldb-api :: functionalities/archives/TestBSDArchives.py lldb-api :: functionalities/data-formatter/data-formatter-objc/nsindexpath/TestDataFormatterNSIndexPath.py lldb-shell :: Reproducer/TestMultipleTargets.test

Hide Details

Hide Details

Testing Time: 364.85s Unsupported : 132 Passed : 1906 Expectedly Failed: 6 Failed : 5 FAILED: tools/lldb/test/CMakeFiles/check-lldb-lit cd /Users/buildslave/jenkins/workspace/lldb-cmake/lldb-build/tools/lldb/test && /usr/local/Frameworks/Python.framework/Versions/3.7/bin/python3.7 /Users/buildslave/jenkins/workspace/lldb-cmake/lldb-build/./bin/llvm-lit -v --time-tests --shuffle --xunit-xml-output=/Users/buildslave/jenkins/workspace/lldb-cmake/test/results.xml -v /Users/buildslave/jenkins/workspace/lldb-cmake/lldb-build/tools/lldb/test ninja: build stopped: subcommand failed. Command failed: Command '['/usr/bin/env', 'TERM=vt100', '/usr/local/bin/ninja', '-v', 'check-lldb']' returned non-zero exit status 1. Command: ['/usr/bin/env', 'TERM=vt100', '/usr/local/bin/ninja', '-v', 'check-lldb'] [Pipeline] } [Pipeline] // timeout [Pipeline] } [Pipeline] // stage [Pipeline] stage [Pipeline] { (Trigger Downstream Jobs) Stage "Trigger Downstream Jobs" skipped due to earlier failure(s) [Pipeline] } [Pipeline] // stage [Pipeline] stage [Pipeline] { (Declarative: Post Actions) [Pipeline] scanForIssues [Clang (LLVM based)] Sleeping for 5 seconds due to JENKINS-32191... [Clang (LLVM based)] Parsing console log (workspace: '/Users/buildslave/jenkins/workspace/lldb-cmake') [Clang (LLVM based)] Successfully parsed console log [Clang (LLVM based)] -> found 1 issue (skipped 0 duplicates) [Clang (LLVM based)] Post processing issues on 'green-dragon-24' with source code encoding 'UTF-8' [Clang (LLVM based)] Creating SCM blamer to obtain author and commit information for affected files [Clang (LLVM based)] Creating SCM miner to obtain statistics for affected repository files [Clang (LLVM based)] Resolving file names for all issues in source directory '/Users/buildslave/jenkins/workspace/lldb-cmake' [Clang (LLVM based)] -> resolved paths in source directory (1 found, 0 not found) [Clang (LLVM based)] Resolving module names from module definitions (build.xml, pom.xml, or Manifest.mf files) [Clang (LLVM based)] -> resolved module names for 1 issues [Clang (LLVM based)] Resolving package names (or namespaces) by parsing the affected files [Clang (LLVM based)] -> resolved package names of 1 affected files [Clang (LLVM based)] No filter has been set, publishing all 1 issues [Clang (LLVM based)] Creating fingerprints for all affected code blocks to track issues over different builds [Clang (LLVM based)] -> created fingerprints for 1 issues (skipped 0 issues) [Clang (LLVM based)] Copying affected files to Jenkins' build folder '/Users/Shared/Jenkins/Home/jobs/lldb-cmake/builds/20739/files-with-issues' [Clang (LLVM based)] -> 1 copied, 0 not in workspace, 0 not-found, 0 with I/O error [Pipeline] junit Recording test results [Pipeline] } [Pipeline] // stage [Pipeline] } [Pipeline] // withEnv [Pipeline] } [Pipeline] // node [Pipeline] End of Pipeline ERROR: script returned exit code 1 Finished: FAILURE