FailedConsole Output

Skipping 190,451 KB.. Full Log
cer status' --capture --capture-path /Users/buildslave/jenkins/workspace/lldb-cmake/lldb-build/tools/lldb/test/Reproducer/Output/TestCaptureEnvOverride.test.tmp.repro | /Users/buildslave/jenkins/workspace/lldb-cmake/lldb-build/bin/FileCheck /Users/buildslave/jenkins/workspace/lldb-cmake/llvm-project/lldb/test/Shell/Reproducer/TestCaptureEnvOverride.test --check-prefix OFF
: 'RUN: at line 11';   LLDB_CAPTURE_REPRODUCER=0 /Users/buildslave/jenkins/workspace/lldb-cmake/lldb-build/bin/lldb --no-lldbinit -S /Users/buildslave/jenkins/workspace/lldb-cmake/lldb-build/tools/lldb/test/Shell/lit-lldb-init -b -o 'reproducer status' --capture | /Users/buildslave/jenkins/workspace/lldb-cmake/lldb-build/bin/FileCheck /Users/buildslave/jenkins/workspace/lldb-cmake/llvm-project/lldb/test/Shell/Reproducer/TestCaptureEnvOverride.test --check-prefix OFF
: 'RUN: at line 12';   LLDB_CAPTURE_REPRODUCER=OFF /Users/buildslave/jenkins/workspace/lldb-cmake/lldb-build/bin/lldb --no-lldbinit -S /Users/buildslave/jenkins/workspace/lldb-cmake/lldb-build/tools/lldb/test/Shell/lit-lldb-init -b -o 'reproducer status' --capture --capture-path /Users/buildslave/jenkins/workspace/lldb-cmake/lldb-build/tools/lldb/test/Reproducer/Output/TestCaptureEnvOverride.test.tmp.repro | /Users/buildslave/jenkins/workspace/lldb-cmake/lldb-build/bin/FileCheck /Users/buildslave/jenkins/workspace/lldb-cmake/llvm-project/lldb/test/Shell/Reproducer/TestCaptureEnvOverride.test --check-prefix OFF
: 'RUN: at line 13';   LLDB_CAPTURE_REPRODUCER=off /Users/buildslave/jenkins/workspace/lldb-cmake/lldb-build/bin/lldb --no-lldbinit -S /Users/buildslave/jenkins/workspace/lldb-cmake/lldb-build/tools/lldb/test/Shell/lit-lldb-init -b -o 'reproducer status' --capture | /Users/buildslave/jenkins/workspace/lldb-cmake/lldb-build/bin/FileCheck /Users/buildslave/jenkins/workspace/lldb-cmake/llvm-project/lldb/test/Shell/Reproducer/TestCaptureEnvOverride.test --check-prefix OFF
: 'RUN: at line 15';   LLDB_CAPTURE_REPRODUCER=bogus /Users/buildslave/jenkins/workspace/lldb-cmake/lldb-build/bin/lldb --no-lldbinit -S /Users/buildslave/jenkins/workspace/lldb-cmake/lldb-build/tools/lldb/test/Shell/lit-lldb-init -b -o 'reproducer status' --capture | /Users/buildslave/jenkins/workspace/lldb-cmake/lldb-build/bin/FileCheck /Users/buildslave/jenkins/workspace/lldb-cmake/llvm-project/lldb/test/Shell/Reproducer/TestCaptureEnvOverride.test --check-prefix CAPTURE
: 'RUN: at line 16';   LLDB_CAPTURE_REPRODUCER=bogus /Users/buildslave/jenkins/workspace/lldb-cmake/lldb-build/bin/lldb --no-lldbinit -S /Users/buildslave/jenkins/workspace/lldb-cmake/lldb-build/tools/lldb/test/Shell/lit-lldb-init -b -o 'reproducer status' | /Users/buildslave/jenkins/workspace/lldb-cmake/lldb-build/bin/FileCheck /Users/buildslave/jenkins/workspace/lldb-cmake/llvm-project/lldb/test/Shell/Reproducer/TestCaptureEnvOverride.test --check-prefix OFF
--
Exit Code: 137

Hide Details

Command Output (stderr): -- /Users/buildslave/jenkins/workspace/lldb-cmake/lldb-build/tools/lldb/test/Reproducer/Output/TestCaptureEnvOverride.test.script: line 11: 1733 Killed: 9 /Users/buildslave/jenkins/workspace/lldb-cmake/lldb-build/bin/lldb --no-lldbinit -S /Users/buildslave/jenkins/workspace/lldb-cmake/lldb-build/tools/lldb/test/Shell/lit-lldb-init -b -o 'reproducer status' --capture --capture-path /Users/buildslave/jenkins/workspace/lldb-cmake/lldb-build/tools/lldb/test/Reproducer/Output/TestCaptureEnvOverride.test.tmp.repro /bin/ls 1734 | /Users/buildslave/jenkins/workspace/lldb-cmake/lldb-build/bin/FileCheck /Users/buildslave/jenkins/workspace/lldb-cmake/llvm-project/lldb/test/Shell/Reproducer/TestCaptureEnvOverride.test --check-prefix CAPTURE

Hide Details

--

Hide Details

******************** FAIL: lldb-shell :: SymbolFile/DWARF/clang-ast-from-dwarf-objc-property.m (2020 of 2049) ******************** TEST 'lldb-shell :: SymbolFile/DWARF/clang-ast-from-dwarf-objc-property.m' FAILED ******************** Script: -- : 'RUN: at line 3'; /Users/buildslave/jenkins/workspace/lldb-cmake/lldb-build/bin/clang --target=specify-a-target-or-use-a-_host-substitution --target=x86_64-apple-darwin18.0.0 -isysroot /Applications/Xcode.app/Contents/Developer/Platforms/MacOSX.platform/Developer/SDKs/MacOSX.sdk -fmodules-cache-path=/Users/buildslave/jenkins/workspace/lldb-cmake/lldb-build/lldb-test-build.noindex/module-cache-clang/lldb-shell -g -c -o /Users/buildslave/jenkins/workspace/lldb-cmake/lldb-build/tools/lldb/test/SymbolFile/DWARF/Output/clang-ast-from-dwarf-objc-property.m.tmp.o /Users/buildslave/jenkins/workspace/lldb-cmake/llvm-project/lldb/test/Shell/SymbolFile/DWARF/clang-ast-from-dwarf-objc-property.m : 'RUN: at line 4'; /Users/buildslave/jenkins/workspace/lldb-cmake/lldb-build/bin/lldb-test symbols -dump-clang-ast /Users/buildslave/jenkins/workspace/lldb-cmake/lldb-build/tools/lldb/test/SymbolFile/DWARF/Output/clang-ast-from-dwarf-objc-property.m.tmp.o | /Users/buildslave/jenkins/workspace/lldb-cmake/lldb-build/bin/FileCheck /Users/buildslave/jenkins/workspace/lldb-cmake/llvm-project/lldb/test/Shell/SymbolFile/DWARF/clang-ast-from-dwarf-objc-property.m -- Exit Code: 137

Hide Details

Command Output (stderr): -- /Users/buildslave/jenkins/workspace/lldb-cmake/lldb-build/tools/lldb/test/SymbolFile/DWARF/Output/clang-ast-from-dwarf-objc-property.m.script: line 2: 1731 Killed: 9 /Users/buildslave/jenkins/workspace/lldb-cmake/lldb-build/bin/clang --target=specify-a-target-or-use-a-_host-substitution --target=x86_64-apple-darwin18.0.0 -isysroot /Applications/Xcode.app/Contents/Developer/Platforms/MacOSX.platform/Developer/SDKs/MacOSX.sdk -fmodules-cache-path=/Users/buildslave/jenkins/workspace/lldb-cmake/lldb-build/lldb-test-build.noindex/module-cache-clang/lldb-shell -g -c -o /Users/buildslave/jenkins/workspace/lldb-cmake/lldb-build/tools/lldb/test/SymbolFile/DWARF/Output/clang-ast-from-dwarf-objc-property.m.tmp.o /Users/buildslave/jenkins/workspace/lldb-cmake/llvm-project/lldb/test/Shell/SymbolFile/DWARF/clang-ast-from-dwarf-objc-property.m

Hide Details

--

Hide Details

******************** FAIL: lldb-unit :: Symbol/./SymbolTests/TestTypeSystemClang.TestRecordHasFields (2021 of 2049) ******************** TEST 'lldb-unit :: Symbol/./SymbolTests/TestTypeSystemClang.TestRecordHasFields' FAILED ********************

Hide Details

******************** FAIL: lldb-unit :: Utility/./UtilityTests/Predicate.WaitForValueNotEqualTo (2022 of 2049) ******************** TEST 'lldb-unit :: Utility/./UtilityTests/Predicate.WaitForValueNotEqualTo' FAILED ********************

Hide Details

******************** FAIL: lldb-unit :: Utility/./UtilityTests/StringListTest.PopBack (2023 of 2049) ******************** TEST 'lldb-unit :: Utility/./UtilityTests/StringListTest.PopBack' FAILED ********************

Hide Details

******************** FAIL: lldb-unit :: Utility/./UtilityTests/SerializationRountripTest.SerializeDeserializeCString (2024 of 2049) ******************** TEST 'lldb-unit :: Utility/./UtilityTests/SerializationRountripTest.SerializeDeserializeCString' FAILED ********************

Hide Details

******************** FAIL: lldb-unit :: Utility/./UtilityTests/RangeTest.DoesAdjoinOrIntersect (2025 of 2049) ******************** TEST 'lldb-unit :: Utility/./UtilityTests/RangeTest.DoesAdjoinOrIntersect' FAILED ********************

Hide Details

******************** FAIL: lldb-api :: functionalities/data-formatter/ptr_ref_typedef/TestPtrRef2Typedef.py (2026 of 2049) ******************** TEST 'lldb-api :: functionalities/data-formatter/ptr_ref_typedef/TestPtrRef2Typedef.py' FAILED ******************** Script: -- /usr/local/Frameworks/Python.framework/Versions/3.7/bin/python3.7 /Users/buildslave/jenkins/workspace/lldb-cmake/llvm-project/lldb/test/API/dotest.py --arch x86_64 -s /Users/buildslave/jenkins/workspace/lldb-cmake/lldb-build/lldb-test-traces -S nm -u CXXFLAGS -u CFLAGS --codesign-identity lldb_codesign --server /Users/buildslave/jenkins/workspace/lldb-cmake/lldb-build/./bin/debugserver --arch x86_64 --build-dir /Users/buildslave/jenkins/workspace/lldb-cmake/lldb-build/lldb-test-build.noindex -s=/Users/buildslave/jenkins/workspace/lldb-cmake/test/logs -t --env TERM=vt100 --env LLVM_LIBS_DIR=/Users/buildslave/jenkins/workspace/lldb-cmake/lldb-build/./lib --build-dir /Users/buildslave/jenkins/workspace/lldb-cmake/lldb-build/lldb-test-build.noindex --lldb-module-cache-dir /Users/buildslave/jenkins/workspace/lldb-cmake/lldb-build/lldb-test-build.noindex/module-cache-lldb/lldb-api --clang-module-cache-dir /Users/buildslave/jenkins/workspace/lldb-cmake/lldb-build/lldb-test-build.noindex/module-cache-clang/lldb-api --executable /Users/buildslave/jenkins/workspace/lldb-cmake/lldb-build/./bin/lldb --compiler /Users/buildslave/jenkins/workspace/lldb-cmake/lldb-build/./bin/clang --dsymutil /Users/buildslave/jenkins/workspace/lldb-cmake/lldb-build/./bin/dsymutil --filecheck /Users/buildslave/jenkins/workspace/lldb-cmake/lldb-build/./bin/FileCheck --lldb-libs-dir /Users/buildslave/jenkins/workspace/lldb-cmake/lldb-build/./lib /Users/buildslave/jenkins/workspace/lldb-cmake/llvm-project/lldb/test/API/functionalities/data-formatter/ptr_ref_typedef -p TestPtrRef2Typedef.py -- Exit Code: -9

Hide Details

Hide Details

******************** FAIL: lldb-unit :: Utility/./UtilityTests/ArchSpecTest.TestParseMachCPUDashSubtypeTripleExtra (2027 of 2049) ******************** TEST 'lldb-unit :: Utility/./UtilityTests/ArchSpecTest.TestParseMachCPUDashSubtypeTripleExtra' FAILED ********************

Hide Details

******************** FAIL: lldb-unit :: Target/./TargetTests/ExecutionContextTest.GetByteOrderTarget (2028 of 2049) ******************** TEST 'lldb-unit :: Target/./TargetTests/ExecutionContextTest.GetByteOrderTarget' FAILED ********************

Hide Details

******************** FAIL: lldb-shell :: SymbolFile/Breakpad/unwind-via-stack-win.test (2029 of 2049) ******************** TEST 'lldb-shell :: SymbolFile/Breakpad/unwind-via-stack-win.test' FAILED ******************** Script: -- : 'RUN: at line 3'; /Users/buildslave/jenkins/workspace/lldb-cmake/lldb-build/bin/yaml2obj /Users/buildslave/jenkins/workspace/lldb-cmake/llvm-project/lldb/test/Shell/SymbolFile/Breakpad/Inputs/unwind-via-stack-win.yaml > /Users/buildslave/jenkins/workspace/lldb-cmake/lldb-build/tools/lldb/test/SymbolFile/Breakpad/Output/unwind-via-stack-win.test.tmp : 'RUN: at line 4'; /Users/buildslave/jenkins/workspace/lldb-cmake/lldb-build/bin/lldb --no-lldbinit -S /Users/buildslave/jenkins/workspace/lldb-cmake/lldb-build/tools/lldb/test/Shell/lit-lldb-init -c /Users/buildslave/jenkins/workspace/lldb-cmake/lldb-build/tools/lldb/test/SymbolFile/Breakpad/Output/unwind-via-stack-win.test.tmp -o "target symbols add /Users/buildslave/jenkins/workspace/lldb-cmake/llvm-project/lldb/test/Shell/SymbolFile/Breakpad/Inputs/unwind-via-stack-win.syms" -s /Users/buildslave/jenkins/workspace/lldb-cmake/llvm-project/lldb/test/Shell/SymbolFile/Breakpad/unwind-via-stack-win.test -b | /Users/buildslave/jenkins/workspace/lldb-cmake/lldb-build/bin/FileCheck /Users/buildslave/jenkins/workspace/lldb-cmake/llvm-project/lldb/test/Shell/SymbolFile/Breakpad/unwind-via-stack-win.test -- Exit Code: 137

Hide Details

Command Output (stderr): -- /Users/buildslave/jenkins/workspace/lldb-cmake/lldb-build/tools/lldb/test/SymbolFile/Breakpad/Output/unwind-via-stack-win.test.script: line 2: 1746 Killed: 9 /Users/buildslave/jenkins/workspace/lldb-cmake/lldb-build/bin/yaml2obj /Users/buildslave/jenkins/workspace/lldb-cmake/llvm-project/lldb/test/Shell/SymbolFile/Breakpad/Inputs/unwind-via-stack-win.yaml > /Users/buildslave/jenkins/workspace/lldb-cmake/lldb-build/tools/lldb/test/SymbolFile/Breakpad/Output/unwind-via-stack-win.test.tmp

Hide Details

--

Hide Details

******************** FAIL: lldb-api :: lang/cpp/multiple-inheritance/TestCppMultipleInheritance.py (2030 of 2049) ******************** TEST 'lldb-api :: lang/cpp/multiple-inheritance/TestCppMultipleInheritance.py' FAILED ******************** Script: -- /usr/local/Frameworks/Python.framework/Versions/3.7/bin/python3.7 /Users/buildslave/jenkins/workspace/lldb-cmake/llvm-project/lldb/test/API/dotest.py --arch x86_64 -s /Users/buildslave/jenkins/workspace/lldb-cmake/lldb-build/lldb-test-traces -S nm -u CXXFLAGS -u CFLAGS --codesign-identity lldb_codesign --server /Users/buildslave/jenkins/workspace/lldb-cmake/lldb-build/./bin/debugserver --arch x86_64 --build-dir /Users/buildslave/jenkins/workspace/lldb-cmake/lldb-build/lldb-test-build.noindex -s=/Users/buildslave/jenkins/workspace/lldb-cmake/test/logs -t --env TERM=vt100 --env LLVM_LIBS_DIR=/Users/buildslave/jenkins/workspace/lldb-cmake/lldb-build/./lib --build-dir /Users/buildslave/jenkins/workspace/lldb-cmake/lldb-build/lldb-test-build.noindex --lldb-module-cache-dir /Users/buildslave/jenkins/workspace/lldb-cmake/lldb-build/lldb-test-build.noindex/module-cache-lldb/lldb-api --clang-module-cache-dir /Users/buildslave/jenkins/workspace/lldb-cmake/lldb-build/lldb-test-build.noindex/module-cache-clang/lldb-api --executable /Users/buildslave/jenkins/workspace/lldb-cmake/lldb-build/./bin/lldb --compiler /Users/buildslave/jenkins/workspace/lldb-cmake/lldb-build/./bin/clang --dsymutil /Users/buildslave/jenkins/workspace/lldb-cmake/lldb-build/./bin/dsymutil --filecheck /Users/buildslave/jenkins/workspace/lldb-cmake/lldb-build/./bin/FileCheck --lldb-libs-dir /Users/buildslave/jenkins/workspace/lldb-cmake/lldb-build/./lib /Users/buildslave/jenkins/workspace/lldb-cmake/llvm-project/lldb/test/API/lang/cpp/multiple-inheritance -p TestCppMultipleInheritance.py -- Exit Code: 1

Hide Details

Command Output (stdout): -- lldb version 11.0.99 clang revision 059ba74bb6f6166ca7c1783ef81dd37a5209b758 llvm revision 059ba74bb6f6166ca7c1783ef81dd37a5209b758 LLDB library dir: /Users/buildslave/jenkins/workspace/lldb-cmake/lldb-build/bin LLDB import library dir: /Users/buildslave/jenkins/workspace/lldb-cmake/lldb-build/./lib libstdcxx tests will not be run because: Don't know how to build with libstdcxx on macosx Skipping following debug info categories: ['dwo']

Hide Details

-- Command Output (stderr): --

Hide Details

Session logs for test failures/errors/unexpected successes will go into directory '/Users/buildslave/jenkins/workspace/lldb-cmake/test/logs' Change dir to: /Users/buildslave/jenkins/workspace/lldb-cmake/llvm-project/lldb/test/API/lang/cpp/multiple-inheritance runCmd: settings clear -all output:

Hide Details

runCmd: settings set symbols.enable-external-lookup false output:

Hide Details

runCmd: settings set target.auto-apply-fixits false output:

Hide Details

runCmd: settings set plugin.process.gdb-remote.packet-timeout 60 output:

Hide Details

runCmd: settings set symbols.clang-modules-cache-path "/Users/buildslave/jenkins/workspace/lldb-cmake/lldb-build/lldb-test-build.noindex/module-cache-lldb/lldb-api" output:

Hide Details

runCmd: settings set use-color false output:

Hide Details

runCmd: setting set target.prefer-dynamic-value no-dynamic-values output:

Hide Details

FAIL: LLDB (/Users/buildslave/jenkins/workspace/lldb-cmake/lldb-build/bin/clang-11-x86_64) :: test_dsym (TestCppMultipleInheritance.TestCase) <bound method SBProcess.Kill of <lldb.SBProcess; proxy of <Swig Object of type 'lldb::SBProcess *' at 0x10e1b0300> >>: success

Hide Details

runCmd: settings clear -all output:

Hide Details

runCmd: settings set symbols.enable-external-lookup false output:

Hide Details

runCmd: settings set target.auto-apply-fixits false output:

Hide Details

runCmd: settings set plugin.process.gdb-remote.packet-timeout 60 output:

Hide Details

runCmd: settings set symbols.clang-modules-cache-path "/Users/buildslave/jenkins/workspace/lldb-cmake/lldb-build/lldb-test-build.noindex/module-cache-lldb/lldb-api" output:

Hide Details

runCmd: settings set use-color false output:

Hide Details

runCmd: setting set target.prefer-dynamic-value no-dynamic-values output:

Hide Details

FAIL: LLDB (/Users/buildslave/jenkins/workspace/lldb-cmake/lldb-build/bin/clang-11-x86_64) :: test_dwarf (TestCppMultipleInheritance.TestCase) UNSUPPORTED: LLDB (/Users/buildslave/jenkins/workspace/lldb-cmake/lldb-build/bin/clang-11-x86_64) :: test_dwo (TestCppMultipleInheritance.TestCase) (test case does not fall in any category of interest for this run) runCmd: settings clear -all output:

Hide Details

runCmd: settings set symbols.enable-external-lookup false output:

Hide Details

runCmd: settings set target.auto-apply-fixits false output:

Hide Details

runCmd: settings set plugin.process.gdb-remote.packet-timeout 60 output:

Hide Details

runCmd: settings set symbols.clang-modules-cache-path "/Users/buildslave/jenkins/workspace/lldb-cmake/lldb-build/lldb-test-build.noindex/module-cache-lldb/lldb-api" output:

Hide Details

runCmd: settings set use-color false output:

Hide Details

runCmd: setting set target.prefer-dynamic-value no-dynamic-values output:

Hide Details

FAIL: LLDB (/Users/buildslave/jenkins/workspace/lldb-cmake/lldb-build/bin/clang-11-x86_64) :: test_gmodules (TestCppMultipleInheritance.TestCase) Restore dir to: /Users/buildslave/jenkins/workspace/lldb-cmake/lldb-build/tools/lldb/test ====================================================================== ERROR: test_dwarf (TestCppMultipleInheritance.TestCase) ---------------------------------------------------------------------- Error when building test subject.

Hide Details

Build Command: make VPATH=/Users/buildslave/jenkins/workspace/lldb-cmake/llvm-project/lldb/test/API/lang/cpp/multiple-inheritance -C /Users/buildslave/jenkins/workspace/lldb-cmake/lldb-build/lldb-test-build.noindex/lang/cpp/multiple-inheritance/TestCppMultipleInheritance.test_dwarf -I /Users/buildslave/jenkins/workspace/lldb-cmake/llvm-project/lldb/test/API/lang/cpp/multiple-inheritance -I /Users/buildslave/jenkins/workspace/lldb-cmake/llvm-project/lldb/packages/Python/lldbsuite/test/make -f /Users/buildslave/jenkins/workspace/lldb-cmake/llvm-project/lldb/test/API/lang/cpp/multiple-inheritance/Makefile MAKE_DSYM=NO ARCH=x86_64 CC="/Users/buildslave/jenkins/workspace/lldb-cmake/lldb-build/bin/clang-11" DSYMUTIL=/Users/buildslave/jenkins/workspace/lldb-cmake/lldb-build/./bin/dsymutil SDKROOT=/Applications/Xcode.app/Contents/Developer/Platforms/MacOSX.platform/Developer/SDKs/MacOSX10.14.sdk CLANG_MODULE_CACHE_DIR=/Users/buildslave/jenkins/workspace/lldb-cmake/lldb-build/lldb-test-build.noindex/module-cache-clang/lldb-api

Hide Details

Build Command Output: /bin/sh: line 1: 1730 Killed: 9 /Users/buildslave/jenkins/workspace/lldb-cmake/lldb-build/bin/clang-11 -M -std=c++11 -g -O0 -fno-builtin -isysroot "/Applications/Xcode.app/Contents/Developer/Platforms/MacOSX.platform/Developer/SDKs/MacOSX10.14.sdk" -arch x86_64 -I/Users/buildslave/jenkins/workspace/lldb-cmake/llvm-project/lldb/packages/Python/lldbsuite/test/make/../../../../../include -I/Users/buildslave/jenkins/workspace/lldb-cmake/llvm-project/lldb/test/API/lang/cpp/multiple-inheritance -I/Users/buildslave/jenkins/workspace/lldb-cmake/llvm-project/lldb/packages/Python/lldbsuite/test/make -include /Users/buildslave/jenkins/workspace/lldb-cmake/llvm-project/lldb/packages/Python/lldbsuite/test/make/test_common.h -fno-limit-debug-info --driver-mode=g++ /Users/buildslave/jenkins/workspace/lldb-cmake/llvm-project/lldb/test/API/lang/cpp/multiple-inheritance/main.cpp > main.d.tmp make: *** [main.o] Killed: 9

Hide Details

Test Directory: /Users/buildslave/jenkins/workspace/lldb-cmake/llvm-project/lldb/test/API/lang/cpp/multiple-inheritance ====================================================================== ERROR: test_gmodules (TestCppMultipleInheritance.TestCase) ---------------------------------------------------------------------- Traceback (most recent call last): File "/Users/buildslave/jenkins/workspace/lldb-cmake/llvm-project/lldb/packages/Python/lldbsuite/test/lldbtest.py", line 1767, in test_method return attrvalue(self) File "/Users/buildslave/jenkins/workspace/lldb-cmake/llvm-project/lldb/test/API/lang/cpp/multiple-inheritance/TestCppMultipleInheritance.py", line 11, in test self.build() File "/Users/buildslave/jenkins/workspace/lldb-cmake/llvm-project/lldb/packages/Python/lldbsuite/test/lldbtest.py", line 2513, in build return self.buildGModules(architecture, compiler, dictionary) File "/Users/buildslave/jenkins/workspace/lldb-cmake/llvm-project/lldb/packages/Python/lldbsuite/test/lldbtest.py", line 1597, in buildGModules dictionary, testdir, testname): File "/Users/buildslave/jenkins/workspace/lldb-cmake/llvm-project/lldb/packages/Python/lldbsuite/test/plugins/builder_base.py", line 257, in buildGModules lldbtest.system(commands, sender=sender) File "/Users/buildslave/jenkins/workspace/lldb-cmake/llvm-project/lldb/packages/Python/lldbsuite/test/lldbtest.py", line 447, in system raise cpe subprocess.CalledProcessError: Command 'make VPATH=/Users/buildslave/jenkins/workspace/lldb-cmake/llvm-project/lldb/test/API/lang/cpp/multiple-inheritance -C /Users/buildslave/jenkins/workspace/lldb-cmake/lldb-build/lldb-test-build.noindex/lang/cpp/multiple-inheritance/TestCppMultipleInheritance.test_gmodules -I /Users/buildslave/jenkins/workspace/lldb-cmake/llvm-project/lldb/test/API/lang/cpp/multiple-inheritance -I /Users/buildslave/jenkins/workspace/lldb-cmake/llvm-project/lldb/packages/Python/lldbsuite/test/make -f /Users/buildslave/jenkins/workspace/lldb-cmake/llvm-project/lldb/test/API/lang/cpp/multiple-inheritance/Makefile MAKE_DSYM=NO MAKE_GMODULES=YES ARCH=x86_64 CC="/Users/buildslave/jenkins/workspace/lldb-cmake/lldb-build/bin/clang-11" DSYMUTIL=/Users/buildslave/jenkins/workspace/lldb-cmake/lldb-build/./bin/dsymutil SDKROOT=/Applications/Xcode.app/Contents/Developer/Platforms/MacOSX.platform/Developer/SDKs/MacOSX10.14.sdk CLANG_MODULE_CACHE_DIR=/Users/buildslave/jenkins/workspace/lldb-cmake/lldb-build/lldb-test-build.noindex/module-cache-clang/lldb-api ' returned non-zero exit status 2. Config=x86_64-/Users/buildslave/jenkins/workspace/lldb-cmake/lldb-build/bin/clang-11 ====================================================================== FAIL: test_dsym (TestCppMultipleInheritance.TestCase) ---------------------------------------------------------------------- Traceback (most recent call last): File "/Users/buildslave/jenkins/workspace/lldb-cmake/llvm-project/lldb/packages/Python/lldbsuite/test/lldbtest.py", line 1767, in test_method return attrvalue(self) File "/Users/buildslave/jenkins/workspace/lldb-cmake/llvm-project/lldb/test/API/lang/cpp/multiple-inheritance/TestCppMultipleInheritance.py", line 12, in test lldbutil.run_to_source_breakpoint(self,"// break here", lldb.SBFileSpec("main.cpp")) File "/Users/buildslave/jenkins/workspace/lldb-cmake/llvm-project/lldb/packages/Python/lldbsuite/test/lldbutil.py", line 868, in run_to_source_breakpoint only_one_thread, extra_images) File "/Users/buildslave/jenkins/workspace/lldb-cmake/llvm-project/lldb/packages/Python/lldbsuite/test/lldbutil.py", line 789, in run_to_breakpoint_do_run "Process launch failed: %s" % (error.GetCString())) AssertionError: True is not False : Process launch failed: process exited with status -1 (this is a non-interactive debug session, cannot get permission to debug processes.) Config=x86_64-/Users/buildslave/jenkins/workspace/lldb-cmake/lldb-build/bin/clang-11 ---------------------------------------------------------------------- Ran 4 tests in 6.039s

Hide Details

RESULT: FAILED (0 passes, 1 failures, 2 errors, 1 skipped, 0 expected failures, 0 unexpected successes)

Hide Details

--

Hide Details

******************** FAIL: lldb-api :: lang/c/shared_lib/TestSharedLib.py (2031 of 2049) ******************** TEST 'lldb-api :: lang/c/shared_lib/TestSharedLib.py' FAILED ******************** Script: -- /usr/local/Frameworks/Python.framework/Versions/3.7/bin/python3.7 /Users/buildslave/jenkins/workspace/lldb-cmake/llvm-project/lldb/test/API/dotest.py --arch x86_64 -s /Users/buildslave/jenkins/workspace/lldb-cmake/lldb-build/lldb-test-traces -S nm -u CXXFLAGS -u CFLAGS --codesign-identity lldb_codesign --server /Users/buildslave/jenkins/workspace/lldb-cmake/lldb-build/./bin/debugserver --arch x86_64 --build-dir /Users/buildslave/jenkins/workspace/lldb-cmake/lldb-build/lldb-test-build.noindex -s=/Users/buildslave/jenkins/workspace/lldb-cmake/test/logs -t --env TERM=vt100 --env LLVM_LIBS_DIR=/Users/buildslave/jenkins/workspace/lldb-cmake/lldb-build/./lib --build-dir /Users/buildslave/jenkins/workspace/lldb-cmake/lldb-build/lldb-test-build.noindex --lldb-module-cache-dir /Users/buildslave/jenkins/workspace/lldb-cmake/lldb-build/lldb-test-build.noindex/module-cache-lldb/lldb-api --clang-module-cache-dir /Users/buildslave/jenkins/workspace/lldb-cmake/lldb-build/lldb-test-build.noindex/module-cache-clang/lldb-api --executable /Users/buildslave/jenkins/workspace/lldb-cmake/lldb-build/./bin/lldb --compiler /Users/buildslave/jenkins/workspace/lldb-cmake/lldb-build/./bin/clang --dsymutil /Users/buildslave/jenkins/workspace/lldb-cmake/lldb-build/./bin/dsymutil --filecheck /Users/buildslave/jenkins/workspace/lldb-cmake/lldb-build/./bin/FileCheck --lldb-libs-dir /Users/buildslave/jenkins/workspace/lldb-cmake/lldb-build/./lib /Users/buildslave/jenkins/workspace/lldb-cmake/llvm-project/lldb/test/API/lang/c/shared_lib -p TestSharedLib.py -- Exit Code: 1

Hide Details

Command Output (stdout): -- lldb version 11.0.99 clang revision 059ba74bb6f6166ca7c1783ef81dd37a5209b758 llvm revision 059ba74bb6f6166ca7c1783ef81dd37a5209b758 LLDB library dir: /Users/buildslave/jenkins/workspace/lldb-cmake/lldb-build/bin LLDB import library dir: /Users/buildslave/jenkins/workspace/lldb-cmake/lldb-build/./lib libstdcxx tests will not be run because: Don't know how to build with libstdcxx on macosx Skipping following debug info categories: ['dwo']

Hide Details

-- Command Output (stderr): --

Hide Details

Session logs for test failures/errors/unexpected successes will go into directory '/Users/buildslave/jenkins/workspace/lldb-cmake/test/logs' Change dir to: /Users/buildslave/jenkins/workspace/lldb-cmake/llvm-project/lldb/test/API/lang/c/shared_lib runCmd: settings clear -all output:

Hide Details

runCmd: settings set symbols.enable-external-lookup false output:

Hide Details

runCmd: settings set target.auto-apply-fixits false output:

Hide Details

runCmd: settings set plugin.process.gdb-remote.packet-timeout 60 output:

Hide Details

runCmd: settings set symbols.clang-modules-cache-path "/Users/buildslave/jenkins/workspace/lldb-cmake/lldb-build/lldb-test-build.noindex/module-cache-lldb/lldb-api" output:

Hide Details

runCmd: settings set use-color false output:

Hide Details

runCmd: setting set target.prefer-dynamic-value no-dynamic-values output:

Hide Details

runCmd: settings set target.preload-symbols true output:

Hide Details

runCmd: breakpoint set -f "main.c" -l 10 output: Breakpoint 1: where = a.out`main + 26 at main.c:10:49, address = 0x0000000100000f3a

Hide Details

Hide Details

Expecting pattern: ^Breakpoint (?P<bpno>[0-9]+): (?P<num_locations>[0-9]+) locations\.$ Not matched

Hide Details

Expecting pattern: ^Breakpoint (?P<bpno>[0-9]+): (?P<num_locations>no) locations \(pending\)\. Not matched

Hide Details

Expecting pattern: ^Breakpoint (?P<bpno>[0-9]+): where = (?P<module>.*)`(?P<symbol>[+\-]{0,1}[^+]+)( \+ (?P<offset>[0-9]+)){0,1}( \[inlined\] (?P<inline_symbol>.*)){0,1} at (?P<file>[^:]+):(?P<line_no>[0-9]+)(?P<column>(:[0-9]+)?), address = (?P<address>0x[0-9a-fA-F]+)$ Matched

Hide Details

runCmd: thread list runCmd failed! error: Process must be launched.

Hide Details

Hide Details

FAIL: LLDB (/Users/buildslave/jenkins/workspace/lldb-cmake/lldb-build/bin/clang-11-x86_64) :: test_expr_dsym (TestSharedLib.SharedLibTestCase) <bound method SBProcess.Kill of <lldb.SBProcess; proxy of <Swig Object of type 'lldb::SBProcess *' at 0x114461a20> >>: success

Hide Details

runCmd: settings clear -all output:

Hide Details

runCmd: settings set symbols.enable-external-lookup false output:

Hide Details

runCmd: settings set target.auto-apply-fixits false output:

Hide Details

runCmd: settings set plugin.process.gdb-remote.packet-timeout 60 output:

Hide Details

runCmd: settings set symbols.clang-modules-cache-path "/Users/buildslave/jenkins/workspace/lldb-cmake/lldb-build/lldb-test-build.noindex/module-cache-lldb/lldb-api" output:

Hide Details

runCmd: settings set use-color false output:

Hide Details

runCmd: setting set target.prefer-dynamic-value no-dynamic-values output:

Hide Details

runCmd: settings set target.preload-symbols true output:

Hide Details

runCmd: breakpoint set -f "main.c" -l 10 output: Breakpoint 1: where = a.out`main + 26 at main.c:10:49, address = 0x0000000100000f3a

Hide Details

Hide Details

Expecting pattern: ^Breakpoint (?P<bpno>[0-9]+): (?P<num_locations>[0-9]+) locations\.$ Not matched

Hide Details

Expecting pattern: ^Breakpoint (?P<bpno>[0-9]+): (?P<num_locations>no) locations \(pending\)\. Not matched

Hide Details

Expecting pattern: ^Breakpoint (?P<bpno>[0-9]+): where = (?P<module>.*)`(?P<symbol>[+\-]{0,1}[^+]+)( \+ (?P<offset>[0-9]+)){0,1}( \[inlined\] (?P<inline_symbol>.*)){0,1} at (?P<file>[^:]+):(?P<line_no>[0-9]+)(?P<column>(:[0-9]+)?), address = (?P<address>0x[0-9a-fA-F]+)$ Matched

Hide Details

runCmd: thread list runCmd failed! error: Process must be launched.

Hide Details

Hide Details

FAIL: LLDB (/Users/buildslave/jenkins/workspace/lldb-cmake/lldb-build/bin/clang-11-x86_64) :: test_expr_dwarf (TestSharedLib.SharedLibTestCase) <bound method SBProcess.Kill of <lldb.SBProcess; proxy of <Swig Object of type 'lldb::SBProcess *' at 0x10cb20bd0> >>: success

Hide Details

UNSUPPORTED: LLDB (/Users/buildslave/jenkins/workspace/lldb-cmake/lldb-build/bin/clang-11-x86_64) :: test_expr_dwo (TestSharedLib.SharedLibTestCase) (test case does not fall in any category of interest for this run) runCmd: settings clear -all output:

Hide Details

runCmd: settings set symbols.enable-external-lookup false output:

Hide Details

runCmd: settings set target.auto-apply-fixits false output:

Hide Details

runCmd: settings set plugin.process.gdb-remote.packet-timeout 60 output:

Hide Details

runCmd: settings set symbols.clang-modules-cache-path "/Users/buildslave/jenkins/workspace/lldb-cmake/lldb-build/lldb-test-build.noindex/module-cache-lldb/lldb-api" output:

Hide Details

runCmd: settings set use-color false output:

Hide Details

runCmd: setting set target.prefer-dynamic-value no-dynamic-values output:

Hide Details

runCmd: settings set target.preload-symbols true output:

Hide Details

runCmd: breakpoint set -f "main.c" -l 10 output: Breakpoint 1: where = a.out`main + 26 at main.c:10:49, address = 0x0000000100000f3a

Hide Details

Hide Details

Expecting pattern: ^Breakpoint (?P<bpno>[0-9]+): (?P<num_locations>[0-9]+) locations\.$ Not matched

Hide Details

Expecting pattern: ^Breakpoint (?P<bpno>[0-9]+): (?P<num_locations>no) locations \(pending\)\. Not matched

Hide Details

Expecting pattern: ^Breakpoint (?P<bpno>[0-9]+): where = (?P<module>.*)`(?P<symbol>[+\-]{0,1}[^+]+)( \+ (?P<offset>[0-9]+)){0,1}( \[inlined\] (?P<inline_symbol>.*)){0,1} at (?P<file>[^:]+):(?P<line_no>[0-9]+)(?P<column>(:[0-9]+)?), address = (?P<address>0x[0-9a-fA-F]+)$ Matched

Hide Details

runCmd: thread list runCmd failed! error: Process must be launched.

Hide Details

Hide Details

FAIL: LLDB (/Users/buildslave/jenkins/workspace/lldb-cmake/lldb-build/bin/clang-11-x86_64) :: test_expr_gmodules (TestSharedLib.SharedLibTestCase) <bound method SBProcess.Kill of <lldb.SBProcess; proxy of <Swig Object of type 'lldb::SBProcess *' at 0x114461840> >>: success

Hide Details

runCmd: settings clear -all output:

Hide Details

runCmd: settings set symbols.enable-external-lookup false output:

Hide Details

runCmd: settings set target.auto-apply-fixits false output:

Hide Details

runCmd: settings set plugin.process.gdb-remote.packet-timeout 60 output:

Hide Details

runCmd: settings set symbols.clang-modules-cache-path "/Users/buildslave/jenkins/workspace/lldb-cmake/lldb-build/lldb-test-build.noindex/module-cache-lldb/lldb-api" output:

Hide Details

runCmd: settings set use-color false output:

Hide Details

runCmd: setting set target.prefer-dynamic-value no-dynamic-values output:

Hide Details

runCmd: settings set target.preload-symbols false output:

Hide Details

runCmd: breakpoint set -f "main.c" -l 10 output: Breakpoint 1: where = a.out`main + 26 at main.c:10:49, address = 0x0000000100000f3a

Hide Details

Hide Details

Expecting pattern: ^Breakpoint (?P<bpno>[0-9]+): (?P<num_locations>[0-9]+) locations\.$ Not matched

Hide Details

Expecting pattern: ^Breakpoint (?P<bpno>[0-9]+): (?P<num_locations>no) locations \(pending\)\. Not matched

Hide Details

Expecting pattern: ^Breakpoint (?P<bpno>[0-9]+): where = (?P<module>.*)`(?P<symbol>[+\-]{0,1}[^+]+)( \+ (?P<offset>[0-9]+)){0,1}( \[inlined\] (?P<inline_symbol>.*)){0,1} at (?P<file>[^:]+):(?P<line_no>[0-9]+)(?P<column>(:[0-9]+)?), address = (?P<address>0x[0-9a-fA-F]+)$ Matched

Hide Details

runCmd: thread list runCmd failed! error: Process must be launched.

Hide Details

Hide Details

FAIL: LLDB (/Users/buildslave/jenkins/workspace/lldb-cmake/lldb-build/bin/clang-11-x86_64) :: test_expr_no_preload_dsym (TestSharedLib.SharedLibTestCase) <bound method SBProcess.Kill of <lldb.SBProcess; proxy of <Swig Object of type 'lldb::SBProcess *' at 0x10cb20bd0> >>: success

Hide Details

runCmd: settings clear -all output:

Hide Details

runCmd: settings set symbols.enable-external-lookup false output:

Hide Details

runCmd: settings set target.auto-apply-fixits false output:

Hide Details

runCmd: settings set plugin.process.gdb-remote.packet-timeout 60 output:

Hide Details

runCmd: settings set symbols.clang-modules-cache-path "/Users/buildslave/jenkins/workspace/lldb-cmake/lldb-build/lldb-test-build.noindex/module-cache-lldb/lldb-api" output:

Hide Details

runCmd: settings set use-color false output:

Hide Details

runCmd: setting set target.prefer-dynamic-value no-dynamic-values output:

Hide Details

runCmd: settings set target.preload-symbols false output:

Hide Details

runCmd: breakpoint set -f "main.c" -l 10 output: Breakpoint 1: where = a.out`main + 26 at main.c:10:49, address = 0x0000000100000f3a

Hide Details

Hide Details

Expecting pattern: ^Breakpoint (?P<bpno>[0-9]+): (?P<num_locations>[0-9]+) locations\.$ Not matched

Hide Details

Expecting pattern: ^Breakpoint (?P<bpno>[0-9]+): (?P<num_locations>no) locations \(pending\)\. Not matched

Hide Details

Expecting pattern: ^Breakpoint (?P<bpno>[0-9]+): where = (?P<module>.*)`(?P<symbol>[+\-]{0,1}[^+]+)( \+ (?P<offset>[0-9]+)){0,1}( \[inlined\] (?P<inline_symbol>.*)){0,1} at (?P<file>[^:]+):(?P<line_no>[0-9]+)(?P<column>(:[0-9]+)?), address = (?P<address>0x[0-9a-fA-F]+)$ Matched

Hide Details

runCmd: thread list runCmd failed! error: Process must be launched.

Hide Details

Hide Details

FAIL: LLDB (/Users/buildslave/jenkins/workspace/lldb-cmake/lldb-build/bin/clang-11-x86_64) :: test_expr_no_preload_dwarf (TestSharedLib.SharedLibTestCase) <bound method SBProcess.Kill of <lldb.SBProcess; proxy of <Swig Object of type 'lldb::SBProcess *' at 0x114461a20> >>: success

Hide Details

UNSUPPORTED: LLDB (/Users/buildslave/jenkins/workspace/lldb-cmake/lldb-build/bin/clang-11-x86_64) :: test_expr_no_preload_dwo (TestSharedLib.SharedLibTestCase) (test case does not fall in any category of interest for this run) runCmd: settings clear -all output:

Hide Details

runCmd: settings set symbols.enable-external-lookup false output:

Hide Details

runCmd: settings set target.auto-apply-fixits false output:

Hide Details

runCmd: settings set plugin.process.gdb-remote.packet-timeout 60 output:

Hide Details

runCmd: settings set symbols.clang-modules-cache-path "/Users/buildslave/jenkins/workspace/lldb-cmake/lldb-build/lldb-test-build.noindex/module-cache-lldb/lldb-api" output:

Hide Details

runCmd: settings set use-color false output:

Hide Details

runCmd: setting set target.prefer-dynamic-value no-dynamic-values output:

Hide Details

FAIL: LLDB (/Users/buildslave/jenkins/workspace/lldb-cmake/lldb-build/bin/clang-11-x86_64) :: test_expr_no_preload_gmodules (TestSharedLib.SharedLibTestCase) runCmd: settings clear -all output:

Hide Details

runCmd: settings set symbols.enable-external-lookup false output:

Hide Details

runCmd: settings set target.auto-apply-fixits false output:

Hide Details

runCmd: settings set plugin.process.gdb-remote.packet-timeout 60 output:

Hide Details

runCmd: settings set symbols.clang-modules-cache-path "/Users/buildslave/jenkins/workspace/lldb-cmake/lldb-build/lldb-test-build.noindex/module-cache-lldb/lldb-api" output:

Hide Details

runCmd: settings set use-color false output:

Hide Details

runCmd: setting set target.prefer-dynamic-value no-dynamic-values output:

Hide Details

XFAIL: LLDB (/Users/buildslave/jenkins/workspace/lldb-cmake/lldb-build/bin/clang-11-x86_64) :: test_frame_variable_dsym (TestSharedLib.SharedLibTestCase) runCmd: settings clear -all output:

Hide Details

runCmd: settings set symbols.enable-external-lookup false output:

Hide Details

runCmd: settings set target.auto-apply-fixits false output:

Hide Details

runCmd: settings set plugin.process.gdb-remote.packet-timeout 60 output:

Hide Details

runCmd: settings set symbols.clang-modules-cache-path "/Users/buildslave/jenkins/workspace/lldb-cmake/lldb-build/lldb-test-build.noindex/module-cache-lldb/lldb-api" output:

Hide Details

runCmd: settings set use-color false output:

Hide Details

runCmd: setting set target.prefer-dynamic-value no-dynamic-values output:

Hide Details

XFAIL: LLDB (/Users/buildslave/jenkins/workspace/lldb-cmake/lldb-build/bin/clang-11-x86_64) :: test_frame_variable_dwarf (TestSharedLib.SharedLibTestCase) UNSUPPORTED: LLDB (/Users/buildslave/jenkins/workspace/lldb-cmake/lldb-build/bin/clang-11-x86_64) :: test_frame_variable_dwo (TestSharedLib.SharedLibTestCase) (test case does not fall in any category of interest for this run) runCmd: settings clear -all output:

Hide Details

runCmd: settings set symbols.enable-external-lookup false output:

Hide Details

runCmd: settings set target.auto-apply-fixits false output:

Hide Details

runCmd: settings set plugin.process.gdb-remote.packet-timeout 60 output:

Hide Details

runCmd: settings set symbols.clang-modules-cache-path "/Users/buildslave/jenkins/workspace/lldb-cmake/lldb-build/lldb-test-build.noindex/module-cache-lldb/lldb-api" output:

Hide Details

runCmd: settings set use-color false output:

Hide Details

runCmd: setting set target.prefer-dynamic-value no-dynamic-values output:

Hide Details

XFAIL: LLDB (/Users/buildslave/jenkins/workspace/lldb-cmake/lldb-build/bin/clang-11-x86_64) :: test_frame_variable_gmodules (TestSharedLib.SharedLibTestCase) Restore dir to: /Users/buildslave/jenkins/workspace/lldb-cmake/lldb-build/tools/lldb/test ====================================================================== ERROR: test_expr_no_preload_gmodules (TestSharedLib.SharedLibTestCase) Test that types work when defined in a shared library and forward-declared in the main executable, but with preloading disabled ---------------------------------------------------------------------- Traceback (most recent call last): File "/Users/buildslave/jenkins/workspace/lldb-cmake/llvm-project/lldb/packages/Python/lldbsuite/test/lldbtest.py", line 1767, in test_method return attrvalue(self) File "/Users/buildslave/jenkins/workspace/lldb-cmake/llvm-project/lldb/packages/Python/lldbsuite/test/decorators.py", line 110, in wrapper func(*args, **kwargs) File "/Users/buildslave/jenkins/workspace/lldb-cmake/llvm-project/lldb/test/API/lang/c/shared_lib/TestSharedLib.py", line 45, in test_expr_no_preload self.common_test_expr(False) File "/Users/buildslave/jenkins/workspace/lldb-cmake/llvm-project/lldb/test/API/lang/c/shared_lib/TestSharedLib.py", line 17, in common_test_expr if "clang" in self.getCompiler() and "3.4" in self.getCompilerVersion(): File "/Users/buildslave/jenkins/workspace/lldb-cmake/llvm-project/lldb/packages/Python/lldbsuite/test/lldbtest.py", line 1308, in getCompilerVersion version_output = system([[compiler, "-v"]])[1] File "/Users/buildslave/jenkins/workspace/lldb-cmake/llvm-project/lldb/packages/Python/lldbsuite/test/lldbtest.py", line 447, in system raise cpe subprocess.CalledProcessError: Command '/Users/buildslave/jenkins/workspace/lldb-cmake/lldb-build/bin/clang-11 -v' died with <Signals.SIGKILL: 9>. Config=x86_64-/Users/buildslave/jenkins/workspace/lldb-cmake/lldb-build/bin/clang-11 ====================================================================== FAIL: test_expr_dsym (TestSharedLib.SharedLibTestCase) Test that types work when defined in a shared library and forward-declared in the main executable ---------------------------------------------------------------------- Traceback (most recent call last): File "/Users/buildslave/jenkins/workspace/lldb-cmake/llvm-project/lldb/packages/Python/lldbsuite/test/lldbtest.py", line 1767, in test_method return attrvalue(self) File "/Users/buildslave/jenkins/workspace/lldb-cmake/llvm-project/lldb/packages/Python/lldbsuite/test/decorators.py", line 110, in wrapper func(*args, **kwargs) File "/Users/buildslave/jenkins/workspace/lldb-cmake/llvm-project/lldb/test/API/lang/c/shared_lib/TestSharedLib.py", line 40, in test_expr self.common_test_expr(True) File "/Users/buildslave/jenkins/workspace/lldb-cmake/llvm-project/lldb/test/API/lang/c/shared_lib/TestSharedLib.py", line 22, in common_test_expr self.common_setup(preload_symbols) File "/Users/buildslave/jenkins/workspace/lldb-cmake/llvm-project/lldb/test/API/lang/c/shared_lib/TestSharedLib.py", line 97, in common_setup 'stop reason = breakpoint']) File "/Users/buildslave/jenkins/workspace/lldb-cmake/llvm-project/lldb/packages/Python/lldbsuite/test/lldbtest.py", line 2367, in expect inHistory=inHistory) File "/Users/buildslave/jenkins/workspace/lldb-cmake/llvm-project/lldb/packages/Python/lldbsuite/test/lldbtest.py", line 2092, in runCmd msg if (msg) else CMD_MSG(cmd)) AssertionError: False is not True : Process should be stopped due to breakpoint Error output: error: Process must be launched.

Hide Details

Config=x86_64-/Users/buildslave/jenkins/workspace/lldb-cmake/lldb-build/bin/clang-11 ====================================================================== FAIL: test_expr_dwarf (TestSharedLib.SharedLibTestCase) Test that types work when defined in a shared library and forward-declared in the main executable ---------------------------------------------------------------------- Traceback (most recent call last): File "/Users/buildslave/jenkins/workspace/lldb-cmake/llvm-project/lldb/packages/Python/lldbsuite/test/lldbtest.py", line 1767, in test_method return attrvalue(self) File "/Users/buildslave/jenkins/workspace/lldb-cmake/llvm-project/lldb/packages/Python/lldbsuite/test/decorators.py", line 110, in wrapper func(*args, **kwargs) File "/Users/buildslave/jenkins/workspace/lldb-cmake/llvm-project/lldb/test/API/lang/c/shared_lib/TestSharedLib.py", line 40, in test_expr self.common_test_expr(True) File "/Users/buildslave/jenkins/workspace/lldb-cmake/llvm-project/lldb/test/API/lang/c/shared_lib/TestSharedLib.py", line 22, in common_test_expr self.common_setup(preload_symbols) File "/Users/buildslave/jenkins/workspace/lldb-cmake/llvm-project/lldb/test/API/lang/c/shared_lib/TestSharedLib.py", line 97, in common_setup 'stop reason = breakpoint']) File "/Users/buildslave/jenkins/workspace/lldb-cmake/llvm-project/lldb/packages/Python/lldbsuite/test/lldbtest.py", line 2367, in expect inHistory=inHistory) File "/Users/buildslave/jenkins/workspace/lldb-cmake/llvm-project/lldb/packages/Python/lldbsuite/test/lldbtest.py", line 2092, in runCmd msg if (msg) else CMD_MSG(cmd)) AssertionError: False is not True : Process should be stopped due to breakpoint Error output: error: Process must be launched.

Hide Details

Config=x86_64-/Users/buildslave/jenkins/workspace/lldb-cmake/lldb-build/bin/clang-11 ====================================================================== FAIL: test_expr_gmodules (TestSharedLib.SharedLibTestCase) Test that types work when defined in a shared library and forward-declared in the main executable ---------------------------------------------------------------------- Traceback (most recent call last): File "/Users/buildslave/jenkins/workspace/lldb-cmake/llvm-project/lldb/packages/Python/lldbsuite/test/lldbtest.py", line 1767, in test_method return attrvalue(self) File "/Users/buildslave/jenkins/workspace/lldb-cmake/llvm-project/lldb/packages/Python/lldbsuite/test/decorators.py", line 110, in wrapper func(*args, **kwargs) File "/Users/buildslave/jenkins/workspace/lldb-cmake/llvm-project/lldb/test/API/lang/c/shared_lib/TestSharedLib.py", line 40, in test_expr self.common_test_expr(True) File "/Users/buildslave/jenkins/workspace/lldb-cmake/llvm-project/lldb/test/API/lang/c/shared_lib/TestSharedLib.py", line 22, in common_test_expr self.common_setup(preload_symbols) File "/Users/buildslave/jenkins/workspace/lldb-cmake/llvm-project/lldb/test/API/lang/c/shared_lib/TestSharedLib.py", line 97, in common_setup 'stop reason = breakpoint']) File "/Users/buildslave/jenkins/workspace/lldb-cmake/llvm-project/lldb/packages/Python/lldbsuite/test/lldbtest.py", line 2367, in expect inHistory=inHistory) File "/Users/buildslave/jenkins/workspace/lldb-cmake/llvm-project/lldb/packages/Python/lldbsuite/test/lldbtest.py", line 2092, in runCmd msg if (msg) else CMD_MSG(cmd)) AssertionError: False is not True : Process should be stopped due to breakpoint Error output: error: Process must be launched.

Hide Details

Config=x86_64-/Users/buildslave/jenkins/workspace/lldb-cmake/lldb-build/bin/clang-11 ====================================================================== FAIL: test_expr_no_preload_dsym (TestSharedLib.SharedLibTestCase) Test that types work when defined in a shared library and forward-declared in the main executable, but with preloading disabled ---------------------------------------------------------------------- Traceback (most recent call last): File "/Users/buildslave/jenkins/workspace/lldb-cmake/llvm-project/lldb/packages/Python/lldbsuite/test/lldbtest.py", line 1767, in test_method return attrvalue(self) File "/Users/buildslave/jenkins/workspace/lldb-cmake/llvm-project/lldb/packages/Python/lldbsuite/test/decorators.py", line 110, in wrapper func(*args, **kwargs) File "/Users/buildslave/jenkins/workspace/lldb-cmake/llvm-project/lldb/test/API/lang/c/shared_lib/TestSharedLib.py", line 45, in test_expr_no_preload self.common_test_expr(False) File "/Users/buildslave/jenkins/workspace/lldb-cmake/llvm-project/lldb/test/API/lang/c/shared_lib/TestSharedLib.py", line 22, in common_test_expr self.common_setup(preload_symbols) File "/Users/buildslave/jenkins/workspace/lldb-cmake/llvm-project/lldb/test/API/lang/c/shared_lib/TestSharedLib.py", line 97, in common_setup 'stop reason = breakpoint']) File "/Users/buildslave/jenkins/workspace/lldb-cmake/llvm-project/lldb/packages/Python/lldbsuite/test/lldbtest.py", line 2367, in expect inHistory=inHistory) File "/Users/buildslave/jenkins/workspace/lldb-cmake/llvm-project/lldb/packages/Python/lldbsuite/test/lldbtest.py", line 2092, in runCmd msg if (msg) else CMD_MSG(cmd)) AssertionError: False is not True : Process should be stopped due to breakpoint Error output: error: Process must be launched.

Hide Details

Config=x86_64-/Users/buildslave/jenkins/workspace/lldb-cmake/lldb-build/bin/clang-11 ====================================================================== FAIL: test_expr_no_preload_dwarf (TestSharedLib.SharedLibTestCase) Test that types work when defined in a shared library and forward-declared in the main executable, but with preloading disabled ---------------------------------------------------------------------- Traceback (most recent call last): File "/Users/buildslave/jenkins/workspace/lldb-cmake/llvm-project/lldb/packages/Python/lldbsuite/test/lldbtest.py", line 1767, in test_method return attrvalue(self) File "/Users/buildslave/jenkins/workspace/lldb-cmake/llvm-project/lldb/packages/Python/lldbsuite/test/decorators.py", line 110, in wrapper func(*args, **kwargs) File "/Users/buildslave/jenkins/workspace/lldb-cmake/llvm-project/lldb/test/API/lang/c/shared_lib/TestSharedLib.py", line 45, in test_expr_no_preload self.common_test_expr(False) File "/Users/buildslave/jenkins/workspace/lldb-cmake/llvm-project/lldb/test/API/lang/c/shared_lib/TestSharedLib.py", line 22, in common_test_expr self.common_setup(preload_symbols) File "/Users/buildslave/jenkins/workspace/lldb-cmake/llvm-project/lldb/test/API/lang/c/shared_lib/TestSharedLib.py", line 97, in common_setup 'stop reason = breakpoint']) File "/Users/buildslave/jenkins/workspace/lldb-cmake/llvm-project/lldb/packages/Python/lldbsuite/test/lldbtest.py", line 2367, in expect inHistory=inHistory) File "/Users/buildslave/jenkins/workspace/lldb-cmake/llvm-project/lldb/packages/Python/lldbsuite/test/lldbtest.py", line 2092, in runCmd msg if (msg) else CMD_MSG(cmd)) AssertionError: False is not True : Process should be stopped due to breakpoint Error output: error: Process must be launched.

Hide Details

Config=x86_64-/Users/buildslave/jenkins/workspace/lldb-cmake/lldb-build/bin/clang-11 ---------------------------------------------------------------------- Ran 12 tests in 30.852s

Hide Details

RESULT: FAILED (0 passes, 5 failures, 1 errors, 3 skipped, 3 expected failures, 0 unexpected successes)

Hide Details

--

Hide Details

******************** TIMEOUT: lldb-shell :: Breakpoint/dummy-target.test (2032 of 2049) ******************** TEST 'lldb-shell :: Breakpoint/dummy-target.test' FAILED ******************** Script: -- : 'RUN: at line 1'; mkdir -p /Users/buildslave/jenkins/workspace/lldb-cmake/lldb-build/tools/lldb/test/Breakpoint/Output/dummy-target.test.tmp : 'RUN: at line 2'; cd /Users/buildslave/jenkins/workspace/lldb-cmake/lldb-build/tools/lldb/test/Breakpoint/Output/dummy-target.test.tmp : 'RUN: at line 3'; '/usr/local/opt/python/bin/python3.7' /Users/buildslave/jenkins/workspace/lldb-cmake/llvm-project/lldb/test/Shell/helper/build.py --compiler=any --arch=64 --tools-dir=/Users/buildslave/jenkins/workspace/lldb-cmake/lldb-build/./bin --libs-dir=/Users/buildslave/jenkins/workspace/lldb-cmake/lldb-build/./lib /Users/buildslave/jenkins/workspace/lldb-cmake/llvm-project/lldb/test/Shell/Breakpoint/Inputs/dummy-target.c -o dummy.out : 'RUN: at line 4'; /Users/buildslave/jenkins/workspace/lldb-cmake/lldb-build/bin/lldb --no-lldbinit -S /Users/buildslave/jenkins/workspace/lldb-cmake/lldb-build/tools/lldb/test/Shell/lit-lldb-init -b -s /Users/buildslave/jenkins/workspace/lldb-cmake/llvm-project/lldb/test/Shell/Breakpoint/dummy-target.test dummy.out | /Users/buildslave/jenkins/workspace/lldb-cmake/lldb-build/bin/FileCheck /Users/buildslave/jenkins/workspace/lldb-cmake/llvm-project/lldb/test/Shell/Breakpoint/dummy-target.test -- Exit Code: -9 Timeout: Reached timeout of 600 seconds

Hide Details

Command Output (stdout): -- Cleaning dummy.out-dummy-target.o Cleaning dummy.out

Hide Details

Hide Details

Hide Details

compiling dummy-target.c -> dummy.out-dummy-target.o STDOUT:

Hide Details

Hide Details

Hide Details

Hide Details

linking dummy.out-dummy-target.o -> dummy.out STDOUT:

Hide Details

Hide Details

--

Hide Details

******************** TIMEOUT: lldb-shell :: Register/x86-64-write.test (2033 of 2049) ******************** TEST 'lldb-shell :: Register/x86-64-write.test' FAILED ******************** Script: -- : 'RUN: at line 4'; /Users/buildslave/jenkins/workspace/lldb-cmake/lldb-build/bin/clang --driver-mode=g++ --target=specify-a-target-or-use-a-_host-substitution --target=x86_64-apple-darwin18.0.0 -isysroot /Applications/Xcode.app/Contents/Developer/Platforms/MacOSX.platform/Developer/SDKs/MacOSX.sdk -fmodules-cache-path=/Users/buildslave/jenkins/workspace/lldb-cmake/lldb-build/lldb-test-build.noindex/module-cache-clang/lldb-shell /Users/buildslave/jenkins/workspace/lldb-cmake/llvm-project/lldb/test/Shell/Register/Inputs/x86-64-write.cpp -o /Users/buildslave/jenkins/workspace/lldb-cmake/lldb-build/tools/lldb/test/Register/Output/x86-64-write.test.tmp : 'RUN: at line 5'; /Users/buildslave/jenkins/workspace/lldb-cmake/lldb-build/bin/lldb --no-lldbinit -S /Users/buildslave/jenkins/workspace/lldb-cmake/lldb-build/tools/lldb/test/Shell/lit-lldb-init -b -s /Users/buildslave/jenkins/workspace/lldb-cmake/llvm-project/lldb/test/Shell/Register/x86-64-write.test /Users/buildslave/jenkins/workspace/lldb-cmake/lldb-build/tools/lldb/test/Register/Output/x86-64-write.test.tmp | /Users/buildslave/jenkins/workspace/lldb-cmake/lldb-build/bin/FileCheck /Users/buildslave/jenkins/workspace/lldb-cmake/llvm-project/lldb/test/Shell/Register/x86-64-write.test -- Exit Code: -9 Timeout: Reached timeout of 600 seconds

Hide Details

Command Output (stderr): -- clang-11: warning: argument unused during compilation: '-fmodules-cache-path=/Users/buildslave/jenkins/workspace/lldb-cmake/lldb-build/lldb-test-build.noindex/module-cache-clang/lldb-shell' [-Wunused-command-line-argument]

Hide Details

--

Hide Details

******************** TIMEOUT: lldb-shell :: SymbolFile/DWARF/win-i386-line-table.s (2034 of 2049) ******************** TEST 'lldb-shell :: SymbolFile/DWARF/win-i386-line-table.s' FAILED ******************** Script: -- : 'RUN: at line 6'; /Users/buildslave/jenkins/workspace/lldb-cmake/lldb-build/bin/llvm-mc -triple i686-windows-gnu /Users/buildslave/jenkins/workspace/lldb-cmake/llvm-project/lldb/test/Shell/SymbolFile/DWARF/win-i386-line-table.s -filetype=obj > /Users/buildslave/jenkins/workspace/lldb-cmake/lldb-build/tools/lldb/test/SymbolFile/DWARF/Output/win-i386-line-table.s.tmp.o : 'RUN: at line 7'; /Users/buildslave/jenkins/workspace/lldb-cmake/lldb-build/bin/lld-link /Users/buildslave/jenkins/workspace/lldb-cmake/lldb-build/tools/lldb/test/SymbolFile/DWARF/Output/win-i386-line-table.s.tmp.o -out:/Users/buildslave/jenkins/workspace/lldb-cmake/lldb-build/tools/lldb/test/SymbolFile/DWARF/Output/win-i386-line-table.s.tmp.exe -debug:dwarf -entry:entry -subsystem:console -lldmingw : 'RUN: at line 8'; /Users/buildslave/jenkins/workspace/lldb-cmake/lldb-build/bin/lldb --no-lldbinit -S /Users/buildslave/jenkins/workspace/lldb-cmake/lldb-build/tools/lldb/test/Shell/lit-lldb-init /Users/buildslave/jenkins/workspace/lldb-cmake/lldb-build/tools/lldb/test/SymbolFile/DWARF/Output/win-i386-line-table.s.tmp.exe -o "image dump line-table -v win-i386-line-table.c" -b | /Users/buildslave/jenkins/workspace/lldb-cmake/lldb-build/bin/FileCheck /Users/buildslave/jenkins/workspace/lldb-cmake/llvm-project/lldb/test/Shell/SymbolFile/DWARF/win-i386-line-table.s -- Exit Code: -9 Timeout: Reached timeout of 600 seconds

Hide Details

Hide Details

******************** TIMEOUT: lldb-shell :: SymbolFile/Breakpad/unwind-via-stack-win-no-memory-info.yaml (2035 of 2049) ******************** TEST 'lldb-shell :: SymbolFile/Breakpad/unwind-via-stack-win-no-memory-info.yaml' FAILED ******************** Script: -- : 'RUN: at line 1'; /Users/buildslave/jenkins/workspace/lldb-cmake/lldb-build/bin/yaml2obj --docnum=1 /Users/buildslave/jenkins/workspace/lldb-cmake/llvm-project/lldb/test/Shell/SymbolFile/Breakpad/unwind-via-stack-win-no-memory-info.yaml > /Users/buildslave/jenkins/workspace/lldb-cmake/lldb-build/tools/lldb/test/SymbolFile/Breakpad/Output/unwind-via-stack-win-no-memory-info.yaml.tmp.dmp : 'RUN: at line 2'; /Users/buildslave/jenkins/workspace/lldb-cmake/lldb-build/bin/yaml2obj --docnum=2 /Users/buildslave/jenkins/workspace/lldb-cmake/llvm-project/lldb/test/Shell/SymbolFile/Breakpad/unwind-via-stack-win-no-memory-info.yaml > /Users/buildslave/jenkins/workspace/lldb-cmake/lldb-build/tools/lldb/test/SymbolFile/Breakpad/Output/unwind-via-stack-win-no-memory-info.exe : 'RUN: at line 3'; /Users/buildslave/jenkins/workspace/lldb-cmake/lldb-build/bin/lldb --no-lldbinit -S /Users/buildslave/jenkins/workspace/lldb-cmake/lldb-build/tools/lldb/test/Shell/lit-lldb-init -c /Users/buildslave/jenkins/workspace/lldb-cmake/lldb-build/tools/lldb/test/SymbolFile/Breakpad/Output/unwind-via-stack-win-no-memory-info.yaml.tmp.dmp /Users/buildslave/jenkins/workspace/lldb-cmake/lldb-build/tools/lldb/test/SymbolFile/Breakpad/Output/unwind-via-stack-win-no-memory-info.exe -o "target symbols add /Users/buildslave/jenkins/workspace/lldb-cmake/llvm-project/lldb/test/Shell/SymbolFile/Breakpad/Inputs/unwind-via-raSearch.syms" -o "thread backtrace" -b | /Users/buildslave/jenkins/workspace/lldb-cmake/lldb-build/bin/FileCheck /Users/buildslave/jenkins/workspace/lldb-cmake/llvm-project/lldb/test/Shell/SymbolFile/Breakpad/unwind-via-stack-win-no-memory-info.yaml -- Exit Code: -9 Timeout: Reached timeout of 600 seconds

Hide Details

Hide Details

******************** UNSUPPORTED: lldb-api :: functionalities/thread/create_during_step/TestCreateDuringStep.py (2036 of 2049) TIMEOUT: lldb-shell :: SymbolFile/Breakpad/unwind-via-stack-cfi.test (2037 of 2049) ******************** TEST 'lldb-shell :: SymbolFile/Breakpad/unwind-via-stack-cfi.test' FAILED ******************** Script: -- : 'RUN: at line 3'; /Users/buildslave/jenkins/workspace/lldb-cmake/lldb-build/bin/yaml2obj /Users/buildslave/jenkins/workspace/lldb-cmake/llvm-project/lldb/test/Shell/SymbolFile/Breakpad/Inputs/unwind-via-stack-cfi.yaml > /Users/buildslave/jenkins/workspace/lldb-cmake/lldb-build/tools/lldb/test/SymbolFile/Breakpad/Output/unwind-via-stack-cfi.test.tmp : 'RUN: at line 4'; /Users/buildslave/jenkins/workspace/lldb-cmake/lldb-build/bin/lldb --no-lldbinit -S /Users/buildslave/jenkins/workspace/lldb-cmake/lldb-build/tools/lldb/test/Shell/lit-lldb-init -c /Users/buildslave/jenkins/workspace/lldb-cmake/lldb-build/tools/lldb/test/SymbolFile/Breakpad/Output/unwind-via-stack-cfi.test.tmp -o "target symbols add /Users/buildslave/jenkins/workspace/lldb-cmake/llvm-project/lldb/test/Shell/SymbolFile/Breakpad/Inputs/unwind-via-stack-cfi.syms" -s /Users/buildslave/jenkins/workspace/lldb-cmake/llvm-project/lldb/test/Shell/SymbolFile/Breakpad/unwind-via-stack-cfi.test -b | /Users/buildslave/jenkins/workspace/lldb-cmake/lldb-build/bin/FileCheck /Users/buildslave/jenkins/workspace/lldb-cmake/llvm-project/lldb/test/Shell/SymbolFile/Breakpad/unwind-via-stack-cfi.test -- Exit Code: -9 Timeout: Reached timeout of 600 seconds

Hide Details

Hide Details

******************** TIMEOUT: lldb-shell :: ObjectFile/ELF/PT_TLS-overlap-PT_LOAD.yaml (2038 of 2049) ******************** TEST 'lldb-shell :: ObjectFile/ELF/PT_TLS-overlap-PT_LOAD.yaml' FAILED ******************** Script: -- : 'RUN: at line 3'; /Users/buildslave/jenkins/workspace/lldb-cmake/lldb-build/bin/yaml2obj /Users/buildslave/jenkins/workspace/lldb-cmake/llvm-project/lldb/test/Shell/ObjectFile/ELF/PT_TLS-overlap-PT_LOAD.yaml > /Users/buildslave/jenkins/workspace/lldb-cmake/lldb-build/tools/lldb/test/ObjectFile/ELF/Output/PT_TLS-overlap-PT_LOAD.yaml.tmp : 'RUN: at line 4'; /Users/buildslave/jenkins/workspace/lldb-cmake/lldb-build/bin/lldb-test object-file /Users/buildslave/jenkins/workspace/lldb-cmake/lldb-build/tools/lldb/test/ObjectFile/ELF/Output/PT_TLS-overlap-PT_LOAD.yaml.tmp | /Users/buildslave/jenkins/workspace/lldb-cmake/lldb-build/bin/FileCheck /Users/buildslave/jenkins/workspace/lldb-cmake/llvm-project/lldb/test/Shell/ObjectFile/ELF/PT_TLS-overlap-PT_LOAD.yaml : 'RUN: at line 5'; /Users/buildslave/jenkins/workspace/lldb-cmake/lldb-build/bin/lldb --no-lldbinit -S /Users/buildslave/jenkins/workspace/lldb-cmake/lldb-build/tools/lldb/test/Shell/lit-lldb-init /Users/buildslave/jenkins/workspace/lldb-cmake/lldb-build/tools/lldb/test/ObjectFile/ELF/Output/PT_TLS-overlap-PT_LOAD.yaml.tmp -o "image lookup -a 0x1000" -b | /Users/buildslave/jenkins/workspace/lldb-cmake/lldb-build/bin/FileCheck --check-prefix=LOOKUP /Users/buildslave/jenkins/workspace/lldb-cmake/llvm-project/lldb/test/Shell/ObjectFile/ELF/PT_TLS-overlap-PT_LOAD.yaml -- Exit Code: -9 Timeout: Reached timeout of 600 seconds

Hide Details

Hide Details

******************** TIMEOUT: lldb-shell :: ObjectFile/ELF/minidebuginfo-find-symbols.yaml (2039 of 2049) ******************** TEST 'lldb-shell :: ObjectFile/ELF/minidebuginfo-find-symbols.yaml' FAILED ******************** Script: -- : 'RUN: at line 3'; /Users/buildslave/jenkins/workspace/lldb-cmake/lldb-build/bin/yaml2obj /Users/buildslave/jenkins/workspace/lldb-cmake/llvm-project/lldb/test/Shell/ObjectFile/ELF/minidebuginfo-find-symbols.yaml > /Users/buildslave/jenkins/workspace/lldb-cmake/lldb-build/tools/lldb/test/ObjectFile/ELF/Output/minidebuginfo-find-symbols.yaml.tmp.obj : 'RUN: at line 5'; /Users/buildslave/jenkins/workspace/lldb-cmake/lldb-build/bin/lldb --no-lldbinit -S /Users/buildslave/jenkins/workspace/lldb-cmake/lldb-build/tools/lldb/test/Shell/lit-lldb-init -b -o 'image dump symtab' /Users/buildslave/jenkins/workspace/lldb-cmake/lldb-build/tools/lldb/test/ObjectFile/ELF/Output/minidebuginfo-find-symbols.yaml.tmp.obj | /Users/buildslave/jenkins/workspace/lldb-cmake/lldb-build/bin/FileCheck /Users/buildslave/jenkins/workspace/lldb-cmake/llvm-project/lldb/test/Shell/ObjectFile/ELF/minidebuginfo-find-symbols.yaml -- Exit Code: -9 Timeout: Reached timeout of 600 seconds

Hide Details

Hide Details

******************** TIMEOUT: lldb-shell :: Quit/TestQuitExitCodeNonInt.test (2040 of 2049) ******************** TEST 'lldb-shell :: Quit/TestQuitExitCodeNonInt.test' FAILED ******************** Script: -- : 'RUN: at line 2'; not /Users/buildslave/jenkins/workspace/lldb-cmake/lldb-build/bin/lldb --no-lldbinit -S /Users/buildslave/jenkins/workspace/lldb-cmake/lldb-build/tools/lldb/test/Shell/lit-lldb-init -b -s /Users/buildslave/jenkins/workspace/lldb-cmake/llvm-project/lldb/test/Shell/Quit/TestQuitExitCodeNonInt.test 2>&1 | /Users/buildslave/jenkins/workspace/lldb-cmake/lldb-build/bin/FileCheck /Users/buildslave/jenkins/workspace/lldb-cmake/llvm-project/lldb/test/Shell/Quit/TestQuitExitCodeNonInt.test -- Exit Code: -9 Timeout: Reached timeout of 600 seconds

Hide Details

Hide Details

******************** TIMEOUT: lldb-shell :: SymbolFile/DWARF/debug_rnglists-dwo.s (2041 of 2049) ******************** TEST 'lldb-shell :: SymbolFile/DWARF/debug_rnglists-dwo.s' FAILED ******************** Script: -- : 'RUN: at line 3'; cd /Users/buildslave/jenkins/workspace/lldb-cmake/lldb-build/tools/lldb/test/SymbolFile/DWARF/Output : 'RUN: at line 4'; /Users/buildslave/jenkins/workspace/lldb-cmake/lldb-build/bin/llvm-mc -triple=x86_64-pc-linux -filetype=obj /Users/buildslave/jenkins/workspace/lldb-cmake/llvm-project/lldb/test/Shell/SymbolFile/DWARF/debug_rnglists-dwo.s >debug_rnglists-dwo.o : 'RUN: at line 5'; /Users/buildslave/jenkins/workspace/lldb-cmake/lldb-build/bin/lldb --no-lldbinit -S /Users/buildslave/jenkins/workspace/lldb-cmake/lldb-build/tools/lldb/test/Shell/lit-lldb-init debug_rnglists-dwo.o -o "image lookup -v -s lookup_rnglists" -o exit | /Users/buildslave/jenkins/workspace/lldb-cmake/lldb-build/bin/FileCheck /Users/buildslave/jenkins/workspace/lldb-cmake/llvm-project/lldb/test/Shell/SymbolFile/DWARF/debug_rnglists-dwo.s -- Exit Code: -9 Timeout: Reached timeout of 600 seconds

Hide Details

Hide Details

******************** TIMEOUT: lldb-shell :: SymbolFile/DWARF/dir-separator-no-comp-dir-relative-name.s (2042 of 2049) ******************** TEST 'lldb-shell :: SymbolFile/DWARF/dir-separator-no-comp-dir-relative-name.s' FAILED ******************** Script: -- : 'RUN: at line 7'; /Users/buildslave/jenkins/workspace/lldb-cmake/lldb-build/bin/llvm-mc -triple x86_64-pc-linux /Users/buildslave/jenkins/workspace/lldb-cmake/llvm-project/lldb/test/Shell/SymbolFile/DWARF/dir-separator-no-comp-dir-relative-name.s -filetype=obj > /Users/buildslave/jenkins/workspace/lldb-cmake/lldb-build/tools/lldb/test/SymbolFile/DWARF/Output/dir-separator-no-comp-dir-relative-name.s.tmp.o : 'RUN: at line 8'; /Users/buildslave/jenkins/workspace/lldb-cmake/lldb-build/bin/ld.lld /Users/buildslave/jenkins/workspace/lldb-cmake/lldb-build/tools/lldb/test/SymbolFile/DWARF/Output/dir-separator-no-comp-dir-relative-name.s.tmp.o -o /Users/buildslave/jenkins/workspace/lldb-cmake/lldb-build/tools/lldb/test/SymbolFile/DWARF/Output/dir-separator-no-comp-dir-relative-name.s.tmp -z separate-code : 'RUN: at line 9'; /Users/buildslave/jenkins/workspace/lldb-cmake/lldb-build/bin/lldb --no-lldbinit -S /Users/buildslave/jenkins/workspace/lldb-cmake/lldb-build/tools/lldb/test/Shell/lit-lldb-init /Users/buildslave/jenkins/workspace/lldb-cmake/lldb-build/tools/lldb/test/SymbolFile/DWARF/Output/dir-separator-no-comp-dir-relative-name.s.tmp -s /Users/buildslave/jenkins/workspace/lldb-cmake/llvm-project/lldb/test/Shell/SymbolFile/DWARF/Inputs/dir-separator-no-comp-dir-relative-name.lldbinit -o exit | /Users/buildslave/jenkins/workspace/lldb-cmake/lldb-build/bin/FileCheck /Users/buildslave/jenkins/workspace/lldb-cmake/llvm-project/lldb/test/Shell/SymbolFile/DWARF/dir-separator-no-comp-dir-relative-name.s -- Exit Code: -9 Timeout: Reached timeout of 600 seconds

Hide Details

Hide Details

******************** TIMEOUT: lldb-shell :: Register/x86-64-ymm-read.test (2043 of 2049) ******************** TEST 'lldb-shell :: Register/x86-64-ymm-read.test' FAILED ******************** Script: -- : 'RUN: at line 4'; /Users/buildslave/jenkins/workspace/lldb-cmake/lldb-build/bin/clang --driver-mode=g++ --target=specify-a-target-or-use-a-_host-substitution --target=x86_64-apple-darwin18.0.0 -isysroot /Applications/Xcode.app/Contents/Developer/Platforms/MacOSX.platform/Developer/SDKs/MacOSX.sdk -fmodules-cache-path=/Users/buildslave/jenkins/workspace/lldb-cmake/lldb-build/lldb-test-build.noindex/module-cache-clang/lldb-shell /Users/buildslave/jenkins/workspace/lldb-cmake/llvm-project/lldb/test/Shell/Register/Inputs/x86-ymm-read.cpp -o /Users/buildslave/jenkins/workspace/lldb-cmake/lldb-build/tools/lldb/test/Register/Output/x86-64-ymm-read.test.tmp : 'RUN: at line 5'; /Users/buildslave/jenkins/workspace/lldb-cmake/lldb-build/bin/lldb --no-lldbinit -S /Users/buildslave/jenkins/workspace/lldb-cmake/lldb-build/tools/lldb/test/Shell/lit-lldb-init -b -s /Users/buildslave/jenkins/workspace/lldb-cmake/llvm-project/lldb/test/Shell/Register/x86-64-ymm-read.test /Users/buildslave/jenkins/workspace/lldb-cmake/lldb-build/tools/lldb/test/Register/Output/x86-64-ymm-read.test.tmp | /Users/buildslave/jenkins/workspace/lldb-cmake/lldb-build/bin/FileCheck /Users/buildslave/jenkins/workspace/lldb-cmake/llvm-project/lldb/test/Shell/Register/x86-64-ymm-read.test -- Exit Code: -9 Timeout: Reached timeout of 600 seconds

Hide Details

Command Output (stderr): -- clang-11: warning: argument unused during compilation: '-fmodules-cache-path=/Users/buildslave/jenkins/workspace/lldb-cmake/lldb-build/lldb-test-build.noindex/module-cache-clang/lldb-shell' [-Wunused-command-line-argument]

Hide Details

--

Hide Details

******************** TIMEOUT: lldb-shell :: Minidump/no-process-id.yaml (2044 of 2049) ******************** TEST 'lldb-shell :: Minidump/no-process-id.yaml' FAILED ******************** Script: -- : 'RUN: at line 1'; /Users/buildslave/jenkins/workspace/lldb-cmake/lldb-build/bin/yaml2obj /Users/buildslave/jenkins/workspace/lldb-cmake/llvm-project/lldb/test/Shell/Minidump/no-process-id.yaml > /Users/buildslave/jenkins/workspace/lldb-cmake/lldb-build/tools/lldb/test/Minidump/Output/no-process-id.yaml.tmp : 'RUN: at line 2'; /Users/buildslave/jenkins/workspace/lldb-cmake/lldb-build/bin/lldb --no-lldbinit -S /Users/buildslave/jenkins/workspace/lldb-cmake/lldb-build/tools/lldb/test/Shell/lit-lldb-init -c /Users/buildslave/jenkins/workspace/lldb-cmake/lldb-build/tools/lldb/test/Minidump/Output/no-process-id.yaml.tmp -o "thread list" -o "register read" -b 2>&1 | /Users/buildslave/jenkins/workspace/lldb-cmake/lldb-build/bin/FileCheck /Users/buildslave/jenkins/workspace/lldb-cmake/llvm-project/lldb/test/Shell/Minidump/no-process-id.yaml -- Exit Code: -9 Timeout: Reached timeout of 600 seconds

Hide Details

Hide Details

******************** TIMEOUT: lldb-shell :: Driver/TestTarget.test (2045 of 2049) ******************** TEST 'lldb-shell :: Driver/TestTarget.test' FAILED ******************** Script: -- : 'RUN: at line 2'; mkdir -p /Users/buildslave/jenkins/workspace/lldb-cmake/lldb-build/tools/lldb/test/Driver/Output/TestTarget.test.tmp/foo : 'RUN: at line 3'; cd /Users/buildslave/jenkins/workspace/lldb-cmake/lldb-build/tools/lldb/test/Driver/Output/TestTarget.test.tmp/foo : 'RUN: at line 4'; /Users/buildslave/jenkins/workspace/lldb-cmake/lldb-build/bin/clang --target=specify-a-target-or-use-a-_host-substitution --target=x86_64-apple-darwin18.0.0 -isysroot /Applications/Xcode.app/Contents/Developer/Platforms/MacOSX.platform/Developer/SDKs/MacOSX.sdk -fmodules-cache-path=/Users/buildslave/jenkins/workspace/lldb-cmake/lldb-build/lldb-test-build.noindex/module-cache-clang/lldb-shell /Users/buildslave/jenkins/workspace/lldb-cmake/llvm-project/lldb/test/Shell/Driver/Inputs/hello.c -g -o a.out : 'RUN: at line 5'; /Users/buildslave/jenkins/workspace/lldb-cmake/lldb-build/bin/lldb --no-lldbinit -S /Users/buildslave/jenkins/workspace/lldb-cmake/lldb-build/tools/lldb/test/Shell/lit-lldb-init -b a.out | /Users/buildslave/jenkins/workspace/lldb-cmake/lldb-build/bin/FileCheck /Users/buildslave/jenkins/workspace/lldb-cmake/llvm-project/lldb/test/Shell/Driver/TestTarget.test -- Exit Code: -9 Timeout: Reached timeout of 600 seconds

Hide Details

Command Output (stderr): -- clang-11: warning: argument unused during compilation: '-fmodules-cache-path=/Users/buildslave/jenkins/workspace/lldb-cmake/lldb-build/lldb-test-build.noindex/module-cache-clang/lldb-shell' [-Wunused-command-line-argument]

Hide Details

--

Hide Details

******************** TIMEOUT: lldb-shell :: Settings/TestLineMarkerColor.test (2046 of 2049) ******************** TEST 'lldb-shell :: Settings/TestLineMarkerColor.test' FAILED ******************** Script: -- : 'RUN: at line 1'; /Users/buildslave/jenkins/workspace/lldb-cmake/lldb-build/bin/clang --target=specify-a-target-or-use-a-_host-substitution --target=x86_64-apple-darwin18.0.0 -isysroot /Applications/Xcode.app/Contents/Developer/Platforms/MacOSX.platform/Developer/SDKs/MacOSX.sdk -fmodules-cache-path=/Users/buildslave/jenkins/workspace/lldb-cmake/lldb-build/lldb-test-build.noindex/module-cache-clang/lldb-shell -g -O0 /Users/buildslave/jenkins/workspace/lldb-cmake/llvm-project/lldb/test/Shell/Settings/Inputs/main.c -o /Users/buildslave/jenkins/workspace/lldb-cmake/lldb-build/tools/lldb/test/Settings/Output/TestLineMarkerColor.test.tmp.out : 'RUN: at line 2'; /Users/buildslave/jenkins/workspace/lldb-cmake/lldb-build/bin/lldb --no-lldbinit -S /Users/buildslave/jenkins/workspace/lldb-cmake/lldb-build/tools/lldb/test/Shell/lit-lldb-init -x -b -s /Users/buildslave/jenkins/workspace/lldb-cmake/llvm-project/lldb/test/Shell/Settings/TestLineMarkerColor.test /Users/buildslave/jenkins/workspace/lldb-cmake/lldb-build/tools/lldb/test/Settings/Output/TestLineMarkerColor.test.tmp.out | /Users/buildslave/jenkins/workspace/lldb-cmake/lldb-build/bin/FileCheck /Users/buildslave/jenkins/workspace/lldb-cmake/llvm-project/lldb/test/Shell/Settings/TestLineMarkerColor.test -- Exit Code: -9 Timeout: Reached timeout of 600 seconds

Hide Details

Command Output (stderr): -- clang-11: warning: argument unused during compilation: '-fmodules-cache-path=/Users/buildslave/jenkins/workspace/lldb-cmake/lldb-build/lldb-test-build.noindex/module-cache-clang/lldb-shell' [-Wunused-command-line-argument]

Hide Details

--

Hide Details

******************** TIMEOUT: lldb-shell :: Heap/heap-cstr.test (2047 of 2049) ******************** TEST 'lldb-shell :: Heap/heap-cstr.test' FAILED ******************** Script: -- : 'RUN: at line 3'; /Users/buildslave/jenkins/workspace/lldb-cmake/lldb-build/bin/clang --target=specify-a-target-or-use-a-_host-substitution --target=x86_64-apple-darwin18.0.0 -isysroot /Applications/Xcode.app/Contents/Developer/Platforms/MacOSX.platform/Developer/SDKs/MacOSX.sdk -fmodules-cache-path=/Users/buildslave/jenkins/workspace/lldb-cmake/lldb-build/lldb-test-build.noindex/module-cache-clang/lldb-shell /Users/buildslave/jenkins/workspace/lldb-cmake/llvm-project/lldb/test/Shell/Heap/Inputs/cstr.c -g -o /Users/buildslave/jenkins/workspace/lldb-cmake/lldb-build/tools/lldb/test/Heap/Output/heap-cstr.test.tmp : 'RUN: at line 4'; /Users/buildslave/jenkins/workspace/lldb-cmake/lldb-build/bin/lldb --no-lldbinit -S /Users/buildslave/jenkins/workspace/lldb-cmake/lldb-build/tools/lldb/test/Shell/lit-lldb-init -b -s /Users/buildslave/jenkins/workspace/lldb-cmake/llvm-project/lldb/test/Shell/Heap/heap-cstr.test -f /Users/buildslave/jenkins/workspace/lldb-cmake/lldb-build/tools/lldb/test/Heap/Output/heap-cstr.test.tmp | /Users/buildslave/jenkins/workspace/lldb-cmake/lldb-build/bin/FileCheck /Users/buildslave/jenkins/workspace/lldb-cmake/llvm-project/lldb/test/Shell/Heap/heap-cstr.test -- Exit Code: -9 Timeout: Reached timeout of 600 seconds

Hide Details

Command Output (stderr): -- clang-11: warning: argument unused during compilation: '-fmodules-cache-path=/Users/buildslave/jenkins/workspace/lldb-cmake/lldb-build/lldb-test-build.noindex/module-cache-clang/lldb-shell' [-Wunused-command-line-argument]

Hide Details

--

Hide Details

******************** TIMEOUT: lldb-shell :: Minidump/disassemble-no-module.yaml (2048 of 2049) ******************** TEST 'lldb-shell :: Minidump/disassemble-no-module.yaml' FAILED ******************** Script: -- : 'RUN: at line 1'; /Users/buildslave/jenkins/workspace/lldb-cmake/lldb-build/bin/yaml2obj /Users/buildslave/jenkins/workspace/lldb-cmake/llvm-project/lldb/test/Shell/Minidump/disassemble-no-module.yaml > /Users/buildslave/jenkins/workspace/lldb-cmake/lldb-build/tools/lldb/test/Minidump/Output/disassemble-no-module.yaml.tmp : 'RUN: at line 2'; /Users/buildslave/jenkins/workspace/lldb-cmake/lldb-build/bin/lldb --no-lldbinit -S /Users/buildslave/jenkins/workspace/lldb-cmake/lldb-build/tools/lldb/test/Shell/lit-lldb-init -c /Users/buildslave/jenkins/workspace/lldb-cmake/lldb-build/tools/lldb/test/Minidump/Output/disassemble-no-module.yaml.tmp -o bt -o disassemble 2>&1 | /Users/buildslave/jenkins/workspace/lldb-cmake/lldb-build/bin/FileCheck /Users/buildslave/jenkins/workspace/lldb-cmake/llvm-project/lldb/test/Shell/Minidump/disassemble-no-module.yaml -- Exit Code: -9 Timeout: Reached timeout of 600 seconds

Hide Details

Hide Details

******************** TIMEOUT: lldb-shell :: Settings/TestDisableColor.test (2049 of 2049) ******************** TEST 'lldb-shell :: Settings/TestDisableColor.test' FAILED ******************** Script: -- : 'RUN: at line 1'; /Users/buildslave/jenkins/workspace/lldb-cmake/lldb-build/bin/lldb --no-lldbinit -S /Users/buildslave/jenkins/workspace/lldb-cmake/lldb-build/tools/lldb/test/Shell/lit-lldb-init -x -b -s /Users/buildslave/jenkins/workspace/lldb-cmake/llvm-project/lldb/test/Shell/Settings/TestDisableColor.test | /Users/buildslave/jenkins/workspace/lldb-cmake/lldb-build/bin/FileCheck /Users/buildslave/jenkins/workspace/lldb-cmake/llvm-project/lldb/test/Shell/Settings/TestDisableColor.test -- Exit Code: -9 Timeout: Reached timeout of 600 seconds

Hide Details

Hide Details

******************** Slowest Tests: -------------------------------------------------------------------------- 600.00s: lldb-shell :: Driver/TestTarget.test 600.00s: lldb-shell :: SymbolFile/Breakpad/unwind-via-stack-win-no-memory-info.yaml 600.00s: lldb-shell :: Settings/TestLineMarkerColor.test 600.00s: lldb-shell :: Reproducer/TestReuseDirectory.test 600.00s: lldb-shell :: SymbolFile/DWARF/debug-types-basic.test 600.00s: lldb-shell :: Reproducer/Functionalities/TestDataFormatter.test 600.00s: lldb-shell :: Register/x86-64-ymm-read.test 600.00s: lldb-shell :: Settings/TestDisableColor.test 600.00s: lldb-shell :: Settings/TestEchoCommands.test 600.00s: lldb-shell :: Minidump/disassemble-no-module.yaml 600.00s: lldb-shell :: Settings/TestFrameFormatMangling.test 600.00s: lldb-shell :: Heap/heap-cstr.test 600.00s: lldb-shell :: SymbolFile/NativePDB/break-by-line.cpp 600.00s: lldb-shell :: Register/x86-64-write.test 600.00s: lldb-shell :: SymbolFile/Breakpad/line-table.test 600.00s: lldb-shell :: Breakpoint/dummy-target.test 600.00s: lldb-unit :: tools/lldb-server/tests/./LLDBServerTests/TestBase.DebugserverEnv 599.99s: lldb-shell :: SymbolFile/Breakpad/line-table-missing-file.test 599.99s: lldb-shell :: Quit/TestQuitExitCodeNonInt.test 599.99s: lldb-shell :: Reproducer/TestSynchronous.test

Hide Details

Tests Times: -------------------------------------------------------------------------- [ Range ] :: [ Percentage ] :: [ Count ] -------------------------------------------------------------------------- [600s,650s) :: [ ] :: [ 35/2049] [550s,600s) :: [ ] :: [ 0/2049] [500s,550s) :: [ ] :: [ 0/2049] [450s,500s) :: [ ] :: [ 0/2049] [400s,450s) :: [ ] :: [ 0/2049] [350s,400s) :: [ ] :: [ 0/2049] [300s,350s) :: [ ] :: [ 0/2049] [250s,300s) :: [ ] :: [ 0/2049] [200s,250s) :: [ ] :: [ 0/2049] [150s,200s) :: [ ] :: [ 1/2049] [100s,150s) :: [ ] :: [ 6/2049] [ 50s,100s) :: [ ] :: [ 14/2049] [ 0s, 50s) :: [************************************** ] :: [1993/2049] -------------------------------------------------------------------------- ******************** Timed Out Tests (35): lldb-shell :: Reproducer/Functionalities/TestDataFormatter.test lldb-shell :: SymbolFile/Breakpad/line-table.test lldb-shell :: SymbolFile/DWARF/parallel-indexing-stress.s lldb-shell :: Reproducer/TestSynchronous.test lldb-shell :: SymbolFile/DWARF/DW_AT_loclists_base.s lldb-shell :: SymbolFile/Breakpad/line-table-edgecases.test lldb-unit :: tools/lldb-server/tests/./LLDBServerTests/TestBase.DebugserverEnv lldb-shell :: SymbolFile/DWARF/dwo-type-in-main-file.s lldb-shell :: SymbolFile/Breakpad/line-table-mixed-path-styles.test lldb-shell :: Reproducer/TestReuseDirectory.test lldb-shell :: Settings/TestFrameFormatMangling.test lldb-shell :: SymbolFile/DWARF/debug-types-basic.test lldb-shell :: SymbolFile/NativePDB/break-by-line.cpp lldb-shell :: Settings/TestEchoCommands.test lldb-shell :: SymbolFile/DWARF/debug_ranges-missing-section.s lldb-shell :: Watchpoint/SetErrorCases.test lldb-shell :: Commands/command-regex-unalias.test lldb-shell :: SymbolFile/Breakpad/line-table-missing-file.test lldb-shell :: Breakpoint/dummy-target.test lldb-shell :: Register/x86-64-write.test lldb-shell :: SymbolFile/DWARF/win-i386-line-table.s lldb-shell :: SymbolFile/Breakpad/unwind-via-stack-win-no-memory-info.yaml lldb-shell :: SymbolFile/Breakpad/unwind-via-stack-cfi.test lldb-shell :: ObjectFile/ELF/PT_TLS-overlap-PT_LOAD.yaml lldb-shell :: ObjectFile/ELF/minidebuginfo-find-symbols.yaml lldb-shell :: Quit/TestQuitExitCodeNonInt.test lldb-shell :: SymbolFile/DWARF/debug_rnglists-dwo.s lldb-shell :: SymbolFile/DWARF/dir-separator-no-comp-dir-relative-name.s lldb-shell :: Register/x86-64-ymm-read.test lldb-shell :: Minidump/no-process-id.yaml lldb-shell :: Driver/TestTarget.test lldb-shell :: Settings/TestLineMarkerColor.test lldb-shell :: Heap/heap-cstr.test lldb-shell :: Minidump/disassemble-no-module.yaml lldb-shell :: Settings/TestDisableColor.test

Hide Details

******************** Failed Tests (904): lldb-api :: lang/objc/foundation/TestObjCMethods.py lldb-api :: lang/cpp/namespace/TestNamespaceLookup.py lldb-api :: lang/objc/foundation/TestFoundationDisassembly.py lldb-api :: types/TestLongTypes.py lldb-api :: commands/expression/diagnostics/TestExprDiagnostics.py lldb-api :: functionalities/thread/exit_during_break/TestExitDuringBreak.py lldb-api :: functionalities/inline-stepping/TestInlineStepping.py lldb-api :: lang/cpp/unicode-literals/TestUnicodeLiterals.py lldb-api :: functionalities/jitloader_gdb/TestJITLoaderGDB.py lldb-api :: commands/expression/import_builtin_fileid/TestImportBuiltinFileID.py lldb-api :: tools/lldb-server/TestGdbRemoteRegisterState.py lldb-api :: functionalities/data-formatter/data-formatter-objc/TestDataFormatterObjCNSContainer.py lldb-api :: lang/c/register_variables/TestRegisterVariables.py lldb-api :: commands/expression/import-std-module/list-dbg-info-content/TestDbgInfoContentListFromStdModule.py lldb-api :: macosx/universal/TestUniversal.py lldb-api :: functionalities/data-formatter/data-formatter-objc/TestDataFormatterObjCExpr.py lldb-shell :: SymbolFile/DWARF/array-sizes.s lldb-api :: lang/cpp/dynamic-value/TestCppValueCast.py lldb-shell :: ObjectFile/ELF/base-address.yaml lldb-api :: lang/cpp/static_methods/TestCPPStaticMethods.py lldb-api :: python_api/breakpoint/TestBreakpointAPI.py lldb-unit :: Utility/./UtilityTests/StreamTeeTest.Constructor1Stream lldb-api :: tools/lldb-server/register-reading/TestGdbRemoteGPacket.py lldb-unit :: Utility/./UtilityTests/RangeDataVector.FindEntryIndexesThatContain lldb-api :: python_api/symbol-context/two-files/TestSymbolContextTwoFiles.py lldb-api :: commands/target/create-deps/TestTargetCreateDeps.py lldb-api :: lang/c/stepping/TestStepAndBreakpoints.py lldb-api :: commands/frame/var-scope/TestFrameVariableScope.py lldb-api :: lang/objc/objc++/TestObjCXX.py lldb-api :: functionalities/abbreviation/TestCommonShortSpellings.py lldb-api :: python_api/sblaunchinfo/TestSBLaunchInfo.py lldb-unit :: Expression/./ExpressionTests/DWARFExpression.DW_OP_stack_value lldb-api :: functionalities/thread/concurrent_events/TestConcurrentDelaySignalBreak.py lldb-api :: commands/expression/namespace_local_var_same_name_cpp_and_c/TestNamespaceLocalVarSameNameCppAndC.py lldb-api :: lang/cpp/const_this/TestConstThis.py lldb-unit :: Utility/./UtilityTests/OptionsWithRawTest.UnterminatedQuote lldb-api :: commands/watchpoints/watchpoint_events/TestWatchpointEvents.py lldb-unit :: Utility/./UtilityTests/OptionsWithRawTest.WhitespaceSuffix lldb-unit :: Editline/./EditlineTests/EditlineTestFixture.EditlineReceivesSingleLineText lldb-unit :: Utility/./UtilityTests/StringListTest.Assignment lldb-shell :: Driver/TestCore.test lldb-shell :: SymbolFile/NativePDB/ast-methods.cpp lldb-shell :: SymbolFile/DWARF/inline-function-address-shared.test lldb-api :: commands/frame/diagnose/dereference-function-return/TestDiagnoseDereferenceFunctionReturn.py lldb-api :: python_api/class_members/TestSBTypeClassMembers.py lldb-unit :: UnwindAssembly/x86/./UnwindAssemblyx86Tests/Testx86AssemblyInspectionEngine.TestPushR12 lldb-api :: types/TestRecursiveTypes.py lldb-shell :: Driver/TestFile.test lldb-api :: sanity/TestSettingSkipping.py lldb-api :: commands/expression/argument_passing_restrictions/TestArgumentPassingRestrictions.py lldb-api :: functionalities/breakpoint/address_breakpoints/TestAddressBreakpoints.py lldb-unit :: Language/Highlighting/./HighlighterTests/HighlighterTest.ClangCursorPosEndOfLine lldb-api :: lang/c/struct_types/TestStructTypes.py lldb-api :: python_api/lldbutil/process/TestPrintStackTraces.py lldb-api :: sample_test/TestSampleInlineTest.py lldb-shell :: Driver/TestSingleQuote.test lldb-shell :: ScriptInterpreter/Lua/bindings.test lldb-shell :: ObjectFile/ELF/avr-basic-info.yaml lldb-api :: functionalities/thread/thread_specific_break/TestThreadSpecificBreakpoint.py lldb-api :: commands/expression/call-function/TestCallStopAndContinue.py lldb-api :: functionalities/tail_call_frames/unambiguous_sequence/TestUnambiguousTailCalls.py lldb-api :: lang/objc/hidden-ivars/TestHiddenIvars.py lldb-api :: types/TestLongTypesExpr.py lldb-api :: python_api/process/io/TestProcessIO.py lldb-unit :: Symbol/./SymbolTests/TestTypeSystemClang.TestNotDeletingUserCopyCstrDueToMoveCStr lldb-api :: lang/objc/objc-optimized/TestObjcOptimized.py lldb-api :: lang/cpp/member-and-local-vars-with-same-name/TestMembersAndLocalsWithSameName.py lldb-api :: functionalities/data-formatter/data-formatter-synthval/TestDataFormatterSynthVal.py lldb-api :: functionalities/data-formatter/data-formatter-smart-array/TestDataFormatterSmartArray.py lldb-unit :: Utility/./UtilityTests/RegularExpression.Match lldb-api :: commands/frame/diagnose/dereference-argument/TestDiagnoseDereferenceArgument.py lldb-api :: functionalities/breakpoint/breakpoint_ignore_count/TestBreakpointIgnoreCount.py lldb-api :: commands/command/history/TestCommandHistory.py lldb-api :: commands/expression/import-std-module/vector/TestVectorFromStdModule.py lldb-api :: tools/lldb-vscode/step/TestVSCode_step.py lldb-api :: python_api/frame/TestFrames.py lldb-shell :: SymbolFile/DWARF/debug-names-compressed.cpp lldb-api :: lang/cpp/bitfields/TestCppBitfields.py lldb-api :: macosx/order/TestOrderFile.py lldb-api :: functionalities/load_using_paths/TestLoadUsingPaths.py lldb-api :: lang/objc/radar-9691614/TestObjCMethodReturningBOOL.py lldb-api :: commands/expression/persistent_types/TestPersistentTypes.py lldb-shell :: SymbolFile/NativePDB/nested-types.cpp lldb-api :: tools/lldb-server/TestGdbRemoteThreadsInStopReply.py lldb-api :: commands/expression/persist_objc_pointeetype/TestPersistObjCPointeeType.py lldb-unit :: Utility/./UtilityTests/SerializationRountripTest.SerializeDeserializeCStringArrayNullptrElem lldb-api :: functionalities/tail_call_frames/ambiguous_tail_call_seq1/TestAmbiguousTailCallSeq1.py lldb-api :: functionalities/thread/concurrent_events/TestConcurrentBreakpointOneDelayBreakpointThreads.py lldb-api :: functionalities/data-formatter/data-formatter-objc/TestDataFormatterObjCNSError.py lldb-shell :: ScriptInterpreter/Python/crashlog.test lldb-api :: commands/disassemble/basic/TestDisassembleBreakpoint.py lldb-api :: functionalities/tail_call_frames/disambiguate_paths_to_common_sink/TestDisambiguatePathsToCommonSink.py lldb-api :: commands/target/auto-install-main-executable/TestAutoInstallMainExecutable.py lldb-shell :: ObjectFile/ELF/minidebuginfo-corrupt-xz.yaml lldb-unit :: UnwindAssembly/ARM64/./Arm64InstEmulationTests/TestArm64InstEmulation.TestFramelessThreeEpilogueFunction lldb-api :: commands/expression/regression-access-function-template-in-record/TestRegressionAccessFunctionTemplateInRecord.py lldb-api :: commands/expression/import-std-module/conflicts/TestStdModuleWithConflicts.py lldb-api :: functionalities/signal/handle-abrt/TestHandleAbort.py lldb-api :: commands/expression/weak_symbols/TestWeakSymbols.py lldb-api :: functionalities/optimized_code/TestNoASanExceptionAfterEvalOP_piece.py lldb-api :: lang/objc/foundation/TestRuntimeTypes.py lldb-api :: api/multiple-targets/TestMultipleTargets.py lldb-api :: lang/objc/foundation/TestSymbolTable.py lldb-api :: functionalities/target-new-solib-notifications/TestModuleLoadedNotifys.py lldb-api :: python_api/module_section/TestModuleAndSection.py lldb-api :: lang/objc/foundation/TestObjCMethods2.py lldb-api :: commands/expression/cast_int_to_anonymous_enum/TestCastIntToAnonymousEnum.py lldb-shell :: SymbolFile/DWARF/debug_ranges.s lldb-api :: functionalities/thread/concurrent_events/TestConcurrentTwoBreakpointThreads.py lldb-api :: commands/gui/invalid-args/TestInvalidArgsGui.py lldb-api :: functionalities/thread/concurrent_events/TestConcurrentTwoWatchpointsOneBreakpoint.py lldb-api :: macosx/find-dsym/bundle-with-dot-in-filename/TestBundleWithDotInFilename.py lldb-api :: commands/expression/two-files/TestObjCTypeQueryFromOtherCompileUnit.py lldb-api :: commands/expression/test/TestExprs.py lldb-api :: functionalities/type_completion/TestTypeCompletion.py lldb-api :: python_api/frame/get-variables/TestGetVariables.py lldb-api :: commands/expression/fixits/TestFixIts.py lldb-api :: lang/cpp/diamond/TestDiamond.py lldb-unit :: Utility/./UtilityTests/StreamTest.SetIndentLevel lldb-shell :: Process/Optimization.test lldb-api :: lang/objc/modules-inline-functions/TestModulesInlineFunctions.py lldb-api :: functionalities/signal/raise/TestRaise.py lldb-api :: lang/cpp/stl/TestStdCXXDisassembly.py lldb-api :: lang/objcxx/hide-runtime-values/TestObjCXXHideRuntimeValues.py lldb-api :: functionalities/data-formatter/typedef_array/TestTypedefArray.py lldb-api :: commands/command/invalid-args/TestInvalidArgsCommand.py lldb-api :: commands/watchpoints/watchpoint_on_vectors/TestValueOfVectorVariable.py lldb-api :: lang/cpp/constructors/TestCppConstructors.py lldb-api :: python_api/value/TestValueAPI.py lldb-api :: types/TestShortTypeExpr.py lldb-api :: python_api/hello_world/TestHelloWorld.py lldb-api :: lang/cpp/global_variables/TestCPPGlobalVariables.py lldb-api :: lang/objc/unicode-string/TestUnicodeString.py lldb-api :: commands/expression/import-std-module/vector-bool/TestVectorBoolFromStdModule.py lldb-api :: lang/cpp/dynamic-value/TestDynamicValue.py lldb-api :: functionalities/data-formatter/data-formatter-stl/libcxx/map/TestDataFormatterLibccMap.py lldb-api :: lang/objc/exceptions/TestObjCExceptions.py lldb-api :: commands/expression/codegen-crash-typedefdecl-not-in_declcontext/TestCodegenCrashTypedefDeclNotInDeclContext.py lldb-api :: lang/objc/objc-baseclass-sbtype/TestObjCBaseClassSBType.py lldb-api :: functionalities/data-formatter/data-formatter-objc/TestDataFormatterObjCCF.py lldb-api :: tools/lldb-server/inferior-crash/TestGdbRemoteAbort.py lldb-api :: lang/objc/objc-super/TestObjCSuper.py lldb-api :: functionalities/memory-region/TestMemoryRegion.py lldb-shell :: ObjectFile/ELF/section-addresses.yaml lldb-api :: lang/c/enum_types/TestEnumTypes.py lldb-shell :: SymbolFile/Breakpad/stack-cfi-arm.yaml lldb-shell :: Reproducer/Functionalities/TestExpressionEvaluation.test lldb-api :: lang/cpp/function-template-parameter-pack/TestFunctionTemplateParameterPack.py lldb-api :: functionalities/data-formatter/data-formatter-proper-plurals/TestFormattersOneIsSingular.py lldb-api :: python_api/watchpoint/TestWatchpointIgnoreCount.py lldb-api :: python_api/lldbutil/iter/TestLLDBIterator.py lldb-api :: functionalities/data-formatter/data-formatter-stl/libcxx/bitset/TestDataFormatterLibcxxBitset.py lldb-api :: lang/cpp/modules-import/TestCXXModulesImport.py lldb-shell :: Host/TestCustomShell.test lldb-unit :: Utility/./UtilityTests/StringListTest.ForRangeEmpty lldb-shell :: SymbolFile/Breakpad/unwind-via-raSearch.test lldb-api :: lang/cpp/limit-debug-info/TestWithLimitDebugInfo.py lldb-api :: functionalities/data-formatter/data-formatter-objc/TestDataFormatterObjCNSDate.py lldb-api :: commands/command/script/TestCommandScript.py lldb-api :: functionalities/breakpoint/breakpoint_language/TestBreakpointLanguage.py lldb-api :: python_api/sbtype_typeclass/TestSBTypeTypeClass.py lldb-api :: tools/lldb-server/TestGdbRemote_vContThreads.py lldb-api :: functionalities/breakpoint/hardware_breakpoints/hardware_breakpoint_on_multiple_threads/TestHWBreakMultiThread.py lldb-shell :: Commands/CommandScriptImmediateOutput/CommandScriptImmediateOutputConsole.test lldb-api :: commands/settings/TestSettings.py lldb-api :: commands/frame/var/TestFrameVar.py lldb-api :: lang/objc/modules-update/TestClangModulesUpdate.py lldb-api :: sample_test/TestSampleTest.py lldb-api :: commands/expression/import-std-module/sysroot/TestStdModuleSysroot.py lldb-api :: tools/lldb-vscode/variables/TestVSCode_variables.py lldb-api :: lang/cpp/char8_t/TestCxxChar8_t.py lldb-api :: lang/cpp/virtual-overload/TestVirtualOverload.py lldb-api :: commands/expression/dont_allow_jit/TestAllowJIT.py lldb-api :: commands/expression/import-std-module/stack/TestStackFromStdModule.py lldb-api :: lang/objc/orderedset/TestOrderedSet.py lldb-api :: commands/expression/timeout/TestCallWithTimeout.py lldb-api :: lang/cpp/accelerator-table/TestCPPAccelerator.py lldb-api :: commands/gui/basic/TestGuiBasic.py lldb-unit :: Language/Highlighting/./HighlighterTests/HighlighterTest.FallbackHighlighter lldb-api :: macosx/nslog/TestDarwinNSLogOutput.py lldb-api :: commands/expression/import-std-module/weak_ptr/TestWeakPtrFromStdModule.py lldb-api :: functionalities/breakpoint/address_breakpoints/TestBadAddressBreakpoints.py lldb-api :: lang/cpp/class-template-parameter-pack/TestClassTemplateParameterPack.py lldb-api :: functionalities/data-formatter/data-formatter-synthtype/TestDataFormatterSynthType.py lldb-unit :: Utility/./UtilityTests/StreamTest.AddressRangeEmptyRange lldb-api :: lang/objc/modules-non-objc-target/TestObjCModulesNonObjCTarget.py lldb-api :: functionalities/pointer_num_children/TestPointerNumChildren.py lldb-api :: functionalities/thread/concurrent_events/TestConcurrentBreakpointsDelayedBreakpointOneWatchpoint.py lldb-api :: functionalities/data-formatter/data-formatter-stl/libcxx/unordered/TestDataFormatterUnordered.py lldb-shell :: Driver/TestPositionalArgs.test lldb-api :: commands/process/launch-with-shellexpand/TestLaunchWithShellExpand.py lldb-api :: lang/c/shared_lib_stripped_symbols/TestSharedLibStrippedSymbols.py lldb-api :: commands/expression/pr35310/TestExprsBug35310.py lldb-api :: tools/lldb-server/TestGdbRemoteSingleStep.py lldb-api :: commands/expression/import-std-module/queue/TestQueueFromStdModule.py lldb-api :: lang/c/unicode/TestUnicodeSymbols.py lldb-api :: functionalities/data-formatter/data-formatter-enum-format/TestDataFormatterEnumFormat.py lldb-api :: lang/objc/blocks/TestObjCIvarsInBlocks.py lldb-shell :: SymbolFile/NativePDB/source-list.cpp lldb-api :: lang/cpp/class_static/TestStaticVariables.py lldb-api :: functionalities/thread/concurrent_events/TestConcurrentCrashWithBreak.py lldb-api :: functionalities/data-formatter/data-formatter-python-synth/TestDataFormatterPythonSynth.py lldb-shell :: Register/x86-64-read.test lldb-api :: lang/objc/objc-checker/TestObjCCheckers.py lldb-api :: functionalities/asan/TestMemoryHistory.py lldb-shell :: SymbolFile/NativePDB/global-classes.cpp lldb-api :: lang/objc/objc-ivar-protocols/TestIvarProtocols.py lldb-api :: functionalities/thread/concurrent_events/TestConcurrentCrashWithSignal.py lldb-api :: python_api/get-value-32bit-int/TestGetValue32BitInt.py lldb-api :: functionalities/tail_call_frames/disambiguate_tail_call_seq/TestDisambiguateTailCallSeq.py lldb-api :: lang/cpp/chained-calls/TestCppChainedCalls.py lldb-api :: lang/objc/foundation/TestObjCMethodsNSArray.py lldb-api :: functionalities/thread/concurrent_events/TestConcurrentTwoWatchpointsOneSignal.py lldb-api :: commands/command/nested_alias/TestNestedAlias.py lldb-api :: lang/cpp/virtual-functions/TestCppVirtualFunctions.py lldb-api :: lang/objc/single-entry-dictionary/TestObjCSingleEntryDictionary.py lldb-api :: lang/objc/objc_direct-methods/TestObjCDirectMethods.py lldb-api :: commands/expression/import-std-module/unique_ptr/TestUniquePtrFromStdModule.py lldb-api :: functionalities/tail_call_frames/disambiguate_call_site/TestDisambiguateCallSite.py lldb-api :: functionalities/recursion/TestValueObjectRecursion.py lldb-unit :: UnwindAssembly/ARM64/./Arm64InstEmulationTests/TestArm64InstEmulation.TestCFARegisterTrackedAcrossJumps lldb-api :: functionalities/breakpoint/global_constructor/TestBreakpointInGlobalConstructor.py lldb-api :: commands/expression/result_numbering/TestResultNumbering.py lldb-api :: commands/watchpoints/watchpoint_size/TestWatchpointSizes.py lldb-unit :: Utility/./UtilityTests/DataExtractorTest.PeekData lldb-api :: types/TestShortType.py lldb-api :: lang/cpp/char1632_t/TestChar1632T.py lldb-unit :: Utility/./UtilityTests/DataExtractorTest.GetSLEB128_bit63 lldb-api :: commands/register/register/intel_xtended_registers/TestMPXRegisters.py lldb-api :: commands/process/attach/TestProcessAttach.py lldb-api :: lang/cpp/lambdas/TestLambdas.py lldb-api :: commands/expression/vector_of_enums/TestVectorOfEnums.py lldb-api :: lang/objc/objc-class-method/TestObjCClassMethod.py lldb-api :: functionalities/data-formatter/data-formatter-ptr-to-array/TestPtrToArrayFormatting.py lldb-api :: functionalities/thread/concurrent_events/TestConcurrentSignalBreak.py lldb-unit :: UnwindAssembly/x86/./UnwindAssemblyx86Tests/Testx86AssemblyInspectionEngine.TestLEAVE lldb-api :: lang/objc/objc-runtime-ivars/TestRuntimeIvars.py lldb-api :: macosx/indirect_symbol/TestIndirectSymbols.py lldb-api :: tools/lldb-server/TestGdbRemoteAuxvSupport.py lldb-shell :: BuildScript/script-args.test lldb-api :: functionalities/value_md5_crash/TestValueMD5Crash.py lldb-api :: lang/objcxx/class-name-clash/TestNameClash.py lldb-api :: commands/expression/static-initializers/TestStaticInitializers.py lldb-api :: functionalities/data-formatter/synthcapping/TestSyntheticCapping.py lldb-api :: tools/lldb-server/TestLldbGdbServer.py lldb-api :: commands/expression/scoped_enums/TestScopedEnumType.py lldb-api :: types/TestDoubleTypes.py lldb-api :: lang/cpp/class_types/TestClassTypes.py lldb-api :: lang/cpp/call-function/TestCallCPPFunction.py lldb-api :: commands/frame/diagnose/virtual-method-call/TestDiagnoseDereferenceVirtualMethodCall.py lldb-api :: functionalities/breakpoint/breakpoint_command/TestBreakpointCommand.py lldb-api :: lang/cpp/thread_local/TestThreadLocal.py lldb-api :: tools/lldb-vscode/console/TestVSCode_console.py lldb-api :: lang/c/anonymous/TestAnonymous.py lldb-api :: tools/lldb-server/inferior-crash/TestGdbRemoteSegFault.py lldb-api :: tools/lldb-server/TestAppleSimulatorOSType.py lldb-api :: functionalities/memory/cache/TestMemoryCache.py lldb-api :: commands/expression/import-std-module/list/TestListFromStdModule.py lldb-api :: python_api/signals/TestSignalsAPI.py lldb-shell :: SymbolFile/DWARF/anon_class_w_and_wo_export_symbols.ll lldb-api :: lang/cpp/covariant-return-types/TestCovariantReturnTypes.py lldb-api :: functionalities/step_scripted/TestStepScripted.py lldb-api :: functionalities/breakpoint/breakpoint_hit_count/TestBreakpointHitCount.py lldb-api :: functionalities/deleted-executable/TestDeletedExecutable.py lldb-api :: functionalities/thread/concurrent_events/TestConcurrentTwoWatchpointThreads.py lldb-api :: python_api/disassemble-raw-data/TestDisassembleRawData.py lldb-api :: functionalities/breakpoint/inlined_breakpoints/TestInlinedBreakpoints.py lldb-api :: commands/watchpoints/multiple_hits/TestMultipleHits.py lldb-api :: functionalities/unwind/noreturn/module-end/TestNoReturnModuleEnd.py lldb-api :: lang/objc/conflicting-definition/TestConflictingDefinition.py lldb-api :: functionalities/var_path/TestVarPath.py lldb-api :: functionalities/set-data/TestSetData.py lldb-api :: functionalities/data-formatter/ostypeformatting/TestFormattersOsType.py lldb-api :: functionalities/data-formatter/data-formatter-stl/libcxx/tuple/TestDataFormatterLibcxxTuple.py lldb-api :: commands/frame/diagnose/array/TestArray.py lldb-api :: functionalities/thread/backtrace_limit/TestBacktraceLimit.py lldb-api :: functionalities/asan/TestReportData.py lldb-api :: functionalities/data-formatter/data-formatter-disabling/TestDataFormatterDisabling.py lldb-api :: functionalities/data-formatter/data-formatter-stl/libcxx/iterator/TestDataFormatterLibccIterator.py lldb-api :: functionalities/breakpoint/dummy_target_breakpoints/TestBreakpointsWithNoTargets.py lldb-api :: lang/c/tls_globals/TestTlsGlobals.py lldb-api :: functionalities/data-formatter/format-propagation/TestFormatPropagation.py lldb-api :: lang/cpp/enum_types/TestCPP11EnumTypes.py lldb-api :: commands/expression/rdar44436068/Test128BitsInteger.py lldb-api :: python_api/watchpoint/watchlocation/TestTargetWatchAddress.py lldb-api :: lang/cpp/gmodules-templates/TestGModules.py lldb-api :: lang/objc/objc-new-syntax/TestObjCNewSyntaxLiteral.py lldb-api :: functionalities/data-formatter/vector-types/TestVectorTypesFormatting.py lldb-api :: commands/watchpoints/watchpoint_commands/command/TestWatchpointCommandPython.py lldb-api :: lang/objc/objc-new-syntax/TestObjCNewSyntaxArray.py lldb-api :: lang/cpp/template-function/TestTemplateFunctions.py lldb-api :: lang/objc/ptr_refs/TestPtrRefsObjC.py lldb-api :: functionalities/tail_call_frames/cross_dso/TestCrossDSOTailCalls.py lldb-api :: commands/statistics/basic/TestStats.py lldb-api :: types/TestFloatTypesExpr.py lldb-api :: functionalities/thread/concurrent_events/TestConcurrentWatchBreakDelay.py lldb-api :: macosx/thread-names/TestInterruptThreadNames.py lldb-shell :: ScriptInterpreter/Lua/persistent_state.test lldb-api :: commands/expression/import-std-module/weak_ptr-dbg-info-content/TestDbgInfoContentWeakPtrFromStdModule.py lldb-api :: functionalities/tsan/thread_numbers/TestTsanThreadNumbers.py lldb-api :: functionalities/breakpoint/require_hw_breakpoints/TestRequireHWBreakpoints.py lldb-api :: commands/watchpoints/watchpoint_disable/TestWatchpointDisable.py lldb-api :: lang/c/shared_lib/TestSharedLib.py lldb-api :: lang/cpp/stl/TestSTL.py lldb-shell :: ScriptInterpreter/Lua/command_script_import.test lldb-api :: functionalities/ubsan/user-expression/TestUbsanUserExpression.py lldb-api :: functionalities/thread/concurrent_events/TestConcurrentCrashWithWatchpoint.py lldb-api :: functionalities/postmortem/minidump/TestMiniDump.py lldb-api :: lang/objc/objc-builtin-types/TestObjCBuiltinTypes.py lldb-api :: tools/lldb-vscode/stackTrace/TestVSCode_stackTrace.py lldb-api :: functionalities/thread/concurrent_events/TestConcurrentCrashWithWatchpointBreakpointSignal.py lldb-api :: macosx/find-dsym/deep-bundle/TestDeepBundle.py lldb-api :: lang/objc/real-definition/TestRealDefinition.py lldb-unit :: tools/lldb-server/tests/./LLDBServerTests/StandardStartupTest.TestStopReplyContainsThreadPcs lldb-api :: functionalities/tail_call_frames/thread_step_out_or_return/TestSteppingOutWithArtificialFrames.py lldb-api :: lang/cpp/multiple-inheritance/TestCppMultipleInheritance.py lldb-api :: python_api/value/linked_list/TestValueAPILinkedList.py lldb-api :: lang/objc/bitfield_ivars/TestBitfieldIvars.py lldb-shell :: Driver/TestHelp.test lldb-unit :: Target/./TargetTests/StackFrameRecognizerTest.NullModuleRegex lldb-unit :: Utility/./UtilityTests/BinaryStreamTest.PutSLEB128EightBytes lldb-api :: lang/cpp/wchar_t/TestCxxWCharT.py lldb-unit :: Utility/./UtilityTests/OptionsWithRawTest.ArgsButNoDelimiter lldb-api :: functionalities/thread/concurrent_events/TestConcurrentBreakpointDelayBreakpointOneSignal.py lldb-unit :: Core/./LLDBCoreTests/SourceFileCache.FindSourceFileFound lldb-api :: functionalities/tail_call_frames/thread_step_out_message/TestArtificialFrameStepOutMessage.py lldb-api :: functionalities/darwin_log/source/info/TestDarwinLogSourceInfo.py lldb-api :: functionalities/paths/TestPaths.py lldb-unit :: Process/gdb-remote/./ProcessGdbRemoteTests/GDBRemoteCommunicationClientTest.SendSignalsToIgnore lldb-unit :: Core/./LLDBCoreTests/MangledTest.ResultForBlockInvocation lldb-shell :: SymbolFile/DWARF/debug-types-line-tables.s lldb-api :: functionalities/data-formatter/data-formatter-cpp/TestDataFormatterCpp.py lldb-shell :: Breakpoint/debug_addrx.test lldb-api :: functionalities/data-formatter/data-formatter-stl/libcxx/queue/TestDataFormatterLibcxxQueue.py lldb-unit :: Symbol/./SymbolTests/SymbolsTest.TerminateLocateExecutableSymbolFileForUnknownExecutableAndUnknownSymbolFile lldb-unit :: Utility/./UtilityTests/Flags.AnyClear lldb-unit :: Symbol/./SymbolTests/TestTypeSystemClang.TestRemoveFastQualifiers lldb-shell :: Commands/command-target-modules-dump-sections.yaml lldb-api :: python_api/sbstructureddata/TestStructuredDataAPI.py lldb-unit :: UnwindAssembly/x86/./UnwindAssemblyx86Tests/Testx86AssemblyInspectionEngine.TestPopR15 lldb-shell :: SymbolFile/DWARF/DW_OP_piece-struct.s lldb-unit :: Utility/./UtilityTests/FileSpecTest.RemoveLastPathComponent lldb-api :: functionalities/memory/find/TestMemoryFind.py lldb-api :: functionalities/unwind/standard/TestStandardUnwind.py lldb-unit :: Host/./HostTests/NativeProcessProtocolTest.SetBreakpointFailVerify lldb-shell :: SymbolFile/NativePDB/function-types-builtins.cpp lldb-api :: benchmarks/turnaround/TestCompileRunToBreakpointTurnaround.py lldb-api :: lang/c/forward/TestForwardDeclaration.py lldb-api :: commands/platform/basic/TestPlatformCommand.py lldb-unit :: Utility/./UtilityTests/SerializationRountripTest.SerializeDeserializeCStringNull lldb-api :: commands/expression/import-std-module/basic/TestImportStdModule.py lldb-api :: commands/add-dsym/uuid/TestAddDsymCommand.py lldb-api :: commands/expression/class_template_specialization_empty_pack/TestClassTemplateSpecializationParametersHandling.py lldb-unit :: Utility/./UtilityTests/ScalarTest.CastOperations lldb-unit :: Host/./HostTests/NativeProcessProtocolTest.SetBreakpointFailWrite lldb-api :: functionalities/completion/TestCompletion.py lldb-api :: functionalities/data-formatter/type_summary_list_script/TestTypeSummaryListScript.py lldb-api :: functionalities/breakpoint/cpp_exception/TestCPPExceptionBreakpoint.py lldb-shell :: SymbolFile/DWARF/dwarf5-partial-index.cpp lldb-unit :: Utility/./UtilityTests/UriParserTest.BracketedHostname lldb-shell :: Commands/command-thread-select.test lldb-api :: functionalities/thread/exit_during_expression/TestExitDuringExpression.py lldb-api :: lang/objc/objc-ivar-stripped/TestObjCIvarStripped.py lldb-shell :: Breakpoint/implicit_const_form_support.test lldb-shell :: Settings/TestFrameFormatNoColor.test lldb-unit :: Utility/./UtilityTests/FileSpecTest.PrependPathComponent lldb-unit :: Utility/./UtilityTests/FileSpecTest.EqualDotsPosix lldb-unit :: Utility/./UtilityTests/OptionsWithRawTest.QuotedSuffix lldb-shell :: ObjectFile/PECOFF/basic-info.yaml lldb-unit :: Interpreter/./InterpreterTests/OptionArgParserTest.toScriptLanguage lldb-shell :: SymbolFile/DWARF/debug_ranges_and_rnglists.test lldb-unit :: Process/gdb-remote/./ProcessGdbRemoteTests/GDBRemoteClientBaseTest.SendContinueAndLateInterrupt lldb-unit :: ScriptInterpreter/Python/./ScriptInterpreterPythonTests/PythonDataObjectsTest.TestPythonString lldb-api :: python_api/sbvalue_const_addrof/TestSBValueConstAddrOf.py lldb-shell :: SymbolFile/DWARF/debug_loclists-dwo.s lldb-api :: functionalities/thread/concurrent_events/TestConcurrentTwoBreakpointsOneSignal.py lldb-unit :: Utility/./UtilityTests/ScalarTest.APIntConstructor lldb-unit :: UnwindAssembly/x86/./UnwindAssemblyx86Tests/Testx86AssemblyInspectionEngine.TestPopR13 lldb-unit :: Process/gdb-remote/./ProcessGdbRemoteTests/GDBRemoteClientBaseTest.SendContinueAndInterrupt2PacketBug lldb-api :: lang/cpp/template/TestTemplateArgs.py lldb-api :: commands/expression/calculator_mode/TestCalculatorMode.py lldb-unit :: Utility/./UtilityTests/LogChannelEnabledTest.log_options lldb-shell :: Minidump/Windows/broken-unwind.test lldb-unit :: SymbolFile/DWARF/./SymbolFileDWARFTests/SymbolFileDWARFTests.TestAbbrevOrder1Start5 lldb-unit :: Utility/./UtilityTests/ScalarTest.Scalar_512 lldb-api :: functionalities/gdb_remote_client/TestTargetXMLArch.py lldb-api :: functionalities/inferior-crashing/recursive-inferior/TestRecursiveInferior.py lldb-unit :: Expression/./ExpressionTests/CppModuleConfigurationTest.Xcode lldb-api :: commands/expression/multiline-navigation/TestMultilineNavigation.py lldb-unit :: Utility/./UtilityTests/NameMatchesTest.Ignore lldb-api :: functionalities/type_lookup/TestTypeLookup.py lldb-unit :: Utility/./UtilityTests/EnvironmentTest.EnvpConstruction lldb-api :: functionalities/memory/read/TestMemoryRead.py lldb-unit :: Utility/./UtilityTests/FileSpecTest.EqualDotsWindows lldb-api :: lang/objc/modules-hash-mismatch/TestClangModulesHashMismatch.py lldb-unit :: Expression/./ExpressionTests/DiagnosticManagerTest.GetStringNoDiags lldb-api :: macosx/duplicate-archive-members/TestDuplicateMembers.py lldb-api :: tools/lldb-server/commandline/TestStubReverseConnect.py lldb-api :: lang/cpp/overloaded-functions/TestOverloadedFunctions.py lldb-unit :: Utility/./UtilityTests/CompletionRequest.DuplicateFilteringWithComments lldb-api :: functionalities/data-formatter/data-formatter-objc/TestDataFormatterObjCNSData.py lldb-api :: functionalities/thread/concurrent_events/TestConcurrentSignalNWatchNBreak.py lldb-unit :: UnwindAssembly/x86/./UnwindAssemblyx86Tests/Testx86AssemblyInspectionEngine.TestPopR12 lldb-api :: tools/lldb-vscode/completions/TestVSCode_completions.py lldb-api :: lang/c/local_variables/TestLocalVariables.py lldb-unit :: Utility/./UtilityTests/FileSpecTest.Yaml lldb-unit :: Utility/./UtilityTests/VMRange.Comparison lldb-api :: functionalities/breakpoint/breakpoint_by_line_and_column/TestBreakpointByLineAndColumn.py lldb-shell :: ObjectFile/Breakpad/breakpad-identification.test lldb-unit :: debugserver/./debugserverTests/RNBSocket.LoopBackConnectIPv4 lldb-api :: functionalities/data-formatter/stringprinter/TestStringPrinter.py lldb-unit :: Utility/./UtilityTests/StringLexerTest.HasAtLeast lldb-shell :: SymbolFile/NativePDB/ast-types.cpp lldb-api :: functionalities/data-formatter/refpointer-recursion/TestDataFormatterRefPtrRecursion.py lldb-unit :: Language/Highlighting/./HighlighterTests/HighlighterTest.ClangIdentifiers lldb-unit :: Symbol/./SymbolTests/TestTypeSystemClang.TestGetTypeClassNested lldb-shell :: SymbolFile/DWARF/find-variable-file.cpp lldb-api :: functionalities/thread/create_after_attach/TestCreateAfterAttach.py lldb-unit :: Utility/./UtilityTests/PassiveReplayTest.InstrumentedFoo lldb-api :: lang/cpp/llvm-style/TestLLVMStyle.py lldb-unit :: Host/./HostTests/MainLoopTest.UnmonitoredSignal lldb-unit :: Utility/./UtilityTests/ArchSpecTest.TripleComponentsWereSpecified lldb-unit :: Utility/./UtilityTests/ListenerTest.GetEventImmediate lldb-unit :: Symbol/./SymbolTests/TestTypeSystemClang.TestGetTypeClassTypeOfExpr lldb-unit :: Process/minidump/./LLDBMinidumpTests/MinidumpParserTest.GetThreadContext_x86_32 lldb-api :: lang/cpp/function-qualifiers/TestCppFunctionQualifiers.py lldb-unit :: Utility/./UtilityTests/SerializationRountripTest.SerializeDeserializePod lldb-unit :: UnwindAssembly/x86/./UnwindAssemblyx86Tests/Testx86AssemblyInspectionEngine.TestPushESI lldb-api :: functionalities/gdb_remote_client/TestArmRegisterDefinition.py lldb-api :: functionalities/step-avoids-no-debug/TestStepNoDebug.py lldb-unit :: Utility/./UtilityTests/StreamTest.AddressRange lldb-shell :: ScriptInterpreter/Lua/convenience_variables.test lldb-unit :: Utility/./UtilityTests/StringExtractorTest.GetHexU8_Underflow2_NoEof lldb-unit :: UnwindAssembly/x86/./UnwindAssemblyx86Tests/Testx86AssemblyInspectionEngine.TestPushEBX lldb-unit :: Utility/./UtilityTests/StreamTeeTest.AppendStream lldb-unit :: ScriptInterpreter/Python/./ScriptInterpreterPythonTests/PythonDataObjectsTest.TestDictionaryResolutionWithDot lldb-unit :: Utility/./UtilityTests/StreamTeeTest.DefaultConstructor lldb-unit :: Utility/./UtilityTests/RangeTest.ContainsRangeStartingFromZero lldb-api :: functionalities/abbreviation/TestAbbreviations.py lldb-api :: lang/c/set_values/TestSetValues.py lldb-unit :: Language/Highlighting/./HighlighterTests/HighlighterTest.ClangPPDirectives lldb-unit :: UnwindAssembly/x86/./UnwindAssemblyx86Tests/Testx86AssemblyInspectionEngine.TestPopRBPWithREX lldb-unit :: Process/minidump/./LLDBMinidumpTests/MinidumpParserTest.GetThreadsAndGetThreadContext lldb-shell :: ScriptInterpreter/None/none.test lldb-api :: functionalities/breakpoint/auto_continue/TestBreakpointAutoContinue.py lldb-api :: functionalities/plugins/command_plugin/TestPluginCommands.py lldb-api :: commands/expression/import-std-module/vector-of-vectors/TestVectorOfVectorsFromStdModule.py lldb-unit :: Utility/./UtilityTests/OptionsWithRawTest.EmptySuffixSingleWhitespace lldb-shell :: SymbolFile/DWARF/dwarf5-atomic.s lldb-api :: commands/expression/rdar42038760/TestScalarURem.py lldb-api :: commands/expression/inline-namespace/TestInlineNamespace.py lldb-shell :: ScriptInterpreter/Python/scripted_breakpoint.test lldb-api :: functionalities/data-formatter/data-formatter-stl/libstdcpp/list/TestDataFormatterStdList.py lldb-unit :: Utility/./UtilityTests/StringExtractorTest.GetU64LittleEndian lldb-unit :: Interpreter/./InterpreterTests/OptionArgParserTest.toBoolean lldb-unit :: Interpreter/./InterpreterTests/CompletionTest.FileCompletionAbsolute lldb-api :: tools/lldb-server/TestGdbRemoteAttach.py lldb-unit :: Utility/./UtilityTests/GeneratorTest.Get lldb-unit :: Core/./LLDBCoreTests/RichManglingContextTest.Basic lldb-api :: functionalities/inferior-crashing/TestInferiorCrashing.py lldb-unit :: Utility/./UtilityTests/StreamTest.PutHex64ByteOrderLittle lldb-unit :: Utility/./UtilityTests/XcodeSDKTest.FindXcodeContentsDirectoryInPath lldb-shell :: ObjectFile/Breakpad/sections-trailing-func.test lldb-api :: functionalities/data-formatter/data-formatter-stl/libcxx/string/TestDataFormatterLibcxxString.py lldb-unit :: Expression/./ExpressionTests/DiagnosticManagerTest.GetStringSeverityLabels lldb-unit :: Utility/./UtilityTests/StreamTest.PutRawBytesToLittleEndian lldb-api :: macosx/find-app-in-bundle/TestFindAppInBundle.py lldb-api :: functionalities/breakpoint/breakpoint_set_restart/TestBreakpointSetRestart.py lldb-api :: commands/frame/diagnose/dereference-this/TestDiagnoseDereferenceThis.py lldb-unit :: UnwindAssembly/x86/./UnwindAssemblyx86Tests/Testx86AssemblyInspectionEngine.TestPushR15 lldb-shell :: Expr/TestTypeOfDeclTypeExpr.test lldb-unit :: Symbol/./SymbolTests/PostfixExpression.ParseFPOProgram lldb-unit :: Signals/./SignalsTests/UnixSignalsTest.GetFilteredSignals lldb-api :: functionalities/return-value/TestReturnValue.py lldb-api :: functionalities/data-formatter/data-formatter-stl/libstdcpp/unique_ptr/invalid/TestDataFormatterInvalidStdUniquePtr.py lldb-api :: commands/process/attach-resume/TestAttachResume.py lldb-api :: functionalities/tsan/multiple/TestTsanMultiple.py lldb-api :: commands/watchpoints/watchpoint_set_command/TestWatchLocationWithWatchSet.py lldb-api :: commands/expression/import-std-module/empty-module/TestEmptyStdModule.py lldb-api :: lang/cpp/std-function-step-into-callable/TestStdFunctionStepIntoCallable.py lldb-unit :: Utility/./UtilityTests/SubsystemRAIITest.SubsystemWithErrorSuccess lldb-shell :: SymbolFile/DWARF/debug_loc.s lldb-unit :: Utility/./UtilityTests/StreamTest.PutBytesAsRawHex8ToLittleEndian lldb-shell :: Reproducer/TestProcessList.test lldb-api :: commands/expression/radar_9531204/TestPrintfAfterUp.py lldb-api :: commands/expression/test/TestExprs2.py lldb-api :: functionalities/data-formatter/data-formatter-objc/TestDataFormatterObjCPlain.py lldb-unit :: Utility/./UtilityTests/AnsiTerminal.Empty lldb-api :: functionalities/rerun/TestRerun.py lldb-unit :: Utility/./UtilityTests/BinaryStreamTest.PutULEB128ThreeBytes lldb-api :: commands/expression/import-std-module/shared_ptr-dbg-info-content/TestSharedPtrDbgInfoContentFromStdModule.py lldb-unit :: Symbol/./SymbolTests/TestClangASTImporter.CompleteFwdDeclWithOtherOrigin lldb-unit :: ObjectFile/Breakpad/./ObjectFileBreakpadTests/InfoRecord.parse lldb-api :: types/TestDoubleTypesExpr.py lldb-unit :: Process/gdb-remote/./ProcessGdbRemoteTests/GDBRemoteClientBaseTest.SendContinueAndAsyncSignal lldb-api :: python_api/watchpoint/TestSetWatchpoint.py lldb-api :: commands/expression/expr-in-syscall/TestExpressionInSyscall.py lldb-api :: types/TestFloatTypes.py lldb-shell :: SymbolFile/DWARF/dir-separator-posix.s lldb-api :: functionalities/plugins/python_os_plugin/stepping_plugin_threads/TestOSPluginStepping.py lldb-shell :: Unwind/eh-frame-dwarf-unwind.test lldb-shell :: SymbolFile/NativePDB/break-by-function.cpp lldb-shell :: Reproducer/TestWorkingDir.test lldb-shell :: Breakpoint/single-file-split-dwarf.test lldb-unit :: Utility/./UtilityTests/ConstStringTest.NullAndEmptyStates lldb-api :: functionalities/data-formatter/data-formatter-stl/libcxx/initializerlist/TestInitializerList.py lldb-unit :: UnwindAssembly/x86/./UnwindAssemblyx86Tests/Testx86AssemblyInspectionEngine.TestPushImm lldb-api :: commands/expression/import-std-module/vector-dbg-info-content/TestDbgInfoContentVectorFromStdModule.py lldb-unit :: Utility/./UtilityTests/UserIDResolver.GetUserName lldb-unit :: Expression/./ExpressionTests/CppModuleConfigurationTest.LinuxLocalLibCpp lldb-unit :: Expression/./ExpressionTests/DiagnosticManagerTest.AddDiagnostic lldb-api :: functionalities/breakpoint/breakpoint_callback_command_source/TestBreakpointCallbackCommandSource.py lldb-unit :: Process/gdb-remote/./ProcessGdbRemoteTests/GDBRemoteCommunicationServerTest.SendErrorResponse_Status lldb-unit :: Symbol/./SymbolTests/TestTypeSystemClang.TestBuiltinTypeForEncodingAndBitSize lldb-unit :: Utility/./UtilityTests/StreamTest.AddressNoSuffix lldb-unit :: Utility/./UtilityTests/BroadcasterTest.BroadcastEvent lldb-api :: functionalities/data-formatter/data-formatter-stl/libcxx/forward_list/TestDataFormatterLibcxxForwardList.py lldb-unit :: Utility/./UtilityTests/ArgsTest.TestQuotedUnknownEscape lldb-shell :: Commands/command-script-import.test lldb-unit :: Process/minidump/./LLDBMinidumpTests/MinidumpParserTest.GetFilteredModuleList lldb-shell :: ObjectFile/Breakpad/uuid-matching-mac.test lldb-unit :: Utility/./UtilityTests/ArgsTest.BareSingleQuote lldb-api :: tools/lldb-server/TestGdbRemoteProcessInfo.py lldb-api :: functionalities/load_unload/TestLoadUnload.py lldb-api :: functionalities/data-formatter/data-formatter-stl/libcxx/vector/TestDataFormatterLibcxxVector.py lldb-shell :: SymbolFile/DWARF/split-dwarf-inlining.cpp lldb-unit :: Expression/./ExpressionTests/CppModuleConfigurationTest.LibCppV2 lldb-api :: functionalities/thread/backtrace_all/TestBacktraceAll.py lldb-shell :: BuildScript/compiler-full-path.test lldb-unit :: Utility/./UtilityTests/StreamTest.PutCString lldb-unit :: Utility/./UtilityTests/Flags.GetBitSize lldb-api :: functionalities/signal/handle-segv/TestHandleSegv.py lldb-unit :: Utility/./UtilityTests/ArgsTest.TestSingleArgWithQuotedSpace lldb-api :: functionalities/inferior-crashing/TestInferiorCrashingStep.py lldb-shell :: Quit/TestQuitExitCodeTooManyArgs.test lldb-shell :: Driver/TestNoUseColor.test lldb-api :: api/listeners/TestListener.py lldb-api :: functionalities/data-formatter/poarray/TestPrintObjectArray.py lldb-unit :: Utility/./UtilityTests/AnsiTerminal.WhiteSpace lldb-api :: python_api/symbol-context/TestSymbolContext.py lldb-api :: functionalities/tail_call_frames/ambiguous_tail_call_seq2/TestAmbiguousTailCallSeq2.py lldb-shell :: ObjectFile/ELF/duplicate-section.yaml lldb-api :: lang/cpp/frame-var-anon-unions/TestFrameVariableAnonymousUnions.py lldb-unit :: Utility/./UtilityTests/ScalarTest.Division lldb-unit :: Expression/./ExpressionTests/DiagnosticManagerTest.AppendMessageAttachToLastDiag lldb-api :: lang/cpp/unique-types/TestUniqueTypes.py lldb-api :: types/TestCharTypeExpr.py lldb-api :: source-manager/TestSourceManager.py lldb-unit :: Utility/./UtilityTests/StringLexerTest.GetUnlexed lldb-unit :: Process/gdb-remote/./ProcessGdbRemoteTests/GDBRemoteCommunicationServerTest.SendErrorResponse_UnimplementedError lldb-unit :: Disassembler/./DisassemblerTests/TestArmv7Disassembly.TestCortexFPDisass lldb-api :: lang/cpp/namespace_conflicts/TestNamespaceConflicts.py lldb-api :: functionalities/thread/num_threads/TestNumThreads.py lldb-api :: lang/objc/objc-struct-return/TestObjCStructReturn.py lldb-unit :: Utility/./UtilityTests/SubsystemRAIITest.SubsystemWithErrorFailure lldb-api :: functionalities/tail_call_frames/inlining_and_tail_calls/TestInliningAndTailCalls.py lldb-api :: lang/objc/foundation/TestConstStrings.py lldb-shell :: Reproducer/TestLuaImport.test lldb-unit :: UnwindAssembly/x86/./UnwindAssemblyx86Tests/Testx86AssemblyInspectionEngine.TestSimplei386ugmented lldb-api :: commands/expression/completion-crash-incomplete-record/TestCompletionCrashIncompleteRecord.py lldb-unit :: Utility/./UtilityTests/LogChannelTest.EnableOptions lldb-api :: functionalities/gdb_remote_client/TestRecognizeBreakpoint.py lldb-unit :: Utility/./UtilityTests/UriParserTest.Empty lldb-api :: tools/lldb-server/TestGdbRemoteExpeditedRegisters.py lldb-api :: commands/expression/import-std-module/deque-basic/TestDequeFromStdModule.py lldb-unit :: Expression/./ExpressionTests/DiagnosticManagerTest.GetStringMultiline lldb-shell :: SymbolFile/DWARF/debug-types-dwo-cross-reference.cpp lldb-unit :: Utility/./UtilityTests/GeneratorTest.Create lldb-api :: lang/cpp/incomplete-types/TestCppIncompleteTypes.py lldb-api :: functionalities/darwin_log/filter/exact_match/subsystem/TestDarwinLogFilterMatchSubsystem.py lldb-unit :: ObjectFile/ELF/./ObjectFileELFTests/ObjectFileELFTest.GetSymtab_NoSymEntryPointArmAddressClass lldb-unit :: Utility/./UtilityTests/ListenerTest.GetEventWait lldb-unit :: UnwindAssembly/x86/./UnwindAssemblyx86Tests/Testx86AssemblyInspectionEngine.TestDisassemblyMidFunctionEpilogues lldb-unit :: UnwindAssembly/x86/./UnwindAssemblyx86Tests/Testx86AssemblyInspectionEngine.TestPushEAX lldb-unit :: Utility/./UtilityTests/OptionsWithRawTest.SingleWordSuffix lldb-unit :: Utility/./UtilityTests/StringListTest.JoinSingle lldb-api :: benchmarks/libcxxmap/TestBenchmarkLibcxxMap.py lldb-api :: commands/expression/import-std-module/deque-dbg-info-content/TestDbgInfoContentDequeFromStdModule.py lldb-unit :: Utility/./UtilityTests/StringListTest.ShiftCString lldb-unit :: Utility/./UtilityTests/ArgsTest.DoubleQuotedItem lldb-unit :: Target/./TargetTests/RemoteAwarePlatformTest.TestResolveExecutabelOnClientByPlatform lldb-unit :: UnwindAssembly/x86/./UnwindAssemblyx86Tests/Testx86AssemblyInspectionEngine.TestSimple32bitFrameFunction lldb-shell :: ObjectFile/ELF/aarch64-relocations.yaml lldb-api :: commands/watchpoints/watchpoint_commands/command/TestWatchpointCommandLLDB.py lldb-api :: python_api/watchpoint/condition/TestWatchpointConditionAPI.py lldb-unit :: Process/gdb-remote/./ProcessGdbRemoteTests/GDBRemoteClientBaseTest.SendContinueDelegateInterface lldb-unit :: Utility/./UtilityTests/Flags.Reset lldb-unit :: Utility/./UtilityTests/StreamTeeTest.CopyConstructor lldb-unit :: Language/CPlusPlus/./LanguageCPlusPlusTests/CPlusPlusLanguage.CPlusPlusNameParser lldb-unit :: Utility/./UtilityTests/LogTest.Unregister lldb-api :: functionalities/gdb_remote_client/TestRestartBug.py lldb-api :: functionalities/ptr_refs/TestPtrRefs.py lldb-api :: commands/platform/basic/TestPlatformPython.py lldb-api :: functionalities/breakpoint/comp_dir_symlink/TestCompDirSymLink.py lldb-api :: lang/objc/objc-dyn-sbtype/TestObjCDynamicSBType.py lldb-api :: commands/frame/diagnose/local-variable/TestLocalVariable.py lldb-api :: functionalities/tail_call_frames/sbapi_support/TestTailCallFrameSBAPI.py lldb-unit :: Process/minidump/./LLDBMinidumpTests/MinidumpParserTest.GetMemoryRegionInfoFromMemory64List lldb-shell :: Commands/command-breakpoint-col.test lldb-api :: commands/frame/select/TestFrameSelect.py lldb-api :: commands/expression/options/TestExprOptions.py lldb-shell :: SymbolFile/DWARF/dwp-debug-types.s lldb-unit :: Utility/./UtilityTests/SerializationRountripTest.SerializeDeserializePodPointers lldb-unit :: Utility/./UtilityTests/BinaryStreamTest.PutULEB128NineBytes lldb-unit :: Language/Highlighting/./HighlighterTests/HighlighterTest.ClangTrailingBackslashMissingNewLine lldb-api :: functionalities/gdb_remote_client/TestPlatformClient.py lldb-shell :: ObjectFile/MachO/lc_build_version.yaml lldb-api :: functionalities/data-formatter/data-formatter-stl/libstdcpp/vbool/TestDataFormatterStdVBool.py lldb-api :: macosx/version_zero/TestGetVersionZeroVersion.py lldb-shell :: Reproducer/TestRelativePath.test lldb-unit :: Target/./TargetTests/MCBasedABI.MapRegisterName lldb-unit :: Host/./HostTests/Host.WaitStatusFormat lldb-api :: functionalities/data-formatter/data-formatter-stl/libcxx/function/TestLibCxxFunction.py lldb-api :: macosx/profile_vrs_detach/TestDetachVrsProfile.py lldb-unit :: Target/./TargetTests/PathMappingListTest.RelativeTests lldb-api :: functionalities/data-formatter/data-formatter-objc/cmtime/TestDataFormatterCMTime.py lldb-unit :: Utility/./UtilityTests/ProcessInstanceInfoList.Yaml lldb-unit :: Utility/./UtilityTests/ProcessInstanceInfo.DumpTable_invalidUID lldb-unit :: ScriptInterpreter/Python/./ScriptInterpreterPythonTests/PythonDataObjectsTest.TestPythonTupleValues lldb-unit :: Utility/./UtilityTests/BinaryStreamTest.PutSLEB128FourBytes lldb-unit :: Utility/./UtilityTests/StreamTeeTest.Write lldb-api :: python_api/process/TestProcessAPI.py lldb-api :: functionalities/breakpoint/breakpoint_command/TestBreakpointCommandsFromPython.py lldb-unit :: Utility/./UtilityTests/StringExtractorTest.GetHexU8_InvalidHex_NoEof lldb-api :: functionalities/thread/concurrent_events/TestConcurrentManyBreakpoints.py lldb-unit :: Utility/./UtilityTests/XcodeSDKTest.GetCanonicalNameAndConstruct lldb-shell :: Reproducer/Functionalities/TestImageList.test lldb-api :: benchmarks/expression/TestExpressionCmd.py lldb-api :: python_api/debugger/TestDebuggerAPI.py lldb-api :: commands/watchpoints/step_over_watchpoint/TestStepOverWatchpoint.py lldb-unit :: Utility/./UtilityTests/ArchSpecTest.Compatibility lldb-unit :: Utility/./UtilityTests/StringExtractorTest.GetHexBytesAvail lldb-unit :: Process/gdb-remote/./ProcessGdbRemoteTests/GDBRemoteCommunicationClientTest.GetModulesInfo_UUID20 lldb-api :: commands/expression/call-restarts/TestCallThatRestarts.py lldb-api :: functionalities/data-formatter/data-formatter-stl/libcxx/optional/TestDataFormatterLibcxxOptional.py lldb-api :: functionalities/breakpoint/step_over_breakpoint/TestStepOverBreakpoint.py lldb-unit :: Utility/./UtilityTests/ConstStringTest.YAML lldb-api :: functionalities/thread/exit_during_step/TestExitDuringStep.py lldb-api :: functionalities/postmortem/minidump-new/TestMiniDumpUUID.py lldb-shell :: SymbolFile/NativePDB/globals-fundamental.cpp lldb-shell :: SymbolFile/DWARF/compilercontext.ll lldb-unit :: Utility/./UtilityTests/UriParserTest.SchemeHostSeparator4 lldb-unit :: Host/./HostTests/FileSystemTest.OpenErrno lldb-unit :: ScriptInterpreter/Python/./ScriptInterpreterPythonTests/PythonDataObjectsTest.TestGlobalNameResolutionWithDot lldb-api :: functionalities/data-formatter/data-formatter-stl/libcxx/atomic/TestLibCxxAtomic.py lldb-api :: lang/c/unions/TestUnionMembers.py lldb-api :: lang/cpp/namespace_definitions/TestNamespaceDefinitions.py lldb-unit :: Utility/./UtilityTests/VASprintfTest.EncodingError lldb-shell :: Minidump/dump-all.test lldb-unit :: Interpreter/./InterpreterTests/CompletionTest.DirCompletionUsername lldb-api :: commands/command/source/TestCommandSource.py lldb-shell :: Unwind/thread-step-out-ret-addr-check.test lldb-api :: lang/cpp/dynamic-value-same-basename/TestDynamicValueSameBase.py lldb-unit :: Process/minidump/./LLDBMinidumpTests/MinidumpParserTest.GetPidWindows lldb-unit :: Utility/./UtilityTests/UriParserTest.BracketedHostnameWithPortIPv6 lldb-unit :: ObjectFile/Breakpad/./ObjectFileBreakpadTests/LineRecord.parse lldb-api :: sanity/TestModuleCacheSanity.py lldb-api :: lang/c/global_variables/TestGlobalVariables.py lldb-api :: functionalities/thread/jump/TestThreadJump.py lldb-unit :: Utility/./UtilityTests/DataExtractorTest.GetCStrAtNullOffset lldb-shell :: ObjectFile/ELF/gnu-debuglink.yaml lldb-unit :: Host/./HostTests/SocketTest.DomainListenConnectAccept lldb-api :: functionalities/breakpoint/consecutive_breakpoints/TestConsecutiveBreakpoints.py lldb-unit :: Language/Highlighting/./HighlighterTests/HighlighterTest.ClangPreserveNewLine lldb-api :: functionalities/data-formatter/data-formatter-objc/TestDataFormatterObjCNSURL.py lldb-unit :: Utility/./UtilityTests/StreamTest.QuotedCString lldb-api :: functionalities/wrong_commands/TestWrongCommands.py lldb-unit :: Symbol/./SymbolTests/TestClangASTImporter.ImportInvalidType lldb-api :: commands/frame/diagnose/inheritance/TestDiagnoseInheritance.py lldb-api :: functionalities/data-formatter/data-formatter-stl/libcxx/variant/TestDataFormatterLibcxxVariant.py lldb-unit :: ObjectFile/Breakpad/./ObjectFileBreakpadTests/FuncRecord.parse lldb-shell :: Breakpoint/debug_rnglist_offset_pair.test lldb-api :: lang/c/array_types/TestArrayTypes.py lldb-api :: lang/cpp/nsimport/TestCppNsImport.py lldb-api :: commands/expression/anonymous-struct/TestCallUserAnonTypedef.py lldb-api :: functionalities/darwin_log/filter/regex/activity/TestDarwinLogFilterRegexActivity.py lldb-api :: functionalities/data-formatter/data-formatter-stl/libcxx/list/TestDataFormatterLibcxxList.py lldb-unit :: UnwindAssembly/x86/./UnwindAssemblyx86Tests/Testx86AssemblyInspectionEngine.TestPopRBX lldb-api :: functionalities/thread/crash_during_step/TestCrashDuringStep.py lldb-unit :: Host/./HostTests/FileSystemTest.Readable lldb-shell :: Settings/TestFrameFormatColor.test lldb-unit :: ScriptInterpreter/Python/./ScriptInterpreterPythonTests/PythonDataObjectsTest.TestScript lldb-unit :: Utility/./UtilityTests/BinaryStreamTest.PutULEB128EightBytes lldb-unit :: Utility/./UtilityTests/UserIDResolver.GetGroupName lldb-unit :: Utility/./UtilityTests/ArgsTest.AppendArguments lldb-unit :: Utility/./UtilityTests/StringExtractorTest.DecodeHexU8_Exact lldb-api :: driver/batch_mode/TestBatchMode.py lldb-api :: functionalities/dead-strip/TestDeadStrip.py lldb-api :: functionalities/data-formatter/dump_dynamic/TestDumpDynamic.py lldb-unit :: Utility/./UtilityTests/BinaryStreamTest.PutULEB128SixBytes lldb-api :: functionalities/data-formatter/compactvectors/TestCompactVectors.py lldb-api :: commands/watchpoints/hello_watchpoint/TestMyFirstWatchpoint.py lldb-unit :: Utility/./UtilityTests/CompletionRequest.FakeLastArg lldb-api :: lang/c/conflicting-symbol/TestConflictingSymbol.py lldb-api :: macosx/function-starts/TestFunctionStarts.py lldb-unit :: Target/./TargetTests/PathMappingListTest.RemapRoot lldb-shell :: ObjectFile/PECOFF/invalid-export-table.yaml lldb-shell :: Breakpoint/jitbp_elf.test lldb-api :: macosx/safe-to-func-call/TestSafeFuncCalls.py lldb-unit :: Utility/./UtilityTests/ConstStringTest.UpdateMangledCounterpart lldb-shell :: SymbolFile/DWARF/debug_loc_and_loclists.s lldb-shell :: Minidump/fb-dump.test lldb-unit :: Utility/./UtilityTests/StreamTest.ShiftOperatorChars lldb-shell :: SymbolFile/Breakpad/line-table-discontinuous-file-ids.test lldb-api :: functionalities/darwin_log/basic/TestDarwinLogBasic.py lldb-api :: functionalities/source-map/TestTargetSourceMap.py lldb-api :: commands/frame/diagnose/complicated-expression/TestComplicatedExpression.py lldb-api :: commands/expression/import-std-module/shared_ptr/TestSharedPtrFromStdModule.py lldb-api :: commands/expression/call-function/TestCallStdStringFunction.py lldb-api :: functionalities/data-formatter/nssetsynth/TestNSSetSynthetic.py lldb-api :: functionalities/thread/state/TestThreadStates.py lldb-shell :: Driver/TestConvenienceVariables.test lldb-unit :: Utility/./UtilityTests/ConstStringTest.format_provider lldb-api :: functionalities/data-formatter/data-formatter-script/TestDataFormatterScript.py lldb-shell :: SymbolFile/NativePDB/function-types-classes.cpp lldb-shell :: SymbolFile/NativePDB/function-types-calling-conv.cpp lldb-api :: commands/version/TestVersion.py lldb-shell :: SymbolFile/dissassemble-entry-point.s lldb-shell :: ObjectFile/MachO/symtab.yaml lldb-api :: functionalities/data-formatter/array_typedef/TestArrayTypedef.py lldb-unit :: Host/./HostTests/SocketTest.UDPConnect lldb-unit :: ScriptInterpreter/Python/./ScriptInterpreterPythonTests/PythonDataObjectsTest.TestTypeNameResolutionNoDot lldb-api :: commands/expression/call-function/TestCallBuiltinFunction.py lldb-unit :: Process/minidump/./LLDBMinidumpTests/MinidumpParserTest.GetMiscInfoWindows lldb-unit :: ScriptInterpreter/Python/./ScriptInterpreterPythonTests/PythonDataObjectsTest.TestResetting lldb-unit :: Utility/./UtilityTests/ArgsTest.ReplaceArgumentAtIndexOutOfRange lldb-unit :: Utility/./UtilityTests/StringExtractorTest.DecodeHexU8_Extra lldb-unit :: Process/gdb-remote/./ProcessGdbRemoteTests/GDBRemoteCommunicationClientTest.SendStartTracePacket lldb-shell :: Minidump/Windows/find-module.test lldb-unit :: Utility/./UtilityTests/ScalarTest.LongLongAssigmentOperator lldb-api :: python_api/sbenvironment/TestSBEnvironment.py lldb-unit :: Utility/./UtilityTests/XcodeSDKTest.ParseTest lldb-unit :: Utility/./UtilityTests/StringListTest.Clear lldb-unit :: Target/./TargetTests/MemoryRegionInfoTest.Formatv lldb-api :: functionalities/data-formatter/var-in-aggregate-misuse/TestVarInAggregateMisuse.py lldb-api :: commands/watchpoints/watchpoint_commands/TestWatchpointCommands.py lldb-unit :: Utility/./UtilityTests/StringListTest.SplitIntoLinesSingleTrailingCR lldb-unit :: Utility/./UtilityTests/Flags.AnySet lldb-unit :: Utility/./UtilityTests/RangeTest.DefaultConstructor lldb-api :: commands/expression/macros/TestMacros.py lldb-api :: functionalities/process_group/TestChangeProcessGroup.py lldb-unit :: Host/./HostTests/HostInfoTest.GetAugmentedArchSpec lldb-api :: functionalities/postmortem/elf-core/gcore/TestGCore.py lldb-unit :: Symbol/./SymbolTests/TestTypeSystemClang.AddMethodToObjCObjectType lldb-unit :: UnwindAssembly/x86/./UnwindAssemblyx86Tests/Testx86AssemblyInspectionEngine.TestPushExtended lldb-api :: lang/objc/rdar-10967107/TestRdar10967107.py lldb-unit :: Utility/./UtilityTests/ArchSpecTest.MergeFromMachOUnknown lldb-api :: tools/lldb-vscode/breakpoint/TestVSCode_setFunctionBreakpoints.py lldb-shell :: Reproducer/TestMultipleTargets.test lldb-api :: commands/expression/multiline-completion/TestMultilineCompletion.py lldb-api :: commands/expression/radar_9673664/TestExprHelpExamples.py lldb-shell :: Minidump/memory-region.yaml lldb-api :: functionalities/data-formatter/nsdictionarysynth/TestNSDictionarySynthetic.py lldb-unit :: Symbol/./SymbolTests/TestTypeSystemClang.TestFunctionTemplateInRecordConstruction lldb-api :: linux/builtin_trap/TestBuiltinTrap.py lldb-shell :: SymbolFile/DWARF/debug-types-address-ranges.s lldb-unit :: Symbol/./SymbolTests/TestClangASTImporter.MetadataPropagationIndirectImport lldb-unit :: UnwindAssembly/x86/./UnwindAssemblyx86Tests/Testx86AssemblyInspectionEngine.TestPushEBP lldb-unit :: Utility/./UtilityTests/UriParserTest.BadPort lldb-api :: lang/objcxx/objcxx-ivar-vector/TestIvarVector.py lldb-api :: commands/expression/persistent_ptr_update/TestPersistentPtrUpdate.py lldb-api :: types/TestCharType.py lldb-unit :: Utility/./UtilityTests/StringExtractorTest.GetHexBytes_OddPair2 lldb-api :: api/multithreaded/TestMultithreaded.py lldb-unit :: Utility/./UtilityTests/ArgsTest.TestSingleQuotedArgWithSpace lldb-unit :: Utility/./UtilityTests/UriParserTest.MinimalPort lldb-api :: arm/breakpoint-it/TestBreakpointIt.py lldb-unit :: Process/gdb-remote/./ProcessGdbRemoteTests/GDBRemoteCommunicationClientTest.WriteRegisterNoSuffix lldb-unit :: Host/./HostTests/File.GetStreamFromDescriptor lldb-unit :: Utility/./UtilityTests/PassiveReplayTest.InstrumentedFooInvalid lldb-unit :: Language/Highlighting/./HighlighterTests/HighlighterTest.ClangStringLiterals lldb-unit :: Utility/./UtilityTests/StringListTest.Join lldb-api :: functionalities/breakpoint/breakpoint_options/TestBreakpointOptions.py lldb-unit :: UnwindAssembly/x86/./UnwindAssemblyx86Tests/Testx86AssemblyInspectionEngine.TestPushRBX lldb-unit :: SymbolFile/NativePDB/./SymbolFileNativePDBTests/PDBFPOProgramToDWARFExpressionTests.UnresolvedCyclicRegisterAssignmentReference lldb-unit :: ObjectFile/Breakpad/./ObjectFileBreakpadTests/FileRecord.parse lldb-unit :: Utility/./UtilityTests/VMRange.Ordering lldb-api :: functionalities/data-formatter/language_category_updates/TestDataFormatterLanguageCategoryUpdates.py lldb-unit :: Utility/./UtilityTests/OptionsWithRawTest.EmptyInput lldb-shell :: SymbolFile/DWARF/debug-types-dwarf5.s lldb-api :: functionalities/lazy-loading/TestLazyLoading.py lldb-api :: macosx/macabi/TestMacABImacOSFramework.py lldb-unit :: Utility/./UtilityTests/LogChannelTest.List lldb-api :: lang/cpp/class_types/TestClassTypesDisassembly.py lldb-api :: lang/objc/objc-stepping/TestObjCStepping.py lldb-api :: functionalities/inferior-crashing/recursive-inferior/TestRecursiveInferiorStep.py lldb-api :: commands/expression/completion-in-lambda-and-unnamed-class/TestCompletionInLambdaAndUnnamedClass.py lldb-unit :: Utility/./UtilityTests/LogChannelEnabledTest.LLDB_LOG_ERROR lldb-api :: functionalities/tsan/thread_leak/TestTsanThreadLeak.py lldb-api :: functionalities/data-formatter/data-formatter-stl/libcxx/multimap/TestDataFormatterLibccMultiMap.py lldb-api :: functionalities/postmortem/elf-core/thread_crash/TestLinuxCoreThreads.py lldb-unit :: SymbolFile/DWARF/./SymbolFileDWARFTests/DWARFASTParserClangTests.EnsureAllDIEsInDeclContextHaveBeenParsedParsesOnlyMatchingEntries lldb-shell :: ObjectFile/ELF/section-types-edgecases.yaml lldb-unit :: Utility/./UtilityTests/SerializationRountripTest.SerializeDeserializeCStringArrayNullptr lldb-api :: functionalities/data-formatter/data-formatter-objc/TestDataFormatterObjNSException.py lldb-api :: commands/expression/call-throws/TestCallThatThrows.py lldb-shell :: ObjectFile/Breakpad/discontiguous-sections.test lldb-shell :: SymbolFile/DWARF/debug_rnglists.s lldb-shell :: SymbolFile/DWARF/forward-declarations.s lldb-api :: python_api/findvalue_duplist/TestSBFrameFindValue.py lldb-shell :: Expr/TestIRMemoryMap.test lldb-api :: lang/cpp/offsetof/TestOffsetofCpp.py lldb-unit :: SymbolFile/DWARF/./SymbolFileDWARFTests/SymbolFileDWARFTests.ParseArangesNonzeroSegmentSize lldb-unit :: Utility/./UtilityTests/RangeTest.EqualInvalid lldb-unit :: ScriptInterpreter/Python/./ScriptInterpreterPythonTests/PythonDataObjectsTest.TestBorrowedReferences lldb-unit :: Expression/./ExpressionTests/CppModuleConfigurationTest.Linux lldb-api :: functionalities/data-formatter/data-formatter-stl/libstdcpp/iterator/TestDataFormatterStdIterator.py lldb-api :: functionalities/thread/state_after_expression/TestStateAfterExpression.py lldb-shell :: Commands/command-regex-delete.test lldb-api :: commands/watchpoints/multiple_threads/TestWatchpointMultipleThreads.py lldb-api :: functionalities/thread/step_until/TestStepUntil.py lldb-shell :: Driver/TestRepl.test lldb-api :: python_api/objc_type/TestObjCType.py lldb-unit :: Utility/./UtilityTests/ScalarTest.ExtractBitfield lldb-unit :: Utility/./UtilityTests/RangeTest.ClearWithStarAddress lldb-api :: lang/cpp/inlines/TestInlines.py lldb-unit :: Host/./HostTests/FileSystemTest.Resolve lldb-unit :: Symbol/./SymbolTests/TestTypeSystemClang.TestGetEnumIntegerTypeUnexpectedType lldb-shell :: ObjectFile/ELF/PT_LOAD-overlap-PT_INTERP.yaml lldb-unit :: Utility/./UtilityTests/StringListTest.LongestCommonPrefix lldb-unit :: Process/gdb-remote/./ProcessGdbRemoteTests/GDBRemoteClientBaseTest.SendContinueAndInterrupt lldb-unit :: Language/Highlighting/./HighlighterTests/HighlighterTest.ClangBraces lldb-api :: commands/register/register/register_command/TestRegisters.py lldb-api :: types/TestIntegerType.py lldb-unit :: Utility/./UtilityTests/RegularExpression.Empty lldb-shell :: Quit/TestQuitExitCode-30.test lldb-unit :: Utility/./UtilityTests/RecordReplayTest.InstrumentedBarPtr lldb-unit :: DataFormatter/./LLDBFormatterTests/FormatManagerTests.CompatibleLangs lldb-api :: lang/objc/ivar-IMP/TestObjCiVarIMP.py lldb-unit :: Utility/./UtilityTests/FileSpecTest.EqualSeparator lldb-api :: commands/expression/completion/TestExprCompletion.py lldb-unit :: SymbolFile/DWARF/./SymbolFileDWARFTests/XcodeSDKModuleTests.TestModuleGetXcodeSDK lldb-api :: lang/cpp/auto/TestCPPAuto.py lldb-unit :: Language/Highlighting/./HighlighterTests/HighlighterTest.ClangSquareBrackets lldb-unit :: Utility/./UtilityTests/BinaryStreamTest.PutULEB128SevenBytes lldb-unit :: Symbol/./SymbolTests/TestClangASTImporter.CanImportInvalidType lldb-api :: lang/cpp/rvalue-references/TestRvalueReferences.py lldb-unit :: Utility/./UtilityTests/StringExtractorTest.GetHexBytesAvail_OddPair lldb-api :: functionalities/thread/concurrent_events/TestConcurrentManySignals.py lldb-unit :: Utility/./UtilityTests/StreamTest.PutStringAsRawHex8 lldb-api :: functionalities/data-formatter/data-formatter-stl/libcxx/unique_ptr/TestDataFormatterLibcxxUniquePtr.py lldb-unit :: Utility/./UtilityTests/StringExtractorTest.GetHexBytesAvail_FullString lldb-shell :: ObjectFile/PECOFF/sections-names.yaml lldb-unit :: UnwindAssembly/x86/./UnwindAssemblyx86Tests/Testx86AssemblyInspectionEngine.TestReturnDetect lldb-unit :: SymbolFile/NativePDB/./SymbolFileNativePDBTests/PDBFPOProgramToDWARFExpressionTests.UnresolvedDependentCyclicRegisterAssignmentReference lldb-unit :: Utility/./UtilityTests/LogTest.Register lldb-unit :: Utility/./UtilityTests/BinaryStreamTest.PutULEB128MaxValue lldb-api :: functionalities/data-formatter/pyobjsynthprovider/TestPyObjSynthProvider.py lldb-unit :: ScriptInterpreter/Python/./ScriptInterpreterPythonTests/PythonDataObjectsTest.TestPythonByteArray lldb-shell :: SymbolFile/DWARF/find-function-regex.cpp lldb-unit :: Utility/./UtilityTests/StringExtractorTest.GetNameColonValueSuccess lldb-unit :: Utility/./UtilityTests/UriParserTest.PortOverflow lldb-api :: functionalities/data-formatter/frameformat_smallstruct/TestFrameFormatSmallStruct.py lldb-unit :: Symbol/./SymbolTests/TestTypeSystemClang.TemplateArguments lldb-unit :: Utility/./UtilityTests/ArgsTest.ReplaceArgumentAtIndexFarOutOfRange lldb-api :: functionalities/thread/concurrent_events/TestConcurrentTwoBreakpointsOneWatchpoint.py lldb-unit :: ScriptInterpreter/Python/./ScriptInterpreterPythonTests/PythonDataObjectsTest.TestPythonDictionaryManipulation lldb-unit :: API/./APITests/SBCommandInterpreterTest.SingleWordCommand lldb-shell :: Driver/TestCommands.test lldb-api :: lang/objc/variadic_methods/TestVariadicMethods.py lldb-unit :: Utility/./UtilityTests/UUIDTest.SetFromStringRef lldb-unit :: Platform/./LLDBPlatformTests/PlatformDarwinTest.FindComponentInPath lldb-api :: commands/settings/quoting/TestQuoting.py lldb-api :: functionalities/archives/TestBSDArchives.py lldb-shell :: ScriptInterpreter/Lua/watchpoint_callback.test lldb-api :: commands/command/script_alias/TestCommandScriptAlias.py lldb-shell :: Quit/TestQuitExitCode0.test lldb-unit :: Expression/./ExpressionTests/DiagnosticManagerTest.GetStringBasic lldb-api :: functionalities/thread/concurrent_events/TestConcurrentTwoBreakpointsOneDelaySignal.py lldb-unit :: Utility/./UtilityTests/OptionsWithRawTest.LeadingSpaceArgs lldb-unit :: Host/./HostTests/SocketTest.TCPListen0GetPort lldb-api :: functionalities/data-formatter/data-formatter-stl/libstdcpp/unique_ptr/TestDataFormatterStdUniquePtr.py lldb-unit :: Utility/./UtilityTests/UriParserTest.BracketedHostnamePort lldb-api :: python_api/event/TestEvents.py lldb-unit :: Utility/./UtilityTests/TimerTest.CategoryTimes2 lldb-unit :: Utility/./UtilityTests/StreamTest.AddressRangeInvalidRange lldb-unit :: Process/gdb-remote/./ProcessGdbRemoteTests/GDBRemoteCommunicationServerTest.SendErrorResponse_ErrorList lldb-api :: commands/watchpoints/variable_out_of_scope/TestWatchedVarHitWhenInScope.py lldb-api :: lang/objc/print-obj/TestPrintObj.py lldb-unit :: Language/Highlighting/./HighlighterTests/HighlighterTest.ClangTrailingBackslashBeforeNewline lldb-api :: lang/cpp/type_lookup/TestCppTypeLookup.py lldb-api :: lang/c/bitfields/TestBitfields.py lldb-unit :: Process/gdb-remote/./ProcessGdbRemoteTests/GDBRemoteClientBaseTest.SendContinueAndWait lldb-unit :: Utility/./UtilityTests/OptionsWithRawTest.MultiWordSuffix lldb-unit :: Utility/./UtilityTests/VMRange.Reset lldb-shell :: ObjectFile/ELF/PT_LOAD-overlap-PT_TLS.yaml lldb-api :: python_api/lldbutil/TestSwigVersion.py lldb-shell :: Reproducer/TestCaptureEnvOverride.test lldb-unit :: Utility/./UtilityTests/XcodeSDKTest.GetSDKTypeForTriple lldb-unit :: Utility/./UtilityTests/CompletionRequest.ShiftArguments lldb-unit :: ScriptInterpreter/Python/./ScriptInterpreterPythonTests/PythonDataObjectsTest.TestPythonBytes lldb-shell :: SymbolFile/DWARF/clang-ast-from-dwarf-objc-property.m lldb-shell :: ObjectFile/ELF/basic-info.yaml lldb-unit :: Utility/./UtilityTests/StreamTest.ShiftOperatorStrings lldb-api :: functionalities/unwind/zeroth_frame/TestZerothFrame.py lldb-unit :: Symbol/./SymbolTests/TestTypeSystemClang.TestRecordHasFields lldb-unit :: Utility/./UtilityTests/Predicate.WaitForValueNotEqualTo lldb-unit :: Utility/./UtilityTests/StringListTest.PopBack lldb-unit :: Utility/./UtilityTests/SerializationRountripTest.SerializeDeserializeCString lldb-unit :: Utility/./UtilityTests/RangeTest.DoesAdjoinOrIntersect lldb-api :: functionalities/data-formatter/ptr_ref_typedef/TestPtrRef2Typedef.py lldb-shell :: SymbolFile/Breakpad/unwind-via-stack-win.test lldb-unit :: Utility/./UtilityTests/ArchSpecTest.TestParseMachCPUDashSubtypeTripleExtra lldb-unit :: Target/./TargetTests/ExecutionContextTest.GetByteOrderTarget

Hide Details

Hide Details

Testing Time: 1488.02s Unsupported : 104 Passed : 1001 Expectedly Failed: 5 Timed Out : 35 Failed : 904 FAILED: tools/lldb/test/CMakeFiles/check-lldb-lit cd /Users/buildslave/jenkins/workspace/lldb-cmake/lldb-build/tools/lldb/test && /usr/local/Frameworks/Python.framework/Versions/3.7/bin/python3.7 /Users/buildslave/jenkins/workspace/lldb-cmake/lldb-build/./bin/llvm-lit -v --time-tests --shuffle --xunit-xml-output=/Users/buildslave/jenkins/workspace/lldb-cmake/test/results.xml -v /Users/buildslave/jenkins/workspace/lldb-cmake/lldb-build/tools/lldb/test ninja: build stopped: subcommand failed. Command failed: Command '['/usr/bin/env', 'TERM=vt100', '/usr/local/bin/ninja', '-v', 'check-lldb']' returned non-zero exit status 1. Command: ['/usr/bin/env', 'TERM=vt100', '/usr/local/bin/ninja', '-v', 'check-lldb'] [Pipeline] } [Pipeline] // timeout [Pipeline] } [Pipeline] // stage [Pipeline] stage [Pipeline] { (Trigger Downstream Jobs) Stage "Trigger Downstream Jobs" skipped due to earlier failure(s) [Pipeline] } [Pipeline] // stage [Pipeline] stage [Pipeline] { (Declarative: Post Actions) [Pipeline] scanForIssues [Clang (LLVM based)] Sleeping for 5 seconds due to JENKINS-32191... [Clang (LLVM based)] Parsing console log (workspace: '/Users/buildslave/jenkins/workspace/lldb-cmake') [Clang (LLVM based)] Successfully parsed console log [Clang (LLVM based)] -> found 2 issues (skipped 0 duplicates) [Clang (LLVM based)] [-ERROR-] Can't create fingerprints for some files: [Clang (LLVM based)] [-ERROR-] - '/Users/buildslave/jenkins/workspace/lldb-cmake/lldb-build/Makefile.rules', IO exception has been thrown: java.nio.file.NoSuchFileException: /Users/buildslave/jenkins/workspace/lldb-cmake/lldb-build/Makefile.rules [Clang (LLVM based)] Post processing issues on 'green-dragon-24' with source code encoding 'UTF-8' [Clang (LLVM based)] Creating SCM blamer to obtain author and commit information for affected files [Clang (LLVM based)] Creating SCM miner to obtain statistics for affected repository files [Clang (LLVM based)] Resolving file names for all issues in source directory '/Users/buildslave/jenkins/workspace/lldb-cmake' [Clang (LLVM based)] -> resolved paths in source directory (1 found, 1 not found) [Clang (LLVM based)] Resolving module names from module definitions (build.xml, pom.xml, or Manifest.mf files) [Clang (LLVM based)] -> resolved module names for 2 issues [Clang (LLVM based)] Resolving package names (or namespaces) by parsing the affected files [Clang (LLVM based)] -> resolved package names of 2 affected files [Clang (LLVM based)] No filter has been set, publishing all 2 issues [Clang (LLVM based)] Creating fingerprints for all affected code blocks to track issues over different builds [Clang (LLVM based)] -> created fingerprints for 1 issues (skipped 1 issues) [Clang (LLVM based)] Copying affected files to Jenkins' build folder '/Users/Shared/Jenkins/Home/jobs/lldb-cmake/builds/20741/files-with-issues' [Clang (LLVM based)] -> 1 copied, 0 not in workspace, 1 not-found, 0 with I/O error [Pipeline] junit Recording test results [Pipeline] emailext

Hide Details

Begin Pre-Send Script... Sending email to: mschifer@apple.com Ahmed Bougacha <abougacha@apple.com> Azhar Mohammed <azhar@apple.com>
[Pipeline] } [Pipeline] // stage [Pipeline] } [Pipeline] // withEnv [Pipeline] } [Pipeline] // node [Pipeline] End of Pipeline ERROR: script returned exit code 1 Finished: FAILURE