Started 12 days ago
Took 1 hr 54 min

Failed Build clang-d332519-g262b10ba1f9-t3999-b3999.tar.gz (Nov 22, 2019 1:21:36 PM)

Issues

Found 10 issues:
Ninja target: aarch64_neon_intrinsics.c.o
[8567/8583] /Users/buildslave/jenkins/workspace/test-suite-verify-machineinstrs-aarch64-O0-g/test-suite-build/tools/timeit --summary SingleSource/Regression/C++/EH/CMakeFiles/Regression-C++-recursive-throw.dir/recursive-throw.cpp.o.time /Users/buildslave/jenkins/workspace/test-suite-verify-machineinstrs-aarch64-O0-g/compiler/bin/clang++  -DNDEBUG  -B /Applications/Xcode.app/Contents/Developer/Toolchains/XcodeDefault.xctoolchain/usr/bin    -Wno-unused-command-line-argument -mllvm -verify-machineinstrs -O0 -g -arch arm64 -isysroot /Applications/Xcode.app/Contents/Developer/Platforms/iPhoneOS.platform/Developer/SDKs/iPhoneOS12.1.sdk   -w -Werror=date-time -MD -MT SingleSource/Regression/C++/EH/CMakeFiles/Regression-C++-recursive-throw.dir/recursive-throw.cpp.o -MF SingleSource/Regression/C++/EH/CMakeFiles/Regression-C++-recursive-throw.dir/recursive-throw.cpp.o.d -o SingleSource/Regression/C++/EH/CMakeFiles/Regression-C++-recursive-throw.dir/recursive-throw.cpp.o -c /Users/buildslave/jenkins/workspace/test-suite-verify-machineinstrs-aarch64-O0-g/test-suite/SingleSource/Regression/C++/EH/recursive-throw.cpp
[8568/8583] : && /Users/buildslave/jenkins/workspace/test-suite-verify-machineinstrs-aarch64-O0-g/test-suite-build/tools/timeit --summary SingleSource/Regression/C++/EH/Regression-C++-ctor_dtor_count-2.link.time /Users/buildslave/jenkins/workspace/test-suite-verify-machineinstrs-aarch64-O0-g/compiler/bin/clang++  -B /Applications/Xcode.app/Contents/Developer/Toolchains/XcodeDefault.xctoolchain/usr/bin    -Wno-unused-command-line-argument -mllvm -verify-machineinstrs -O0 -g -arch arm64 -isysroot /Applications/Xcode.app/Contents/Developer/Platforms/iPhoneOS.platform/Developer/SDKs/iPhoneOS12.1.sdk -Wl,-search_paths_first -Wl,-headerpad_max_install_names -B /Applications/Xcode.app/Contents/Developer/Toolchains/XcodeDefault.xctoolchain/usr/bin SingleSource/Regression/C++/EH/CMakeFiles/Regression-C++-ctor_dtor_count-2.dir/ctor_dtor_count-2.cpp.o  -o SingleSource/Regression/C++/EH/Regression-C++-ctor_dtor_count-2  -lstdc++ && cd /Users/buildslave/jenkins/workspace/test-suite-verify-machineinstrs-aarch64-O0-g/test-suite-build/SingleSource/Regression/C++/EH && /usr/local/Cellar/cmake/3.13.1/bin/cmake -E create_symlink /Users/buildslave/jenkins/workspace/test-suite-verify-machineinstrs-aarch64-O0-g/test-suite/SingleSource/Regression/C++/EH/ctor_dtor_count-2.reference_output /Users/buildslave/jenkins/workspace/test-suite-verify-machineinstrs-aarch64-O0-g/test-suite-build/SingleSource/Regression/C++/EH/ctor_dtor_count-2.reference_output
[8569/8583] : && /Users/buildslave/jenkins/workspace/test-suite-verify-machineinstrs-aarch64-O0-g/test-suite-build/tools/timeit --summary SingleSource/Regression/C++/EH/Regression-C++-recursive-throw.link.time /Users/buildslave/jenkins/workspace/test-suite-verify-machineinstrs-aarch64-O0-g/compiler/bin/clang++  -B /Applications/Xcode.app/Contents/Developer/Toolchains/XcodeDefault.xctoolchain/usr/bin    -Wno-unused-command-line-argument -mllvm -verify-machineinstrs -O0 -g -arch arm64 -isysroot /Applications/Xcode.app/Contents/Developer/Platforms/iPhoneOS.platform/Developer/SDKs/iPhoneOS12.1.sdk -Wl,-search_paths_first -Wl,-headerpad_max_install_names -B /Applications/Xcode.app/Contents/Developer/Toolchains/XcodeDefault.xctoolchain/usr/bin SingleSource/Regression/C++/EH/CMakeFiles/Regression-C++-recursive-throw.dir/recursive-throw.cpp.o  -o SingleSource/Regression/C++/EH/Regression-C++-recursive-throw  -lstdc++ && cd /Users/buildslave/jenkins/workspace/test-suite-verify-machineinstrs-aarch64-O0-g/test-suite-build/SingleSource/Regression/C++/EH && /usr/local/Cellar/cmake/3.13.1/bin/cmake -E create_symlink /Users/buildslave/jenkins/workspace/test-suite-verify-machineinstrs-aarch64-O0-g/test-suite/SingleSource/Regression/C++/EH/recursive-throw.reference_output /Users/buildslave/jenkins/workspace/test-suite-verify-machineinstrs-aarch64-O0-g/test-suite-build/SingleSource/Regression/C++/EH/recursive-throw.reference_output
[8570/8583] /Users/buildslave/jenkins/workspace/test-suite-verify-machineinstrs-aarch64-O0-g/test-suite-build/tools/timeit --summary SingleSource/Regression/C++/EH/CMakeFiles/Regression-C++-ConditionalExpr.dir/ConditionalExpr.cpp.o.time /Users/buildslave/jenkins/workspace/test-suite-verify-machineinstrs-aarch64-O0-g/compiler/bin/clang++  -DNDEBUG  -B /Applications/Xcode.app/Contents/Developer/Toolchains/XcodeDefault.xctoolchain/usr/bin    -Wno-unused-command-line-argument -mllvm -verify-machineinstrs -O0 -g -arch arm64 -isysroot /Applications/Xcode.app/Contents/Developer/Platforms/iPhoneOS.platform/Developer/SDKs/iPhoneOS12.1.sdk   -w -Werror=date-time -MD -MT SingleSource/Regression/C++/EH/CMakeFiles/Regression-C++-ConditionalExpr.dir/ConditionalExpr.cpp.o -MF SingleSource/Regression/C++/EH/CMakeFiles/Regression-C++-ConditionalExpr.dir/ConditionalExpr.cpp.o.d -o SingleSource/Regression/C++/EH/CMakeFiles/Regression-C++-ConditionalExpr.dir/ConditionalExpr.cpp.o -c /Users/buildslave/jenkins/workspace/test-suite-verify-machineinstrs-aarch64-O0-g/test-suite/SingleSource/Regression/C++/EH/ConditionalExpr.cpp
[8571/8583] /Users/buildslave/jenkins/workspace/test-suite-verify-machineinstrs-aarch64-O0-g/test-suite-build/tools/timeit --summary SingleSource/UnitTests/Vector/AArch64/CMakeFiles/aarch64_neon_intrinsics.dir/aarch64_neon_intrinsics.c.o.time /Users/buildslave/jenkins/workspace/test-suite-verify-machineinstrs-aarch64-O0-g/compiler/bin/clang -DNDEBUG  -B /Applications/Xcode.app/Contents/Developer/Toolchains/XcodeDefault.xctoolchain/usr/bin    -Wno-unused-command-line-argument -mllvm -verify-machineinstrs -O0 -g -arch arm64 -isysroot /Applications/Xcode.app/Contents/Developer/Platforms/iPhoneOS.platform/Developer/SDKs/iPhoneOS12.1.sdk   -w -Werror=date-time -std=c99 -MD -MT SingleSource/UnitTests/Vector/AArch64/CMakeFiles/aarch64_neon_intrinsics.dir/aarch64_neon_intrinsics.c.o -MF SingleSource/UnitTests/Vector/AArch64/CMakeFiles/aarch64_neon_intrinsics.dir/aarch64_neon_intrinsics.c.o.d -o SingleSource/UnitTests/Vector/AArch64/CMakeFiles/aarch64_neon_intrinsics.dir/aarch64_neon_intrinsics.c.o   -c /Users/buildslave/jenkins/workspace/test-suite-verify-machineinstrs-aarch64-O0-g/test-suite/SingleSource/UnitTests/Vector/AArch64/aarch64_neon_intrinsics.c
FAILED: SingleSource/UnitTests/Vector/AArch64/CMakeFiles/aarch64_neon_intrinsics.dir/aarch64_neon_intrinsics.c.o 
/Users/buildslave/jenkins/workspace/test-suite-verify-machineinstrs-aarch64-O0-g/test-suite-build/tools/timeit --summary SingleSource/UnitTests/Vector/AArch64/CMakeFiles/aarch64_neon_intrinsics.dir/aarch64_neon_intrinsics.c.o.time /Users/buildslave/jenkins/workspace/test-suite-verify-machineinstrs-aarch64-O0-g/compiler/bin/clang -DNDEBUG  -B /Applications/Xcode.app/Contents/Developer/Toolchains/XcodeDefault.xctoolchain/usr/bin    -Wno-unused-command-line-argument -mllvm -verify-machineinstrs -O0 -g -arch arm64 -isysroot /Applications/Xcode.app/Contents/Developer/Platforms/iPhoneOS.platform/Developer/SDKs/iPhoneOS12.1.sdk   -w -Werror=date-time -std=c99 -MD -MT SingleSource/UnitTests/Vector/AArch64/CMakeFiles/aarch64_neon_intrinsics.dir/aarch64_neon_intrinsics.c.o -MF SingleSource/UnitTests/Vector/AArch64/CMakeFiles/aarch64_neon_intrinsics.dir/aarch64_neon_intrinsics.c.o.d -o SingleSource/UnitTests/Vector/AArch64/CMakeFiles/aarch64_neon_intrinsics.dir/aarch64_neon_intrinsics.c.o   -c /Users/buildslave/jenkins/workspace/test-suite-verify-machineinstrs-aarch64-O0-g/test-suite/SingleSource/UnitTests/Vector/AArch64/aarch64_neon_intrinsics.c
/Users/buildslave/jenkins/workspace/test-suite-verify-machineinstrs-aarch64-O0-g/test-suite/SingleSource/UnitTests/Vector/AArch64/aarch64_neon_intrinsics.c:37433:27: error: invalid conversion between vector type 'int32x2_t' (vector of 2 'int32_t' values) and integer type 'int' of different size
aarch64_neon_intrinsics.c error: invalid conversion between vector type 'int32x2_t' (vector of 2 'int32_t' values) and integer type 'int' of different size
[8569/8583] : && /Users/buildslave/jenkins/workspace/test-suite-verify-machineinstrs-aarch64-O0-g/test-suite-build/tools/timeit --summary SingleSource/Regression/C++/EH/Regression-C++-recursive-throw.link.time /Users/buildslave/jenkins/workspace/test-suite-verify-machineinstrs-aarch64-O0-g/compiler/bin/clang++  -B /Applications/Xcode.app/Contents/Developer/Toolchains/XcodeDefault.xctoolchain/usr/bin    -Wno-unused-command-line-argument -mllvm -verify-machineinstrs -O0 -g -arch arm64 -isysroot /Applications/Xcode.app/Contents/Developer/Platforms/iPhoneOS.platform/Developer/SDKs/iPhoneOS12.1.sdk -Wl,-search_paths_first -Wl,-headerpad_max_install_names -B /Applications/Xcode.app/Contents/Developer/Toolchains/XcodeDefault.xctoolchain/usr/bin SingleSource/Regression/C++/EH/CMakeFiles/Regression-C++-recursive-throw.dir/recursive-throw.cpp.o  -o SingleSource/Regression/C++/EH/Regression-C++-recursive-throw  -lstdc++ && cd /Users/buildslave/jenkins/workspace/test-suite-verify-machineinstrs-aarch64-O0-g/test-suite-build/SingleSource/Regression/C++/EH && /usr/local/Cellar/cmake/3.13.1/bin/cmake -E create_symlink /Users/buildslave/jenkins/workspace/test-suite-verify-machineinstrs-aarch64-O0-g/test-suite/SingleSource/Regression/C++/EH/recursive-throw.reference_output /Users/buildslave/jenkins/workspace/test-suite-verify-machineinstrs-aarch64-O0-g/test-suite-build/SingleSource/Regression/C++/EH/recursive-throw.reference_output
[8570/8583] /Users/buildslave/jenkins/workspace/test-suite-verify-machineinstrs-aarch64-O0-g/test-suite-build/tools/timeit --summary SingleSource/Regression/C++/EH/CMakeFiles/Regression-C++-ConditionalExpr.dir/ConditionalExpr.cpp.o.time /Users/buildslave/jenkins/workspace/test-suite-verify-machineinstrs-aarch64-O0-g/compiler/bin/clang++  -DNDEBUG  -B /Applications/Xcode.app/Contents/Developer/Toolchains/XcodeDefault.xctoolchain/usr/bin    -Wno-unused-command-line-argument -mllvm -verify-machineinstrs -O0 -g -arch arm64 -isysroot /Applications/Xcode.app/Contents/Developer/Platforms/iPhoneOS.platform/Developer/SDKs/iPhoneOS12.1.sdk   -w -Werror=date-time -MD -MT SingleSource/Regression/C++/EH/CMakeFiles/Regression-C++-ConditionalExpr.dir/ConditionalExpr.cpp.o -MF SingleSource/Regression/C++/EH/CMakeFiles/Regression-C++-ConditionalExpr.dir/ConditionalExpr.cpp.o.d -o SingleSource/Regression/C++/EH/CMakeFiles/Regression-C++-ConditionalExpr.dir/ConditionalExpr.cpp.o -c /Users/buildslave/jenkins/workspace/test-suite-verify-machineinstrs-aarch64-O0-g/test-suite/SingleSource/Regression/C++/EH/ConditionalExpr.cpp
[8571/8583] /Users/buildslave/jenkins/workspace/test-suite-verify-machineinstrs-aarch64-O0-g/test-suite-build/tools/timeit --summary SingleSource/UnitTests/Vector/AArch64/CMakeFiles/aarch64_neon_intrinsics.dir/aarch64_neon_intrinsics.c.o.time /Users/buildslave/jenkins/workspace/test-suite-verify-machineinstrs-aarch64-O0-g/compiler/bin/clang -DNDEBUG  -B /Applications/Xcode.app/Contents/Developer/Toolchains/XcodeDefault.xctoolchain/usr/bin    -Wno-unused-command-line-argument -mllvm -verify-machineinstrs -O0 -g -arch arm64 -isysroot /Applications/Xcode.app/Contents/Developer/Platforms/iPhoneOS.platform/Developer/SDKs/iPhoneOS12.1.sdk   -w -Werror=date-time -std=c99 -MD -MT SingleSource/UnitTests/Vector/AArch64/CMakeFiles/aarch64_neon_intrinsics.dir/aarch64_neon_intrinsics.c.o -MF SingleSource/UnitTests/Vector/AArch64/CMakeFiles/aarch64_neon_intrinsics.dir/aarch64_neon_intrinsics.c.o.d -o SingleSource/UnitTests/Vector/AArch64/CMakeFiles/aarch64_neon_intrinsics.dir/aarch64_neon_intrinsics.c.o   -c /Users/buildslave/jenkins/workspace/test-suite-verify-machineinstrs-aarch64-O0-g/test-suite/SingleSource/UnitTests/Vector/AArch64/aarch64_neon_intrinsics.c
FAILED: SingleSource/UnitTests/Vector/AArch64/CMakeFiles/aarch64_neon_intrinsics.dir/aarch64_neon_intrinsics.c.o 
/Users/buildslave/jenkins/workspace/test-suite-verify-machineinstrs-aarch64-O0-g/test-suite-build/tools/timeit --summary SingleSource/UnitTests/Vector/AArch64/CMakeFiles/aarch64_neon_intrinsics.dir/aarch64_neon_intrinsics.c.o.time /Users/buildslave/jenkins/workspace/test-suite-verify-machineinstrs-aarch64-O0-g/compiler/bin/clang -DNDEBUG  -B /Applications/Xcode.app/Contents/Developer/Toolchains/XcodeDefault.xctoolchain/usr/bin    -Wno-unused-command-line-argument -mllvm -verify-machineinstrs -O0 -g -arch arm64 -isysroot /Applications/Xcode.app/Contents/Developer/Platforms/iPhoneOS.platform/Developer/SDKs/iPhoneOS12.1.sdk   -w -Werror=date-time -std=c99 -MD -MT SingleSource/UnitTests/Vector/AArch64/CMakeFiles/aarch64_neon_intrinsics.dir/aarch64_neon_intrinsics.c.o -MF SingleSource/UnitTests/Vector/AArch64/CMakeFiles/aarch64_neon_intrinsics.dir/aarch64_neon_intrinsics.c.o.d -o SingleSource/UnitTests/Vector/AArch64/CMakeFiles/aarch64_neon_intrinsics.dir/aarch64_neon_intrinsics.c.o   -c /Users/buildslave/jenkins/workspace/test-suite-verify-machineinstrs-aarch64-O0-g/test-suite/SingleSource/UnitTests/Vector/AArch64/aarch64_neon_intrinsics.c
/Users/buildslave/jenkins/workspace/test-suite-verify-machineinstrs-aarch64-O0-g/test-suite/SingleSource/UnitTests/Vector/AArch64/aarch64_neon_intrinsics.c:37433:27: error: invalid conversion between vector type 'int32x2_t' (vector of 2 'int32_t' values) and integer type 'int' of different size
      arg2 = vcombine_s32(vcreate_s32(0),
                          ^~~~~~~~~~~~~~
aarch64_neon_intrinsics.c error: invalid conversion between vector type 'int32x2_t' (vector of 2 'int32_t' values) and integer type 'int' of different size
      arg2 = vcombine_s32(vcreate_s32(0),
                          ^~~~~~~~~~~~~~
/Users/buildslave/jenkins/workspace/test-suite-verify-machineinstrs-aarch64-O0-g/compiler/lib/clang/10.0.0/include/arm_neon.h:4169:11: note: expanded from macro 'vcreate_s32'
  __ret = (int32x2_t)(__p0); \
          ^~~~~~~~~~~~~~~~~
/Users/buildslave/jenkins/workspace/test-suite-verify-machineinstrs-aarch64-O0-g/test-suite/SingleSource/UnitTests/Vector/AArch64/aarch64_neon_intrinsics.c:43129:27: error: invalid conversion between vector type 'int32x2_t' (vector of 2 'int32_t' values) and integer type 'int' of different size
                          vcreate_s32(0));
                          ^~~~~~~~~~~~~~
aarch64_neon_intrinsics.c error: invalid conversion between vector type 'uint16x4_t' (vector of 4 'uint16_t' values) and integer type 'int' of different size
                          vcreate_s32(0));
                          ^~~~~~~~~~~~~~
/Users/buildslave/jenkins/workspace/test-suite-verify-machineinstrs-aarch64-O0-g/compiler/lib/clang/10.0.0/include/arm_neon.h:4169:11: note: expanded from macro 'vcreate_s32'
  __ret = (int32x2_t)(__p0); \
          ^~~~~~~~~~~~~~~~~
/Users/buildslave/jenkins/workspace/test-suite-verify-machineinstrs-aarch64-O0-g/test-suite/SingleSource/UnitTests/Vector/AArch64/aarch64_neon_intrinsics.c:44230:14: error: invalid conversion between vector type 'uint16x4_t' (vector of 4 'uint16_t' values) and integer type 'int' of different size
      arg2 = vcreate_u16(0);
             ^~~~~~~~~~~~~~
aarch64_neon_intrinsics.c error: invalid conversion between vector type 'int16x4_t' (vector of 4 'int16_t' values) and integer type 'int' of different size
      arg2 = vcreate_u16(0);
             ^~~~~~~~~~~~~~
/Users/buildslave/jenkins/workspace/test-suite-verify-machineinstrs-aarch64-O0-g/compiler/lib/clang/10.0.0/include/arm_neon.h:4149:11: note: expanded from macro 'vcreate_u16'
  __ret = (uint16x4_t)(__p0); \
          ^~~~~~~~~~~~~~~~~~
/Users/buildslave/jenkins/workspace/test-suite-verify-machineinstrs-aarch64-O0-g/test-suite/SingleSource/UnitTests/Vector/AArch64/aarch64_neon_intrinsics.c:62891:27: error: invalid conversion between vector type 'int16x4_t' (vector of 4 'int16_t' values) and integer type 'int' of different size
                          vcreate_s16(0));
                          ^~~~~~~~~~~~~~
aarch64_neon_intrinsics.c error: invalid conversion between vector type 'int32x2_t' (vector of 2 'int32_t' values) and integer type 'int' of different size
                          vcreate_s16(0));
                          ^~~~~~~~~~~~~~
/Users/buildslave/jenkins/workspace/test-suite-verify-machineinstrs-aarch64-O0-g/compiler/lib/clang/10.0.0/include/arm_neon.h:4179:11: note: expanded from macro 'vcreate_s16'
  __ret = (int16x4_t)(__p0); \
          ^~~~~~~~~~~~~~~~~
/Users/buildslave/jenkins/workspace/test-suite-verify-machineinstrs-aarch64-O0-g/test-suite/SingleSource/UnitTests/Vector/AArch64/aarch64_neon_intrinsics.c:107308:34: error: invalid conversion between vector type 'int32x2_t' (vector of 2 'int32_t' values) and integer type 'int' of different size
      arg2.val[0] = vcombine_s32(vcreate_s32(0),
                                 ^~~~~~~~~~~~~~
aarch64_neon_intrinsics.c error: invalid conversion between vector type 'uint32x2_t' (vector of 2 'uint32_t' values) and integer type 'int' of different size
      arg2.val[0] = vcombine_s32(vcreate_s32(0),
                                 ^~~~~~~~~~~~~~
/Users/buildslave/jenkins/workspace/test-suite-verify-machineinstrs-aarch64-O0-g/compiler/lib/clang/10.0.0/include/arm_neon.h:4169:11: note: expanded from macro 'vcreate_s32'
  __ret = (int32x2_t)(__p0); \
          ^~~~~~~~~~~~~~~~~
/Users/buildslave/jenkins/workspace/test-suite-verify-machineinstrs-aarch64-O0-g/test-suite/SingleSource/UnitTests/Vector/AArch64/aarch64_neon_intrinsics.c:174263:27: error: invalid conversion between vector type 'uint32x2_t' (vector of 2 'uint32_t' values) and integer type 'int' of different size
                          vcreate_u32(0));
                          ^~~~~~~~~~~~~~
aarch64_neon_intrinsics.c error: invalid conversion between vector type 'int32x2_t' (vector of 2 'int32_t' values) and integer type 'int' of different size
                          vcreate_u32(0));
                          ^~~~~~~~~~~~~~
/Users/buildslave/jenkins/workspace/test-suite-verify-machineinstrs-aarch64-O0-g/compiler/lib/clang/10.0.0/include/arm_neon.h:4139:11: note: expanded from macro 'vcreate_u32'
  __ret = (uint32x2_t)(__p0); \
          ^~~~~~~~~~~~~~~~~~
/Users/buildslave/jenkins/workspace/test-suite-verify-machineinstrs-aarch64-O0-g/test-suite/SingleSource/UnitTests/Vector/AArch64/aarch64_neon_intrinsics.c:175191:27: error: invalid conversion between vector type 'int32x2_t' (vector of 2 'int32_t' values) and integer type 'int' of different size
      arg1 = vcombine_s32(vcreate_s32(0),
                          ^~~~~~~~~~~~~~
aarch64_neon_intrinsics.c error: invalid conversion between vector type 'int32x2_t' (vector of 2 'int32_t' values) and integer type 'int' of different size
      arg1 = vcombine_s32(vcreate_s32(0),
                          ^~~~~~~~~~~~~~
/Users/buildslave/jenkins/workspace/test-suite-verify-machineinstrs-aarch64-O0-g/compiler/lib/clang/10.0.0/include/arm_neon.h:4169:11: note: expanded from macro 'vcreate_s32'
  __ret = (int32x2_t)(__p0); \
          ^~~~~~~~~~~~~~~~~
/Users/buildslave/jenkins/workspace/test-suite-verify-machineinstrs-aarch64-O0-g/test-suite/SingleSource/UnitTests/Vector/AArch64/aarch64_neon_intrinsics.c:176993:27: error: invalid conversion between vector type 'int32x2_t' (vector of 2 'int32_t' values) and integer type 'int' of different size
                          vcreate_s32(0));
                          ^~~~~~~~~~~~~~
aarch64_neon_intrinsics.c error: invalid conversion between vector type 'uint16x4_t' (vector of 4 'uint16_t' values) and integer type 'int' of different size
                          vcreate_s32(0));
                          ^~~~~~~~~~~~~~
/Users/buildslave/jenkins/workspace/test-suite-verify-machineinstrs-aarch64-O0-g/compiler/lib/clang/10.0.0/include/arm_neon.h:4169:11: note: expanded from macro 'vcreate_s32'
  __ret = (int32x2_t)(__p0); \
          ^~~~~~~~~~~~~~~~~
/Users/buildslave/jenkins/workspace/test-suite-verify-machineinstrs-aarch64-O0-g/test-suite/SingleSource/UnitTests/Vector/AArch64/aarch64_neon_intrinsics.c:210780:27: error: invalid conversion between vector type 'uint16x4_t' (vector of 4 'uint16_t' values) and integer type 'int' of different size
      arg1 = vcombine_u16(vcreate_u16(0),
                          ^~~~~~~~~~~~~~

Build Log

Changes
  1. [lldb][DataFormatters] Support pretty printing std::string when built (detail)
  2. [lit] Attempt to print test summary on CTRL+C (detail)
  3. [APFloat] Fix subtraction of subnormal numbers (detail)
  4. Don't forward __pthread_mutex_* interceptors to pthread_mutex_* version (detail)
  5. Reinstate MSan suppression of PR24578. (detail)
  6. [APFloat] Enlarge ExponentType to 32bit integer (detail)
  7. [clang-include-fixer] Suppress cmd prompt from Vim on Windows (detail)
  8. Slightly speculative buildbot fix for issue reported in 8293f74 commit (detail)
  9. [DWARF] Handle call sites with indirect call targets (detail)
  10. [CMake] Support installation of InstrProfData.inc (detail)
  11. Revert "[CMake] Support installation of InstrProfData.inc" (detail)

Started by upstream project relay-test-suite-verify-machineinstrs build number 6755
originally caused by:

This run spent:

  • 1 hr 38 min waiting;
  • 1 hr 54 min build duration;
  • 1 hr 54 min total from scheduled to completion.
Revision: 262b10ba1f9db4d00f43bcb1d8c1e557dced3bcd
  • detached

Identified problems

Compile Error

This build failed because of a compile error. Below is a list of all errors in the build log:
Indication 1

Ninja target failed

Below is a link to the first failed ninja target.
Indication 2