Started 24 days ago
Took 1 hr 19 min

Failed Build clang-d360298-gf49edafd9ab-t12678-b12678.tar.gz (Jul 14, 2020 6:25:57 PM)

Issues

Found 3 issues:
Ninja target: matrix-types-spec.cpp.o
[8390/11531] : && /Users/buildslave/jenkins/workspace/test-suite-verify-machineinstrs-aarch64-O3/test-suite-build/tools/timeit --summary SingleSource/UnitTests/Vector/Vector-sumarray.link.time /Users/buildslave/jenkins/workspace/test-suite-verify-machineinstrs-aarch64-O3/compiler/bin/clang -B /Applications/Xcode.app/Contents/Developer/Toolchains/XcodeDefault.xctoolchain/usr/bin    -Wno-unused-command-line-argument -mllvm -verify-machineinstrs -O3 -arch arm64 -isysroot /Applications/Xcode.app/Contents/Developer/Platforms/iPhoneOS.platform/Developer/SDKs/iPhoneOS13.5.sdk -Wl,-search_paths_first -Wl,-headerpad_max_install_names -B /Applications/Xcode.app/Contents/Developer/Toolchains/XcodeDefault.xctoolchain/usr/bin SingleSource/UnitTests/Vector/CMakeFiles/Vector-sumarray.dir/sumarray.c.o  -o SingleSource/UnitTests/Vector/Vector-sumarray   && cd /Users/buildslave/jenkins/workspace/test-suite-verify-machineinstrs-aarch64-O3/test-suite-build/SingleSource/UnitTests/Vector && /usr/local/Cellar/cmake/3.17.2/bin/cmake -E create_symlink /Users/buildslave/jenkins/workspace/test-suite-verify-machineinstrs-aarch64-O3/test-suite/SingleSource/UnitTests/Vector/sumarray.reference_output /Users/buildslave/jenkins/workspace/test-suite-verify-machineinstrs-aarch64-O3/test-suite-build/SingleSource/UnitTests/Vector/sumarray.reference_output
[8391/11531] : && /Users/buildslave/jenkins/workspace/test-suite-verify-machineinstrs-aarch64-O3/test-suite-build/tools/timeit --summary SingleSource/UnitTests/Vector/Vector-build2.link.time /Users/buildslave/jenkins/workspace/test-suite-verify-machineinstrs-aarch64-O3/compiler/bin/clang -B /Applications/Xcode.app/Contents/Developer/Toolchains/XcodeDefault.xctoolchain/usr/bin    -Wno-unused-command-line-argument -mllvm -verify-machineinstrs -O3 -arch arm64 -isysroot /Applications/Xcode.app/Contents/Developer/Platforms/iPhoneOS.platform/Developer/SDKs/iPhoneOS13.5.sdk -Wl,-search_paths_first -Wl,-headerpad_max_install_names -B /Applications/Xcode.app/Contents/Developer/Toolchains/XcodeDefault.xctoolchain/usr/bin SingleSource/UnitTests/Vector/CMakeFiles/Vector-build2.dir/build2.c.o  -o SingleSource/UnitTests/Vector/Vector-build2   && cd /Users/buildslave/jenkins/workspace/test-suite-verify-machineinstrs-aarch64-O3/test-suite-build/SingleSource/UnitTests/Vector && /usr/local/Cellar/cmake/3.17.2/bin/cmake -E create_symlink /Users/buildslave/jenkins/workspace/test-suite-verify-machineinstrs-aarch64-O3/test-suite/SingleSource/UnitTests/Vector/build2.reference_output /Users/buildslave/jenkins/workspace/test-suite-verify-machineinstrs-aarch64-O3/test-suite-build/SingleSource/UnitTests/Vector/build2.reference_output
[8392/11531] /Users/buildslave/jenkins/workspace/test-suite-verify-machineinstrs-aarch64-O3/test-suite-build/tools/timeit --summary SingleSource/UnitTests/C++11/CMakeFiles/stdthreadbug.dir/stdthreadbug.cpp.o.time /Users/buildslave/jenkins/workspace/test-suite-verify-machineinstrs-aarch64-O3/compiler/bin/clang++  -DNDEBUG  -B /Applications/Xcode.app/Contents/Developer/Toolchains/XcodeDefault.xctoolchain/usr/bin    -Wno-unused-command-line-argument -mllvm -verify-machineinstrs -O3 -arch arm64 -isysroot /Applications/Xcode.app/Contents/Developer/Platforms/iPhoneOS.platform/Developer/SDKs/iPhoneOS13.5.sdk   -w -Werror=date-time -std=c++11 -pthread -MD -MT SingleSource/UnitTests/C++11/CMakeFiles/stdthreadbug.dir/stdthreadbug.cpp.o -MF SingleSource/UnitTests/C++11/CMakeFiles/stdthreadbug.dir/stdthreadbug.cpp.o.d -o SingleSource/UnitTests/C++11/CMakeFiles/stdthreadbug.dir/stdthreadbug.cpp.o -c /Users/buildslave/jenkins/workspace/test-suite-verify-machineinstrs-aarch64-O3/test-suite/SingleSource/UnitTests/C++11/stdthreadbug.cpp
[8393/11531] : && /Users/buildslave/jenkins/workspace/test-suite-verify-machineinstrs-aarch64-O3/test-suite-build/tools/timeit --summary SingleSource/UnitTests/C++11/stdthreadbug.link.time /Users/buildslave/jenkins/workspace/test-suite-verify-machineinstrs-aarch64-O3/compiler/bin/clang++  -B /Applications/Xcode.app/Contents/Developer/Toolchains/XcodeDefault.xctoolchain/usr/bin    -Wno-unused-command-line-argument -mllvm -verify-machineinstrs -O3 -arch arm64 -isysroot /Applications/Xcode.app/Contents/Developer/Platforms/iPhoneOS.platform/Developer/SDKs/iPhoneOS13.5.sdk -Wl,-search_paths_first -Wl,-headerpad_max_install_names -B /Applications/Xcode.app/Contents/Developer/Toolchains/XcodeDefault.xctoolchain/usr/bin SingleSource/UnitTests/C++11/CMakeFiles/stdthreadbug.dir/stdthreadbug.cpp.o  -o SingleSource/UnitTests/C++11/stdthreadbug  -lstdc++ -pthread && cd /Users/buildslave/jenkins/workspace/test-suite-verify-machineinstrs-aarch64-O3/test-suite-build/SingleSource/UnitTests/C++11 && /usr/local/Cellar/cmake/3.17.2/bin/cmake -E create_symlink /Users/buildslave/jenkins/workspace/test-suite-verify-machineinstrs-aarch64-O3/test-suite/SingleSource/UnitTests/C++11/stdthreadbug.reference_output /Users/buildslave/jenkins/workspace/test-suite-verify-machineinstrs-aarch64-O3/test-suite-build/SingleSource/UnitTests/C++11/stdthreadbug.reference_output
[8394/11531] /Users/buildslave/jenkins/workspace/test-suite-verify-machineinstrs-aarch64-O3/test-suite-build/tools/timeit --summary SingleSource/UnitTests/CMakeFiles/matrix-types-spec.dir/matrix-types-spec.cpp.o.time /Users/buildslave/jenkins/workspace/test-suite-verify-machineinstrs-aarch64-O3/compiler/bin/clang++  -DNDEBUG  -B /Applications/Xcode.app/Contents/Developer/Toolchains/XcodeDefault.xctoolchain/usr/bin    -Wno-unused-command-line-argument -mllvm -verify-machineinstrs -O3 -arch arm64 -isysroot /Applications/Xcode.app/Contents/Developer/Platforms/iPhoneOS.platform/Developer/SDKs/iPhoneOS13.5.sdk   -w -Werror=date-time -fenable-matrix -MD -MT SingleSource/UnitTests/CMakeFiles/matrix-types-spec.dir/matrix-types-spec.cpp.o -MF SingleSource/UnitTests/CMakeFiles/matrix-types-spec.dir/matrix-types-spec.cpp.o.d -o SingleSource/UnitTests/CMakeFiles/matrix-types-spec.dir/matrix-types-spec.cpp.o -c /Users/buildslave/jenkins/workspace/test-suite-verify-machineinstrs-aarch64-O3/test-suite/SingleSource/UnitTests/matrix-types-spec.cpp
FAILED: SingleSource/UnitTests/CMakeFiles/matrix-types-spec.dir/matrix-types-spec.cpp.o 
/Users/buildslave/jenkins/workspace/test-suite-verify-machineinstrs-aarch64-O3/test-suite-build/tools/timeit --summary SingleSource/UnitTests/CMakeFiles/matrix-types-spec.dir/matrix-types-spec.cpp.o.time /Users/buildslave/jenkins/workspace/test-suite-verify-machineinstrs-aarch64-O3/compiler/bin/clang++  -DNDEBUG  -B /Applications/Xcode.app/Contents/Developer/Toolchains/XcodeDefault.xctoolchain/usr/bin    -Wno-unused-command-line-argument -mllvm -verify-machineinstrs -O3 -arch arm64 -isysroot /Applications/Xcode.app/Contents/Developer/Platforms/iPhoneOS.platform/Developer/SDKs/iPhoneOS13.5.sdk   -w -Werror=date-time -fenable-matrix -MD -MT SingleSource/UnitTests/CMakeFiles/matrix-types-spec.dir/matrix-types-spec.cpp.o -MF SingleSource/UnitTests/CMakeFiles/matrix-types-spec.dir/matrix-types-spec.cpp.o.d -o SingleSource/UnitTests/CMakeFiles/matrix-types-spec.dir/matrix-types-spec.cpp.o -c /Users/buildslave/jenkins/workspace/test-suite-verify-machineinstrs-aarch64-O3/test-suite/SingleSource/UnitTests/matrix-types-spec.cpp
Intrinsic name not mangled correctly for type arguments! Should be: llvm.matrix.column.major.load.v9f64
Fatal Error: error in backend: Broken function found, compilation aborted!
Intrinsic name not mangled correctly for type arguments! Should be: llvm.matrix.column.major.load.v9f64
<9 x double> (double*, i64, i1, i32, i32)* @llvm.matrix.column.major.load.v9f64.p0f64
Intrinsic name not mangled correctly for type arguments! Should be: llvm.matrix.column.major.store.v9f64
void (<9 x double>, double*, i64, i1, i32, i32)* @llvm.matrix.column.major.store.v9f64.p0f64
in function _Z13transposeSpecIdLj3ELj3EEvPT_S1_
fatal error: error in backend: Broken function found, compilation aborted!
PLEASE submit a bug report to https://bugs.llvm.org/ and include the crash backtrace, preprocessed source, and associated run script.
Stack dump:
Error: clang frontend command failed with exit code 70 (use -v to see invocation)
24 clang++       0x000000010ca3b2bd clang::driver::Compilation::ExecuteCommand(clang::driver::Command const&, clang::driver::Command const*&) const + 221
25 clang++       0x000000010ca3b6dd clang::driver::Compilation::ExecuteJobs(clang::driver::JobList const&, llvm::SmallVectorImpl<std::__1::pair<int, clang::driver::Command const*> >&) const + 125
26 clang++       0x000000010ca4fb9c clang::driver::Driver::ExecuteCompilation(clang::driver::Compilation&, llvm::SmallVectorImpl<std::__1::pair<int, clang::driver::Command const*> >&) + 204
27 clang++       0x000000010a5e1985 main + 10389
28 libdyld.dylib 0x00007fff696f7cc9 start + 1
clang-11: error: clang frontend command failed with exit code 70 (use -v to see invocation)
clang version 11.0.0 (https://github.com/llvm/llvm-project.git f49edafd9abf75aaa7d9254c345026620e69b5ce)
Target: aarch64-apple-darwin19.5.0

Build Log

Changes
  1. [flang] Implement anonymous units in the runtime (details)
  2. [lldb/Test] Create reproducer dir if necessary (details)
  3. [flang] Fix list-directed input (repeated nulls and LOGICAL) (details)
  4. Fix test that was accidentally adding the llvm-as binary into an (details)

Started by upstream project relay-test-suite-verify-machineinstrs build number 8345
originally caused by:

This run spent:

  • 48 min waiting;
  • 1 hr 19 min build duration;
  • 1 hr 19 min total from scheduled to completion.
Revision: a5b58cdd800d0d45b1bdd1f7fe058db6acbfd918
  • refs/remotes/origin/master
Revision: f49edafd9abf75aaa7d9254c345026620e69b5ce
  • detached
Revision: 4c57b004f148dffc6db199890d91fc3e6e578972
  • refs/remotes/origin/master
Revision: 60cfbf7833b8039b938ce679bed89c738b519e1d
  • refs/remotes/origin/master

Identified problems

Ninja target failed

Below is a link to the first failed ninja target.
Indication 1

Compile Error

This build failed because of a compile error. Below is a list of all errors in the build log:
Indication 2