Started 2 mo 19 days ago
Took 1 hr 6 min

Failed Build clang-d362945-g975467e4aa7-t13500-b13500.tar.gz (Aug 9, 2020 7:19:36 AM)

Issues

Found 3 issues:
Ninja target: decode_i386.c.o
[7616/11531] /Users/buildslave/jenkins/workspace/test-suite-verify-machineinstrs-aarch64-O3/test-suite-build/tools/timeit --summary MultiSource/Benchmarks/MiBench/consumer-lame/CMakeFiles/consumer-lame.dir/gtkanal.c.o.time /Users/buildslave/jenkins/workspace/test-suite-verify-machineinstrs-aarch64-O3/compiler/bin/clang -DNDEBUG  -B /Applications/Xcode.app/Contents/Developer/Toolchains/XcodeDefault.xctoolchain/usr/bin    -Wno-unused-command-line-argument -mllvm -verify-machineinstrs -O3 -arch arm64 -isysroot /Applications/Xcode.app/Contents/Developer/Platforms/iPhoneOS.platform/Developer/SDKs/iPhoneOS13.5.sdk   -w -Werror=date-time -DHAVEMPGLIB -DLAMEPARSE -DNDEBUG -D__NO_MATH_INLINES -DLAMESNDFILE -MD -MT MultiSource/Benchmarks/MiBench/consumer-lame/CMakeFiles/consumer-lame.dir/gtkanal.c.o -MF MultiSource/Benchmarks/MiBench/consumer-lame/CMakeFiles/consumer-lame.dir/gtkanal.c.o.d -o MultiSource/Benchmarks/MiBench/consumer-lame/CMakeFiles/consumer-lame.dir/gtkanal.c.o   -c /Users/buildslave/jenkins/workspace/test-suite-verify-machineinstrs-aarch64-O3/test-suite/MultiSource/Benchmarks/MiBench/consumer-lame/gtkanal.c
[7617/11531] /Users/buildslave/jenkins/workspace/test-suite-verify-machineinstrs-aarch64-O3/test-suite-build/tools/timeit --summary MultiSource/Benchmarks/MiBench/consumer-lame/CMakeFiles/consumer-lame.dir/get_audio.c.o.time /Users/buildslave/jenkins/workspace/test-suite-verify-machineinstrs-aarch64-O3/compiler/bin/clang -DNDEBUG  -B /Applications/Xcode.app/Contents/Developer/Toolchains/XcodeDefault.xctoolchain/usr/bin    -Wno-unused-command-line-argument -mllvm -verify-machineinstrs -O3 -arch arm64 -isysroot /Applications/Xcode.app/Contents/Developer/Platforms/iPhoneOS.platform/Developer/SDKs/iPhoneOS13.5.sdk   -w -Werror=date-time -DHAVEMPGLIB -DLAMEPARSE -DNDEBUG -D__NO_MATH_INLINES -DLAMESNDFILE -MD -MT MultiSource/Benchmarks/MiBench/consumer-lame/CMakeFiles/consumer-lame.dir/get_audio.c.o -MF MultiSource/Benchmarks/MiBench/consumer-lame/CMakeFiles/consumer-lame.dir/get_audio.c.o.d -o MultiSource/Benchmarks/MiBench/consumer-lame/CMakeFiles/consumer-lame.dir/get_audio.c.o   -c /Users/buildslave/jenkins/workspace/test-suite-verify-machineinstrs-aarch64-O3/test-suite/MultiSource/Benchmarks/MiBench/consumer-lame/get_audio.c
[7618/11531] /Users/buildslave/jenkins/workspace/test-suite-verify-machineinstrs-aarch64-O3/test-suite-build/tools/timeit --summary MultiSource/Benchmarks/MiBench/consumer-lame/CMakeFiles/consumer-lame.dir/id3tag.c.o.time /Users/buildslave/jenkins/workspace/test-suite-verify-machineinstrs-aarch64-O3/compiler/bin/clang -DNDEBUG  -B /Applications/Xcode.app/Contents/Developer/Toolchains/XcodeDefault.xctoolchain/usr/bin    -Wno-unused-command-line-argument -mllvm -verify-machineinstrs -O3 -arch arm64 -isysroot /Applications/Xcode.app/Contents/Developer/Platforms/iPhoneOS.platform/Developer/SDKs/iPhoneOS13.5.sdk   -w -Werror=date-time -DHAVEMPGLIB -DLAMEPARSE -DNDEBUG -D__NO_MATH_INLINES -DLAMESNDFILE -MD -MT MultiSource/Benchmarks/MiBench/consumer-lame/CMakeFiles/consumer-lame.dir/id3tag.c.o -MF MultiSource/Benchmarks/MiBench/consumer-lame/CMakeFiles/consumer-lame.dir/id3tag.c.o.d -o MultiSource/Benchmarks/MiBench/consumer-lame/CMakeFiles/consumer-lame.dir/id3tag.c.o   -c /Users/buildslave/jenkins/workspace/test-suite-verify-machineinstrs-aarch64-O3/test-suite/MultiSource/Benchmarks/MiBench/consumer-lame/id3tag.c
[7619/11531] /Users/buildslave/jenkins/workspace/test-suite-verify-machineinstrs-aarch64-O3/test-suite-build/tools/timeit --summary MultiSource/Benchmarks/MiBench/consumer-lame/CMakeFiles/consumer-lame.dir/ieeefloat.c.o.time /Users/buildslave/jenkins/workspace/test-suite-verify-machineinstrs-aarch64-O3/compiler/bin/clang -DNDEBUG  -B /Applications/Xcode.app/Contents/Developer/Toolchains/XcodeDefault.xctoolchain/usr/bin    -Wno-unused-command-line-argument -mllvm -verify-machineinstrs -O3 -arch arm64 -isysroot /Applications/Xcode.app/Contents/Developer/Platforms/iPhoneOS.platform/Developer/SDKs/iPhoneOS13.5.sdk   -w -Werror=date-time -DHAVEMPGLIB -DLAMEPARSE -DNDEBUG -D__NO_MATH_INLINES -DLAMESNDFILE -MD -MT MultiSource/Benchmarks/MiBench/consumer-lame/CMakeFiles/consumer-lame.dir/ieeefloat.c.o -MF MultiSource/Benchmarks/MiBench/consumer-lame/CMakeFiles/consumer-lame.dir/ieeefloat.c.o.d -o MultiSource/Benchmarks/MiBench/consumer-lame/CMakeFiles/consumer-lame.dir/ieeefloat.c.o   -c /Users/buildslave/jenkins/workspace/test-suite-verify-machineinstrs-aarch64-O3/test-suite/MultiSource/Benchmarks/MiBench/consumer-lame/ieeefloat.c
[7620/11531] /Users/buildslave/jenkins/workspace/test-suite-verify-machineinstrs-aarch64-O3/test-suite-build/tools/timeit --summary MultiSource/Benchmarks/MiBench/consumer-lame/CMakeFiles/consumer-lame.dir/decode_i386.c.o.time /Users/buildslave/jenkins/workspace/test-suite-verify-machineinstrs-aarch64-O3/compiler/bin/clang -DNDEBUG  -B /Applications/Xcode.app/Contents/Developer/Toolchains/XcodeDefault.xctoolchain/usr/bin    -Wno-unused-command-line-argument -mllvm -verify-machineinstrs -O3 -arch arm64 -isysroot /Applications/Xcode.app/Contents/Developer/Platforms/iPhoneOS.platform/Developer/SDKs/iPhoneOS13.5.sdk   -w -Werror=date-time -DHAVEMPGLIB -DLAMEPARSE -DNDEBUG -D__NO_MATH_INLINES -DLAMESNDFILE -MD -MT MultiSource/Benchmarks/MiBench/consumer-lame/CMakeFiles/consumer-lame.dir/decode_i386.c.o -MF MultiSource/Benchmarks/MiBench/consumer-lame/CMakeFiles/consumer-lame.dir/decode_i386.c.o.d -o MultiSource/Benchmarks/MiBench/consumer-lame/CMakeFiles/consumer-lame.dir/decode_i386.c.o   -c /Users/buildslave/jenkins/workspace/test-suite-verify-machineinstrs-aarch64-O3/test-suite/MultiSource/Benchmarks/MiBench/consumer-lame/decode_i386.c
FAILED: MultiSource/Benchmarks/MiBench/consumer-lame/CMakeFiles/consumer-lame.dir/decode_i386.c.o 
/Users/buildslave/jenkins/workspace/test-suite-verify-machineinstrs-aarch64-O3/test-suite-build/tools/timeit --summary MultiSource/Benchmarks/MiBench/consumer-lame/CMakeFiles/consumer-lame.dir/decode_i386.c.o.time /Users/buildslave/jenkins/workspace/test-suite-verify-machineinstrs-aarch64-O3/compiler/bin/clang -DNDEBUG  -B /Applications/Xcode.app/Contents/Developer/Toolchains/XcodeDefault.xctoolchain/usr/bin    -Wno-unused-command-line-argument -mllvm -verify-machineinstrs -O3 -arch arm64 -isysroot /Applications/Xcode.app/Contents/Developer/Platforms/iPhoneOS.platform/Developer/SDKs/iPhoneOS13.5.sdk   -w -Werror=date-time -DHAVEMPGLIB -DLAMEPARSE -DNDEBUG -D__NO_MATH_INLINES -DLAMESNDFILE -MD -MT MultiSource/Benchmarks/MiBench/consumer-lame/CMakeFiles/consumer-lame.dir/decode_i386.c.o -MF MultiSource/Benchmarks/MiBench/consumer-lame/CMakeFiles/consumer-lame.dir/decode_i386.c.o.d -o MultiSource/Benchmarks/MiBench/consumer-lame/CMakeFiles/consumer-lame.dir/decode_i386.c.o   -c /Users/buildslave/jenkins/workspace/test-suite-verify-machineinstrs-aarch64-O3/test-suite/MultiSource/Benchmarks/MiBench/consumer-lame/decode_i386.c
Assertion failed: (SE.DT.dominates(Ret, &*BIP)), function ReuseOrCreateCast, file /Users/buildslave/jenkins/workspace/clang-stage1-RA/llvm-project/llvm/lib/Transforms/Utils/ScalarEvolutionExpander.cpp, line 85.
assertion: SE.DT.dominates(Ret, &*BIP)
[7618/11531] /Users/buildslave/jenkins/workspace/test-suite-verify-machineinstrs-aarch64-O3/test-suite-build/tools/timeit --summary MultiSource/Benchmarks/MiBench/consumer-lame/CMakeFiles/consumer-lame.dir/id3tag.c.o.time /Users/buildslave/jenkins/workspace/test-suite-verify-machineinstrs-aarch64-O3/compiler/bin/clang -DNDEBUG  -B /Applications/Xcode.app/Contents/Developer/Toolchains/XcodeDefault.xctoolchain/usr/bin    -Wno-unused-command-line-argument -mllvm -verify-machineinstrs -O3 -arch arm64 -isysroot /Applications/Xcode.app/Contents/Developer/Platforms/iPhoneOS.platform/Developer/SDKs/iPhoneOS13.5.sdk   -w -Werror=date-time -DHAVEMPGLIB -DLAMEPARSE -DNDEBUG -D__NO_MATH_INLINES -DLAMESNDFILE -MD -MT MultiSource/Benchmarks/MiBench/consumer-lame/CMakeFiles/consumer-lame.dir/id3tag.c.o -MF MultiSource/Benchmarks/MiBench/consumer-lame/CMakeFiles/consumer-lame.dir/id3tag.c.o.d -o MultiSource/Benchmarks/MiBench/consumer-lame/CMakeFiles/consumer-lame.dir/id3tag.c.o   -c /Users/buildslave/jenkins/workspace/test-suite-verify-machineinstrs-aarch64-O3/test-suite/MultiSource/Benchmarks/MiBench/consumer-lame/id3tag.c
[7619/11531] /Users/buildslave/jenkins/workspace/test-suite-verify-machineinstrs-aarch64-O3/test-suite-build/tools/timeit --summary MultiSource/Benchmarks/MiBench/consumer-lame/CMakeFiles/consumer-lame.dir/ieeefloat.c.o.time /Users/buildslave/jenkins/workspace/test-suite-verify-machineinstrs-aarch64-O3/compiler/bin/clang -DNDEBUG  -B /Applications/Xcode.app/Contents/Developer/Toolchains/XcodeDefault.xctoolchain/usr/bin    -Wno-unused-command-line-argument -mllvm -verify-machineinstrs -O3 -arch arm64 -isysroot /Applications/Xcode.app/Contents/Developer/Platforms/iPhoneOS.platform/Developer/SDKs/iPhoneOS13.5.sdk   -w -Werror=date-time -DHAVEMPGLIB -DLAMEPARSE -DNDEBUG -D__NO_MATH_INLINES -DLAMESNDFILE -MD -MT MultiSource/Benchmarks/MiBench/consumer-lame/CMakeFiles/consumer-lame.dir/ieeefloat.c.o -MF MultiSource/Benchmarks/MiBench/consumer-lame/CMakeFiles/consumer-lame.dir/ieeefloat.c.o.d -o MultiSource/Benchmarks/MiBench/consumer-lame/CMakeFiles/consumer-lame.dir/ieeefloat.c.o   -c /Users/buildslave/jenkins/workspace/test-suite-verify-machineinstrs-aarch64-O3/test-suite/MultiSource/Benchmarks/MiBench/consumer-lame/ieeefloat.c
[7620/11531] /Users/buildslave/jenkins/workspace/test-suite-verify-machineinstrs-aarch64-O3/test-suite-build/tools/timeit --summary MultiSource/Benchmarks/MiBench/consumer-lame/CMakeFiles/consumer-lame.dir/decode_i386.c.o.time /Users/buildslave/jenkins/workspace/test-suite-verify-machineinstrs-aarch64-O3/compiler/bin/clang -DNDEBUG  -B /Applications/Xcode.app/Contents/Developer/Toolchains/XcodeDefault.xctoolchain/usr/bin    -Wno-unused-command-line-argument -mllvm -verify-machineinstrs -O3 -arch arm64 -isysroot /Applications/Xcode.app/Contents/Developer/Platforms/iPhoneOS.platform/Developer/SDKs/iPhoneOS13.5.sdk   -w -Werror=date-time -DHAVEMPGLIB -DLAMEPARSE -DNDEBUG -D__NO_MATH_INLINES -DLAMESNDFILE -MD -MT MultiSource/Benchmarks/MiBench/consumer-lame/CMakeFiles/consumer-lame.dir/decode_i386.c.o -MF MultiSource/Benchmarks/MiBench/consumer-lame/CMakeFiles/consumer-lame.dir/decode_i386.c.o.d -o MultiSource/Benchmarks/MiBench/consumer-lame/CMakeFiles/consumer-lame.dir/decode_i386.c.o   -c /Users/buildslave/jenkins/workspace/test-suite-verify-machineinstrs-aarch64-O3/test-suite/MultiSource/Benchmarks/MiBench/consumer-lame/decode_i386.c
FAILED: MultiSource/Benchmarks/MiBench/consumer-lame/CMakeFiles/consumer-lame.dir/decode_i386.c.o 
/Users/buildslave/jenkins/workspace/test-suite-verify-machineinstrs-aarch64-O3/test-suite-build/tools/timeit --summary MultiSource/Benchmarks/MiBench/consumer-lame/CMakeFiles/consumer-lame.dir/decode_i386.c.o.time /Users/buildslave/jenkins/workspace/test-suite-verify-machineinstrs-aarch64-O3/compiler/bin/clang -DNDEBUG  -B /Applications/Xcode.app/Contents/Developer/Toolchains/XcodeDefault.xctoolchain/usr/bin    -Wno-unused-command-line-argument -mllvm -verify-machineinstrs -O3 -arch arm64 -isysroot /Applications/Xcode.app/Contents/Developer/Platforms/iPhoneOS.platform/Developer/SDKs/iPhoneOS13.5.sdk   -w -Werror=date-time -DHAVEMPGLIB -DLAMEPARSE -DNDEBUG -D__NO_MATH_INLINES -DLAMESNDFILE -MD -MT MultiSource/Benchmarks/MiBench/consumer-lame/CMakeFiles/consumer-lame.dir/decode_i386.c.o -MF MultiSource/Benchmarks/MiBench/consumer-lame/CMakeFiles/consumer-lame.dir/decode_i386.c.o.d -o MultiSource/Benchmarks/MiBench/consumer-lame/CMakeFiles/consumer-lame.dir/decode_i386.c.o   -c /Users/buildslave/jenkins/workspace/test-suite-verify-machineinstrs-aarch64-O3/test-suite/MultiSource/Benchmarks/MiBench/consumer-lame/decode_i386.c
Assertion failed: (SE.DT.dominates(Ret, &*BIP)), function ReuseOrCreateCast, file /Users/buildslave/jenkins/workspace/clang-stage1-RA/llvm-project/llvm/lib/Transforms/Utils/ScalarEvolutionExpander.cpp, line 85.
PLEASE submit a bug report to https://bugs.llvm.org/ and include the crash backtrace, preprocessed source, and associated run script.
Stack dump:
Error: clang frontend command failed due to signal (use -v to see invocation)
31 clang                    0x0000000102ee700d clang::driver::Compilation::ExecuteCommand(clang::driver::Command const&, clang::driver::Command const*&) const + 221
32 clang                    0x0000000102ee742d clang::driver::Compilation::ExecuteJobs(clang::driver::JobList const&, llvm::SmallVectorImpl<std::__1::pair<int, clang::driver::Command const*> >&) const + 125
33 clang                    0x0000000102efba1c clang::driver::Driver::ExecuteCompilation(clang::driver::Compilation&, llvm::SmallVectorImpl<std::__1::pair<int, clang::driver::Command const*> >&) + 204
34 clang                    0x0000000100a40855 main + 10389
35 libdyld.dylib            0x00007fff6eb25cc9 start + 1
clang-12: error: clang frontend command failed due to signal (use -v to see invocation)
clang version 12.0.0 (https://github.com/llvm/llvm-project.git 975467e4aa7ce1b8fcf4af0e25cdf053cfa8669e)
Target: aarch64-apple-darwin19.5.0

Build Log

Changes
  1. [SCEVExpander] Avoid re-using existing casts if it means updating users. (details)
  2. [VectorCombine] try to create vector loads from scalar loads (details)
  3. [Diagnostics] Handle string concat pattern and avoid false positives (details)

Started by upstream project relay-test-suite-verify-machineinstrs build number 8595
originally caused by:

This run spent:

  • 34 min waiting;
  • 1 hr 6 min build duration;
  • 1 hr 6 min total from scheduled to completion.
Revision: 74e099cb9569f67ddb4341839eea408abc67e04e
  • refs/remotes/origin/master
Revision: 975467e4aa7ce1b8fcf4af0e25cdf053cfa8669e
  • detached
Revision: 61eaf8a9eccf4edbef18f55593d1095254ed3ff5
  • refs/remotes/origin/master
Revision: 350389291e2a1e1dec566596c97919b5569c2f33
  • refs/remotes/origin/master

Identified problems

Ninja target failed

Below is a link to the first failed ninja target.
Indication 1

Assertion failure

This build failed because of an assertion failure. Below is a list of all errors in the build log:
Indication 2

Compile Error

This build failed because of a compile error. Below is a list of all errors in the build log:
Indication 3