Started 12 days ago
Took 55 min

Failed Build clang-d354717-gd5b1643c74e-t10379-b10379.tar.gz (May 19, 2020 3:41:02 PM)

Issues

Found 3 issues:
Ninja target: AArch64_halide_runtime.bc.o
[2770/11529] /Users/buildslave/jenkins/workspace/test-suite-verify-machineinstrs-aarch64-globalisel-O0-g/test-suite-build/tools/timeit --summary Bitcode/simd_ops/CMakeFiles/simd_ops_test_op_shrn_618.dir/AArch64_halide_runtime.bc.o.time /Users/buildslave/jenkins/workspace/test-suite-verify-machineinstrs-aarch64-globalisel-O0-g/compiler/bin/clang++  -DNDEBUG  -B /Applications/Xcode.app/Contents/Developer/Toolchains/XcodeDefault.xctoolchain/usr/bin    -Wno-unused-command-line-argument -mllvm -verify-machineinstrs -O0 -g -arch arm64 -isysroot /Applications/Xcode.app/Contents/Developer/Platforms/iPhoneOS.platform/Developer/SDKs/iPhoneOS11.4.sdk   -w -Werror=date-time -MD -MT Bitcode/simd_ops/CMakeFiles/simd_ops_test_op_shrn_618.dir/AArch64_halide_runtime.bc.o -MF Bitcode/simd_ops/CMakeFiles/simd_ops_test_op_shrn_618.dir/AArch64_halide_runtime.bc.o.d -o Bitcode/simd_ops/CMakeFiles/simd_ops_test_op_shrn_618.dir/AArch64_halide_runtime.bc.o -c /Users/buildslave/jenkins/workspace/test-suite-verify-machineinstrs-aarch64-globalisel-O0-g/test-suite/Bitcode/simd_ops/AArch64_halide_runtime.bc
[2771/11529] /Users/buildslave/jenkins/workspace/test-suite-verify-machineinstrs-aarch64-globalisel-O0-g/test-suite-build/tools/timeit --summary Bitcode/simd_ops/CMakeFiles/simd_ops_test_op_sabd_1001.dir/AArch64_tests/test_op_sabd_1001.bc.o.time /Users/buildslave/jenkins/workspace/test-suite-verify-machineinstrs-aarch64-globalisel-O0-g/compiler/bin/clang++  -DNDEBUG  -B /Applications/Xcode.app/Contents/Developer/Toolchains/XcodeDefault.xctoolchain/usr/bin    -Wno-unused-command-line-argument -mllvm -verify-machineinstrs -O0 -g -arch arm64 -isysroot /Applications/Xcode.app/Contents/Developer/Platforms/iPhoneOS.platform/Developer/SDKs/iPhoneOS11.4.sdk   -w -Werror=date-time -MD -MT Bitcode/simd_ops/CMakeFiles/simd_ops_test_op_sabd_1001.dir/AArch64_tests/test_op_sabd_1001.bc.o -MF Bitcode/simd_ops/CMakeFiles/simd_ops_test_op_sabd_1001.dir/AArch64_tests/test_op_sabd_1001.bc.o.d -o Bitcode/simd_ops/CMakeFiles/simd_ops_test_op_sabd_1001.dir/AArch64_tests/test_op_sabd_1001.bc.o -c /Users/buildslave/jenkins/workspace/test-suite-verify-machineinstrs-aarch64-globalisel-O0-g/test-suite/Bitcode/simd_ops/AArch64_tests/test_op_sabd_1001.bc
[2772/11529] /Users/buildslave/jenkins/workspace/test-suite-verify-machineinstrs-aarch64-globalisel-O0-g/test-suite-build/tools/timeit --summary Bitcode/simd_ops/CMakeFiles/simd_ops_test_op_sabd_1001.dir/AArch64_scalar_tests/scalar_test_op_sabd_1001.bc.o.time /Users/buildslave/jenkins/workspace/test-suite-verify-machineinstrs-aarch64-globalisel-O0-g/compiler/bin/clang++  -DNDEBUG  -B /Applications/Xcode.app/Contents/Developer/Toolchains/XcodeDefault.xctoolchain/usr/bin    -Wno-unused-command-line-argument -mllvm -verify-machineinstrs -O0 -g -arch arm64 -isysroot /Applications/Xcode.app/Contents/Developer/Platforms/iPhoneOS.platform/Developer/SDKs/iPhoneOS11.4.sdk   -w -Werror=date-time -MD -MT Bitcode/simd_ops/CMakeFiles/simd_ops_test_op_sabd_1001.dir/AArch64_scalar_tests/scalar_test_op_sabd_1001.bc.o -MF Bitcode/simd_ops/CMakeFiles/simd_ops_test_op_sabd_1001.dir/AArch64_scalar_tests/scalar_test_op_sabd_1001.bc.o.d -o Bitcode/simd_ops/CMakeFiles/simd_ops_test_op_sabd_1001.dir/AArch64_scalar_tests/scalar_test_op_sabd_1001.bc.o -c /Users/buildslave/jenkins/workspace/test-suite-verify-machineinstrs-aarch64-globalisel-O0-g/test-suite/Bitcode/simd_ops/AArch64_scalar_tests/scalar_test_op_sabd_1001.bc
[2773/11529] /Users/buildslave/jenkins/workspace/test-suite-verify-machineinstrs-aarch64-globalisel-O0-g/test-suite-build/tools/timeit --summary Bitcode/simd_ops/CMakeFiles/simd_ops_test_op_ushll_512.dir/AArch64_halide_runtime.bc.o.time /Users/buildslave/jenkins/workspace/test-suite-verify-machineinstrs-aarch64-globalisel-O0-g/compiler/bin/clang++  -DNDEBUG  -B /Applications/Xcode.app/Contents/Developer/Toolchains/XcodeDefault.xctoolchain/usr/bin    -Wno-unused-command-line-argument -mllvm -verify-machineinstrs -O0 -g -arch arm64 -isysroot /Applications/Xcode.app/Contents/Developer/Platforms/iPhoneOS.platform/Developer/SDKs/iPhoneOS11.4.sdk   -w -Werror=date-time -MD -MT Bitcode/simd_ops/CMakeFiles/simd_ops_test_op_ushll_512.dir/AArch64_halide_runtime.bc.o -MF Bitcode/simd_ops/CMakeFiles/simd_ops_test_op_ushll_512.dir/AArch64_halide_runtime.bc.o.d -o Bitcode/simd_ops/CMakeFiles/simd_ops_test_op_ushll_512.dir/AArch64_halide_runtime.bc.o -c /Users/buildslave/jenkins/workspace/test-suite-verify-machineinstrs-aarch64-globalisel-O0-g/test-suite/Bitcode/simd_ops/AArch64_halide_runtime.bc
[2774/11529] /Users/buildslave/jenkins/workspace/test-suite-verify-machineinstrs-aarch64-globalisel-O0-g/test-suite-build/tools/timeit --summary Bitcode/simd_ops/CMakeFiles/simd_ops_test_op_shrn_620.dir/AArch64_halide_runtime.bc.o.time /Users/buildslave/jenkins/workspace/test-suite-verify-machineinstrs-aarch64-globalisel-O0-g/compiler/bin/clang++  -DNDEBUG  -B /Applications/Xcode.app/Contents/Developer/Toolchains/XcodeDefault.xctoolchain/usr/bin    -Wno-unused-command-line-argument -mllvm -verify-machineinstrs -O0 -g -arch arm64 -isysroot /Applications/Xcode.app/Contents/Developer/Platforms/iPhoneOS.platform/Developer/SDKs/iPhoneOS11.4.sdk   -w -Werror=date-time -MD -MT Bitcode/simd_ops/CMakeFiles/simd_ops_test_op_shrn_620.dir/AArch64_halide_runtime.bc.o -MF Bitcode/simd_ops/CMakeFiles/simd_ops_test_op_shrn_620.dir/AArch64_halide_runtime.bc.o.d -o Bitcode/simd_ops/CMakeFiles/simd_ops_test_op_shrn_620.dir/AArch64_halide_runtime.bc.o -c /Users/buildslave/jenkins/workspace/test-suite-verify-machineinstrs-aarch64-globalisel-O0-g/test-suite/Bitcode/simd_ops/AArch64_halide_runtime.bc
FAILED: Bitcode/simd_ops/CMakeFiles/simd_ops_test_op_shrn_620.dir/AArch64_halide_runtime.bc.o 
/Users/buildslave/jenkins/workspace/test-suite-verify-machineinstrs-aarch64-globalisel-O0-g/test-suite-build/tools/timeit --summary Bitcode/simd_ops/CMakeFiles/simd_ops_test_op_shrn_620.dir/AArch64_halide_runtime.bc.o.time /Users/buildslave/jenkins/workspace/test-suite-verify-machineinstrs-aarch64-globalisel-O0-g/compiler/bin/clang++  -DNDEBUG  -B /Applications/Xcode.app/Contents/Developer/Toolchains/XcodeDefault.xctoolchain/usr/bin    -Wno-unused-command-line-argument -mllvm -verify-machineinstrs -O0 -g -arch arm64 -isysroot /Applications/Xcode.app/Contents/Developer/Platforms/iPhoneOS.platform/Developer/SDKs/iPhoneOS11.4.sdk   -w -Werror=date-time -MD -MT Bitcode/simd_ops/CMakeFiles/simd_ops_test_op_shrn_620.dir/AArch64_halide_runtime.bc.o -MF Bitcode/simd_ops/CMakeFiles/simd_ops_test_op_shrn_620.dir/AArch64_halide_runtime.bc.o.d -o Bitcode/simd_ops/CMakeFiles/simd_ops_test_op_shrn_620.dir/AArch64_halide_runtime.bc.o -c /Users/buildslave/jenkins/workspace/test-suite-verify-machineinstrs-aarch64-globalisel-O0-g/test-suite/Bitcode/simd_ops/AArch64_halide_runtime.bc
Assertion failed: (getOperandMapping(Idx).isValid() && "We must have a mapping for reg operands"), function verify, file /Users/buildslave/jenkins/workspace/clang-stage1-RA/llvm-project/llvm/lib/CodeGen/GlobalISel/RegisterBankInfo.cpp, line 620.
assertion: getOperandMapping(Idx).isValid() && "We must have a mapping for reg operands"
[2772/11529] /Users/buildslave/jenkins/workspace/test-suite-verify-machineinstrs-aarch64-globalisel-O0-g/test-suite-build/tools/timeit --summary Bitcode/simd_ops/CMakeFiles/simd_ops_test_op_sabd_1001.dir/AArch64_scalar_tests/scalar_test_op_sabd_1001.bc.o.time /Users/buildslave/jenkins/workspace/test-suite-verify-machineinstrs-aarch64-globalisel-O0-g/compiler/bin/clang++  -DNDEBUG  -B /Applications/Xcode.app/Contents/Developer/Toolchains/XcodeDefault.xctoolchain/usr/bin    -Wno-unused-command-line-argument -mllvm -verify-machineinstrs -O0 -g -arch arm64 -isysroot /Applications/Xcode.app/Contents/Developer/Platforms/iPhoneOS.platform/Developer/SDKs/iPhoneOS11.4.sdk   -w -Werror=date-time -MD -MT Bitcode/simd_ops/CMakeFiles/simd_ops_test_op_sabd_1001.dir/AArch64_scalar_tests/scalar_test_op_sabd_1001.bc.o -MF Bitcode/simd_ops/CMakeFiles/simd_ops_test_op_sabd_1001.dir/AArch64_scalar_tests/scalar_test_op_sabd_1001.bc.o.d -o Bitcode/simd_ops/CMakeFiles/simd_ops_test_op_sabd_1001.dir/AArch64_scalar_tests/scalar_test_op_sabd_1001.bc.o -c /Users/buildslave/jenkins/workspace/test-suite-verify-machineinstrs-aarch64-globalisel-O0-g/test-suite/Bitcode/simd_ops/AArch64_scalar_tests/scalar_test_op_sabd_1001.bc
[2773/11529] /Users/buildslave/jenkins/workspace/test-suite-verify-machineinstrs-aarch64-globalisel-O0-g/test-suite-build/tools/timeit --summary Bitcode/simd_ops/CMakeFiles/simd_ops_test_op_ushll_512.dir/AArch64_halide_runtime.bc.o.time /Users/buildslave/jenkins/workspace/test-suite-verify-machineinstrs-aarch64-globalisel-O0-g/compiler/bin/clang++  -DNDEBUG  -B /Applications/Xcode.app/Contents/Developer/Toolchains/XcodeDefault.xctoolchain/usr/bin    -Wno-unused-command-line-argument -mllvm -verify-machineinstrs -O0 -g -arch arm64 -isysroot /Applications/Xcode.app/Contents/Developer/Platforms/iPhoneOS.platform/Developer/SDKs/iPhoneOS11.4.sdk   -w -Werror=date-time -MD -MT Bitcode/simd_ops/CMakeFiles/simd_ops_test_op_ushll_512.dir/AArch64_halide_runtime.bc.o -MF Bitcode/simd_ops/CMakeFiles/simd_ops_test_op_ushll_512.dir/AArch64_halide_runtime.bc.o.d -o Bitcode/simd_ops/CMakeFiles/simd_ops_test_op_ushll_512.dir/AArch64_halide_runtime.bc.o -c /Users/buildslave/jenkins/workspace/test-suite-verify-machineinstrs-aarch64-globalisel-O0-g/test-suite/Bitcode/simd_ops/AArch64_halide_runtime.bc
[2774/11529] /Users/buildslave/jenkins/workspace/test-suite-verify-machineinstrs-aarch64-globalisel-O0-g/test-suite-build/tools/timeit --summary Bitcode/simd_ops/CMakeFiles/simd_ops_test_op_shrn_620.dir/AArch64_halide_runtime.bc.o.time /Users/buildslave/jenkins/workspace/test-suite-verify-machineinstrs-aarch64-globalisel-O0-g/compiler/bin/clang++  -DNDEBUG  -B /Applications/Xcode.app/Contents/Developer/Toolchains/XcodeDefault.xctoolchain/usr/bin    -Wno-unused-command-line-argument -mllvm -verify-machineinstrs -O0 -g -arch arm64 -isysroot /Applications/Xcode.app/Contents/Developer/Platforms/iPhoneOS.platform/Developer/SDKs/iPhoneOS11.4.sdk   -w -Werror=date-time -MD -MT Bitcode/simd_ops/CMakeFiles/simd_ops_test_op_shrn_620.dir/AArch64_halide_runtime.bc.o -MF Bitcode/simd_ops/CMakeFiles/simd_ops_test_op_shrn_620.dir/AArch64_halide_runtime.bc.o.d -o Bitcode/simd_ops/CMakeFiles/simd_ops_test_op_shrn_620.dir/AArch64_halide_runtime.bc.o -c /Users/buildslave/jenkins/workspace/test-suite-verify-machineinstrs-aarch64-globalisel-O0-g/test-suite/Bitcode/simd_ops/AArch64_halide_runtime.bc
FAILED: Bitcode/simd_ops/CMakeFiles/simd_ops_test_op_shrn_620.dir/AArch64_halide_runtime.bc.o 
/Users/buildslave/jenkins/workspace/test-suite-verify-machineinstrs-aarch64-globalisel-O0-g/test-suite-build/tools/timeit --summary Bitcode/simd_ops/CMakeFiles/simd_ops_test_op_shrn_620.dir/AArch64_halide_runtime.bc.o.time /Users/buildslave/jenkins/workspace/test-suite-verify-machineinstrs-aarch64-globalisel-O0-g/compiler/bin/clang++  -DNDEBUG  -B /Applications/Xcode.app/Contents/Developer/Toolchains/XcodeDefault.xctoolchain/usr/bin    -Wno-unused-command-line-argument -mllvm -verify-machineinstrs -O0 -g -arch arm64 -isysroot /Applications/Xcode.app/Contents/Developer/Platforms/iPhoneOS.platform/Developer/SDKs/iPhoneOS11.4.sdk   -w -Werror=date-time -MD -MT Bitcode/simd_ops/CMakeFiles/simd_ops_test_op_shrn_620.dir/AArch64_halide_runtime.bc.o -MF Bitcode/simd_ops/CMakeFiles/simd_ops_test_op_shrn_620.dir/AArch64_halide_runtime.bc.o.d -o Bitcode/simd_ops/CMakeFiles/simd_ops_test_op_shrn_620.dir/AArch64_halide_runtime.bc.o -c /Users/buildslave/jenkins/workspace/test-suite-verify-machineinstrs-aarch64-globalisel-O0-g/test-suite/Bitcode/simd_ops/AArch64_halide_runtime.bc
Assertion failed: (getOperandMapping(Idx).isValid() && "We must have a mapping for reg operands"), function verify, file /Users/buildslave/jenkins/workspace/clang-stage1-RA/llvm-project/llvm/lib/CodeGen/GlobalISel/RegisterBankInfo.cpp, line 620.
PLEASE submit a bug report to https://bugs.llvm.org/ and include the crash backtrace, preprocessed source, and associated run script.
Stack dump:
Error: clang frontend command failed due to signal (use -v to see invocation)
26 clang++                  0x000000010c6f392d clang::driver::Compilation::ExecuteCommand(clang::driver::Command const&, clang::driver::Command const*&) const + 221
27 clang++                  0x000000010c6f3d6b clang::driver::Compilation::ExecuteJobs(clang::driver::JobList const&, llvm::SmallVectorImpl<std::__1::pair<int, clang::driver::Command const*> >&) const + 123
28 clang++                  0x000000010c7081ab clang::driver::Driver::ExecuteCompilation(clang::driver::Compilation&, llvm::SmallVectorImpl<std::__1::pair<int, clang::driver::Command const*> >&) + 203
29 clang++                  0x000000010a1ae479 main + 10777
30 libdyld.dylib            0x00007fff4ffd9015 start + 1
clang-11: error: clang frontend command failed due to signal (use -v to see invocation)
clang version 11.0.0 (https://github.com/llvm/llvm-project.git d5b1643c74eeae327d85c75fe79fd98edb1014f9)
Target: aarch64-apple-darwin17.6.0

Build Log

Changes
  1. [analyzer] Move apiModeling.StdCLibraryFunctionArgs to alpha. (details)
  2. [lldb/Reproducers] Update GDB remote client tests for passive replay (details)
  3. [gn build] Try to unbreak Windows build after f8e833a501. (details)
  4. Give helpers internal linkage. NFC. (details)
  5. Fix X86_64 complex-returns for regcall. (details)
  6. [AArch64] Disable MachineOutliner on Windows. (details)
  7. [clang-misexpect] Fixed typo which causes that --pgo-warn-misexpect option is not passed in the compiler invocation (details)
  8. [gn build] Try harder to unbreak Windows build after f8e833a501. (details)
  9. Revert "[clang-misexpect] Fixed typo which causes that --pgo-warn-misexpect option is not passed in the compiler invocation" (details)
  10. [mlir][shape] Add `shape.from_extents`. (details)
  11. [mlir][SPIRV] Fix blocks nested too deeply error. (details)

Started by upstream project relay-test-suite-verify-machineinstrs build number 7832
originally caused by:

This run spent:

  • 36 min waiting;
  • 55 min build duration;
  • 55 min total from scheduled to completion.
Revision: ea71685b0b17bb9197c5fe6cac5cb8fff2543847
  • refs/remotes/origin/master
Revision: d5b1643c74eeae327d85c75fe79fd98edb1014f9
  • detached
Revision: f34ad041dce4f3b55a013ab6e7d712349a2844a0
  • refs/remotes/origin/master
Revision: 2c3c4a6286d453f763c0245c6536ddd368f0db99
  • refs/remotes/origin/master

Identified problems

Ninja target failed

Below is a link to the first failed ninja target.
Indication 1

Assertion failure

This build failed because of an assertion failure. Below is a list of all errors in the build log:
Indication 2

Compile Error

This build failed because of a compile error. Below is a list of all errors in the build log:
Indication 3