Started 14 days ago
Took 2 hr 0 min

Failed Build clang-d358856-g05c479491c1-t12019-b12019.tar.gz (Jun 30, 2020 7:04:17 AM)

Issues

Found 5 issues:
Ninja target: mytimer.cpp.o [7610/11527] /Users/buildslave/jenkins/workspace/test-suite-verify-machineinstrs-aarch64-globalisel-O0-g/test-suite-build/tools/timeit --summary MultiSource/Benchmarks/DOE-ProxyApps-C++/PENNANT/CMakeFiles/PENNANT.dir/InputFile.cc.o.time /Users/buildslave/jenkins/workspace/test-suite-verify-machineinstrs-aarch64-globalisel-O0-g/compiler/bin/clang++ -DNDEBUG -B /Applications/Xcode.app/Contents/Developer/Toolchains/XcodeDefault.xctoolchain/usr/bin -Wno-unused-command-line-argument -mllvm -verify-machineinstrs -O0 -g -arch arm64 -isysroot /Applications/Xcode.app/Contents/Developer/Platforms/iPhoneOS.platform/Developer/SDKs/iPhoneOS13.5.sdk -w -Werror=date-time -MD -MT MultiSource/Benchmarks/DOE-ProxyApps-C++/PENNANT/CMakeFiles/PENNANT.dir/InputFile.cc.o -MF MultiSource/Benchmarks/DOE-ProxyApps-C++/PENNANT/CMakeFiles/PENNANT.dir/InputFile.cc.o.d -o MultiSource/Benchmarks/DOE-ProxyApps-C++/PENNANT/CMakeFiles/PENNANT.dir/InputFile.cc.o -c /Users/buildslave/jenkins/workspace/test-suite-verify-machineinstrs-aarch64-globalisel-O0-g/test-suite/MultiSource/Benchmarks/DOE-ProxyApps-C++/PENNANT/InputFile.cc [7611/11527] /Users/buildslave/jenkins/workspace/test-suite-verify-machineinstrs-aarch64-globalisel-O0-g/test-suite-build/tools/timeit --summary MultiSource/Benchmarks/DOE-ProxyApps-C++/PENNANT/CMakeFiles/PENNANT.dir/QCS.cc.o.time /Users/buildslave/jenkins/workspace/test-suite-verify-machineinstrs-aarch64-globalisel-O0-g/compiler/bin/clang++ -DNDEBUG -B /Applications/Xcode.app/Contents/Developer/Toolchains/XcodeDefault.xctoolchain/usr/bin -Wno-unused-command-line-argument -mllvm -verify-machineinstrs -O0 -g -arch arm64 -isysroot /Applications/Xcode.app/Contents/Developer/Platforms/iPhoneOS.platform/Developer/SDKs/iPhoneOS13.5.sdk -w -Werror=date-time -MD -MT MultiSource/Benchmarks/DOE-ProxyApps-C++/PENNANT/CMakeFiles/PENNANT.dir/QCS.cc.o -MF MultiSource/Benchmarks/DOE-ProxyApps-C++/PENNANT/CMakeFiles/PENNANT.dir/QCS.cc.o.d -o MultiSource/Benchmarks/DOE-ProxyApps-C++/PENNANT/CMakeFiles/PENNANT.dir/QCS.cc.o -c /Users/buildslave/jenkins/workspace/test-suite-verify-machineinstrs-aarch64-globalisel-O0-g/test-suite/MultiSource/Benchmarks/DOE-ProxyApps-C++/PENNANT/QCS.cc [7612/11527] /Users/buildslave/jenkins/workspace/test-suite-verify-machineinstrs-aarch64-globalisel-O0-g/test-suite-build/tools/timeit --summary MultiSource/Benchmarks/DOE-ProxyApps-C++/miniFE/CMakeFiles/miniFE.dir/BoxPartition.cpp.o.time /Users/buildslave/jenkins/workspace/test-suite-verify-machineinstrs-aarch64-globalisel-O0-g/compiler/bin/clang++ -DNDEBUG -I/Users/buildslave/jenkins/workspace/test-suite-verify-machineinstrs-aarch64-globalisel-O0-g/test-suite/MultiSource/Benchmarks/DOE-ProxyApps-C++/miniFE -B /Applications/Xcode.app/Contents/Developer/Toolchains/XcodeDefault.xctoolchain/usr/bin -Wno-unused-command-line-argument -mllvm -verify-machineinstrs -O0 -g -arch arm64 -isysroot /Applications/Xcode.app/Contents/Developer/Platforms/iPhoneOS.platform/Developer/SDKs/iPhoneOS13.5.sdk -w -Werror=date-time -I. -DMINIFE_SCALAR=double -DMINIFE_LOCAL_ORDINAL=int -DMINIFE_GLOBAL_ORDINAL=int -DMINIFE_CSR_MATRIX -DREDSTORM -D_XOPEN_SOURCE=700 -MD -MT MultiSource/Benchmarks/DOE-ProxyApps-C++/miniFE/CMakeFiles/miniFE.dir/BoxPartition.cpp.o -MF MultiSource/Benchmarks/DOE-ProxyApps-C++/miniFE/CMakeFiles/miniFE.dir/BoxPartition.cpp.o.d -o MultiSource/Benchmarks/DOE-ProxyApps-C++/miniFE/CMakeFiles/miniFE.dir/BoxPartition.cpp.o -c /Users/buildslave/jenkins/workspace/test-suite-verify-machineinstrs-aarch64-globalisel-O0-g/test-suite/MultiSource/Benchmarks/DOE-ProxyApps-C++/miniFE/BoxPartition.cpp [7613/11527] /Users/buildslave/jenkins/workspace/test-suite-verify-machineinstrs-aarch64-globalisel-O0-g/test-suite-build/tools/timeit --summary MultiSource/Benchmarks/DOE-ProxyApps-C++/PENNANT/CMakeFiles/PENNANT.dir/main.cc.o.time /Users/buildslave/jenkins/workspace/test-suite-verify-machineinstrs-aarch64-globalisel-O0-g/compiler/bin/clang++ -DNDEBUG -B /Applications/Xcode.app/Contents/Developer/Toolchains/XcodeDefault.xctoolchain/usr/bin -Wno-unused-command-line-argument -mllvm -verify-machineinstrs -O0 -g -arch arm64 -isysroot /Applications/Xcode.app/Contents/Developer/Platforms/iPhoneOS.platform/Developer/SDKs/iPhoneOS13.5.sdk -w -Werror=date-time -MD -MT MultiSource/Benchmarks/DOE-ProxyApps-C++/PENNANT/CMakeFiles/PENNANT.dir/main.cc.o -MF MultiSource/Benchmarks/DOE-ProxyApps-C++/PENNANT/CMakeFiles/PENNANT.dir/main.cc.o.d -o MultiSource/Benchmarks/DOE-ProxyApps-C++/PENNANT/CMakeFiles/PENNANT.dir/main.cc.o -c /Users/buildslave/jenkins/workspace/test-suite-verify-machineinstrs-aarch64-globalisel-O0-g/test-suite/MultiSource/Benchmarks/DOE-ProxyApps-C++/PENNANT/main.cc [7614/11527] /Users/buildslave/jenkins/workspace/test-suite-verify-machineinstrs-aarch64-globalisel-O0-g/test-suite-build/tools/timeit --summary MultiSource/Benchmarks/DOE-ProxyApps-C++/miniFE/CMakeFiles/miniFE.dir/mytimer.cpp.o.time /Users/buildslave/jenkins/workspace/test-suite-verify-machineinstrs-aarch64-globalisel-O0-g/compiler/bin/clang++ -DNDEBUG -I/Users/buildslave/jenkins/workspace/test-suite-verify-machineinstrs-aarch64-globalisel-O0-g/test-suite/MultiSource/Benchmarks/DOE-ProxyApps-C++/miniFE -B /Applications/Xcode.app/Contents/Developer/Toolchains/XcodeDefault.xctoolchain/usr/bin -Wno-unused-command-line-argument -mllvm -verify-machineinstrs -O0 -g -arch arm64 -isysroot /Applications/Xcode.app/Contents/Developer/Platforms/iPhoneOS.platform/Developer/SDKs/iPhoneOS13.5.sdk -w -Werror=date-time -I. -DMINIFE_SCALAR=double -DMINIFE_LOCAL_ORDINAL=int -DMINIFE_GLOBAL_ORDINAL=int -DMINIFE_CSR_MATRIX -DREDSTORM -D_XOPEN_SOURCE=700 -MD -MT MultiSource/Benchmarks/DOE-ProxyApps-C++/miniFE/CMakeFiles/miniFE.dir/mytimer.cpp.o -MF MultiSource/Benchmarks/DOE-ProxyApps-C++/miniFE/CMakeFiles/miniFE.dir/mytimer.cpp.o.d -o MultiSource/Benchmarks/DOE-ProxyApps-C++/miniFE/CMakeFiles/miniFE.dir/mytimer.cpp.o -c /Users/buildslave/jenkins/workspace/test-suite-verify-machineinstrs-aarch64-globalisel-O0-g/test-suite/MultiSource/Benchmarks/DOE-ProxyApps-C++/miniFE/mytimer.cpp FAILED: MultiSource/Benchmarks/DOE-ProxyApps-C++/miniFE/CMakeFiles/miniFE.dir/mytimer.cpp.o /Users/buildslave/jenkins/workspace/test-suite-verify-machineinstrs-aarch64-globalisel-O0-g/test-suite-build/tools/timeit --summary MultiSource/Benchmarks/DOE-ProxyApps-C++/miniFE/CMakeFiles/miniFE.dir/mytimer.cpp.o.time /Users/buildslave/jenkins/workspace/test-suite-verify-machineinstrs-aarch64-globalisel-O0-g/compiler/bin/clang++ -DNDEBUG -I/Users/buildslave/jenkins/workspace/test-suite-verify-machineinstrs-aarch64-globalisel-O0-g/test-suite/MultiSource/Benchmarks/DOE-ProxyApps-C++/miniFE -B /Applications/Xcode.app/Contents/Developer/Toolchains/XcodeDefault.xctoolchain/usr/bin -Wno-unused-command-line-argument -mllvm -verify-machineinstrs -O0 -g -arch arm64 -isysroot /Applications/Xcode.app/Contents/Developer/Platforms/iPhoneOS.platform/Developer/SDKs/iPhoneOS13.5.sdk -w -Werror=date-time -I. -DMINIFE_SCALAR=double -DMINIFE_LOCAL_ORDINAL=int -DMINIFE_GLOBAL_ORDINAL=int -DMINIFE_CSR_MATRIX -DREDSTORM -D_XOPEN_SOURCE=700 -MD -MT MultiSource/Benchmarks/DOE-ProxyApps-C++/miniFE/CMakeFiles/miniFE.dir/mytimer.cpp.o -MF MultiSource/Benchmarks/DOE-ProxyApps-C++/miniFE/CMakeFiles/miniFE.dir/mytimer.cpp.o.d -o MultiSource/Benchmarks/DOE-ProxyApps-C++/miniFE/CMakeFiles/miniFE.dir/mytimer.cpp.o -c /Users/buildslave/jenkins/workspace/test-suite-verify-machineinstrs-aarch64-globalisel-O0-g/test-suite/MultiSource/Benchmarks/DOE-ProxyApps-C++/miniFE/mytimer.cpp /Users/buildslave/jenkins/workspace/test-suite-verify-machineinstrs-aarch64-globalisel-O0-g/test-suite/MultiSource/Benchmarks/DOE-ProxyApps-C++/miniFE/mytimer.cpp:116:19: error: variable has incomplete type 'struct timezone' mytimer.cpp error: variable has incomplete type 'struct timezone' [7612/11527] /Users/buildslave/jenkins/workspace/test-suite-verify-machineinstrs-aarch64-globalisel-O0-g/test-suite-build/tools/timeit --summary MultiSource/Benchmarks/DOE-ProxyApps-C++/miniFE/CMakeFiles/miniFE.dir/BoxPartition.cpp.o.time /Users/buildslave/jenkins/workspace/test-suite-verify-machineinstrs-aarch64-globalisel-O0-g/compiler/bin/clang++ -DNDEBUG -I/Users/buildslave/jenkins/workspace/test-suite-verify-machineinstrs-aarch64-globalisel-O0-g/test-suite/MultiSource/Benchmarks/DOE-ProxyApps-C++/miniFE -B /Applications/Xcode.app/Contents/Developer/Toolchains/XcodeDefault.xctoolchain/usr/bin -Wno-unused-command-line-argument -mllvm -verify-machineinstrs -O0 -g -arch arm64 -isysroot /Applications/Xcode.app/Contents/Developer/Platforms/iPhoneOS.platform/Developer/SDKs/iPhoneOS13.5.sdk -w -Werror=date-time -I. -DMINIFE_SCALAR=double -DMINIFE_LOCAL_ORDINAL=int -DMINIFE_GLOBAL_ORDINAL=int -DMINIFE_CSR_MATRIX -DREDSTORM -D_XOPEN_SOURCE=700 -MD -MT MultiSource/Benchmarks/DOE-ProxyApps-C++/miniFE/CMakeFiles/miniFE.dir/BoxPartition.cpp.o -MF MultiSource/Benchmarks/DOE-ProxyApps-C++/miniFE/CMakeFiles/miniFE.dir/BoxPartition.cpp.o.d -o MultiSource/Benchmarks/DOE-ProxyApps-C++/miniFE/CMakeFiles/miniFE.dir/BoxPartition.cpp.o -c /Users/buildslave/jenkins/workspace/test-suite-verify-machineinstrs-aarch64-globalisel-O0-g/test-suite/MultiSource/Benchmarks/DOE-ProxyApps-C++/miniFE/BoxPartition.cpp [7613/11527] /Users/buildslave/jenkins/workspace/test-suite-verify-machineinstrs-aarch64-globalisel-O0-g/test-suite-build/tools/timeit --summary MultiSource/Benchmarks/DOE-ProxyApps-C++/PENNANT/CMakeFiles/PENNANT.dir/main.cc.o.time /Users/buildslave/jenkins/workspace/test-suite-verify-machineinstrs-aarch64-globalisel-O0-g/compiler/bin/clang++ -DNDEBUG -B /Applications/Xcode.app/Contents/Developer/Toolchains/XcodeDefault.xctoolchain/usr/bin -Wno-unused-command-line-argument -mllvm -verify-machineinstrs -O0 -g -arch arm64 -isysroot /Applications/Xcode.app/Contents/Developer/Platforms/iPhoneOS.platform/Developer/SDKs/iPhoneOS13.5.sdk -w -Werror=date-time -MD -MT MultiSource/Benchmarks/DOE-ProxyApps-C++/PENNANT/CMakeFiles/PENNANT.dir/main.cc.o -MF MultiSource/Benchmarks/DOE-ProxyApps-C++/PENNANT/CMakeFiles/PENNANT.dir/main.cc.o.d -o MultiSource/Benchmarks/DOE-ProxyApps-C++/PENNANT/CMakeFiles/PENNANT.dir/main.cc.o -c /Users/buildslave/jenkins/workspace/test-suite-verify-machineinstrs-aarch64-globalisel-O0-g/test-suite/MultiSource/Benchmarks/DOE-ProxyApps-C++/PENNANT/main.cc [7614/11527] /Users/buildslave/jenkins/workspace/test-suite-verify-machineinstrs-aarch64-globalisel-O0-g/test-suite-build/tools/timeit --summary MultiSource/Benchmarks/DOE-ProxyApps-C++/miniFE/CMakeFiles/miniFE.dir/mytimer.cpp.o.time /Users/buildslave/jenkins/workspace/test-suite-verify-machineinstrs-aarch64-globalisel-O0-g/compiler/bin/clang++ -DNDEBUG -I/Users/buildslave/jenkins/workspace/test-suite-verify-machineinstrs-aarch64-globalisel-O0-g/test-suite/MultiSource/Benchmarks/DOE-ProxyApps-C++/miniFE -B /Applications/Xcode.app/Contents/Developer/Toolchains/XcodeDefault.xctoolchain/usr/bin -Wno-unused-command-line-argument -mllvm -verify-machineinstrs -O0 -g -arch arm64 -isysroot /Applications/Xcode.app/Contents/Developer/Platforms/iPhoneOS.platform/Developer/SDKs/iPhoneOS13.5.sdk -w -Werror=date-time -I. -DMINIFE_SCALAR=double -DMINIFE_LOCAL_ORDINAL=int -DMINIFE_GLOBAL_ORDINAL=int -DMINIFE_CSR_MATRIX -DREDSTORM -D_XOPEN_SOURCE=700 -MD -MT MultiSource/Benchmarks/DOE-ProxyApps-C++/miniFE/CMakeFiles/miniFE.dir/mytimer.cpp.o -MF MultiSource/Benchmarks/DOE-ProxyApps-C++/miniFE/CMakeFiles/miniFE.dir/mytimer.cpp.o.d -o MultiSource/Benchmarks/DOE-ProxyApps-C++/miniFE/CMakeFiles/miniFE.dir/mytimer.cpp.o -c /Users/buildslave/jenkins/workspace/test-suite-verify-machineinstrs-aarch64-globalisel-O0-g/test-suite/MultiSource/Benchmarks/DOE-ProxyApps-C++/miniFE/mytimer.cpp FAILED: MultiSource/Benchmarks/DOE-ProxyApps-C++/miniFE/CMakeFiles/miniFE.dir/mytimer.cpp.o /Users/buildslave/jenkins/workspace/test-suite-verify-machineinstrs-aarch64-globalisel-O0-g/test-suite-build/tools/timeit --summary MultiSource/Benchmarks/DOE-ProxyApps-C++/miniFE/CMakeFiles/miniFE.dir/mytimer.cpp.o.time /Users/buildslave/jenkins/workspace/test-suite-verify-machineinstrs-aarch64-globalisel-O0-g/compiler/bin/clang++ -DNDEBUG -I/Users/buildslave/jenkins/workspace/test-suite-verify-machineinstrs-aarch64-globalisel-O0-g/test-suite/MultiSource/Benchmarks/DOE-ProxyApps-C++/miniFE -B /Applications/Xcode.app/Contents/Developer/Toolchains/XcodeDefault.xctoolchain/usr/bin -Wno-unused-command-line-argument -mllvm -verify-machineinstrs -O0 -g -arch arm64 -isysroot /Applications/Xcode.app/Contents/Developer/Platforms/iPhoneOS.platform/Developer/SDKs/iPhoneOS13.5.sdk -w -Werror=date-time -I. -DMINIFE_SCALAR=double -DMINIFE_LOCAL_ORDINAL=int -DMINIFE_GLOBAL_ORDINAL=int -DMINIFE_CSR_MATRIX -DREDSTORM -D_XOPEN_SOURCE=700 -MD -MT MultiSource/Benchmarks/DOE-ProxyApps-C++/miniFE/CMakeFiles/miniFE.dir/mytimer.cpp.o -MF MultiSource/Benchmarks/DOE-ProxyApps-C++/miniFE/CMakeFiles/miniFE.dir/mytimer.cpp.o.d -o MultiSource/Benchmarks/DOE-ProxyApps-C++/miniFE/CMakeFiles/miniFE.dir/mytimer.cpp.o -c /Users/buildslave/jenkins/workspace/test-suite-verify-machineinstrs-aarch64-globalisel-O0-g/test-suite/MultiSource/Benchmarks/DOE-ProxyApps-C++/miniFE/mytimer.cpp /Users/buildslave/jenkins/workspace/test-suite-verify-machineinstrs-aarch64-globalisel-O0-g/test-suite/MultiSource/Benchmarks/DOE-ProxyApps-C++/miniFE/mytimer.cpp:116:19: error: variable has incomplete type 'struct timezone' struct timezone tz; ^ Ninja target: pr84524.c.o [8308/11527] /Users/buildslave/jenkins/workspace/test-suite-verify-machineinstrs-aarch64-globalisel-O0-g/test-suite-build/tools/timeit --summary SingleSource/Regression/C/gcc-c-torture/execute/CMakeFiles/GCC-C-execute-pr68381.dir/pr68381.c.o.time /Users/buildslave/jenkins/workspace/test-suite-verify-machineinstrs-aarch64-globalisel-O0-g/compiler/bin/clang -DNDEBUG -B /Applications/Xcode.app/Contents/Developer/Toolchains/XcodeDefault.xctoolchain/usr/bin -Wno-unused-command-line-argument -mllvm -verify-machineinstrs -O0 -g -arch arm64 -isysroot /Applications/Xcode.app/Contents/Developer/Platforms/iPhoneOS.platform/Developer/SDKs/iPhoneOS13.5.sdk -w -Werror=date-time -w -O -fexpensive-optimizations -MD -MT SingleSource/Regression/C/gcc-c-torture/execute/CMakeFiles/GCC-C-execute-pr68381.dir/pr68381.c.o -MF SingleSource/Regression/C/gcc-c-torture/execute/CMakeFiles/GCC-C-execute-pr68381.dir/pr68381.c.o.d -o SingleSource/Regression/C/gcc-c-torture/execute/CMakeFiles/GCC-C-execute-pr68381.dir/pr68381.c.o -c /Users/buildslave/jenkins/workspace/test-suite-verify-machineinstrs-aarch64-globalisel-O0-g/test-suite/SingleSource/Regression/C/gcc-c-torture/execute/pr68381.c [8309/11527] : && /Users/buildslave/jenkins/workspace/test-suite-verify-machineinstrs-aarch64-globalisel-O0-g/test-suite-build/tools/timeit --summary SingleSource/Regression/C/gcc-c-torture/execute/GCC-C-execute-va-arg-10.link.time /Users/buildslave/jenkins/workspace/test-suite-verify-machineinstrs-aarch64-globalisel-O0-g/compiler/bin/clang -B /Applications/Xcode.app/Contents/Developer/Toolchains/XcodeDefault.xctoolchain/usr/bin -Wno-unused-command-line-argument -mllvm -verify-machineinstrs -O0 -g -arch arm64 -isysroot /Applications/Xcode.app/Contents/Developer/Platforms/iPhoneOS.platform/Developer/SDKs/iPhoneOS13.5.sdk -Wl,-search_paths_first -Wl,-headerpad_max_install_names -B /Applications/Xcode.app/Contents/Developer/Toolchains/XcodeDefault.xctoolchain/usr/bin SingleSource/Regression/C/gcc-c-torture/execute/CMakeFiles/GCC-C-execute-va-arg-10.dir/va-arg-10.c.o -o SingleSource/Regression/C/gcc-c-torture/execute/GCC-C-execute-va-arg-10 && : [8310/11527] /Users/buildslave/jenkins/workspace/test-suite-verify-machineinstrs-aarch64-globalisel-O0-g/test-suite-build/tools/timeit --summary SingleSource/Regression/C/gcc-c-torture/execute/CMakeFiles/GCC-C-execute-pr67929_1.dir/pr67929_1.c.o.time /Users/buildslave/jenkins/workspace/test-suite-verify-machineinstrs-aarch64-globalisel-O0-g/compiler/bin/clang -DNDEBUG -B /Applications/Xcode.app/Contents/Developer/Toolchains/XcodeDefault.xctoolchain/usr/bin -Wno-unused-command-line-argument -mllvm -verify-machineinstrs -O0 -g -arch arm64 -isysroot /Applications/Xcode.app/Contents/Developer/Platforms/iPhoneOS.platform/Developer/SDKs/iPhoneOS13.5.sdk -w -Werror=date-time -w -MD -MT SingleSource/Regression/C/gcc-c-torture/execute/CMakeFiles/GCC-C-execute-pr67929_1.dir/pr67929_1.c.o -MF SingleSource/Regression/C/gcc-c-torture/execute/CMakeFiles/GCC-C-execute-pr67929_1.dir/pr67929_1.c.o.d -o SingleSource/Regression/C/gcc-c-torture/execute/CMakeFiles/GCC-C-execute-pr67929_1.dir/pr67929_1.c.o -c /Users/buildslave/jenkins/workspace/test-suite-verify-machineinstrs-aarch64-globalisel-O0-g/test-suite/SingleSource/Regression/C/gcc-c-torture/execute/pr67929_1.c [8311/11527] /Users/buildslave/jenkins/workspace/test-suite-verify-machineinstrs-aarch64-globalisel-O0-g/test-suite-build/tools/timeit --summary SingleSource/Regression/C/gcc-c-torture/execute/CMakeFiles/GCC-C-execute-pr68376-2.dir/pr68376-2.c.o.time /Users/buildslave/jenkins/workspace/test-suite-verify-machineinstrs-aarch64-globalisel-O0-g/compiler/bin/clang -DNDEBUG -B /Applications/Xcode.app/Contents/Developer/Toolchains/XcodeDefault.xctoolchain/usr/bin -Wno-unused-command-line-argument -mllvm -verify-machineinstrs -O0 -g -arch arm64 -isysroot /Applications/Xcode.app/Contents/Developer/Platforms/iPhoneOS.platform/Developer/SDKs/iPhoneOS13.5.sdk -w -Werror=date-time -w -MD -MT SingleSource/Regression/C/gcc-c-torture/execute/CMakeFiles/GCC-C-execute-pr68376-2.dir/pr68376-2.c.o -MF SingleSource/Regression/C/gcc-c-torture/execute/CMakeFiles/GCC-C-execute-pr68376-2.dir/pr68376-2.c.o.d -o SingleSource/Regression/C/gcc-c-torture/execute/CMakeFiles/GCC-C-execute-pr68376-2.dir/pr68376-2.c.o -c /Users/buildslave/jenkins/workspace/test-suite-verify-machineinstrs-aarch64-globalisel-O0-g/test-suite/SingleSource/Regression/C/gcc-c-torture/execute/pr68376-2.c [8312/11527] /Users/buildslave/jenkins/workspace/test-suite-verify-machineinstrs-aarch64-globalisel-O0-g/test-suite-build/tools/timeit --summary SingleSource/Regression/C/gcc-c-torture/execute/CMakeFiles/GCC-C-execute-pr84524.dir/pr84524.c.o.time /Users/buildslave/jenkins/workspace/test-suite-verify-machineinstrs-aarch64-globalisel-O0-g/compiler/bin/clang -DNDEBUG -B /Applications/Xcode.app/Contents/Developer/Toolchains/XcodeDefault.xctoolchain/usr/bin -Wno-unused-command-line-argument -mllvm -verify-machineinstrs -O0 -g -arch arm64 -isysroot /Applications/Xcode.app/Contents/Developer/Platforms/iPhoneOS.platform/Developer/SDKs/iPhoneOS13.5.sdk -w -Werror=date-time -w -MD -MT SingleSource/Regression/C/gcc-c-torture/execute/CMakeFiles/GCC-C-execute-pr84524.dir/pr84524.c.o -MF SingleSource/Regression/C/gcc-c-torture/execute/CMakeFiles/GCC-C-execute-pr84524.dir/pr84524.c.o.d -o SingleSource/Regression/C/gcc-c-torture/execute/CMakeFiles/GCC-C-execute-pr84524.dir/pr84524.c.o -c /Users/buildslave/jenkins/workspace/test-suite-verify-machineinstrs-aarch64-globalisel-O0-g/test-suite/SingleSource/Regression/C/gcc-c-torture/execute/pr84524.c FAILED: SingleSource/Regression/C/gcc-c-torture/execute/CMakeFiles/GCC-C-execute-pr84524.dir/pr84524.c.o /Users/buildslave/jenkins/workspace/test-suite-verify-machineinstrs-aarch64-globalisel-O0-g/test-suite-build/tools/timeit --summary SingleSource/Regression/C/gcc-c-torture/execute/CMakeFiles/GCC-C-execute-pr84524.dir/pr84524.c.o.time /Users/buildslave/jenkins/workspace/test-suite-verify-machineinstrs-aarch64-globalisel-O0-g/compiler/bin/clang -DNDEBUG -B /Applications/Xcode.app/Contents/Developer/Toolchains/XcodeDefault.xctoolchain/usr/bin -Wno-unused-command-line-argument -mllvm -verify-machineinstrs -O0 -g -arch arm64 -isysroot /Applications/Xcode.app/Contents/Developer/Platforms/iPhoneOS.platform/Developer/SDKs/iPhoneOS13.5.sdk -w -Werror=date-time -w -MD -MT SingleSource/Regression/C/gcc-c-torture/execute/CMakeFiles/GCC-C-execute-pr84524.dir/pr84524.c.o -MF SingleSource/Regression/C/gcc-c-torture/execute/CMakeFiles/GCC-C-execute-pr84524.dir/pr84524.c.o.d -o SingleSource/Regression/C/gcc-c-torture/execute/CMakeFiles/GCC-C-execute-pr84524.dir/pr84524.c.o -c /Users/buildslave/jenkins/workspace/test-suite-verify-machineinstrs-aarch64-globalisel-O0-g/test-suite/SingleSource/Regression/C/gcc-c-torture/execute/pr84524.c Fatal Error: error in backend: Found 1 machine code errors. *** Bad machine code: Copy Instruction is illegal with mismatching sizes *** - function: main - basic block: %bb.5 for.body4 (0x7fe729852a08) - instruction: %38:gpr32common = COPY %36:_(s16), debug-location !102; test-suite/SingleSource/Regression/C/gcc-c-torture/execute/pr84524.c:31:4 Def Size = 32, Src Size = 16 fatal error: error in backend: Found 1 machine code errors. PLEASE submit a bug report to https://bugs.llvm.org/ and include the crash backtrace, preprocessed source, and associated run script. Stack dump: Error: clang frontend command failed with exit code 70 (use -v to see invocation) 24 clang 0x000000010a9c341d clang::driver::Compilation::ExecuteCommand(clang::driver::Command const&, clang::driver::Command const*&) const + 221 25 clang 0x000000010a9c383d clang::driver::Compilation::ExecuteJobs(clang::driver::JobList const&, llvm::SmallVectorImpl<std::__1::pair<int, clang::driver::Command const*> >&) const + 125 26 clang 0x000000010a9d7aec clang::driver::Driver::ExecuteCompilation(clang::driver::Compilation&, llvm::SmallVectorImpl<std::__1::pair<int, clang::driver::Command const*> >&) + 204 27 clang 0x000000010858003d main + 10509 28 libdyld.dylib 0x00007fff696f7cc9 start + 1 clang-11: error: clang frontend command failed with exit code 70 (use -v to see invocation) clang version 11.0.0 (https://github.com/llvm/llvm-project.git 05c479491c1d3236cae4eccaa3fcd2794598522c) Target: aarch64-apple-darwin19.5.0

Build Log

Changes
  1. [AST] Fix handling of some edge cases in fixed-point division. (details)
  2. [lldb] Tab completion for `frame recognizer delete` (details)
  3. [X86] Add tests for cmp-zero + and/trunc + or-reduction patterns (details)
  4. [lldb] Fix TestModuleGetXcodeSDK test after DWARFYAML change (details)
  5. [PM] Fix new PM to perform SpeculativeExecution as in old PM (details)
  6. [NFC][ARM] Tail predication reduction tests (details)
  7. [Alignment][NFC] Migrate SelectionDAGTargetInfo::EmitTargetCodeForMemset to Align (details)
  8. [Alignment][NFC] Migrate SelectionDAGTargetInfo::EmitTargetCodeForMemmove to Align (details)
  9. [clangd] Suppress GCC -Woverloaded-virtual by renaming ThreadsafeFS extension point (details)
  10. [Alignment][NFC] Migrate SelectionDAGTargetInfo::EmitTargetCodeForMemcpy to Align (details)
  11. Make it possible for client code to consume CLANG_LINK_CLANG_DYLIB (details)

Started by upstream project relay-test-suite-verify-machineinstrs build number 8279
originally caused by:

This run spent:

  • 1 hr 45 min waiting;
  • 2 hr 0 min build duration;
  • 2 hr 0 min total from scheduled to completion.
Revision: 40dd3891d6e81726fb450af140659f52c12bcf43
  • refs/remotes/origin/master
Revision: 05c479491c1d3236cae4eccaa3fcd2794598522c
  • detached
Revision: f34ad041dce4f3b55a013ab6e7d712349a2844a0
  • refs/remotes/origin/master
Revision: 0bfeb655e49fc6feeeb63d534019019bf4bb4d7c
  • refs/remotes/origin/master

Identified problems

Compile Error

This build failed because of a compile error. Below is a list of all errors in the build log:
Indication 1

Ninja target failed

Below is a link to the first failed ninja target.
Indication 2