Started 3 days 3 hr ago
Took 50 min

Failed Build clang-d358958-gf5e0ae240f2-t12037-b12037.tar.gz (Jun 30, 2020 11:07:05 PM)

Issues

Found 5 issues:
Ninja target: mytimer.cpp.o [7755/11527] /Users/buildslave/jenkins/workspace/test-suite-verify-machineinstrs-aarch64-globalisel-O0-g/test-suite-build/tools/timeit --summary MultiSource/Benchmarks/DOE-ProxyApps-C++/PENNANT/CMakeFiles/PENNANT.dir/InputFile.cc.o.time /Users/buildslave/jenkins/workspace/test-suite-verify-machineinstrs-aarch64-globalisel-O0-g/compiler/bin/clang++ -DNDEBUG -B /Applications/Xcode.app/Contents/Developer/Toolchains/XcodeDefault.xctoolchain/usr/bin -Wno-unused-command-line-argument -mllvm -verify-machineinstrs -O0 -g -arch arm64 -isysroot /Applications/Xcode.app/Contents/Developer/Platforms/iPhoneOS.platform/Developer/SDKs/iPhoneOS13.5.sdk -w -Werror=date-time -MD -MT MultiSource/Benchmarks/DOE-ProxyApps-C++/PENNANT/CMakeFiles/PENNANT.dir/InputFile.cc.o -MF MultiSource/Benchmarks/DOE-ProxyApps-C++/PENNANT/CMakeFiles/PENNANT.dir/InputFile.cc.o.d -o MultiSource/Benchmarks/DOE-ProxyApps-C++/PENNANT/CMakeFiles/PENNANT.dir/InputFile.cc.o -c /Users/buildslave/jenkins/workspace/test-suite-verify-machineinstrs-aarch64-globalisel-O0-g/test-suite/MultiSource/Benchmarks/DOE-ProxyApps-C++/PENNANT/InputFile.cc [7756/11527] /Users/buildslave/jenkins/workspace/test-suite-verify-machineinstrs-aarch64-globalisel-O0-g/test-suite-build/tools/timeit --summary MultiSource/Benchmarks/DOE-ProxyApps-C++/PENNANT/CMakeFiles/PENNANT.dir/QCS.cc.o.time /Users/buildslave/jenkins/workspace/test-suite-verify-machineinstrs-aarch64-globalisel-O0-g/compiler/bin/clang++ -DNDEBUG -B /Applications/Xcode.app/Contents/Developer/Toolchains/XcodeDefault.xctoolchain/usr/bin -Wno-unused-command-line-argument -mllvm -verify-machineinstrs -O0 -g -arch arm64 -isysroot /Applications/Xcode.app/Contents/Developer/Platforms/iPhoneOS.platform/Developer/SDKs/iPhoneOS13.5.sdk -w -Werror=date-time -MD -MT MultiSource/Benchmarks/DOE-ProxyApps-C++/PENNANT/CMakeFiles/PENNANT.dir/QCS.cc.o -MF MultiSource/Benchmarks/DOE-ProxyApps-C++/PENNANT/CMakeFiles/PENNANT.dir/QCS.cc.o.d -o MultiSource/Benchmarks/DOE-ProxyApps-C++/PENNANT/CMakeFiles/PENNANT.dir/QCS.cc.o -c /Users/buildslave/jenkins/workspace/test-suite-verify-machineinstrs-aarch64-globalisel-O0-g/test-suite/MultiSource/Benchmarks/DOE-ProxyApps-C++/PENNANT/QCS.cc [7757/11527] /Users/buildslave/jenkins/workspace/test-suite-verify-machineinstrs-aarch64-globalisel-O0-g/test-suite-build/tools/timeit --summary MultiSource/Benchmarks/DOE-ProxyApps-C++/miniFE/CMakeFiles/miniFE.dir/BoxPartition.cpp.o.time /Users/buildslave/jenkins/workspace/test-suite-verify-machineinstrs-aarch64-globalisel-O0-g/compiler/bin/clang++ -DNDEBUG -I/Users/buildslave/jenkins/workspace/test-suite-verify-machineinstrs-aarch64-globalisel-O0-g/test-suite/MultiSource/Benchmarks/DOE-ProxyApps-C++/miniFE -B /Applications/Xcode.app/Contents/Developer/Toolchains/XcodeDefault.xctoolchain/usr/bin -Wno-unused-command-line-argument -mllvm -verify-machineinstrs -O0 -g -arch arm64 -isysroot /Applications/Xcode.app/Contents/Developer/Platforms/iPhoneOS.platform/Developer/SDKs/iPhoneOS13.5.sdk -w -Werror=date-time -I. -DMINIFE_SCALAR=double -DMINIFE_LOCAL_ORDINAL=int -DMINIFE_GLOBAL_ORDINAL=int -DMINIFE_CSR_MATRIX -DREDSTORM -D_XOPEN_SOURCE=700 -MD -MT MultiSource/Benchmarks/DOE-ProxyApps-C++/miniFE/CMakeFiles/miniFE.dir/BoxPartition.cpp.o -MF MultiSource/Benchmarks/DOE-ProxyApps-C++/miniFE/CMakeFiles/miniFE.dir/BoxPartition.cpp.o.d -o MultiSource/Benchmarks/DOE-ProxyApps-C++/miniFE/CMakeFiles/miniFE.dir/BoxPartition.cpp.o -c /Users/buildslave/jenkins/workspace/test-suite-verify-machineinstrs-aarch64-globalisel-O0-g/test-suite/MultiSource/Benchmarks/DOE-ProxyApps-C++/miniFE/BoxPartition.cpp [7758/11527] /Users/buildslave/jenkins/workspace/test-suite-verify-machineinstrs-aarch64-globalisel-O0-g/test-suite-build/tools/timeit --summary MultiSource/Benchmarks/DOE-ProxyApps-C++/PENNANT/CMakeFiles/PENNANT.dir/main.cc.o.time /Users/buildslave/jenkins/workspace/test-suite-verify-machineinstrs-aarch64-globalisel-O0-g/compiler/bin/clang++ -DNDEBUG -B /Applications/Xcode.app/Contents/Developer/Toolchains/XcodeDefault.xctoolchain/usr/bin -Wno-unused-command-line-argument -mllvm -verify-machineinstrs -O0 -g -arch arm64 -isysroot /Applications/Xcode.app/Contents/Developer/Platforms/iPhoneOS.platform/Developer/SDKs/iPhoneOS13.5.sdk -w -Werror=date-time -MD -MT MultiSource/Benchmarks/DOE-ProxyApps-C++/PENNANT/CMakeFiles/PENNANT.dir/main.cc.o -MF MultiSource/Benchmarks/DOE-ProxyApps-C++/PENNANT/CMakeFiles/PENNANT.dir/main.cc.o.d -o MultiSource/Benchmarks/DOE-ProxyApps-C++/PENNANT/CMakeFiles/PENNANT.dir/main.cc.o -c /Users/buildslave/jenkins/workspace/test-suite-verify-machineinstrs-aarch64-globalisel-O0-g/test-suite/MultiSource/Benchmarks/DOE-ProxyApps-C++/PENNANT/main.cc [7759/11527] /Users/buildslave/jenkins/workspace/test-suite-verify-machineinstrs-aarch64-globalisel-O0-g/test-suite-build/tools/timeit --summary MultiSource/Benchmarks/DOE-ProxyApps-C++/miniFE/CMakeFiles/miniFE.dir/mytimer.cpp.o.time /Users/buildslave/jenkins/workspace/test-suite-verify-machineinstrs-aarch64-globalisel-O0-g/compiler/bin/clang++ -DNDEBUG -I/Users/buildslave/jenkins/workspace/test-suite-verify-machineinstrs-aarch64-globalisel-O0-g/test-suite/MultiSource/Benchmarks/DOE-ProxyApps-C++/miniFE -B /Applications/Xcode.app/Contents/Developer/Toolchains/XcodeDefault.xctoolchain/usr/bin -Wno-unused-command-line-argument -mllvm -verify-machineinstrs -O0 -g -arch arm64 -isysroot /Applications/Xcode.app/Contents/Developer/Platforms/iPhoneOS.platform/Developer/SDKs/iPhoneOS13.5.sdk -w -Werror=date-time -I. -DMINIFE_SCALAR=double -DMINIFE_LOCAL_ORDINAL=int -DMINIFE_GLOBAL_ORDINAL=int -DMINIFE_CSR_MATRIX -DREDSTORM -D_XOPEN_SOURCE=700 -MD -MT MultiSource/Benchmarks/DOE-ProxyApps-C++/miniFE/CMakeFiles/miniFE.dir/mytimer.cpp.o -MF MultiSource/Benchmarks/DOE-ProxyApps-C++/miniFE/CMakeFiles/miniFE.dir/mytimer.cpp.o.d -o MultiSource/Benchmarks/DOE-ProxyApps-C++/miniFE/CMakeFiles/miniFE.dir/mytimer.cpp.o -c /Users/buildslave/jenkins/workspace/test-suite-verify-machineinstrs-aarch64-globalisel-O0-g/test-suite/MultiSource/Benchmarks/DOE-ProxyApps-C++/miniFE/mytimer.cpp FAILED: MultiSource/Benchmarks/DOE-ProxyApps-C++/miniFE/CMakeFiles/miniFE.dir/mytimer.cpp.o /Users/buildslave/jenkins/workspace/test-suite-verify-machineinstrs-aarch64-globalisel-O0-g/test-suite-build/tools/timeit --summary MultiSource/Benchmarks/DOE-ProxyApps-C++/miniFE/CMakeFiles/miniFE.dir/mytimer.cpp.o.time /Users/buildslave/jenkins/workspace/test-suite-verify-machineinstrs-aarch64-globalisel-O0-g/compiler/bin/clang++ -DNDEBUG -I/Users/buildslave/jenkins/workspace/test-suite-verify-machineinstrs-aarch64-globalisel-O0-g/test-suite/MultiSource/Benchmarks/DOE-ProxyApps-C++/miniFE -B /Applications/Xcode.app/Contents/Developer/Toolchains/XcodeDefault.xctoolchain/usr/bin -Wno-unused-command-line-argument -mllvm -verify-machineinstrs -O0 -g -arch arm64 -isysroot /Applications/Xcode.app/Contents/Developer/Platforms/iPhoneOS.platform/Developer/SDKs/iPhoneOS13.5.sdk -w -Werror=date-time -I. -DMINIFE_SCALAR=double -DMINIFE_LOCAL_ORDINAL=int -DMINIFE_GLOBAL_ORDINAL=int -DMINIFE_CSR_MATRIX -DREDSTORM -D_XOPEN_SOURCE=700 -MD -MT MultiSource/Benchmarks/DOE-ProxyApps-C++/miniFE/CMakeFiles/miniFE.dir/mytimer.cpp.o -MF MultiSource/Benchmarks/DOE-ProxyApps-C++/miniFE/CMakeFiles/miniFE.dir/mytimer.cpp.o.d -o MultiSource/Benchmarks/DOE-ProxyApps-C++/miniFE/CMakeFiles/miniFE.dir/mytimer.cpp.o -c /Users/buildslave/jenkins/workspace/test-suite-verify-machineinstrs-aarch64-globalisel-O0-g/test-suite/MultiSource/Benchmarks/DOE-ProxyApps-C++/miniFE/mytimer.cpp /Users/buildslave/jenkins/workspace/test-suite-verify-machineinstrs-aarch64-globalisel-O0-g/test-suite/MultiSource/Benchmarks/DOE-ProxyApps-C++/miniFE/mytimer.cpp:116:19: error: variable has incomplete type 'struct timezone' mytimer.cpp error: variable has incomplete type 'struct timezone' [7757/11527] /Users/buildslave/jenkins/workspace/test-suite-verify-machineinstrs-aarch64-globalisel-O0-g/test-suite-build/tools/timeit --summary MultiSource/Benchmarks/DOE-ProxyApps-C++/miniFE/CMakeFiles/miniFE.dir/BoxPartition.cpp.o.time /Users/buildslave/jenkins/workspace/test-suite-verify-machineinstrs-aarch64-globalisel-O0-g/compiler/bin/clang++ -DNDEBUG -I/Users/buildslave/jenkins/workspace/test-suite-verify-machineinstrs-aarch64-globalisel-O0-g/test-suite/MultiSource/Benchmarks/DOE-ProxyApps-C++/miniFE -B /Applications/Xcode.app/Contents/Developer/Toolchains/XcodeDefault.xctoolchain/usr/bin -Wno-unused-command-line-argument -mllvm -verify-machineinstrs -O0 -g -arch arm64 -isysroot /Applications/Xcode.app/Contents/Developer/Platforms/iPhoneOS.platform/Developer/SDKs/iPhoneOS13.5.sdk -w -Werror=date-time -I. -DMINIFE_SCALAR=double -DMINIFE_LOCAL_ORDINAL=int -DMINIFE_GLOBAL_ORDINAL=int -DMINIFE_CSR_MATRIX -DREDSTORM -D_XOPEN_SOURCE=700 -MD -MT MultiSource/Benchmarks/DOE-ProxyApps-C++/miniFE/CMakeFiles/miniFE.dir/BoxPartition.cpp.o -MF MultiSource/Benchmarks/DOE-ProxyApps-C++/miniFE/CMakeFiles/miniFE.dir/BoxPartition.cpp.o.d -o MultiSource/Benchmarks/DOE-ProxyApps-C++/miniFE/CMakeFiles/miniFE.dir/BoxPartition.cpp.o -c /Users/buildslave/jenkins/workspace/test-suite-verify-machineinstrs-aarch64-globalisel-O0-g/test-suite/MultiSource/Benchmarks/DOE-ProxyApps-C++/miniFE/BoxPartition.cpp [7758/11527] /Users/buildslave/jenkins/workspace/test-suite-verify-machineinstrs-aarch64-globalisel-O0-g/test-suite-build/tools/timeit --summary MultiSource/Benchmarks/DOE-ProxyApps-C++/PENNANT/CMakeFiles/PENNANT.dir/main.cc.o.time /Users/buildslave/jenkins/workspace/test-suite-verify-machineinstrs-aarch64-globalisel-O0-g/compiler/bin/clang++ -DNDEBUG -B /Applications/Xcode.app/Contents/Developer/Toolchains/XcodeDefault.xctoolchain/usr/bin -Wno-unused-command-line-argument -mllvm -verify-machineinstrs -O0 -g -arch arm64 -isysroot /Applications/Xcode.app/Contents/Developer/Platforms/iPhoneOS.platform/Developer/SDKs/iPhoneOS13.5.sdk -w -Werror=date-time -MD -MT MultiSource/Benchmarks/DOE-ProxyApps-C++/PENNANT/CMakeFiles/PENNANT.dir/main.cc.o -MF MultiSource/Benchmarks/DOE-ProxyApps-C++/PENNANT/CMakeFiles/PENNANT.dir/main.cc.o.d -o MultiSource/Benchmarks/DOE-ProxyApps-C++/PENNANT/CMakeFiles/PENNANT.dir/main.cc.o -c /Users/buildslave/jenkins/workspace/test-suite-verify-machineinstrs-aarch64-globalisel-O0-g/test-suite/MultiSource/Benchmarks/DOE-ProxyApps-C++/PENNANT/main.cc [7759/11527] /Users/buildslave/jenkins/workspace/test-suite-verify-machineinstrs-aarch64-globalisel-O0-g/test-suite-build/tools/timeit --summary MultiSource/Benchmarks/DOE-ProxyApps-C++/miniFE/CMakeFiles/miniFE.dir/mytimer.cpp.o.time /Users/buildslave/jenkins/workspace/test-suite-verify-machineinstrs-aarch64-globalisel-O0-g/compiler/bin/clang++ -DNDEBUG -I/Users/buildslave/jenkins/workspace/test-suite-verify-machineinstrs-aarch64-globalisel-O0-g/test-suite/MultiSource/Benchmarks/DOE-ProxyApps-C++/miniFE -B /Applications/Xcode.app/Contents/Developer/Toolchains/XcodeDefault.xctoolchain/usr/bin -Wno-unused-command-line-argument -mllvm -verify-machineinstrs -O0 -g -arch arm64 -isysroot /Applications/Xcode.app/Contents/Developer/Platforms/iPhoneOS.platform/Developer/SDKs/iPhoneOS13.5.sdk -w -Werror=date-time -I. -DMINIFE_SCALAR=double -DMINIFE_LOCAL_ORDINAL=int -DMINIFE_GLOBAL_ORDINAL=int -DMINIFE_CSR_MATRIX -DREDSTORM -D_XOPEN_SOURCE=700 -MD -MT MultiSource/Benchmarks/DOE-ProxyApps-C++/miniFE/CMakeFiles/miniFE.dir/mytimer.cpp.o -MF MultiSource/Benchmarks/DOE-ProxyApps-C++/miniFE/CMakeFiles/miniFE.dir/mytimer.cpp.o.d -o MultiSource/Benchmarks/DOE-ProxyApps-C++/miniFE/CMakeFiles/miniFE.dir/mytimer.cpp.o -c /Users/buildslave/jenkins/workspace/test-suite-verify-machineinstrs-aarch64-globalisel-O0-g/test-suite/MultiSource/Benchmarks/DOE-ProxyApps-C++/miniFE/mytimer.cpp FAILED: MultiSource/Benchmarks/DOE-ProxyApps-C++/miniFE/CMakeFiles/miniFE.dir/mytimer.cpp.o /Users/buildslave/jenkins/workspace/test-suite-verify-machineinstrs-aarch64-globalisel-O0-g/test-suite-build/tools/timeit --summary MultiSource/Benchmarks/DOE-ProxyApps-C++/miniFE/CMakeFiles/miniFE.dir/mytimer.cpp.o.time /Users/buildslave/jenkins/workspace/test-suite-verify-machineinstrs-aarch64-globalisel-O0-g/compiler/bin/clang++ -DNDEBUG -I/Users/buildslave/jenkins/workspace/test-suite-verify-machineinstrs-aarch64-globalisel-O0-g/test-suite/MultiSource/Benchmarks/DOE-ProxyApps-C++/miniFE -B /Applications/Xcode.app/Contents/Developer/Toolchains/XcodeDefault.xctoolchain/usr/bin -Wno-unused-command-line-argument -mllvm -verify-machineinstrs -O0 -g -arch arm64 -isysroot /Applications/Xcode.app/Contents/Developer/Platforms/iPhoneOS.platform/Developer/SDKs/iPhoneOS13.5.sdk -w -Werror=date-time -I. -DMINIFE_SCALAR=double -DMINIFE_LOCAL_ORDINAL=int -DMINIFE_GLOBAL_ORDINAL=int -DMINIFE_CSR_MATRIX -DREDSTORM -D_XOPEN_SOURCE=700 -MD -MT MultiSource/Benchmarks/DOE-ProxyApps-C++/miniFE/CMakeFiles/miniFE.dir/mytimer.cpp.o -MF MultiSource/Benchmarks/DOE-ProxyApps-C++/miniFE/CMakeFiles/miniFE.dir/mytimer.cpp.o.d -o MultiSource/Benchmarks/DOE-ProxyApps-C++/miniFE/CMakeFiles/miniFE.dir/mytimer.cpp.o -c /Users/buildslave/jenkins/workspace/test-suite-verify-machineinstrs-aarch64-globalisel-O0-g/test-suite/MultiSource/Benchmarks/DOE-ProxyApps-C++/miniFE/mytimer.cpp /Users/buildslave/jenkins/workspace/test-suite-verify-machineinstrs-aarch64-globalisel-O0-g/test-suite/MultiSource/Benchmarks/DOE-ProxyApps-C++/miniFE/mytimer.cpp:116:19: error: variable has incomplete type 'struct timezone' struct timezone tz; ^ Ninja target: pr84524.c.o [9122/11527] /Users/buildslave/jenkins/workspace/test-suite-verify-machineinstrs-aarch64-globalisel-O0-g/test-suite-build/tools/timeit --summary SingleSource/Regression/C/gcc-c-torture/execute/CMakeFiles/GCC-C-execute-pr78720.dir/pr78720.c.o.time /Users/buildslave/jenkins/workspace/test-suite-verify-machineinstrs-aarch64-globalisel-O0-g/compiler/bin/clang -DNDEBUG -B /Applications/Xcode.app/Contents/Developer/Toolchains/XcodeDefault.xctoolchain/usr/bin -Wno-unused-command-line-argument -mllvm -verify-machineinstrs -O0 -g -arch arm64 -isysroot /Applications/Xcode.app/Contents/Developer/Platforms/iPhoneOS.platform/Developer/SDKs/iPhoneOS13.5.sdk -w -Werror=date-time -w -MD -MT SingleSource/Regression/C/gcc-c-torture/execute/CMakeFiles/GCC-C-execute-pr78720.dir/pr78720.c.o -MF SingleSource/Regression/C/gcc-c-torture/execute/CMakeFiles/GCC-C-execute-pr78720.dir/pr78720.c.o.d -o SingleSource/Regression/C/gcc-c-torture/execute/CMakeFiles/GCC-C-execute-pr78720.dir/pr78720.c.o -c /Users/buildslave/jenkins/workspace/test-suite-verify-machineinstrs-aarch64-globalisel-O0-g/test-suite/SingleSource/Regression/C/gcc-c-torture/execute/pr78720.c [9123/11527] : && /Users/buildslave/jenkins/workspace/test-suite-verify-machineinstrs-aarch64-globalisel-O0-g/test-suite-build/tools/timeit --summary SingleSource/Regression/C/gcc-c-torture/execute/GCC-C-execute-pr78791.link.time /Users/buildslave/jenkins/workspace/test-suite-verify-machineinstrs-aarch64-globalisel-O0-g/compiler/bin/clang -B /Applications/Xcode.app/Contents/Developer/Toolchains/XcodeDefault.xctoolchain/usr/bin -Wno-unused-command-line-argument -mllvm -verify-machineinstrs -O0 -g -arch arm64 -isysroot /Applications/Xcode.app/Contents/Developer/Platforms/iPhoneOS.platform/Developer/SDKs/iPhoneOS13.5.sdk -Wl,-search_paths_first -Wl,-headerpad_max_install_names -B /Applications/Xcode.app/Contents/Developer/Toolchains/XcodeDefault.xctoolchain/usr/bin SingleSource/Regression/C/gcc-c-torture/execute/CMakeFiles/GCC-C-execute-pr78791.dir/pr78791.c.o -o SingleSource/Regression/C/gcc-c-torture/execute/GCC-C-execute-pr78791 && : [9124/11527] : && /Users/buildslave/jenkins/workspace/test-suite-verify-machineinstrs-aarch64-globalisel-O0-g/test-suite-build/tools/timeit --summary SingleSource/Regression/C/gcc-c-torture/execute/GCC-C-execute-pr78726.link.time /Users/buildslave/jenkins/workspace/test-suite-verify-machineinstrs-aarch64-globalisel-O0-g/compiler/bin/clang -B /Applications/Xcode.app/Contents/Developer/Toolchains/XcodeDefault.xctoolchain/usr/bin -Wno-unused-command-line-argument -mllvm -verify-machineinstrs -O0 -g -arch arm64 -isysroot /Applications/Xcode.app/Contents/Developer/Platforms/iPhoneOS.platform/Developer/SDKs/iPhoneOS13.5.sdk -Wl,-search_paths_first -Wl,-headerpad_max_install_names -B /Applications/Xcode.app/Contents/Developer/Toolchains/XcodeDefault.xctoolchain/usr/bin SingleSource/Regression/C/gcc-c-torture/execute/CMakeFiles/GCC-C-execute-pr78726.dir/pr78726.c.o -o SingleSource/Regression/C/gcc-c-torture/execute/GCC-C-execute-pr78726 && : [9125/11527] /Users/buildslave/jenkins/workspace/test-suite-verify-machineinstrs-aarch64-globalisel-O0-g/test-suite-build/tools/timeit --summary SingleSource/Regression/C/gcc-c-torture/execute/CMakeFiles/GCC-C-execute-pr78675.dir/pr78675.c.o.time /Users/buildslave/jenkins/workspace/test-suite-verify-machineinstrs-aarch64-globalisel-O0-g/compiler/bin/clang -DNDEBUG -B /Applications/Xcode.app/Contents/Developer/Toolchains/XcodeDefault.xctoolchain/usr/bin -Wno-unused-command-line-argument -mllvm -verify-machineinstrs -O0 -g -arch arm64 -isysroot /Applications/Xcode.app/Contents/Developer/Platforms/iPhoneOS.platform/Developer/SDKs/iPhoneOS13.5.sdk -w -Werror=date-time -w -MD -MT SingleSource/Regression/C/gcc-c-torture/execute/CMakeFiles/GCC-C-execute-pr78675.dir/pr78675.c.o -MF SingleSource/Regression/C/gcc-c-torture/execute/CMakeFiles/GCC-C-execute-pr78675.dir/pr78675.c.o.d -o SingleSource/Regression/C/gcc-c-torture/execute/CMakeFiles/GCC-C-execute-pr78675.dir/pr78675.c.o -c /Users/buildslave/jenkins/workspace/test-suite-verify-machineinstrs-aarch64-globalisel-O0-g/test-suite/SingleSource/Regression/C/gcc-c-torture/execute/pr78675.c [9126/11527] /Users/buildslave/jenkins/workspace/test-suite-verify-machineinstrs-aarch64-globalisel-O0-g/test-suite-build/tools/timeit --summary SingleSource/Regression/C/gcc-c-torture/execute/CMakeFiles/GCC-C-execute-pr84524.dir/pr84524.c.o.time /Users/buildslave/jenkins/workspace/test-suite-verify-machineinstrs-aarch64-globalisel-O0-g/compiler/bin/clang -DNDEBUG -B /Applications/Xcode.app/Contents/Developer/Toolchains/XcodeDefault.xctoolchain/usr/bin -Wno-unused-command-line-argument -mllvm -verify-machineinstrs -O0 -g -arch arm64 -isysroot /Applications/Xcode.app/Contents/Developer/Platforms/iPhoneOS.platform/Developer/SDKs/iPhoneOS13.5.sdk -w -Werror=date-time -w -MD -MT SingleSource/Regression/C/gcc-c-torture/execute/CMakeFiles/GCC-C-execute-pr84524.dir/pr84524.c.o -MF SingleSource/Regression/C/gcc-c-torture/execute/CMakeFiles/GCC-C-execute-pr84524.dir/pr84524.c.o.d -o SingleSource/Regression/C/gcc-c-torture/execute/CMakeFiles/GCC-C-execute-pr84524.dir/pr84524.c.o -c /Users/buildslave/jenkins/workspace/test-suite-verify-machineinstrs-aarch64-globalisel-O0-g/test-suite/SingleSource/Regression/C/gcc-c-torture/execute/pr84524.c FAILED: SingleSource/Regression/C/gcc-c-torture/execute/CMakeFiles/GCC-C-execute-pr84524.dir/pr84524.c.o /Users/buildslave/jenkins/workspace/test-suite-verify-machineinstrs-aarch64-globalisel-O0-g/test-suite-build/tools/timeit --summary SingleSource/Regression/C/gcc-c-torture/execute/CMakeFiles/GCC-C-execute-pr84524.dir/pr84524.c.o.time /Users/buildslave/jenkins/workspace/test-suite-verify-machineinstrs-aarch64-globalisel-O0-g/compiler/bin/clang -DNDEBUG -B /Applications/Xcode.app/Contents/Developer/Toolchains/XcodeDefault.xctoolchain/usr/bin -Wno-unused-command-line-argument -mllvm -verify-machineinstrs -O0 -g -arch arm64 -isysroot /Applications/Xcode.app/Contents/Developer/Platforms/iPhoneOS.platform/Developer/SDKs/iPhoneOS13.5.sdk -w -Werror=date-time -w -MD -MT SingleSource/Regression/C/gcc-c-torture/execute/CMakeFiles/GCC-C-execute-pr84524.dir/pr84524.c.o -MF SingleSource/Regression/C/gcc-c-torture/execute/CMakeFiles/GCC-C-execute-pr84524.dir/pr84524.c.o.d -o SingleSource/Regression/C/gcc-c-torture/execute/CMakeFiles/GCC-C-execute-pr84524.dir/pr84524.c.o -c /Users/buildslave/jenkins/workspace/test-suite-verify-machineinstrs-aarch64-globalisel-O0-g/test-suite/SingleSource/Regression/C/gcc-c-torture/execute/pr84524.c Fatal Error: error in backend: Found 1 machine code errors. *** Bad machine code: Copy Instruction is illegal with mismatching sizes *** - function: main - basic block: %bb.5 for.body4 (0x7f92c50e4808) - instruction: %38:gpr32common = COPY %36:_(s16), debug-location !102; test-suite/SingleSource/Regression/C/gcc-c-torture/execute/pr84524.c:31:4 Def Size = 32, Src Size = 16 fatal error: error in backend: Found 1 machine code errors. PLEASE submit a bug report to https://bugs.llvm.org/ and include the crash backtrace, preprocessed source, and associated run script. Stack dump: Error: clang frontend command failed with exit code 70 (use -v to see invocation) 24 clang 0x00000001053bbcad clang::driver::Compilation::ExecuteCommand(clang::driver::Command const&, clang::driver::Command const*&) const + 221 25 clang 0x00000001053bc0cd clang::driver::Compilation::ExecuteJobs(clang::driver::JobList const&, llvm::SmallVectorImpl<std::__1::pair<int, clang::driver::Command const*> >&) const + 125 26 clang 0x00000001053d037c clang::driver::Driver::ExecuteCompilation(clang::driver::Compilation&, llvm::SmallVectorImpl<std::__1::pair<int, clang::driver::Command const*> >&) + 204 27 clang 0x0000000102f78995 main + 10389 28 libdyld.dylib 0x00007fff696f7cc9 start + 1 clang-11: error: clang frontend command failed with exit code 70 (use -v to see invocation) clang version 11.0.0 (https://github.com/llvm/llvm-project.git f5e0ae240f2daeee214097f222e12cd23706b1db) Target: aarch64-apple-darwin19.5.0

Build Log

Changes
  1. Fix diagnostic for missing virtual dtor (details)
  2. [lld][WebAssembly] Give better error message on bad archive member (details)
  3. [NFC] fix diagnostic (details)
  4. [CodeComplete] Add code completion after function equals (details)
  5. [mlir] Remove the default template parameters from AttrBase and TypeBase. (details)
  6. [ELF][test] Fix ppc32-gnu-ifunc.s and remove XFAIL: * (details)

Started by upstream project relay-test-suite-verify-machineinstrs build number 8287
originally caused by:

This run spent:

  • 34 min waiting;
  • 50 min build duration;
  • 50 min total from scheduled to completion.
Revision: 8721195e10b4722a0b5bfae6b6c9b5b24af65db9
  • refs/remotes/origin/master
Revision: f5e0ae240f2daeee214097f222e12cd23706b1db
  • detached
Revision: 53229320df0e57a7b779a3dcded72fc9e6d44e01
  • refs/remotes/origin/master
Revision: 0bfeb655e49fc6feeeb63d534019019bf4bb4d7c
  • refs/remotes/origin/master

Identified problems

Compile Error

This build failed because of a compile error. Below is a list of all errors in the build log:
Indication 1

Ninja target failed

Below is a link to the first failed ninja target.
Indication 2