Started 2 mo 20 days ago
Took 1 hr 20 min

Failed Build clang-d362557-gb0c50ef759d-t13393-b13393.tar.gz (Aug 5, 2020 12:56:28 PM)

Issues

Found 3 issues:
Ninja target: pr17377.c.o
[9286/11531] : && /Users/buildslave/jenkins/workspace/test-suite-verify-machineinstrs-aarch64-globalisel-O0-g/test-suite-build/tools/timeit --summary SingleSource/Regression/C/gcc-c-torture/execute/GCC-C-execute-memcpy-2.link.time /Users/buildslave/jenkins/workspace/test-suite-verify-machineinstrs-aarch64-globalisel-O0-g/compiler/bin/clang -B /Applications/Xcode.app/Contents/Developer/Toolchains/XcodeDefault.xctoolchain/usr/bin    -Wno-unused-command-line-argument -mllvm -verify-machineinstrs -O0 -g -arch arm64 -isysroot /Applications/Xcode.app/Contents/Developer/Platforms/iPhoneOS.platform/Developer/SDKs/iPhoneOS13.5.sdk -Wl,-search_paths_first -Wl,-headerpad_max_install_names -B /Applications/Xcode.app/Contents/Developer/Toolchains/XcodeDefault.xctoolchain/usr/bin SingleSource/Regression/C/gcc-c-torture/execute/CMakeFiles/GCC-C-execute-memcpy-2.dir/memcpy-2.c.o  -o SingleSource/Regression/C/gcc-c-torture/execute/GCC-C-execute-memcpy-2   && :
[9287/11531] /Users/buildslave/jenkins/workspace/test-suite-verify-machineinstrs-aarch64-globalisel-O0-g/test-suite-build/tools/timeit --summary SingleSource/Regression/C/gcc-c-torture/execute/CMakeFiles/GCC-C-execute-mayalias-2.dir/mayalias-2.c.o.time /Users/buildslave/jenkins/workspace/test-suite-verify-machineinstrs-aarch64-globalisel-O0-g/compiler/bin/clang -DNDEBUG  -B /Applications/Xcode.app/Contents/Developer/Toolchains/XcodeDefault.xctoolchain/usr/bin    -Wno-unused-command-line-argument -mllvm -verify-machineinstrs -O0 -g -arch arm64 -isysroot /Applications/Xcode.app/Contents/Developer/Platforms/iPhoneOS.platform/Developer/SDKs/iPhoneOS13.5.sdk   -w -Werror=date-time -w -MD -MT SingleSource/Regression/C/gcc-c-torture/execute/CMakeFiles/GCC-C-execute-mayalias-2.dir/mayalias-2.c.o -MF SingleSource/Regression/C/gcc-c-torture/execute/CMakeFiles/GCC-C-execute-mayalias-2.dir/mayalias-2.c.o.d -o SingleSource/Regression/C/gcc-c-torture/execute/CMakeFiles/GCC-C-execute-mayalias-2.dir/mayalias-2.c.o   -c /Users/buildslave/jenkins/workspace/test-suite-verify-machineinstrs-aarch64-globalisel-O0-g/test-suite/SingleSource/Regression/C/gcc-c-torture/execute/mayalias-2.c
[9288/11531] /Users/buildslave/jenkins/workspace/test-suite-verify-machineinstrs-aarch64-globalisel-O0-g/test-suite-build/tools/timeit --summary SingleSource/Regression/C/gcc-c-torture/execute/CMakeFiles/GCC-C-execute-pr65053-2.dir/pr65053-2.c.o.time /Users/buildslave/jenkins/workspace/test-suite-verify-machineinstrs-aarch64-globalisel-O0-g/compiler/bin/clang -DNDEBUG  -B /Applications/Xcode.app/Contents/Developer/Toolchains/XcodeDefault.xctoolchain/usr/bin    -Wno-unused-command-line-argument -mllvm -verify-machineinstrs -O0 -g -arch arm64 -isysroot /Applications/Xcode.app/Contents/Developer/Platforms/iPhoneOS.platform/Developer/SDKs/iPhoneOS13.5.sdk   -w -Werror=date-time -w -MD -MT SingleSource/Regression/C/gcc-c-torture/execute/CMakeFiles/GCC-C-execute-pr65053-2.dir/pr65053-2.c.o -MF SingleSource/Regression/C/gcc-c-torture/execute/CMakeFiles/GCC-C-execute-pr65053-2.dir/pr65053-2.c.o.d -o SingleSource/Regression/C/gcc-c-torture/execute/CMakeFiles/GCC-C-execute-pr65053-2.dir/pr65053-2.c.o   -c /Users/buildslave/jenkins/workspace/test-suite-verify-machineinstrs-aarch64-globalisel-O0-g/test-suite/SingleSource/Regression/C/gcc-c-torture/execute/pr65053-2.c
[9289/11531] : && /Users/buildslave/jenkins/workspace/test-suite-verify-machineinstrs-aarch64-globalisel-O0-g/test-suite-build/tools/timeit --summary SingleSource/Regression/C/gcc-c-torture/execute/GCC-C-execute-memcpy-1.link.time /Users/buildslave/jenkins/workspace/test-suite-verify-machineinstrs-aarch64-globalisel-O0-g/compiler/bin/clang -B /Applications/Xcode.app/Contents/Developer/Toolchains/XcodeDefault.xctoolchain/usr/bin    -Wno-unused-command-line-argument -mllvm -verify-machineinstrs -O0 -g -arch arm64 -isysroot /Applications/Xcode.app/Contents/Developer/Platforms/iPhoneOS.platform/Developer/SDKs/iPhoneOS13.5.sdk -Wl,-search_paths_first -Wl,-headerpad_max_install_names -B /Applications/Xcode.app/Contents/Developer/Toolchains/XcodeDefault.xctoolchain/usr/bin SingleSource/Regression/C/gcc-c-torture/execute/CMakeFiles/GCC-C-execute-memcpy-1.dir/memcpy-1.c.o  -o SingleSource/Regression/C/gcc-c-torture/execute/GCC-C-execute-memcpy-1   && :
[9290/11531] /Users/buildslave/jenkins/workspace/test-suite-verify-machineinstrs-aarch64-globalisel-O0-g/test-suite-build/tools/timeit --summary SingleSource/Regression/C/gcc-c-torture/execute/CMakeFiles/GCC-C-execute-pr17377.dir/pr17377.c.o.time /Users/buildslave/jenkins/workspace/test-suite-verify-machineinstrs-aarch64-globalisel-O0-g/compiler/bin/clang -DNDEBUG  -B /Applications/Xcode.app/Contents/Developer/Toolchains/XcodeDefault.xctoolchain/usr/bin    -Wno-unused-command-line-argument -mllvm -verify-machineinstrs -O0 -g -arch arm64 -isysroot /Applications/Xcode.app/Contents/Developer/Platforms/iPhoneOS.platform/Developer/SDKs/iPhoneOS13.5.sdk   -w -Werror=date-time -w -MD -MT SingleSource/Regression/C/gcc-c-torture/execute/CMakeFiles/GCC-C-execute-pr17377.dir/pr17377.c.o -MF SingleSource/Regression/C/gcc-c-torture/execute/CMakeFiles/GCC-C-execute-pr17377.dir/pr17377.c.o.d -o SingleSource/Regression/C/gcc-c-torture/execute/CMakeFiles/GCC-C-execute-pr17377.dir/pr17377.c.o   -c /Users/buildslave/jenkins/workspace/test-suite-verify-machineinstrs-aarch64-globalisel-O0-g/test-suite/SingleSource/Regression/C/gcc-c-torture/execute/pr17377.c
FAILED: SingleSource/Regression/C/gcc-c-torture/execute/CMakeFiles/GCC-C-execute-pr17377.dir/pr17377.c.o 
/Users/buildslave/jenkins/workspace/test-suite-verify-machineinstrs-aarch64-globalisel-O0-g/test-suite-build/tools/timeit --summary SingleSource/Regression/C/gcc-c-torture/execute/CMakeFiles/GCC-C-execute-pr17377.dir/pr17377.c.o.time /Users/buildslave/jenkins/workspace/test-suite-verify-machineinstrs-aarch64-globalisel-O0-g/compiler/bin/clang -DNDEBUG  -B /Applications/Xcode.app/Contents/Developer/Toolchains/XcodeDefault.xctoolchain/usr/bin    -Wno-unused-command-line-argument -mllvm -verify-machineinstrs -O0 -g -arch arm64 -isysroot /Applications/Xcode.app/Contents/Developer/Platforms/iPhoneOS.platform/Developer/SDKs/iPhoneOS13.5.sdk   -w -Werror=date-time -w -MD -MT SingleSource/Regression/C/gcc-c-torture/execute/CMakeFiles/GCC-C-execute-pr17377.dir/pr17377.c.o -MF SingleSource/Regression/C/gcc-c-torture/execute/CMakeFiles/GCC-C-execute-pr17377.dir/pr17377.c.o.d -o SingleSource/Regression/C/gcc-c-torture/execute/CMakeFiles/GCC-C-execute-pr17377.dir/pr17377.c.o   -c /Users/buildslave/jenkins/workspace/test-suite-verify-machineinstrs-aarch64-globalisel-O0-g/test-suite/SingleSource/Regression/C/gcc-c-torture/execute/pr17377.c
Fatal Error: error in backend: Found 1 machine code errors.
# End machine code for function f.

*** Bad machine code: Virtual register defs don't dominate all uses. ***
- function:    f
- v. register: %18
fatal error: error in backend: Found 1 machine code errors.
PLEASE submit a bug report to https://bugs.llvm.org/ and include the crash backtrace, preprocessed source, and associated run script.
Stack dump:
Error: clang frontend command failed with exit code 70 (use -v to see invocation)
24 clang         0x000000010f01e94d clang::driver::Compilation::ExecuteCommand(clang::driver::Command const&, clang::driver::Command const*&) const + 221
25 clang         0x000000010f01ed6d clang::driver::Compilation::ExecuteJobs(clang::driver::JobList const&, llvm::SmallVectorImpl<std::__1::pair<int, clang::driver::Command const*> >&) const + 125
26 clang         0x000000010f03335c clang::driver::Driver::ExecuteCompilation(clang::driver::Compilation&, llvm::SmallVectorImpl<std::__1::pair<int, clang::driver::Command const*> >&) + 204
27 clang         0x000000010cb84c55 main + 10389
28 libdyld.dylib 0x00007fff6eb25cc9 start + 1
clang-12: error: clang frontend command failed with exit code 70 (use -v to see invocation)
clang version 12.0.0 (https://github.com/llvm/llvm-project.git b0c50ef759d368b33731d0261cae78117c3accdd)
Target: aarch64-apple-darwin19.5.0

Build Log

Changes
  1. [clangd] Fix a crash in DefineInline (details)
  2. [InstSimplify] reduce code duplication in simplifyICmpWithMinMax(); NFC (details)
  3. MachO: support `-syslibroot` (details)
  4. [JITLink][AArch64] Improve debug output for addend relocations. (details)
  5. [JITLink][AArch64] Handle addends on PAGE21 / PAGEOFF12 relocations. (details)
  6. Add libFuzzer shared object build output (details)
  7. [ELF] --oformat=binary: use LMA to compute file offsets (details)
  8. [ELF] --icf: don't fold text sections with LSDA (details)
  9. [ELF] Allow sections after a non-SHF_ALLOC section to be covered by PT_LOAD (details)
  10. [mlir] Fix rank bitwidth in UnrankedMemRefType conversion. (details)
  11. [MLIR][NFC] Fix clang-tidy warnings in std to llvm conversion (details)
  12. [InstSimplify] add tests for icmp with 'mul nuw' operand; NFC (details)
  13. [NFC][InstCombine] Tests for negation of `add` w/ single negatible operand (details)
  14. [InstCombine] Negator: 0 - (X + Y)  -->  (-X) - Y  iff a single operand negated (details)
  15. Remove special Hexagon packet traversal code (details)
  16. [lldb] Make SBTarget::LaunchSimple start form the target's LaunchInfo (details)
  17. [lldb] Add an option to inherit TCC permissions from parent. (details)
  18. [NFC][InstCombine] Negator: include all the needed headers, IWYU (details)
  19. [LoopVectorizer] Inloop vector reductions (details)
  20. [ASan][Darwin] Adapt test for macOS 11+ version scheme (details)
  21. [lldb/test] Replace LLDB_TEST_SRC env variable with configuration (details)
  22. [TFUtils] Expose untyped accessor to evaluation result tensors (details)
  23. Revert "[LoopVectorizer] Inloop vector reductions" (details)
  24. [X86][SSE] Fold 128-bit PACK(EXTEND(X),EXTEND(Y)) -> CONCAT(X,Y) subvectors (details)
  25. [msan] Remove readnone and friends from call sites. (details)
  26. [LIBOMPTARGET]Fix order of mapper data for targetDataEnd function. (details)
  27. Fix _ExtInt(1) to be a i1 in memory. (details)
  28. [clangd] Hide "swap if branch" tweak (details)
  29. Remove Olesen from LLVM code owners (details)
  30. [MLIR][LinAlg] Use AnyTypeOf for LinalgOperand for better error msg. (details)
  31. [libFuzzer] Do not link pthreads on Android. (details)
  32. [mlir][nfc] Rename `promoteMemRefDescriptors` to `promoteOperands`. (details)
  33. [flang][NFC] Unify OpenMP and OpenACC structure checker (details)
  34. [clang-format] fix BreakBeforeBraces.MultiLine with for each macros (details)
  35. [InstSimplify] add vector tests for icmp with mul nuw; NFC (details)
  36. [InstSimplify] fold icmp with mul nuw and constant operands (details)
  37. [lldb/test] Use realpath consistently for test root file paths. (details)
  38. [InstSimplify] fold icmp with mul nsw and constant operands (details)
  39. AMDGPU: Fix verifier error with undef source producing s_bitset* (details)
  40. AMDGPU: Remove leftover test (details)
  41. [spirv] Fix bitwidth emulation for Workgroup storage class (details)
  42. AMDGPU: Refactor buffer atomic intrinsic lowering (details)
  43. [NFC][InstCombine] Add tests for negation of old-style [n]abs, select-of-op-vs-negation-of-op (details)
  44. [InstCombine] Negator: -(cond ? x : -x)  -->  cond ? -x : x (details)
  45. [mlir][StandardToSPIRV] Use spv.UMod for index re-calculation (details)
  46. [clangd] Disable define out-of-line code action on templates (details)
  47. Revert "Add libFuzzer shared object build output" (details)
Changes
  1. [CUDA, test-suite] Prevent constant folding of the test inputs. (details / githubweb)
  2. [CUDA, test-suite] More test cases for rint() and nearint() (details / githubweb)

Started by upstream project relay-test-suite-verify-machineinstrs build number 8552
originally caused by:

This run spent:

  • 7.1 sec waiting;
  • 1 hr 20 min build duration;
  • 1 hr 20 min total from scheduled to completion.
Revision: 74e099cb9569f67ddb4341839eea408abc67e04e
  • refs/remotes/origin/master
Revision: b0c50ef759d368b33731d0261cae78117c3accdd
  • detached
Revision: 554f0722ae0daaab3abb7fd2205a9f00ce787cf0
  • refs/remotes/origin/master
Revision: f1a62a9c12d0b2f789823e46627bf070da6daaae
  • refs/remotes/origin/master

Identified problems

Compile Error

This build failed because of a compile error. Below is a list of all errors in the build log:
Indication 1

Ninja target failed

Below is a link to the first failed ninja target.
Indication 2